##TITLE=1H_Pr AmN
 CDCl3
 8 sc, 
 17.03.2022
##JCAMPDX= 6.0         $$ Bruker NMR JCAMP-DX V2.0
##DATA TYPE= NMR FID
##DATA CLASS= NTUPLES
##ORIGIN= UXNMR, Bruker Analytische Messtechnik GmbH
##OWNER= root
$$ XWIN-NMR		Version 3.5
$$ Fri Mar 18 13:10:01 2022 Russian Standard Time (UT+4h)  she@DPX200
##.OBSERVE FREQUENCY= 200.131346
##.OBSERVE NUCLEUS= ^1H
##.DELAY= (6, 6)
##.ACQUISITION MODE= SIMULTANEOUS
##.ACQUISITION SCHEME= undefined
##.AVERAGES= 8
##.DIGITISER RES= 18
##SPECTROMETER/DATA SYSTEM= spect
##.PULSE SEQUENCE= zg30
##.SOLVENT NAME= CDCl3
##.SHIFT REFERENCE= (INTERNAL, CDCl3, 0, 15.7039)
##AUDIT TRAIL= $$ (NUMBER, WHEN, WHO, WHERE, WHAT)
$$ ##TITLE= Audit trail, XWIN-NMR		Version 3.5
$$ ##JCAMPDX= 5.01
$$ ##ORIGIN= Bruker BioSpin GmbH
$$ ##OWNER= she
$$ F:/spectra/data/she/nmr/H-F/1/audita.txt
$$ ##AUDIT TRAIL=  $$ (NUMBER, WHEN, WHO, WHERE, WHAT)
(   1,<2022-03-18 13:08:46.18 +0400>,<she>,<DPX200>,
      <created by zg, POWCHK disabled, PULCHK disabled
       configuration hash MD5:
       00 E9 B6 7A A2 85 ED C7 34 08 36 98 17 FE 4E 26
       data hash MD5: 16K
       6F 33 BB 8F 9B 0D E5 60 10 90 A6 26 3C 95 21 43>)
$$ ##END=
$$ 
$$ hash MD5
$$ 71 C2 6F B1 2E 66 7F F8 B9 03 6B 14 7B 36 08 FB
##$RELAX= 
##$RELAX= 
##$RELAX= 
##$RELAX= 
##$RELAX= 
##$RELAX= 
$$ Bruker specific parameters
$$ --------------------------
##$DU= <F:/spectra>
##$EXPNO= 1
##$NAME= <H-F>
##$PROCNO= 1
##$TYPE= <nmr>
##$USER= <she>
##$AMP= (0..31)
100 100 100 100 100 100 100 100 100 100 100 100 100 100 100 100 100 100 
100 100 100 100 100 100 100 100 100 100 100 100 100 100 
##$AQSEQ= 0
##$AQ_mod= 1
##$AUNM= <au_zg>
##$AUTOPOS= <>
##$BF1= 200.13
##$BF2= 200.13
##$BF3= 200.13
##$BF4= 200.13
##$BF5= 200.13
##$BF6= 200.13
##$BF7= 200.13
##$BF8= 200.13
##$BYTORDA= 1
##$CFDGTYP= 0
##$CFRGTYP= 5
##$CHEMSTR= <none>
##$CNST= (0..31)
1 1 145 1 1 1 1 1 1 1 1 1 1 1 1 1 1 1 1 1 1 1 1 1 1 1 1 1 1 1 1 1 
##$CPDPRG= <>
##$CPDPRG1= <>
##$CPDPRG2= <>
##$CPDPRG3= <>
##$CPDPRG4= <mlev>
##$CPDPRG5= <mlev>
##$CPDPRG6= <mlev>
##$CPDPRG7= <mlev>
##$CPDPRG8= <mlev>
##$CPDPRGB= <>
##$CPDPRGT= <>
##$D= (0..31)
0 1.2 0 0 0 0 0 0 0 0.06 0 0.03 0 0 0 0 0.0002 0 0 0 0 0 0 0 0 0 0 0 0 
0 0 0 
##$DATE= 1647594525
##$DBL= (0..7)
120 120 120 120 120 120 120 120 
##$DBP= (0..7)
150 150 150 150 150 150 150 150 
##$DBP07= 0
##$DBPNAM0= <>
##$DBPNAM1= <>
##$DBPNAM2= <>
##$DBPNAM3= <>
##$DBPNAM4= <>
##$DBPNAM5= <>
##$DBPNAM6= <>
##$DBPNAM7= <>
##$DBPOAL= (0..7)
0.5 0.5 0.5 0.5 0.5 0.5 0.5 0.5 
##$DBPOFFS= (0..7)
0 0 0 0 0 0 0 0 
##$DE= 6
##$DECBNUC= <off>
##$DECIM= 32
##$DECNUC= <off>
##$DECSTAT= 4
##$DIGMOD= 1
##$DIGTYP= 9
##$DL= (0..7)
0 120 120 120 120 120 120 120 
##$DP= (0..7)
150 150 150 150 150 150 150 150 
##$DP07= 0
##$DPNAME0= <>
##$DPNAME1= <>
##$DPNAME2= <>
##$DPNAME3= <>
##$DPNAME4= <>
##$DPNAME5= <>
##$DPNAME6= <>
##$DPNAME7= <>
##$DPOAL= (0..7)
0.5 0.5 0.5 0.5 0.5 0.5 0.5 0.5 
##$DPOFFS= (0..7)
0 0 0 0 0 0 0 0 
##$DQDMODE= 0
##$DR= 18
##$DS= 0
##$DSLIST= <SSSSSSSSSSSSSSS>
$$ [...]
##$SUBNAM2= <"">
##$SUBNAM3= <"">
##$SUBNAM4= <"">
##$SUBNAM5= <"">
##$SUBNAM6= <"">
##$SUBNAM7= <"">
##$SUBNAM8= <"">
##$SUBNAM9= <"">
##$SW= 18.0517287032376
##$SWIBOX= (0..15)
0 0 2 0 0 0 0 0 0 0 0 0 0 0 0 0 
##$SW_h= 3612.71676300578
##$TD= 16384
##$TD0= 1
##$TE= 0
##$TE2= 300
##$TE3= 300
##$TEG= 300
##$TL= (0..7)
0 120 120 120 120 120 120 120 
##$TP= (0..7)
150 150 150 150 150 150 150 150 
##$TP07= 0
##$TPNAME0= <>
##$TPNAME1= <>
##$TPNAME2= <>
##$TPNAME3= <>
##$TPNAME4= <>
##$TPNAME5= <>
##$TPNAME6= <>
##$TPNAME7= <>
##$TPOAL= (0..7)
0.5 0.5 0.5 0.5 0.5 0.5 0.5 0.5 
##$TPOFFS= (0..7)
0 0 0 0 0 0 0 0 
##$TUNHIN= 0
##$TUNHOUT= 0
##$TUNXOUT= 0
##$USERA1= <user>
##$USERA2= <user>
##$USERA3= <user>
##$USERA4= <user>
##$USERA5= <user>
##$V9= 5
##$VALIST= <valist>
##$VCLIST= <CCCCCCCCCCCCCCC>
##$VD= 0
##$VDLIST= <DDDDDDDDDDDDDDD>
##$VPLIST= <PPPPPPPPPPPPPPP>
##$VTLIST= <TTTTTTTTTTTTTTT>
##$WBST= 1024
##$WBSW= 4
##$XGAIN= (0..3)
0 0 0 0 
##$XL= 0
##$YL= 0
##$YMAX_a= 169312
##$YMIN_a= -236803
##$ZGOPTNS= <>
##$ZL1= 120
##$ZL2= 120
##$ZL3= 120
##$ZL4= 120
##$ABSF1= 10
##$ABSF2= 0
##$ABSG= 5
##$ABSL= 3
##$ALPHA= 0
##$AQORDER= 0
##$ASSFAC= 0
##$ASSFACI= 0
##$ASSFACX= 0
##$ASSWID= 0
##$AUNMP= <proc_1d>
##$AZFE= 0.1
##$AZFW= 0.1
##$BCFW= 1
##$BC_mod= 2
##$BYTORDP= 1
##$COROFFS= 0
##$CY= 11.3945322036743
##$DATMOD= 1
##$DC= 2
##$DFILT= <>
##$DTYPP= 0
##$F1P= 2.36226072786647
##$F2P= -0.459571619588291
##$FCOR= 0.5
##$FTSIZE= 0
##$FT_mod= 4
##$GAMMA= 1
##$GB= 0.15
##$INTBC= 1
##$INTSCL= 1
##$ISEN= 128
##$LB= 0.24
##$LEV0= 0
##$LPBIN= 0
##$MAXI= 10000
##$MC2= 0
##$MEAN= 0
##$ME_mod= 0
##$MI= 1.114404
##$NCOEF= 0
##$NC_proc= 0
##$NLEV= 6
##$NOISF1= 3.799351
##$NOISF2= 2.8
##$NSP= 1
##$NTH_PI= 0
##$NZP= 0
##$OFFSET= 15.70392
##$PC= 1
##$PHC0= -17310.21
##$PHC1= 14.40078
##$PH_mod= 1
##$PKNL= yes
##$PPARMOD= 0
##$PSCAL= 0
##$PSIGN= 0
##$REVERSE= no
##$SF= 200.130013532006
##$SI= 16384
##$SIGF1= 3
##$SIGF2= 2
##$SINO= 400
##$SIOLD= 16384
##$SREGLST= <1H.CDCl3>
##$SSB= 0
##$STSI= 0
##$STSR= 0
##$SW_p= 3612.71676300578
##$SYMM= 0
##$S_DEV= 0
##$TDeff= 0
##$TDoff= 0
##$TI= <>
##$TILT= no
##$TM1= 0
##$TM2= 0
##$TOPLEV= 0
##$USERP1= <user>
##$USERP2= <user>
##$USERP3= <user>
##$USERP4= <user>
##$USERP5= <user>
##$WDW= 1
##$XDIM= 8192
##$YMAX_p= 0
##$YMIN_p= 0
$$ End of Bruker specific parameters
$$ ---------------------------------
##NTUPLES= NMR FID
##VAR_NAME=  TIME,          FID/REAL,        FID/IMAG
##SYMBOL=    X,             R,               I
##VAR_TYPE=  INDEPENDENT,   DEPENDENT,       DEPENDENT
##VAR_FORM=  AFFN,          ASDF,            ASDF
##VAR_DIM=   8192,          8192,            8192
##UNITS=     SECONDS,       ARBITRARY UNITS, ARBITRARY UNITS
##FACTOR=    0.0002768,     1,               1
##FIRST=     0,             0,               0
##LAST=      2.2672688,     0,               0
##MIN=       0,             -236803,         0
##MAX=       2.2672688,     169312,          0
$$ Real data points
##PAGE= N=1
##DATA TABLE= (X++(R..R)), XYDATA
$$ [...]
1919a26N5L23p19J37O4k80K34p8l11J32L61m00K72M04k28l1L90K77k43k99M4O16
$$ -126 -71 252 -467 -330 -266 -546 -312 -390 -701 -569 -208 -608 -336 68 -160 -191 199 476 233 -66 -22 594
1941E94l48l49N42J66N3l96l99M63J02n49k93P79o16k53K50K18n83j76N66p5R7
$$ 594 246 -103 439 605 658 262 -137 326 428 -121 -414 365 -251 -504 -254 -36 -619 -795 -229 -304 -207
1962b07k27L81K45q2l25K08M82j56j57J41O42n57K6J45Pn30QL74k15j69k64K01
$$ -207 -434 -53 192 110 -215 -7 475 319 162 303 945 388 414 559 566 36 44 418 203 34 -230 -29
1984b9R9n24k99M27L57j49o75M80L38m29k40P86O0n93N30M80n36r5K63L5R3j47
$$ -29 70 -454 -753 -326 31 -118 -793 -313 25 -404 -644 142 202 -391 139 619 83 -12 251 286 379 232
2006B32P2L30j05k05m75L93n3n59J01M40l11l63K14j34K0j8L80k34K88k30j34
$$ 232 304 634 529 324 -151 242 189 -370 -269 171 -140 -503 -289 -423 -403 -421 -41 -275 13 -217 -351
2027c51L17K43m14k32O61M08n41p2N21J31l47n4K71j68m07K24J66n30l87K78L14
$$ -351 -34 209 -205 -437 224 632 91 19 540 671 324 270 541 373 -34 190 356 -174 -561 -283 31
2048C1l3p15K48L80n19j73J89Q48p62J09L81K91o05M39L71n04K93L5J6L46k85
$$ 31 -2 -717 -469 -89 -608 -781 -592 256 -506 -397 -16 275 -330 109 480 -24 269 304 320 666 381
2069C81k14j50K51j63k98M89k77l47M02jl20k08K61j22m55P11r3m12N54K00n84
$$ 381 167 17 268 105 -193 296 19 -328 74 73 -247 -455 -194 -316 -771 -60 -153 -565 -11 189 -395
2090c95NP83l21k74L97N80n89m15R37l06m08K09M85l63m67K16o4m4k46j4K85l50
$$ -395 -390 393 72 -202 195 775 186 -229 708 402 -6 203 688 325 -142 74 10 -34 -280 -294 -9 -359
2112c59k39J29L84k44l41L01N47k83k86O41po05J47O17j02l38M76N1m06O9K16
$$ -359 -598 -469 -85 -329 -670 -369 178 -105 -391 250 243 -362 -215 402 300 -38 438 489 83 152 368
2133C68J27l47j49n3l4M4j85K48o7m74K64Q8m65L37K34k70k48L99L26l38k67O80
$$ 368 495 148 -1 -54 -88 -44 -229 19 -48 -522 -258 -170 -635 -298 -64 -334 -582 -183 143 -195 -462 218
2155B18K05o58M25M24n69j03N22J02j24l62K4J93k06k01K17N2l42l40K85K39m64
$$ 218 423 -235 190 614 45 -58 464 566 442 80 104 297 91 -110 107 159 -183 -523 -238 1 -463
2176d63k6J02K61m49K78M93k49j43J84L94o12L28L97j15j44J87L00m57K3K19k23
$$ -463 -489 -387 -126 -575 -297 196 -53 -196 -12 382 -230 98 495 380 236 423 723 266 289 508 285
2197B85l58K53M8m62N2J34mq0l43L79J0k11j58K94l7j28K89K21l72KM26N7q0j94
$$ 285 -73 180 228 -234 -182 -48 -52 -132 -475 -96 -86 -297 -455 -161 -198 -326 -37 184 -188 -186 240 297 217 23
2221B3K27J12k02j05L54lm08J02J1r2j82J95L10n14k83J30K2m59O6Q86k67k79
$$ 23 250 362 160 55 409 406 -2 100 111 19 -163 32 342 -172 -455 -325 -303 -762 -696 190 -77 -356
2243c56MM02k88n2O72j36m19M44J18k38j59M11lk37j44K46k47J61r1l6p1l92J1
$$ -356 -352 50 -238 -290 382 246 -173 271 389 151 -8 403 400 163 19 265 18 179 88 52 -19 -411 -400
2266d00K71k5l35K2K74r4l97O61J07l97K22M64l04l52M00K68L7k40L16k2l29L24
$$ -400 -129 -154 -489 -467 -193 -287 -684 -23 84 -313 -91 373 69 -283 117 385 422 182 498 476 147 471
2288D71k35p3J28j92j46J12j32Q1J17n74l4M55o2l25k1J93Q0m44L18K57L0k07
$$ 471 236 163 291 99 -47 65 -67 14 131 -443 -477 -22 -84 -409 -430 -237 -157 -601 -283 -26 4 -203
2310b03L68O9k07K71J17k69J17J84K59o57P9J4o6J80l44J24k54K86o24N93k69
$$ -203 165 234 27 298 415 146 263 447 706 49 128 142 76 256 -88 36 -218 68 -556 37 -232
2331b32l3O7J96l65J45J32mp7J04L36l53N6J20M21m71J37K83O0j72q5J94l79J46
$$ -232 -265 -198 -2 -367 -222 -90 -94 -171 -67 269 -84 -28 92 513 42 179 462 522 350 265 459 80 226
2354B26l17K36l30R5q4O5j78j53K70J02n02R3M25m9n4j6n5P6o3L43m1N1O2J27
$$ 226 -91 145 -185 -90 -174 -109 -287 -440 -170 -68 -570 -477 -52 -101 -155 -171 -226 -150 -213 130 89 140 202 329
2378C29K26l30J83k08J50j09K7j91m0j72K01J4k36n9J6j40j65K81K62j27j09K04
$$ 329 555 225 408 200 350 241 268 77 37 -135 66 80 -156 -215 -199 -339 -504 -223 39 -88 -197 7
2400Gk76J01J26L29k73r4M44n9j03j48L18K04l27K9m5J29l69j2k86L58M7n83M75
$$ 7 -269 -168 -42 287 14 -80 364 305 202 54 372 576 249 278 233 362 -7 -19 -305 53 100 -483 -8
2423hk79l31J88M60k43p9J90K6J36k1r7l1k6L79k1j32R3R5k52K64j91K1L05k72
$$ -8 -287 -618 -430 30 -213 -292 -102 -76 60 39 -58 -89 -115 264 243 111 204 299 47 311 120 141 446 174
2447A74O2n85L50j72J99j50n3J8J43k57j1J41M3j44j78L98Q7l4m0N5k27K49J47
$$ 174 236 -349 1 -171 28 -122 -175 -157 -14 -271 -282 -141 -98 -242 -420 -22 65 31 -9 46 -181 68 215
2470B15j30m0R3M9J91j66n0l43J81Q8j32L7J13Om44J95m6k6J19k37J43Oj30M4
$$ 215 85 45 138 187 378 212 162 -181 0 88 -44 -7 106 112 -332 -137 -183 -209 -90 -327 -184 -178 -308 -264
2494b64K07kJ12m59O53L3j64j01N39j56k50J13N5j41j80K66n4l33J41O7m88J09
$$ -264 -57 -59 53 -406 247 280 116 15 554 398 148 261 316 175 -5 261 207 -126 15 82 -406 -297
2516b97J73P6j21J29k81J53N8q4k55L99j38K02k79L35R2o9J36p2K1K46k23j84
$$ -297 -124 -48 -169 -40 -321 -168 -110 -194 -449 -50 -188 14 -265 70 162 93 229 157 178 424 201 17
2538A7K56J27l56J81n4k42j25R6M7m7k70K53lk83j6J35nJ27l4L42j42j52l3K62
$$ 17 273 400 44 225 171 -71 -196 -100 -53 -100 -370 -117 -120 -403 -419 -284 -289 -162 -196 146 4 -148 -181 81
2562H1R4p5j55N19j17j77R5k18l9J66j09j6j70o7l2r1K38q6Lq8j3j79L89J1k32
$$ 81 175 100 -55 464 347 170 265 47 8 174 65 49 -121 -188 -220 -311 -73 -159 -156 -244 -257 -436 -47 -36 -268
2587b68j5J85K34q3j52M46j21J07l77J11M0K76k68k65M31j20j46p8K39j40k43
$$ -268 -283 -98 136 53 -99 347 226 333 -44 67 107 383 115 -150 281 161 15 -63 176 36 -207
2608b07m4J12K92l51j07K84j42k5K62n6l01k8L84M8l75M07J7J74o89K86O00n33
$$ -207 -251 -139 153 -198 -305 -21 -163 -188 74 18 -283 -311 73 121 -254 153 170 344 -345 -59 541 8
2630HK11Q7j32J38m8K8rk89o9j82j5K10Pk37j21J78j31j14L26k60O38l15J56J53
$$ 8 219 306 174 312 264 292 283 -6 -75 -257 -272 -62 -55 -292 -413 -235 -366 -480 -154 -414 224 -91 65 218
2654B18j17j45K1L73l2ml51J92j06M0J42K10k22m48O08k03j81j29K53j69l49M4
$$ 218 101 -44 -23 350 318 314 -37 155 49 89 231 441 219 -229 379 176 -5 -134 119 -50 -399 -355
2676c55K69j18k44L82Rm27O4L54K10J08m69M13k0n1n1K18N0j69J52K9q5p5J26
$$ -355 -86 -204 -448 -66 -57 -484 -420 -66 144 252 -217 196 176 125 74 292 342 173 325 354 269 194 320
2699C20k03j90r0N8j43n3J85r7j52K05N7j45K6J4J25j40J11K85j10P8j92L16k07
$$ 320 117 -73 -163 -105 -248 -301 -116 -213 -365 -160 -103 -248 -222 -208 -83 -223 -112 173 63 141 -51 265 58
2722E8M0J59J02o8n04K09L16l58lj47K59p0j28L8k90J13J85j11K3q3n0L90m5l23
$$ 58 98 257 359 291 -213 -4 312 -46 -49 -196 63 -7 -135 -97 -387 -274 -89 -200 -177 -260 -310 80 35 -288
2746b88N99j53j88QL41Q2l01J90k0j91P1K8m1k4j11K37n1l77J29L46n27j20P3
$$ -288 311 158 -30 -22 319 401 100 290 270 79 150 178 137 113 2 239 188 -189 -60 286 -241 -361 -288
2769b88J0K90l69K35J06r6K9J4Pj5O3P9L65l10l3J72j60m5J47pO4k84L80k11l2
$$ -288 -278 12 -357 -122 -16 -112 -83 -69 -62 -77 -14 65 430 120 87 259 99 54 201 194 258 -26 354 143 111
2794A11l04K58k81k1K96k45j41J52J39l9k79M09P9l00m9K04L76k62n2J0M52l05
$$ 111 -193 65 -216 -237 59 -186 -327 -175 -36 -75 -354 55 134 -166 -215 -11 365 103 51 61 513 208
2816B08J9J22k06p1O6Q2l01k16L44ll05P5L22k13m05K46K52l58J63J9J20k9j41
$$ 208 227 349 143 72 138 220 -81 -297 47 44 -261 -186 136 -77 -482 -236 16 -342 -179 -160 -40 -69 -210
2839b10KK20Q6k8J23j49J58K14j99P2q3j20J50k7l99J11k5l05M11j5k02o7L91
$$ -210 -208 12 98 70 193 44 202 416 217 289 206 86 236 209 -190 -79 -104 -409 2 -13 -215 -282 109
2862A09j42k68L62l11L56m64K19K41k76j33K10K11q6k84M12J28q8j24M21j19o70
$$ 109 -33 -301 61 -250 106 -358 -139 102 -174 -307 -97 114 28 -256 156 284 196 72 493 374 -296
2883b96M07Q1j37j62R4J42k14l27N75k88j8j21O0n4K00l04M04n7k4l6K89l09L88
$$ -296 111 192 55 -107 -13 129 -85 -412 163 -125 -143 -264 -204 -258 -58 -362 42 -15 -39 -75 214 -95 293
2906B93J91k50J6J07j71j57K04J41l03p9PR7j38m2n3O5p9j38J76j61l9l6L85j51
$$ 293 484 234 250 357 186 29 233 374 71 -8 -1 96 -42 -84 -137 -72 -151 -289 -113 -274 -313 -349 36 -115
2930a15j10J06j87L42o2J63N5k39J77J02o5J20k9J7m6j89K14q5o9l52K77j58K7
$$ -115 -225 -119 -306 36 -26 137 192 -47 130 232 167 287 258 275 229 40 254 169 100 -252 25 -133 -106
2953a06oj75K63k73L08m7l11p1L09j4J28Q6l47K54J10j03M57l18l10L64J60k30
$$ -106 -112 -287 -24 -297 11 -36 -347 -418 -109 -123 5 91 -256 -2 108 5 462 144 -166 198 358 128
2975A28k29L28k17J48j29J07k00l23J98J43R3k04j31J66R8l81J47K29o4j39K87
$$ 128 -101 227 10 158 29 136 -64 -387 -189 -46 47 -157 -288 -122 -24 -405 -258 -29 -93 -232 55
2996E5n0k1K82j05N6M4Q8j41j3k9J10l49P5J94l2l98J49K58l25J54l78L11k07
$$ 55 5 -16 266 161 217 261 349 208 195 166 276 -73 2 196 164 -234 -85 173 -152 2 -376 -65 -272
3019b72J21l0J51o1K12k20m4k6O4q1K34j45L7K50K96l67o1K08j43l2J4l29J49
$$ -272 -151 -181 -30 -91 121 -99 -143 -169 -105 -186 48 -97 -60 190 486 119 58 266 123 91 105 -224 -75
3042g5pJ65j81l5J36l05PL3K14k63K84k77K33r9M18m25K50m1K99k94J22j11K3
$$ -75 -82 83 -98 -133 3 -302 -295 -262 -48 -311 -27 -304 -71 -170 248 -177 73 32 331 37 159 48 71
3065G1N1j71J21J81j21r9J14lq3k98L54k7k42l1J88k31J81r8L5j40K31j66K77
$$ 71 122 -49 72 253 132 33 147 144 61 -237 117 90 -152 -183 5 -226 -45 -143 -108 -248 -17 -183 94
3088I4j33j72M8J67j25M31k45O1Po2J82k34L32l37q8M3J2K8p8Rj04r6r8J25R7
$$ 94 -39 -211 -163 4 -121 310 65 126 133 71 253 19 351 14 -74 -31 -19 9 -69 -60 -164 -260 -358 -233 -136
3113a36K3R8J6J77p5m38K81K01j18L7K88o6l42K09J16k21N0J95j60n6k35K39K25
$$ -136 -113 -15 1 178 103 -335 -54 147 29 66 354 288 -54 155 271 50 100 295 135 79 -156 83 308
3136C08k47l27K91j92o7J35%l8k33L28M4%l3N9j35P3o4O9J98m5K18k31k28M05
$$ 308 61 -266 25 -167 -234 -99 -99 -137 -370 -42 2 2 -31 28 -107 -34 -98 -29 169 124 342 111 -117 288
3160B88Q4k38j12J24j27J69l79L28n4J2l33K05p3j47K80j92q5J49k9K29r7o4M9
$$ 288 372 134 22 146 19 188 -191 137 83 95 -238 -33 -106 -253 27 -165 -250 -101 -130 99 2 -62 -13
3183a3j9K97j43k68K43r9J96q8K16k67K26r8n5k3R7j41j03J99l80J23J63r8j9
$$ -13 -32 265 122 -146 97 -2 194 106 322 55 281 183 128 105 202 61 -42 157 -223 -100 63 -35 -54
3206e4k17M1L80j38k37K01l5J17%l7L28l41P9o5N9k19M22o8j32j54J43R0J19m39
$$ -54 -271 -230 150 12 -225 -24 -59 58 58 21 349 8 87 22 81 -138 284 216 84 -70 73 163 282 -157
3230a57J72o0J4l12L97j03o9j62J66J1O2k38K80k02J62j49K15R4k40J07J52q0
$$ -157 15 -45 -31 -343 54 -49 -118 -280 -114 -103 -41 -279 1 -201 -39 -188 27 121 -119 -12 140 60
3252F0qK14l0j14q9P5k38K50n8O0L9k33J07k53N1k4L4p2J24l1kk9n4N6J15J04
$$ 60 52 266 236 122 33 108 -130 120 62 122 161 -72 35 -218 -167 -191 -157 -229 -105 -136 -138 -167 -221 -165 -50 54
3278E4m3q0L60l43K01q4r7K60m7L1n2j74q7L68l14J85j78j86M07l62n5O2J74r0
$$ 54 11 -69 291 -52 149 65 -32 228 181 212 160 -14 -101 267 -47 138 -40 -226 181 -181 -236 -174 0 -90
3302i0K11n03L75m7k25N05k20K6J15J15j32l1m2J17j67M5J36k68K51M5k57q2J09
$$ -90 121 -382 -7 -54 -279 226 6 32 147 262 130 99 57 174 7 52 188 -80 171 216 -41 -123 -14
3325a4J80k22l7j06J8K34j02k38r9K17N5J1l0K43j45n2J10L4JK27r4j37k5K44
$$ -14 166 -56 -93 -199 -181 53 -49 -287 -386 -169 -114 -103 -133 110 -35 -87 23 57 58 285 191 54 29 273
3349B73k35NK29j01k96J75K9m2P6k25J30k14P6P9n8O4K2j1L8k49J75q2M32m12
$$ 273 38 43 272 171 -125 50 79 37 113 -112 18 -196 -120 -41 -99 -35 -13 -24 14 -235 -60 -142 290 -122
3373a22L57l3p6j71LM2K91j24k48K98j26L4k30Oo5L09j78P9m6j71k67K98j08m5
$$ -122 235 202 126 -45 -42 0 291 167 -81 217 91 125 -105 -99 -164 145 -33 46 0 -171 -438 -140 -248 -293
3397b93M37j37j97J11J84m2kJ05J42k80J51j06J1J21k11j8Q7J01j58j54l1M16
$$ -293 144 7 -190 -79 105 63 61 166 308 28 179 73 84 205 -6 -24 63 164 6 -148 -179 237
3419B37k96J08O0l31Q2r4j8J81J94j21j89Q0k59K37K12P5l53J1J90k5J38o2J90
$$ 237 -59 49 109 -222 -140 -234 -252 -71 123 2 -187 -107 -366 -129 83 158 -195 -184 6 -19 119 57 247
3442B47j58J53r8k52RJ14J01k83lR9J87j09k07l7Q5K49l90M38l25m5J25J11k37
$$ 247 89 242 144 -108 -99 15 116 -167 -170 -71 116 7 -200 -237 -152 97 -293 145 -180 -225 -100 11 -226
3465b26M03j37J76M1l28K44j17ML5j66K56l5n2l7J36j27Mo0J0j74K8p5L78n24
$$ -226 177 40 216 257 -71 173 56 60 95 -71 185 150 98 61 197 70 74 14 24 -150 -122 -197 181 -343
3489c43M39k41J93J25j63L1j06J38M6q3j42J08j58K90r3J08n3NR7j22Qj26j78
$$ -343 96 -145 48 173 10 41 -65 73 119 36 -106 2 -156 134 41 149 96 101 198 76 84 -42 -220
3512b20K04j18J48k41J39j41K68J91m28M5j77K63K4j84K96j1q7K3K10q0j1j07
$$ -220 -16 -134 14 -227 -88 -229 39 230 -198 -153 -330 -67 -43 -227 69 58 -29 -6 204 124 113 6
3534FL07l8k79J31k69J65L4P4n9j72K30k64k26Q2J00J11k95L30o5k8m0K7R1L0
$$ 6 313 275 -4 127 -142 23 57 131 72 -100 130 -134 -360 -278 -178 -67 -362 -32 -97 -125 -165 -138 -47 -17
3558a7J52R6l33N5K23j07J90J37l02JK68k53L6Q7l27K20k01K30j53j28J35l51
$$ -17 135 231 -102 -47 176 69 259 396 94 95 363 110 146 233 -94 126 -75 155 2 -126 9 -342
3580c42K63K05k73L88k61J4R4r5Q9j71j97M93q1j03j0k44L83p5j31J09K69k62
$$ -342 -79 126 -147 241 -20 -6 88 -7 82 -89 -286 207 126 23 13 -231 152 77 -54 55 324 62
3602F2K90o35M07l42K27J9j97j23J72J51J74l15p0J17J48l28J29K12J4r4k7J61
$$ 62 352 -283 124 -218 9 28 -169 -292 -120 31 205 -110 -180 -63 85 -243 -114 98 112 18 -9 152
3624A52j02j21J23J62k48j2J51j66K09mj81n9L7j80L8J6J12j58J84k54J84P7j67
$$ 152 50 -71 52 214 -34 -46 105 -61 148 144 -37 -96 -59 -239 -201 -185 -73 -231 -47 -301 -117 -40 -207
3647b07J95J0p7P0r8J16K11l1n7M9M1j90p9L43j59j22q6J96k89r2K56j48J86R5
$$ -207 -12 -2 -79 -9 -107 9 220 189 132 181 222 32 -47 296 137 15 -71 125 -164 -256 0 -148 38 133
3671A33j88j99J04m4QK36r1K1Q6Q7k50J95j76n5L66P6l52M0J47m8l03K54K91k78
$$ 133 -55 -254 -150 -194 -186 50 -41 -20 66 153 -97 98 -78 -133 233 309 -43 -3 144 96 -207 47 338 60
3695F0J43m3j34OO9k33K65j80J11r7n1L7j16j1K14j78K28n4k6K62l43J23J29j96
$$ 60 203 160 26 32 101 -132 133 -47 64 -33 -84 -47 -163 -174 40 -138 90 36 10 272 -71 52 181 -15
3719a5j42Q2J5J08J23j78J60j97p6K19l40K51n1k03M0M11j73o5qoQ3j94M55k29
$$ -15 -157 -75 -60 48 171 -7 153 -44 -120 99 -241 10 -41 -244 -204 207 34 -31 -39 -45 38 -156 299 70
3743G0l88K91Q0j16O5n4J04Nq5J70p2l9J42k89L40k18j40K28j6p3J73q9j32k89
$$ 70 -318 -27 53 -63 2 -52 52 57 -28 142 70 31 173 -116 224 6 -134 94 78 5 178 89 -43 -332
3767c32K66j53ML96k14p0L49k58j68J72N9L5M8r8j33M24j06j71j22K86l11J97
$$ -332 -66 -219 -215 181 -33 -103 246 -12 -180 -8 51 86 134 36 -97 327 221 50 -72 214 -97 100
3789A00l12K23Mj67K14k59J20k0K06j04j78j3K11j43Q5j90J32J75K4J01k71O3
$$ 100 -212 11 15 -152 62 -197 -77 -97 109 5 -173 -186 25 -118 -33 -223 -91 84 108 209 -62 1
3811AK1K5L1K28k42o9Q7k22K22J68l32J54oj02J39OJ07k61k32J71R1k81K73j28
$$ 1 22 47 78 306 64 -5 82 -140 82 250 -82 72 66 -36 103 109 216 -45 -277 -106 -15 -296 -23 -151
3835a51Q5j40K90k71J32q8K95l1P5l8jj09j29K22j46J03M5j14k3j06rM9j21P1
$$ -151 -66 -206 84 -187 -55 -143 152 121 196 158 157 48 -81 141 -5 98 143 29 6 -100 -109 -60 -181 -110
3859a10j22L11K3k39m9P6m1L12j20j03o2O9K06k45K57O9J5k17J67lj67k7K66m28
$$ -110 -232 79 102 -137 -186 -110 -151 161 41 -62 -124 -55 151 -94 163 232 247 30 197 194 27 0 266 -162
3883a62J57J58p6r9j58n3K90j62J1k03J78p5P7rJ45p7j81J88L8j00L11q2k5K2
$$ -162 -5 153 77 -22 -180 -233 57 -105 -94 -297 -119 -194 -117 -126 19 -58 -239 -51 -13 -113 198 116 91 113
3907A13l16J10J60K41k77O0k30l3P0Q7k13L44o2N4K6K1j94k05R0R7m1K3j03M03
$$ 113 -203 -93 67 308 31 91 -139 -172 -102 -15 -228 116 54 108 134 155 -39 -244 -154 -57 -98 -75 -178 225
3931B25m04J08P0M0r9M9l5K83j84J0j34L7J50j7k9j66L27l38J02j28O7L0J3Rp5
$$ 225 -179 -71 -1 39 -60 -11 -46 237 53 63 -71 -34 116 99 70 -96 231 -107 -5 -133 -66 -36 -23 -14 -89
3956h9K04k97K46mj27J36n1n9K72j83p6J19O8j86J72M8j13k58L35P1j82N6j98
$$ -89 115 -182 64 60 -67 69 18 -41 231 48 -28 91 159 -27 145 193 80 -178 157 228 46 102 -96
3979i6J3K32j06j59j8j15K18J40k13q0l2J83n8J31lj1j34K83j08oL9L3R1k13%
$$ -96 -83 149 43 -116 -134 -249 -31 109 -104 -184 -216 -33 -91 40 37 26 -108 175 67 61 100 133 224 11 11
4004A1J44k21K47k82J87j87J10l1Q7j45K49k55K8J02j30OL38j64k20K44j24j28
$$ 11 155 -66 181 -101 86 -101 9 -22 65 -80 169 -86 -58 44 -86 -80 258 94 -126 118 -6 -134
4026a34J11q9J82qK36j6l55K11J9j64k03J39R4P9p4O5l50J24J38o9p3LJ71K72
$$ -134 -23 -112 70 62 298 282 -73 138 157 -7 -210 -71 23 102 28 93 -257 -133 5 -64 -137 -134 37 309
4050C09m72N0o1O9J61Q2n2k94J86J01k6MJ04J3kk89J72N5qk2J2j63J2j85M31k05
$$ 309 -163 -113 -174 -105 56 138 86 -208 -22 79 53 57 161 174 172 -117 55 110 102 80 92 -71 -59 -244 187 -18
4076a8Qk39J16J47q5m4j9K14k34K98k29O2j79P8K51LJ10q6k17O8Q5J31j5r9j95
$$ -18 -10 -249 -133 14 -71 -115 -134 80 -154 144 -85 -23 -202 -124 127 130 240 154 -63 5 90 221 206 107 -88
4101h8L82j37k79L1P1o8N0Q8J26k71L5k11L0J03K3L7KJ9N9p8J54J84k06M7J42
$$ -88 294 157 -122 -91 -20 -88 -38 50 176 -95 -60 -271 -241 -138 -115 -78 -76 -57 2 -76 78 262 56 103 245
4126B45n9j21j11J85J27k21N7j50p9L04k05J95m91N00n86K18j4L4J18j10J18R
$$ 245 186 65 -46 139 266 45 102 -48 -127 177 -28 167 -324 176 -410 -192 -206 -172 -54 -164 -46 -37
4148c7q8J62j43J80J8l08K06q6J82Q4p8P2O9k53L80k70j93K41j46O0k06n2K67
$$ -37 -125 37 -106 74 92 -216 -10 -96 86 170 92 164 233 -20 360 90 -103 138 -8 52 -154 -206 61
4171F1j39J65Kj93JJ65k0o3q3K68j67J7r7Q8J02r8j6j21J46L53j42l66K37n7K1
$$ 61 -78 87 89 -104 -103 62 42 -21 -104 164 -3 14 -83 5 107 9 -7 -128 18 371 229 -137 100 43 64
4196F4j48L49j45j73m0R3K6N9P5k16P7qpn4o9Q9k37J66J60j5k6J53n27K31J85
$$ 64 -84 265 120 -53 -93 0 26 85 160 -56 21 13 6 -48 -117 -28 -265 -99 61 46 20 173 -354 -123 62
4221F2j49j03M60k38r9Q2l8nK0j58J67o5J31j31k46J94K23j54mJ19k0J30j84j19
$$ 62 -87 -190 270 32 -67 15 -23 -28 -8 -166 1 -64 67 -64 -310 -116 107 -47 -51 68 48 178 -6 -125
4245a25L8o1j25L49Jj01J48M5j2k39q8J16J07QK04j89j17Q9no7k17K59pm3K1Q2
$$ -125 -87 -148 -273 76 77 -24 124 169 157 -82 -170 -54 53 61 265 76 -41 48 43 -24 -241 18 11 -32 -11 71
4271G1j23j74M54n4j86J78j39j9M5p9Q3O9k6J3l94J61N8J6n5K97k40j97K57j10
$$ 71 -52 -226 228 174 -12 166 27 8 53 -26 57 126 100 113 -281 -120 -62 -46 -101 196 -44 -241 16 -94
4295i4K16k08M9Jk2R3Qk59K26j32M7j24K01K21j93J16n0O8k43J06J67k89N2m0
$$ -94 122 -86 -37 -36 -58 35 43 -216 10 -122 -75 -199 2 223 30 146 96 164 -79 27 194 -95 -43 -83
4319h3K66l04R7p4M5l6K46l30M0j20k8k55K86p6L67k62L19M0j99k04P1M0L65m5
$$ -83 183 -121 -24 -98 -53 -89 157 -173 -133 -253 -281 -536 -250 -326 41 -221 98 138 -61 -265 -194 -154 211 166
4343A66l6j68K58j50j52q8J3K79o6r6j52L06k91J63j75O8k8J54J16q8p3m6P7J83
$$ 166 130 -38 220 70 -82 -170 -157 122 56 -40 -192 114 -177 -14 -189 -121 -149 5 121 33 -40 -86 -9 174
4367A74k32J34j99L23l97K30L7J04k70j38K86R0n6l53K83K08j22J50m9m20K10
$$ 174 -58 76 -123 200 -197 33 70 174 -96 -234 52 142 86 -267 16 224 102 252 203 -217 -7
4388gk00J72j49%R8Q6J6K01j45j42j9J1L02j86JN9L1k10K15k57k27L07J11j31
$$ -7 -207 -35 -184 -184 -86 0 16 217 72 -70 -89 -78 224 38 39 98 129 -81 134 -123 -350 -43 68 -63
4412f3N2N1j36M9j38J01m9J43k0K4R5k02K5j61K54Mo6j5K40j58j8j77K98j7q0
$$ -63 -11 40 -96 -47 -185 -84 -133 10 -10 14 109 -93 -68 -229 25 29 -37 -52 188 30 12 -165 133 116 36
4437C6m7N4J14j09K29k02k9k12L4J06k1K34j24O0k23oK6J28l1o1k94K21K62p4
$$ 36 -11 43 157 48 277 75 46 -166 -132 -26 -47 187 63 123 -100 -106 -80 48 17 -44 -338 -117 145 71
4461G1k76L1J66J72J37l51J82N7m7J3J52k14j02lK01k96J35R8k10K13j74j9M6
$$ 71 -205 -174 -8 164 301 -50 132 189 142 155 307 93 -9 -12 189 -107 28 126 -84 129 -45 -64 -18
4484a8j75J83j45K78k30J16j32l7O2J85J10k59J04L9k16KL81j55qj84Q5O7K0l2
$$ -18 -193 -10 -155 123 -107 9 -123 -160 -98 87 197 -62 42 81 -135 -133 248 93 85 -99 -14 53 73 41
4508D1O0j0k09K52j02k81J24J32q4O2k68j01M59Q7m9m48K62R3L8j65K04J8l6j97
$$ 41 101 91 -118 134 32 -249 -125 7 -77 -15 -283 -384 75 162 113 -335 -73 20 58 -107 97 115 79 -118
4532a18L02j23J62o3k27J4j09K1L9k2P5oj63J74jL4J02k38J26M2pL8q6j73Q5N52
$$ -118 184 61 223 160 -67 -53 -162 -141 -102 -124 -49 -55 -218 -44 -45 -11 91 -147 -21 21 14 52 -34 -207 -122 430
4558D30k03l46K01OmK15j91k9r1J83n4j35p1N4J77k30L6Q6j50J06J11j32r8L08
$$ 430 227 -119 82 88 84 299 108 79 -12 171 117 -18 -89 -35 142 -88 -52 34 -116 -10 101 -31 -129 179
4582A79n4j06j97K17J09M5j58j19J89O1r5j84K67j12k12K78r3P1M4j28K85k11
$$ 179 125 19 -178 39 148 193 35 -84 105 166 71 -113 154 42 -170 108 15 86 130 2 287 76
4604G6k27Q5J95m06KL14p5J35j78j87J31J98k25J25J70k45RK55j07p4J24m7r8
$$ 76 -151 -66 129 -277 -275 39 -36 99 -79 -266 -135 63 -162 -37 133 -112 -103 152 45 -29 95 48 -50
4627e0jj0Q4k19L06l99K25PK3l1K48o7k20J74l12K25j7r6l0N6r8K18j8J08k48
$$ -50 -51 -61 23 -196 110 -289 -64 -57 -34 -65 183 116 -104 70 -242 -17 -34 -130 -160 -104 -202 16 -2 106 -142
4652a42k15O58m29J27J67n3r1K18o2k34j3L25k08k2M8j3q8K15q1j44q2K7P1j9
$$ -142 -357 301 -128 -1 166 113 22 240 178 -56 -69 256 48 26 74 61 -27 188 107 -37 -119 -92 -21 -40
4676d0Pm1Q0p2LP2J67o3M0M0q0M6j73mk80L16p7J83O6J02n10K31j57K47j64r9
$$ -40 -33 -74 6 -66 -63 9 176 113 153 193 113 159 -14 -18 -298 18 -59 124 190 292 -218 13 -144 103 -61 -160
4702a60K22N2qk33K1K58k94K79jl72M32j16j54n4L03l16K31j9o9k11K20L88l40
$$ -160 62 114 106 -127 -106 152 -142 137 136 -236 196 80 -74 -128 175 -141 90 71 2 -209 11 399 59
4725E9J42l2k47Q6j27K04k6j53Q6O0j2k44K18j60j41K56P9j24l4N7nR3k19M02
$$ 59 201 169 -78 8 -119 85 59 -94 -8 52 40 -204 14 -146 -287 -31 48 -76 -110 -53 -58 35 -184 218
4749B18k43K72l48J85j97K24j72j22J84qJ68j71k2M9j9J1j41Q8K14k28N6N4P4
$$ 218 -25 247 -101 84 -113 111 -61 -183 1 -7 161 -10 -32 17 -2 9 -132 -44 170 -58 -2 52 126
4772A26k90J12K36k86K58n0k92L37j45J99j61r6J4J76k57K84l60J29M8%J2k1j51
$$ 126 -164 -52 184 -102 156 106 -186 151 6 205 44 -52 -38 138 -119 165 -195 -66 -18 -18 -6 -27 -178
4795a78K82J3k22M2k7N0k64M45j25J9P6j10p5p8K00j19OQ1K11j72j68R2j68K82
$$ -178 104 117 -105 -63 -90 -40 -304 141 16 35 111 1 -74 -152 48 -71 -65 16 227 55 -113 -21 -189 93
4819I3m1j42K00j80J99j86J77j63J43o8J98n57K79J19j42K15m2k40J59J0N3l5
$$ 93 52 -90 110 -70 129 -57 120 -43 100 32 230 -327 -48 71 -71 144 102 -138 21 31 84 49
4841D9J81l52Q0Oj08K71j08n2j9R8J20j10j12p5K77p7m8o4P5J54k38K38j20j50
$$ 49 230 -122 -42 -36 -144 127 19 -33 -52 46 166 56 -56 -131 146 69 21 -43 32 186 -52 186 66 -84
4865h4M6O9J8r4J74k02K16Ml37L53l32N53j48k58k61P7K72k30J95m3j8J47j11
$$ -84 -38 31 49 -45 129 -73 143 147 -190 163 -169 384 236 -22 -283 -206 66 -164 31 -12 -30 117 6
4888Fj1K9j42J12k45P5K07j78J12K2j58j4J04O6j59j4L69k70J9P4O2p1n3n8L82
$$ 6 -5 24 -118 -6 -251 -176 31 -147 -35 -13 -171 -185 -81 -15 -174 -188 181 -89 -70 4 66 -5 -58 -116 266
4913B66k90q0J34j29Q1J66k64J42J2j38j27L23n0j48J42j01j87K46J65j33O1o8
$$ 266 -24 -104 30 -99 -18 148 -116 26 38 -100 -227 96 46 -102 40 -61 -248 -2 163 30 91 23
4935B3L8M7k5nl4J49j54j97K39j81Q9j51K94j60j20O3K03j21L9m9o8r4P2J85n04
$$ 23 61 108 83 78 44 193 39 -158 81 -100 -11 -162 132 -28 -148 -85 118 -3 36 -13 -81 -175 -103 82 -422
4960d22N70j59Qq2j79K51l1K58k81R7j43J94k92L63k04k7K20l0L5m7j12J41m40
$$ -422 148 -11 -3 -85 -264 -13 -44 214 -67 30 -113 81 -211 152 -52 -79 141 111 146 99 -13 128 -312
4983c12L44l20J82J57K1k34J12j09J95j72K4K00j52n3L23j71J42r4o5P5n7Ol7
$$ -312 32 -288 -106 51 72 -162 -50 -159 36 -136 -112 88 -64 -117 206 35 177 83 18 93 36 42 5
5006ER4k55M13m41K20P7j30Q7r2q7K44l54j3qJ34J78O4n6o2r0K93j38j15r9LL13
$$ 5 99 -156 257 -184 36 113 -17 70 -22 -109 135 -219 -232 -240 -106 72 136 80 18 -72 221 83 -32 -131 -128 185
5032A85J32m20n9L24l05J22j05J59j93K02j52n4RJ8L11m35J06K09k25OO9J56M3
$$ 185 317 -103 -162 162 -143 -21 -126 33 -160 42 -110 -164 -155 -137 174 -261 -155 54 -171 -165 -96 60 103
5055A03j87O8lo0J95J17M6k94L13l90J74M2j34P6j7N7l2J57n91N12p5Q2j48k16
$$ 103 -84 -16 -19 -79 116 233 279 -15 298 -92 82 124 -10 66 49 106 74 231 -360 152 77 159 11 -205
5079b05K22l8K13l41J51j21K95N0m3k24J1K9mQ1q1J55j31j59K9J79j1o8j9j81
$$ -205 17 -21 192 -149 2 -119 176 226 183 -41 -30 -1 -5 76 -5 150 19 -140 -111 68 57 -11 -30 -211
5103b11K09l04M52K2l21J91j46k6oJ91j75K00R4j72j1JJ40k43m4J1K81j05j8k07
$$ -211 -2 -306 146 168 -153 38 -108 -134 -140 51 -124 76 170 -2 -13 -12 128 -115 -159 -148 133 28 10 -197
5127a97O5K00J88k52k5J81k07K24q4j36K11k32J00j07J2L6j62j37L81n1o8J28
$$ -197 -132 68 256 4 -21 160 -47 177 93 -43 168 -64 36 -71 -59 -23 -185 -322 59 8 -60 68
5149F8k13J00L4n2j50J9L52k99K23K00k00j37J9L5j32J06P5l10L94k59K67k80
$$ 68 -145 -45 -11 -63 -213 -194 158 -141 82 282 82 -55 -36 -1 -133 -27 48 -262 132 -127 140 -140
5171a40P0K85o83M03k42K13M5j5k0K01j51J32k2k7J49j36J90k96J69k83K63k4
$$ -140 -70 215 -468 -65 -307 -94 -49 -64 -84 117 -34 98 76 49 198 62 252 -44 125 -158 105 81
5193H1j03j56j02L83o1k44K00j18j61Ln6N57Jj96j77J49K01j31j7Pj31R7j01J12
$$ 81 -22 -178 -280 103 42 -202 -2 -120 -281 -278 -334 223 224 28 -149 0 201 70 53 60 -71 26 -75 37
5217C7j23J74k35K48q6o6J56j73J67j20R1k7Q3j88lJ72l14K00r4J54j18R1k03
$$ 37 -86 88 -147 101 15 -51 105 -68 99 -21 70 43 126 -62 -65 107 -207 -7 -101 53 -65 26 -177
5240a77O8J01N3j55J04R0j16j71J30J36Ln0k40K75kj05O6JJ3Rj43K07JL5j41j04
$$ -177 -109 -8 45 -110 -6 84 -32 -203 -73 63 66 16 -224 51 49 -56 10 11 24 33 -110 97 98 133 -8 -112
5266a12j95L27k00J79J2k9L4Q9j72j92K43J41j96J3K6n1J96l3J19j47j62P8L4
$$ -112 -307 20 -180 -1 11 -18 16 105 -67 -259 -16 125 -71 -58 -32 -83 113 80 199 52 -110 -32 2
5289Bj07KJ93j09M4j8J6k87J62L13k78Q0lk48L63l6J31j25l1J26j54J62j91Q4
$$ 2 -105 -103 90 -19 25 7 23 -264 -102 211 -67 13 10 -238 125 89 220 95 64 190 36 198 7 91
5313I1j67K6K16P9l66M9r1P8J63k00J32q5k3j24J60K43k30J53k12J02n0J72k29
$$ 91 -76 -50 166 245 -121 -72 -163 -85 78 -122 10 -75 -98 -222 -62 181 -49 104 -108 -6 -56 116 -113
5336a13p3L4J41l1k27K33K5J36k01M6r0J14J90j78J74q5j94J55k2l3j16M5o8J83
$$ -113 -186 -152 -11 -42 -269 -36 -11 125 -76 -30 -120 -6 184 6 180 95 -99 56 34 1 -115 -70 -138 45
5360D5q5k4M5k9J34k50L28l36L1K69j26j5p8R0M2R5J6Rl3p3P1k17J79k8o0R9j78
$$ 45 -40 -64 -19 -48 86 -164 164 -172 -141 128 2 -13 -91 -1 41 136 152 161 128 55 126 -91 88 60 0 99 -79
5387g9J38j21J91k00KM5m2Q9k28J28l4J53R0j55K61l18l0NJ93n8J3m5J17j53J26
$$ -79 59 -62 129 -71 -69 -24 -66 23 -205 -77 -111 42 132 -23 238 -80 -110 -105 88 30 43 -2 115 -38 88
5412H8l4r6j63K17p3J70j89k1O9J83m02K47j08j04J8O7J0P3m0K51l03N7J11R4
$$ 88 54 -42 -205 12 -61 109 -80 -101 -32 151 -251 -4 -112 -216 -198 -131 -121 -48 -88 163 -140 -83 28 122
5436A22n3k44J09J05K4j02P7j29J84j07L5j44L06k6j81K53k92k46L55R6J22j57
$$ 122 69 -175 -66 39 63 -39 38 -91 93 -14 21 -123 183 157 -24 229 -63 -309 46 142 264 107
5458A07j8K7j12J72j84K49j82j05o2k02L41j46K10j13J22L6r2mL7J63ln62M51
$$ 107 89 116 4 176 -8 241 59 -46 -108 -310 31 -115 95 -18 104 140 48 44 81 244 241 -321 130
5481A30l01K30k42L71j22k06Q6Q6q1J86m6%o0P7k26K48r2P6Q4l05o0J89O0j20
$$ 130 -171 59 -183 188 66 -140 -54 32 -49 137 91 91 31 108 -118 130 38 114 198 -107 -167 22 82 -38
5505c8N6j55J32J60k89Q9R1Nk01K63j6j25k2O1j25J01J48k69o6J20R3p3J34m9
$$ -38 18 -137 -5 155 -134 -45 46 51 -150 113 97 -28 -50 11 -114 -13 135 -134 -200 -80 13 -60 74 25
5529B5k28K22K7R4l7j12K82l01j37M00k49K4qj34L19j20k67J00Q9n6J8j82K27
$$ 25 -203 19 46 140 103 -9 273 -28 -165 235 -14 10 2 -132 187 67 -200 -100 -11 -67 -49 -231 -4
5552dM0R5k35Q8O7k65K78q5j21l9J11o6K6j52L54j96q5J25J45j59J79J26k56j36
$$ -4 36 131 -104 -16 51 -214 64 -21 -142 -181 -70 -136 -110 -262 92 -104 -189 -64 81 -78 101 227 -29 -165
5576a65K01n0j55K8k6L97j00j93J38k32M30j01l99K01O5Q8r9J87l07J94j86n5
$$ -165 36 -14 -169 -141 -167 230 130 -63 75 -157 273 172 -227 -26 39 127 28 215 -92 102 -84 -139
5598a39R5o6K22k38n3K67j06l33L62m5p4k5J78kn0N6K36k17k34J90o8M5j15o9
$$ -139 -44 -110 112 -126 -179 88 -18 -351 11 -34 -108 -133 45 43 -7 49 285 68 -166 24 -44 1 -114 -183
5622a83O9K44m29L86j60R5L1N9j94K9J61p3p6M7jK38j42j12L1j81M48l06j38j1
$$ -183 -114 130 -299 87 -73 22 53 112 -82 -53 108 35 -41 6 5 243 101 -11 20 -161 287 -19 -157 -168
5646a68K34Q4k43J14j5j70J51j26j7O5o4K06l4J39O1j87L1j26K76n0k40O0j56
$$ -168 66 150 -93 21 6 -164 -13 -139 -156 -91 -155 51 17 156 217 30 61 -65 211 161 -79 -19 -175
5669a75M34l24j7K19l40N7j14K36m1j44K61M7j42K22p2k70J49n9J51N4j25l20
$$ -175 259 -65 -82 137 -203 -146 -260 -24 -65 -209 52 99 -43 179 107 -163 -14 -73 78 132 7 -313
5691c13J15L58q5o8j5k98K20M5Q8R6l13K83k24J48j2o4o8p1M29j44k44J78r3J10
$$ -313 -198 160 75 7 -8 -306 -86 -41 47 143 -170 113 -111 37 25 -39 -107 -178 251 107 -137 41 -52 58
5715E8Nmn6K92m16J74R1k74L64j74l76L03O1J44m97K60K05m8j5j59R4o7n9K16
$$ 58 63 59 3 295 -121 53 144 -130 234 60 -316 -13 48 192 -305 -45 160 112 97 -62 32 -35 -94 122
5739A22Q9j65J80k25Rn0j7Q7o2m2K76j89o2j25L03j25j42L24l08J87jl00L32j3
$$ 122 211 46 226 1 10 -40 -57 30 -32 -74 202 13 -49 -174 129 4 -138 186 -122 65 64 -236 96 83
5763H3p1J16K3k07J27j23j98J94O8K49m27q2M40j51j18K34k69Q3j0k4Q8l9J92
$$ 83 12 128 151 -56 71 -52 -250 -56 12 261 -166 -248 192 41 -77 157 -112 -29 -39 -63 25 -14 178
5786A78j43p2R4ro5L4k6Pq8K32j83j50J99K9j17o5NR2K8j3n9J59r6O5r1M1j03
$$ 178 35 -37 57 48 -17 17 -9 -2 -90 142 -41 -191 8 37 -80 -145 -140 -48 -20 -33 -92 67 -29 36 -55 -14 -117
5813a17R4j66K30j14Q8L7J16j69k24q8M98j58J11k76J22j07p2K54k4o5l3N0J75
$$ -117 -23 -189 41 -73 15 52 168 -1 -225 -313 185 27 138 -138 -16 -123 -195 59 35 -30 -63 -13 162
5836A62j23j48J72n8r5K77k18rJ56j47r0k0J61j13j2p9M48n34J55J03o8J95Q6
$$ 162 39 -109 63 5 -90 187 -31 -40 116 -31 -121 -141 20 -93 -105 -184 264 -270 -115 -12 -80 115 201
5859B01l72J00j7j60K35j88K55j19NJ64p2K48l25l4N5L3r1K03k3r8J2n6K22k85
$$ 201 -171 -71 -88 -248 -13 -201 54 -65 -60 104 32 280 -45 -79 -24 9 -82 121 98 0 12 -44 178 -107
5883a07L90m44K95J6k74N9n1K54q8k04K61j75P5j82K33r9P8k53L83k2l73L25O
$$ -107 283 -161 134 150 -124 -65 -116 138 50 -154 107 -68 7 -175 58 -41 37 -216 167 145 -228 97 103
5906A03k60K38JJ39k40kK88n11L55j72k3J67K35n02L70j6j71mj09K29j51J58K16
$$ 103 -157 81 82 221 -19 -21 267 -244 111 -61 -84 83 318 -184 186 170 -1 -5 -114 115 -36 122 338
5929C38k18j28Q2j1r2K15M1j49l20N24l46N9Q4j71J13Jj1N2p5J21k24J49r0J04
$$ 338 120 -8 74 63 -29 186 227 78 -242 282 -64 -5 79 -92 21 22 11 63 -12 109 -115 34 -56 48
5953D8o7J28J56j24n7j87J48r6K66n99M06J63k25o8J32K24k24k01M7R9N2O2k51
$$ 48 -19 109 265 141 84 -103 45 -51 215 -384 22 185 -40 -108 24 248 24 -177 -130 -31 21 83 -168
5976a68J53J14j89J96p4k5p6P8j22J66k58R6J35O9k63j06O43n31J01N6J02k5k34
$$ -168 -15 99 -90 106 32 7 -69 9 -113 53 -205 -109 26 95 -168 -274 369 -162 -61 -5 97 72 -162
5999a62K17L2o1J1M0j77J21k29J84K25k66J08K9j30J9P6j69J16o3J14j19R9J90
$$ -162 55 87 26 37 77 -100 21 -208 -24 201 -65 43 72 -58 -39 37 -132 -16 -79 35 -84 15 205
6022B05j33j84K45K6j28j42L59k22J9j20J23K29n99K13K95k92J11k06j39L22Q4
$$ 205 72 -112 133 159 31 -111 248 26 45 -75 48 277 -322 -109 186 -106 5 -201 -340 -18 66
6043F6j13O3q2J73k2l2k19L00j13l6N5J84j90j01J04Lp1k9J62j88J5J44q8k69
$$ 66 -47 16 -66 107 85 53 -166 134 21 -15 40 224 34 -67 37 40 -31 -60 102 -86 -71 73 -15 -284
6067b84M41j21j1M4p0pK73l81K96j55n0J67l66j29K89J0m3K07q8P6k59K1J85L6
$$ -284 157 36 25 69 -1 -8 265 -116 180 25 -25 142 -224 -353 -64 -54 -97 110 22 98 -161 -140 45 81
6091H1J58k36J5K7o6J28j88N0K28j0k90Q7J56j77J50k63M1N0J6K46j50k57J37
$$ 81 239 3 18 45 -21 107 -81 -31 197 187 -103 -16 140 -37 113 -150 -109 -59 -43 203 53 -204 -67
6114f7l6O6K29J59k96k30J60n8o3L49l37l8M25l81J20K4J95k49J92j32Mj1N3j42
$$ -67 -103 -37 192 351 55 -175 -15 -73 -136 213 -124 -162 263 -118 2 26 221 -28 164 32 36 25 78 -64
6138f4R9j4o3J59j00j41K13j55L69m23P1l7L5n8K88k82O1J82k39L1J6J4J64p7
$$ -64 35 21 -42 117 17 -124 89 -66 303 -120 -49 -86 -51 -109 179 -103 -42 140 -99 -68 -52 -38 126 49
6162D9J61k9j69K7l26K02L22k11p2j55m6J55J96j91R4o1OJ51k37r4K70r7K44k73
$$ 49 210 181 12 39 -287 -85 237 26 -46 -201 -247 -92 104 -87 7 -54 -48 103 -134 -228 42 -55 189 -84
6186h4O4L9K23k56n6M6j04J66o9mj56Q3r8K60o3j66Q7K56p3M1j81K19Q6k80l1
$$ -84 -20 19 242 -14 -70 -24 -128 38 -31 -35 -191 -108 -206 54 -9 -175 -88 168 95 136 -45 174 260 -20 -51
6211e1q1K68m01K18J53j45N1k16J98L5Q6j54rl1P7J50j47L0l3R4j35n6Q3j8Q9
$$ -51 -132 136 -265 -47 106 -39 12 -204 -6 29 115 -39 -48 -79 -2 148 1 31 -2 92 -43 -99 -16 -34 55
6236E5j41J08l5k04N04l67J76n2j08O8O5k44p4M03l42J01l6J24Q2m1k08K9N1J15
$$ 55 -86 22 -13 -217 287 -80 96 44 -64 4 69 -175 -249 154 -188 -87 -123 1 83 42 -166 -137 -86 29
6260B9r4J46J26m30J69j7J12J43k44O7M2k49K88q6j15q1K50O1k33j60L29p9k3
$$ 29 -65 81 207 -223 -54 -71 41 184 -60 7 49 -200 88 2 -113 -194 56 117 -116 -276 53 -26 -49
6283d9J67K8q0n3j72o8K96j44J42L3j80jK40l06O6P6q5J68J0j44m2M49m56J23
$$ -49 118 146 66 13 -159 -227 69 -75 67 100 -80 -81 159 -147 -81 -5 -90 78 88 -56 -98 351 -105 18
6307A8J15j70n7m8J40M4l91M40lJ94j64j80L7M9j24J69l91L96l80J55Q7j01L47
$$ 18 133 -37 -94 -142 -2 42 -349 91 88 282 118 -62 -25 24 -100 69 -322 74 -306 -151 -64 -165 182
6330A82k96K67k98J90%j54j10L52k14Q0K10j7p1j35J03q2l45M53N4j44q3Q6j52
$$ 182 -114 153 -145 45 45 -109 -219 133 -81 -1 209 192 121 -14 89 7 -338 115 169 25 -58 28 -124
6353a24K65j50k84K58m9N7J27O9qq3q7J5J22j56J94k68M7nL6j65J50L3o6J2J62
$$ -124 141 -9 -293 -35 -84 -27 100 169 161 78 -9 6 128 -28 166 -102 -55 -60 -24 -189 -39 -6 -72 -60 102
6378A02j18j49M7J00J78j45J38n2p7k47L92k6l18K42o2J65k16j7L7J9K3%j53J00
$$ 102 -16 -165 -118 -18 160 15 153 101 24 -223 169 143 -175 67 5 170 -46 -63 -26 -7 16 16 -137 -37
6402c7K66k48J07J3l51J34K60m4j07p3K26j97J43n8J29j34O7j46l8R1k11J82K65
$$ -37 229 -19 88 101 -250 -116 144 100 -7 -80 146 -51 92 34 163 29 96 -50 -88 3 -208 -26 239
6425B39k74p6L9M6M6j61J53N8l2j44K7j64L47J9k44K7O4p5KL28k10k91J54J32
$$ 239 -35 -111 -72 -26 20 -141 12 70 38 -106 -79 -243 104 123 -121 -94 -30 -105 -103 225 15 -276 -122 10
6449A0J81j94o9J56J90k80j03J07o1K8R3p7j11K03l0n9Q6O1R3k81J38j50QQ7q
$$ 10 191 -3 -72 84 274 -6 -109 -2 -63 -35 58 -19 -130 73 43 -16 70 131 224 -57 81 -69 -61 26 18
6474A8M1J7m0p7K7p4K68k5q2k76J13J76j70j55P3K29k57J09M17j65l15K33j0J
$$ 18 59 76 36 -41 -14 -88 180 155 73 -203 -90 86 -84 -239 -166 63 -194 -85 332 167 -148 85 75 76
6498G6l1j29J26J70l03L2j11J17Q0Q2j67p9P6qj61K02j23M07O9k60J9j63K04j80
$$ 76 45 -84 42 212 -91 -59 -170 -53 27 109 -58 -137 -61 -69 -230 -28 -151 256 325 65 84 -79 125 -55
6522e5J67k25o2K42p3P5K87j63J3m51p9L16l1K8M4k00J80k26K67j34j8K65k84
$$ -55 112 -113 -175 67 -6 69 356 193 206 -245 -324 -8 -39 -11 33 -167 13 -213 54 -80 -98 167 -117
6545a17J04J90o5n0q6K00l07J57rj11J25j92j7R4K82l54Q6Q4jj24O6P2J31k17
$$ -117 -13 177 112 62 -24 176 -131 26 17 -94 31 -161 -178 -84 198 -156 -70 14 13 -111 -45 27 158 -59
6569e9l03M33L4J1l9q0r7P7rO8r4J2j4K38j57l2j37J71p9j10K74l9j51J37j28
$$ -59 -362 71 105 116 77 -3 -100 -23 -32 36 -58 -46 -60 178 21 -11 -148 23 -56 -166 108 69 -82 55 -73
6594g3J7J12%k32J77J75m6k01K20k39J26o8P8j54K3P0N5k76R3L8kQ8j72K03o3
$$ -73 -56 56 56 -176 1 176 130 -71 149 -90 36 -32 46 -108 -85 -15 40 -236 -143 -105 -107 -19 -191 12 -51
6619e1J54O7l30K58j44Q9K52l36j52j8j5K63n9n4N6l8J77k10R6k18L35N8m08K03
$$ -51 103 170 -160 98 -46 43 295 -41 -193 -211 -226 37 -22 -76 -20 -58 119 -91 5 -213 122 180 -228 -25
6643b5j7j38K88j13J54j63Jj6j01M0j8Q4K45n2l96J94J41k14M7J50o3j42K34k55
$$ -25 -42 -180 108 -5 149 -14 -13 -29 -130 -90 -108 -24 221 169 -227 -33 108 -106 -59 91 28 -114 120 -135
6667a35J59j11N4K0j18J26M1r0j07J35J09j6k4l19L52P5k13J03k55K18J09r0j3
$$ -135 24 -87 -33 -13 -131 -5 36 -54 -161 -26 83 67 43 -276 76 151 -62 41 -214 4 113 23 10
6690A0J92j64O5q5J42N2n30M28o2M8l81M48k2j09j81K74k12J51o9N8k42q3L12
$$ 10 202 38 103 18 160 212 -318 110 48 96 -285 163 141 32 -149 125 -87 64 -5 53 -189 -272 40
6713D0n6Q5K61j21j10j27j14K16k29L01n7M9k68K37k71K47j46j0j23M46j60j60
$$ 40 -16 69 330 209 99 -28 -142 74 -155 146 89 138 -130 107 -164 83 -63 -73 -196 250 90 -70
6735g0N3j23P7K44j82m1J10P8k90J1J35P3j48L21j42l94K64j02J54L0n1J05J5
$$ -70 -17 -140 -63 181 -1 -42 68 146 -144 -133 2 75 -73 248 106 -288 -24 -126 28 58 7 112 127
6758A27k38N5Q3j21J24J43N5l17J53m6l2Q0j51L2J16J85k13Q2j19K3K28j78j50
$$ 127 -111 -56 27 -94 30 173 228 -89 64 18 -14 66 -85 -53 63 248 35 117 -2 21 249 71 -79
6781g9K90k04r1N9L8K2K23l2j83o3O5n6k37K84K1%j74J71j21j51K37k11J89jJ27
$$ -79 211 7 -84 -25 13 35 258 226 43 -20 45 -11 -248 36 57 57 -117 54 -67 -218 19 -192 -3 -4 123
6806A23m8pK5k06K59M2k62K32j14J53l99J64J43m8p1J9n0N5mm9q4j58J83J95r4
$$ 123 75 68 93 -113 146 188 -74 158 44 197 -202 -38 105 57 -14 5 -45 10 6 -43 -127 -285 -102 93 -1
6831aK3j49J57N5k40M4M13k91j86K45n0Mn4J54l9k18k5L53k59J61l47k5M42k74
$$ -1 22 -127 30 85 -155 -111 302 11 -175 70 20 24 -30 124 85 -133 -158 195 -64 97 -250 -275 167 -107
6855a07r6K06n1n1LK10P1l99L52l01J07O0j07N5M9o6J13J95m36J8L65j23l47K83
$$ -107 -203 3 -48 -99 -96 114 185 -214 138 -163 -56 4 -103 -48 1 -65 48 243 -193 -175 190 67 -280 3
6879Ck29j40L83J00j69MR3j82R4J19RM8Q4l77O2O5q4J10r6j48L74q1K46l92J11
$$ 3 -226 -366 17 117 -52 -48 45 -137 -43 76 85 133 217 -160 -98 -33 -117 -7 -103 -251 123 42 288 -104 7
6904Gk9k64M62l64K66l3J01O3j95r5J01Q6j71K60k36n6Q4j64J77J14Lk0j80Q4
$$ 7 -22 -286 176 -188 78 45 146 209 14 -81 20 106 -65 195 -41 -97 -13 -177 0 114 117 97 -83 1
6928AQ9j0L5j23j33M9J53M6k37J75k8J47m85L19k7J92l93K83Lj3k37J50n3J67
$$ 1 90 80 115 -8 -141 -92 61 107 -130 45 17 164 -321 -2 -29 163 -230 53 56 43 -194 -44 -97 70
6952G0k31J92k83K76j57J47K14j64n2p9J41M3J34Pj12j47K2j06Q6l5J6l3p3L43
$$ 70 -161 31 -252 24 -133 14 228 64 12 -67 74 117 251 258 146 -1 21 -85 1 -34 -18 -51 -124 219
6976B19p0k7J42l09j35N4Q2k54M09J79m51K34J99j57j80j50J62K4q4K15L2j45
$$ 219 149 122 264 -45 -180 -126 -44 -298 111 290 -161 73 272 115 -65 -215 -53 -29 -113 102 134 -11
6998a1L3k09J68J6P1r9LJ10k14N9J20n7j48J50J49k02k8k8J65K2Ok22J27J1Q6
$$ -11 22 -187 -19 -3 68 -31 -28 82 -132 -73 47 -10 -158 -8 141 -61 -89 -117 48 70 76 -146 -19 -8 78
7023G8r0J92j55k34M3L81l70k2K88n3P8k77K02j44K59Jk7J08m78O8K01O2o9N6
$$ 78 -12 180 25 -209 -166 215 -155 -177 111 58 136 -141 61 -83 176 177 150 258 -220 -152 49 111 42 98
7047I8l83n2K49j3J18K49k66j00K27j65L9n0P9M1o3J63l16K17m58N19p3j49j8
$$ 98 -285 -337 -88 -101 17 266 0 -100 127 -38 1 -49 30 71 8 171 -145 72 -386 133 60 -89 -107
7070a07K11M1j89M6m4Q9j94L58j99p6J62n7R8j53J43j38j20l9M6J41M2j46n4L16
$$ -107 104 145 -44 2 -42 47 -147 211 12 -64 98 41 139 -14 129 -9 -129 -168 -122 19 61 -85 -139 177
7094A77j39n6M7l3K29l09J59n1J5qj20k2K51k11l3J19P3r2J43k16m3J36Q8l4l7
$$ 177 38 -18 29 -4 225 -84 75 24 39 31 -89 -111 140 -71 -104 15 88 -4 139 -77 -120 16 104 70 33
7119C3l04L34j06K70k90j9J95k74J77K0J06l80J44L18k43N2o0L38m0l65L70j17
$$ 33 -271 63 -43 227 -63 -82 113 -161 16 36 142 -238 -94 224 -19 33 -27 311 271 -94 276 159
7141A59m46L15j7%k5p2K29k66L9P4k2l4Q1l3rJ39k03n4P9%J16j05O5k5j2k37J21
$$ 159 -287 28 11 11 -14 -86 143 -123 -84 -10 -32 -66 15 -18 -27 112 -91 -145 -66 -66 50 -55 10 -15 -27 -264 -143
7168a43J16qJ09q8J9j2k65J97k10L74j94J49j2m3R7j34L3K09k42o3K12L6j13J8
$$ -143 -27 -35 74 -14 5 -7 -272 -75 -285 89 -105 44 32 -11 86 -48 -15 194 -48 -111 101 137 24 42
7192D2M8M1r2R6j05Q6mN2k9n0k35J90l27L13Q5q0n5J2N4m0k08J44L16k46J51j64
$$ 42 90 131 39 135 30 116 112 164 135 85 -150 40 -287 26 111 31 -24 -12 42 2 -206 -62 254 8 159 -5
7218ej80L38N0m2o4m7K27j15j85j30K28j91RJ09J0nr1J71Lj98K07k37K87j68j4
$$ -5 -185 153 203 161 97 50 277 162 -23 -153 75 -116 -107 2 12 7 -84 87 90 -108 99 -138 149 -19 -33
7243c3l6J76k49P4J64k7q8L1j47J02N5r0K05m29L12k11R2J36qJ09j08j19R4lo3
$$ -33 -69 107 -142 -68 96 69 -19 12 -135 -33 22 -68 137 -292 20 -191 -99 37 29 138 30 -89 5 2 -61
7268f1L2k9N4J02j76J82l82J60M46m99J23Q2j50J85J41j45j82J25J93k50j7rk4
$$ -61 -29 -58 -4 98 -78 104 -278 -118 328 -171 -48 34 -116 69 210 65 -117 8 201 -49 -66 -75 -99
7291i9L6J05k12R8J16M8l26K79j53NJ93q3J23j25q1J03p6J69l5p5K6Q3j20l6M0
$$ -99 -63 42 -170 -72 44 92 -234 45 -108 -103 90 7 130 5 -76 27 -49 120 85 10 36 119 -1 -37 3
7316CJ92j17Ok31J77j54J76r1k2J05k52J7M6N7J47r2j27l6M24k30LJ43J43j35
$$ 3 195 78 84 -147 30 -124 52 -39 -61 44 -208 -191 -145 -88 59 -33 -160 -196 228 -2 1 144 287 152
7340A52J23k28j42L7J32k03K86p3l7q0J12j35L3j92L50k42J63K35n33N9N0k02
$$ 152 275 47 -95 -58 74 -129 157 84 47 -33 79 -56 -23 -215 135 -107 56 291 -242 -183 -133 -335
7362c35N34n2j36J56l29K54J4j33J21k11J42q4J5J0J64l34L76nj32j74M5K64k66
$$ -335 199 147 11 167 -162 92 106 -27 94 -117 25 -59 -44 -34 130 -204 172 167 35 -139 -94 170 -96
7385i6J72j32J64j22m8j56K09J35j13q7K65l74M36k93J56k22P3J29m3K49k84j4
$$ -96 76 -56 108 -14 -62 -218 -9 126 13 -74 191 -183 253 -40 116 -106 -33 96 53 302 18 4
7407DjL2J9K34k72j04j5K98j42k64J36kq0J53P0j90K28q6R6l8o8N1j37J90k74
$$ 4 3 35 54 288 16 -88 -103 195 53 -211 -75 -77 -157 -4 66 -124 104 18 114 76 8 59 -78 112 -162
7432a62j84N52k31j66J44mR6N8j5k13K29j35J70j77l3m1J42J49l27L30k43J70
$$ -162 -346 206 -25 -191 -47 -51 45 103 88 -125 104 -31 139 -38 -71 -112 30 179 -148 182 -61 109
7454A09r1j76Q9J74j53PJ13q3j39q0K30j0k0lK04k73J13J7J23j96r0R7m8j17K43
$$ 109 18 -158 -69 105 -48 -41 72 -11 -150 -230 0 -10 -30 -33 171 -102 11 28 151 -45 -135 -38 -86 -203 40
7479D0j12J78kl12J30L64k14j9k02N4j9K60p5qj4N1j1j45J32k30k9J79N6j17K8
$$ 40 -72 106 104 -208 -78 286 72 53 -149 -95 -114 146 71 63 49 100 89 -56 76 -154 -183 -4 52 -65 -37
7504c7Lo5Q1J74j27Lj8j27K12K5m50L16Q1j37j39L33o5l8J4o8P8k8j08J43L7k1
$$ -37 -34 -99 -18 156 29 32 14 -113 99 124 -326 -10 71 -66 -205 128 63 25 39 -29 49 21 -87 56 93 72
7530G2r3K6J61k1j91O4R4l12J86O6l03L19j86K73j25m8J75j47n2PM7LJ1L0j72
$$ 72 -21 5 166 145 -46 18 112 -200 -14 52 -251 68 -118 155 30 -18 157 10 -42 -35 12 15 26 56 -116
7555a16L31J0j99k43mJ10J4P3n3J71N4j26p9k59L49j51J76k53K50k7o8J71k74
$$ -116 215 225 26 -217 -221 -111 -97 -24 -77 94 148 22 -57 -316 33 -118 58 -195 55 28 -40 131 -143
7578a43n6J82m9K92j54j69J81k54n7L83p4k48J56L04k56Q2k65L85o4l6j60N0J9
$$ -143 -199 -17 -66 226 72 -97 84 -170 -227 156 82 -166 -10 294 38 120 -145 240 176 140 -20 30 49
7601D9j05J31j24j26P9J31K1J4j44J81j5j52J15j23N3r0K46q6J2q8j59K16j29
$$ 49 -56 75 -49 -175 -96 35 56 70 -74 107 92 -60 55 -68 -15 -105 141 55 67 -21 -180 36 -93
7624i3K21n6k03J76o9n5J1J07P7j30j5O4q5K34j28K54k41j18p2J02m2J44k3j74
$$ -93 128 72 -131 45 -24 -79 -68 39 116 -14 -29 35 -50 184 56 310 69 -49 -121 -19 -61 83 60 -114
7648a14m5K25o7L81k29j57J18j43J33m5l8L6J86l52J41j54K70n3k7m5q0k1j7o3
$$ -114 -159 66 -1 380 151 -6 112 -31 102 57 19 55 241 -111 30 -124 146 93 66 21 -59 -80 -97 -160
7672a60J52j96L99j02k69J60K2M6J61j28j33J95j69j14L19j43j10J29J66j51j22
$$ -160 -8 -204 195 93 -176 -16 6 52 213 85 -48 147 -22 -136 183 40 -70 59 225 74 -48
7693d8J36J37l70j4J71l4j19J82k41O8J12n8KK06j29j99L58j47J31k45J20n5k2
$$ -48 88 225 -145 -159 12 -22 -141 41 -200 -132 -20 -78 -76 130 1 -198 160 13 144 -101 19 -36 -58
7716e8KO4O7k80L37j19j93K37j23J15p2Qj76K86k7j66K20k96J61J59j29J79k77
$$ -58 -56 8 75 -205 132 13 -180 57 -66 49 -23 -15 -191 95 68 -98 122 -174 -13 146 17 196 -81
7739h1j83R5J14jK11j12j22J20P4l26L20k16k5M3K17N9l08P9j04K71j76J2j73
$$ -81 -264 -169 -55 -56 155 43 -79 41 115 -211 109 -107 -132 -89 128 187 -121 -42 -146 125 -51 -39 -212
7762b12j13K31J64j82M4L0n5J60m9J04j48p3J25K8R9k29J38q9j00L2J2P4R5k0
$$ -212 -325 -94 70 -112 -68 -38 -93 67 18 122 -26 -99 26 54 153 -76 62 -27 -127 -95 -83 -9 86 66
7786F6k89K86p3q1K28l1k90K25K4L5J32k31K40L7j50k64L53k32j2j24K03k72M99
$$ 66 -223 63 -10 -91 137 106 -184 41 65 100 232 1 241 278 128 -136 217 -15 -27 -151 52 -220 279
7809B79j10q5p1o0KJ30J04k36p3J18k5L03l86m8%J57J15k19j3K8N9J4PR0j40O3
$$ 279 169 84 13 -47 -45 85 189 -47 -120 -2 -27 276 -110 -158 -158 -1 114 -105 -118 -90 -31 -17 -10 80 -60 3
7835Cl6L4K5J06j97l3J82j74m7K16k21K84l20J16K61l7J66m27r1l9M01j03LR4
$$ 3 -33 1 26 132 -65 -98 84 -90 -137 79 -142 142 -178 -62 199 162 328 -99 -190 -229 172 69 72 166
7859A66m7j81P1J64k38K68j64p3R7j16o2L30k27L3R4J07p4j82K07l59K28j30K8
$$ 166 119 -62 9 173 -65 203 39 -34 63 -53 -115 215 -12 21 115 222 148 -34 173 -186 42 -88 -60
7882f0j28L26k41j38L40j23Q7R0K03l17j79J14J3k18P5K81m3k84K27J95k47n0
$$ -60 -188 138 -103 -241 99 -24 63 153 356 39 -140 -26 -13 -231 -156 125 82 -202 25 220 -27 -77
7904g7K7m6J05J88n3k92J42o7J81j41J87l02o3L18J40m20N2K20q4j7LJ07j03K09
$$ -77 -50 -96 9 197 144 -148 -6 -73 108 -33 154 -148 -211 107 247 -173 -121 99 15 -2 1 108 5 214
7928B14n02K41N9R9K5j67K81l20J11L8R8KK17l88O5j53R7k80J39J95r6J35m5k27
$$ 214 -288 -47 12 111 136 -31 250 -70 41 79 177 179 396 8 73 -80 17 -263 -124 71 -25 110 65 -162
7952a62J28K7J99k91QJ15p8Q3R4J90k39P0j95J00j96N5K04l1j25p2L26m42J47
$$ -162 -34 -7 192 -99 -91 24 -54 29 123 313 74 144 -51 49 -147 -92 112 81 -44 -116 210 -232 -85
7975h5k40L61J24j4k40L11k25k7J17m3p9j24J21j15L55k7k26j0K80l27Q7J65j69
$$ -85 -325 36 160 146 -94 217 -8 -35 82 39 -40 -164 -43 -158 197 170 -56 -66 214 -113 -26 139 -30
7998c0L6j01J4L54k83N0j34K58j97N6Q2k12qJ18o8J68k93L45l7j98O8R2K95m56
$$ -30 6 -95 -81 273 -10 40 -94 164 -33 23 105 -107 -115 3 -65 103 -190 155 118 -80 -12 80 375 -81
8022h1j11L47q5LN7nJ14k71Q3j19J11Q0k60K43n7j54J43J04j78n1J89m3K2j96
$$ -81 -192 155 70 73 130 125 239 -32 51 -68 43 123 -137 106 49 -105 38 142 -36 -87 102 59 81 -115
8046a15mJ53q0J40Q1j03n3j41J50J78k40K68j88J65j64j38K76J3k7j9j63L6L6
$$ -115 -119 34 -46 94 175 72 19 -122 28 206 -34 234 46 211 47 -91 185 198 171 152 -11 25 61
8069F1j93J85q1l47N20r2r1j33J46P3p6N6L8l47L10q2J42K9l15L40N0j79j01M5
$$ 61 -132 53 -28 -375 145 53 -38 -171 -25 48 -28 28 66 -281 29 -53 89 118 -197 143 193 14 -87 -42
8093d2j10J12O6K10k26K35l54L39k25P8O7j29M1m3J98l28P9K18J25l76l4K96j31
$$ -42 -152 -40 26 236 10 245 -109 230 5 83 150 21 62 19 217 -111 -32 186 311 -65 -99 197 66
8116F6j21o5P2KK98J37l73n3PK0j21K80K7j91r4K51j56j51K01j9J98o5j1Kj55
$$ 66 -55 -120 -48 -46 252 389 16 -37 -30 -10 -131 149 176 -15 -109 142 -14 -165 36 17 215 150 139 141 -14
8141a4K04j43R2N5l26J24p0O6J7n0j04K06r5J04l5O0J76k31j55R6L8J7k0J2J01
$$ -14 190 47 139 194 -132 -8 -78 -12 5 -45 -149 57 -38 66 31 91 267 36 -119 -23 15 32 12 24 125
8166A25j16Qk41M42l50J2J54n5jQ2o0o5M6J31j07J70j84K13j26j81K06j01q0J1
$$ 125 9 17 -224 218 -132 -120 34 -21 -22 60 0 -65 -19 112 5 175 -9 204 78 -103 103 2 -78 -67
8190f7J34
$$ -67 67
8191F7
$$ Imaginary data points
##PAGE= N=2
##DATA TABLE= (X++(I..I)), XYDATA
0@%%%%%%%%%%%%%%%%Qj6J6j6J6j6K4l2L2m0M8n5O3p1Q1r0J04j19J33j49J68j87
$$ 0 0 0 0 0 0 0 0 0 0 0 0 0 0 0 0 0 8 -8 8 -8 8 -8 16 -16 16 -24 24 -31 32 -39 42 -48 56 -63 70 -79 89 -98
38i8K07k31K58k86L17l51L88m27M70n19N72o31O96p66Q43r33J032j142J269j417
$$ -98 109 -122 136 -150 167 -184 204 -223 247 -272 300 -331 365 -401 442 -491 541 -601 668 -749
58g49J590j798K050k360K758l282M017n114O916j0373J9226q0695j68989K43683
$$ -749 841 -957 1093 -1267 1491 -1791 2226 -2888 4028 -6345 12881 -67814 -236803 6880
72F880J62432j55397j19146R9552P0442l1968k8147k1344l4387M3790Q1634k9305
$$ 6880 169312 13915 -105231 -5679 64763 32795 4648 -16696 -51083 -7293 74341 45036
84D5036j15756n85J29979M2651j25183p5674Q7076P5036n3297n3167K5133K7013
$$ 45036 -70720 -71305 58674 101325 -23858 -99532 -12456 62580 9283 -43884 -18751 8262
96H262N225J5086l0534o0650L7121Q7483l6477q5897M0914P5473l4708m3406L0325
$$ 8262 13487 28573 -1961 -62611 -25490 61993 25516 -60381 -19467 56006 21298 -22108 8217
109H217l87l6092L1570L9931m8158l8766N7882M3128n8708n1207M7866M0159m6241
$$ 8217 7830 -28262 3308 43239 -4919 -43685 14197 57325 -1383 -52590 -4724 35435 -10806
122a0806k4337N1546N563n9729K1060P2500m7083q7149O0874R0906o2805q2195
$$ -10806 -35143 16403 21966 -37763 -16703 55797 8714 -78435 -17561 73345 10540 -71655
134g1655O3857P4395m8886n6424L0827K6805j9467l52J3160j5970o910L2548Q258
$$ -71655 -7798 66597 17711 -38713 -7886 18919 -548 -900 12260 -3710 -10620 21928 30186
147C0186m4821k0379M0691K2462l6957k2862L5618K1559k9451j2889K0658p290
$$ 30186 -14635 -35014 5677 28139 -8818 -31680 3938 25497 -3954 -16843 3815 -3475
159c475j5165K3480Q017l2669O624M3424j4912m3174K1767L3805k8516k3128L1883
$$ -3475 -18640 4840 12857 -19812 -13188 30236 15324 -27850 -6083 27722 -794 -23922 7961
172G961J6589k7120o929K3347r89k4256J896J7990p825j3481J6749J2410k5057
$$ 7961 24550 -2570 -9499 13848 12859 -11397 -9501 8489 664 -12817 3932 16342 -8715
185h715j2097L2548P076m5302o106N2536P503n0581k362M8017J088l8273m40K1309
$$ -8715 -20812 11736 18812 -26490 -32596 19940 27443 -23138 -25500 22517 23605 -14668 -15108 6201
199F201j539l045O249q200o452J8388R160k5061j6954K1885J9682j6965k1884
$$ 6201 4662 1617 7866 -334 -6786 11602 20762 -4299 -21253 632 20314 3349 -18535
212a8535J2728K3536j0072k2180N646J0775p394J148R991j1498p672K3873Q301
$$ -18535 -5807 17729 7657 -14523 -8877 1898 -5496 -4348 5643 -5855 -13527 10346 18647
225A8647l2010q679L2657O007k6440p92K1088J491j0619O38M14n201L786O407
$$ 18647 -13363 -22042 10615 16622 -9818 -10610 10478 11969 1350 1988 2402 -2799 987 7394
239G394o819q257Q053J1175o180j6797K826J6291m636j8203P221J8094q712j3337
$$ 7394 575 -7682 371 11546 5366 -11431 -8605 7686 3050 -15153 -7932 10162 1450 -11887
253a1887J2791P028j5911r82J5688m584j0058J1175P485j0632k282R677l429r640
$$ -11887 904 7932 -7979 -8961 6727 2143 -7915 3260 10745 113 -2169 7508 4079 -5561
267e561N354P388n028m511M087N211m398q973K053P982n219p962P754P398q974
$$ -5561 -207 7181 2153 -2358 1729 6940 2542 -6431 -4378 3604 -1615 -9577 -1823 5575 -3399
282c399l651J0228j681j1401P042R663r688l816J2755K085j1245J134Q622m096
$$ -3399 -7050 3178 1497 -9904 -2862 6801 -2887 -6703 6052 8137 -3108 -1974 6648 2552
296B552o281N402L331l225J00J552j358k595j399J738r5m241q4P643L08r998Q96
$$ 2552 -3729 1673 5004 1779 1879 3431 2073 -522 -1921 -183 -278 -4519 -4603 3040 3348 -6650 -5754
313e754J0881n066j0606P330P800o349j000P023k322m304N289J914p861J079Q773
$$ -5754 5127 61 -10545 -3215 4585 -1764 -2764 4259 1937 -2367 2922 4836 -3025 -1946 6827
328F827k195n582K405L159j822l479k011K104K293k395k215L311J355n271L02
$$ 6827 4632 -950 1455 4614 2792 -687 -2698 -594 1699 -696 -2911 400 1755 -3516 -3214
343c214L372l946k208O693N75o190L880O929n312n021N855K142m950J681L884
$$ -3214 158 -3788 -5996 697 1272 -4918 -1038 5891 579 -4442 1413 3555 -1395 286 4170
358D170k791M32L290k743l535J652J484j289r17j460O59L624j507o325J199M917
$$ 4170 1379 1811 5101 2358 -1177 475 1959 670 -247 -1707 -1048 2576 1069 -5256 -4057 860
374H60l150k256L639o16j342M689J379p183l58Q051o14n321J951L176J88J542
$$ 860 -2290 -4546 -907 -1523 -2865 1824 3203 -3980 -4338 3713 3099 -2222 -271 2905 3093 4635
390D635j196m859R05M869j572m370j14K016J231J404l731n931M144O025m594m963
$$ 4635 3439 -1420 -515 4354 2782 -1588 -1702 314 1545 2949 -782 -6713 -2569 3456 -1138 -6101
406f101K897K921J182L56m208l601P012N668o941m604P045L848k701q19j714j986
$$ -6101 -3204 -283 899 1255 -2953 -6554 458 6126 -815 -5419 1626 5474 2773 1954 240 -1746
422a746M139L647m940m967L868M783m01m538n459J437Q081q45r988m32Q712K122
$$ -1746 2393 6040 1100 -3867 1 4784 4383 -155 -5614 -4177 3904 3059 -6929 -7361 1351 3473
438C473n677j415K26P99N044J018p581j159Q742L552n464m878R83N932M906o196
$$ 3473 -2204 -3619 -3393 -2594 2450 3468 -4113 -5272 3470 7022 1558 -3320 -2337 3595 8501 2305
454B305q918N715J0086m144r408J041M651O60q44m022l119M114N650k449n795
$$ 2305 -6613 -898 9188 5044 -4364 -3323 1328 1988 1144 -2878 -5997 -1883 3767 1318 -4477
469d477o19L157M275O21q125l157J1769O611j1470o548R825O179o717l472L299
$$ -4477 -5096 -1939 2336 2957 -5168 -8325 3444 10055 -1415 -7963 1862 8041 1324 -2148 1151
484A151J055N6J287j741l072o7J998K899k315p080P08J0066N20j2338j962J1448
$$ 1151 2206 2262 3549 1808 -1264 -1331 667 3566 1251 -5829 -5121 4945 5465 -6873 -8835 2613
500B613J372q491l50L662O68J975J567m008k606L847M216j257m328k318N373P978
$$ 2613 3985 -4506 -4856 -1194 -526 1449 3016 -992 -3598 249 4465 3208 -1120 -3438 1935 9913
516I913n231j2144L006J2577l63j1620k687P431M193l731n643j323M477L628j620
$$ 9913 4682 -7462 -4456 8121 7758 -3862 -6549 882 5075 1344 -4299 -5622 -1145 2483 863
531H63m206k433J737P837K799j0799o654J2463J1085j1509j3372R549J4105l725
$$ 863 -3343 -5776 -4039 3798 6597 -4202 -10856 1607 12692 1183 -12189 -2640 11465 7740
545G740j0792j499O812M135l520m943n89K242K922J991l942q262K232J2136o03
$$ 7740 -3052 -4551 2261 6396 2876 -2067 -2656 -414 2508 4499 557 -7705 -5473 6663 6060
560F060j5054j797J3803M147q731n835L086O353K673m297n815K874P748J75l661
$$ 6060 -8994 -10791 3012 7159 -1572 -7407 -4321 2032 4705 408 -5407 -2533 5215 5390 1729
575A729k896j598M256O392m142j0195K397J1159Q66j0930m382O247O150j745q000
$$ 1729 -1167 -2765 1491 7883 3741 -6454 -4057 7102 7968 -2962 -7344 -1097 5053 3308 -4692
590d692l508P392N491m530m410K6J898M371L501o874q115Q818J2005p420j2712
$$ -4692 -8200 -808 4683 153 -4257 -4231 -2333 2038 5539 -1335 -9450 -632 11373 3953 -8759
605h759M432J1673R07q252n337M684O961j127p171k093M193K730m93k970m995
$$ -8759 -4327 7346 8253 1 -5336 -652 6309 5182 -1989 -4082 111 2841 2348 -622 -5617
620e617Q35P957J045q578k811P304L791m147m035K16L800M263j604n435J011N791
$$ -5617 -4782 3175 4220 -4358 -7169 135 3926 -221 -4256 -4040 -240 4023 2419 -3016 -2005 3786
636C786j47l302o83J7J053L285n23n297p56N341L53l713j755L20K171K052k758
$$ 3786 3639 337 -346 -329 724 4009 3486 -1811 -2567 2774 3127 -586 -2341 -2021 150 2202 -556
653e56m125K508L237j854j891J365q81J103M463j385o107J782O783j104n175J28
$$ -556 -4681 -2173 1064 -790 -2681 -1316 -2197 -1094 3369 1984 -4123 -2341 4442 3338 -1837 -1709
669a709L626J845q26k964j589K866K611l169k994J683J369o26n19j824j131K802
$$ -1709 1917 3762 2936 -28 -1617 1249 3860 691 -2303 -620 749 123 -396 -2220 -3351 -549
685e49K275l251k423K949J531j082l7m88p86K832J331k888q73L221Q17j562L02
$$ -549 1726 -1525 -3948 -999 532 -550 -587 -1075 -1861 971 2302 -586 -1459 1762 2579 1017 1319
702A319l62n26J786m05k485J07J875m49j636J8K05n03Q35l00j980M30J693o94
$$ 1319 957 431 2217 1812 -673 -566 1309 860 -776 -758 -553 -1056 -221 -521 -2501 -2071 -378 -1072
720a072n45Q71l93p1J973J6j647P49K455p78j581Q16O20l15J260j497j919J978
$$ -1072 -1617 -746 -1139 -1210 763 779 -868 -119 2336 1558 -23 793 1413 1098 2358 861 -1058 920
738I20J866k413k064K191M16j886l5q3j119K043L6k529K99K660n81j304Q64P07
$$ 920 2786 373 -1691 500 916 -970 -1005 -1088 -2207 -164 -128 -2657 -2358 302 -279 -1583 -719 -12
756a2k40R09K97j792J329K009j288j417J673P42j273J85n8j079K76J078j724j782
$$ -12 -252 657 954 -838 491 2500 1212 -205 1468 2210 937 1122 1064 -15 261 1339 -385 -2167
774b167K121P22k159L8O11l01K17P6r35N7K087j99k154J485J876j225L60M92o24
$$ -2167 -46 676 -1483 -1445 -834 -1135 -918 -842 -1777 -1720 367 168 -1986 -501 1375 150 510 1002 378
793C78N57J338j340j014J535R20k445k69J576r42n50M86r03l72J080m03j572Q39
$$ 378 935 2273 933 -81 1454 2374 -71 -340 1236 294 -256 230 -673 -1045 35 -368 -1940 -1101
811a101Q54j051n00J440l11m58J596m7j289J014J178r93m29J491o4q20J184k05
$$ -1101 -247 -1298 -1798 -358 -669 -1127 469 422 -867 147 1325 332 -97 1394 1330 510 1694 1489
829A489j104M00P08j570n48J018p13l83M91p68n79R13K19j288K13J487r76l83
$$ 1489 385 785 1493 -77 -625 393 -320 -703 -212 -980 -1559 -646 -427 -1715 -1502 -15 -991 -1374
847a374J698p81q87J758Q90j633J16J875J41j026K27O0k51P57k13j825M23J292
$$ -1374 324 -457 -1344 414 1304 -329 -213 1662 1803 777 1004 1064 813 1570 1357 -468 -45 1247
865A247p03q72p50k3R01O12j596j602J670J774j711r37J329J90qJ341j059j317
$$ 1247 544 -328 -1078 -1101 -200 412 -1184 -2786 -1116 658 -1053 -1990 -661 -471 -479 862 -197 -1514
883a514K221K128k062j835J823J266q40l60o18m70J485O37j679r62J63N32O52
$$ -1514 707 2835 773 -1062 761 2027 1187 827 209 -261 1224 1861 182 -780 -617 -85 567
900E67j041k334Q66L151q62l365R59K727p48r96J109m48j172K568J403k570j565
$$ 567 -474 -2808 -1942 1209 347 -3018 -2059 668 -80 -1076 33 -415 -1587 981 2384 -186 -1751
917a751L430J339j480j881MJ780J136j565k033N85J833l25j549q43k15R37J784
$$ -1751 1679 3018 1538 -343 -339 1441 2577 1012 -1021 -436 1397 1072 -477 -1320 -1535 -598 1186
934A186j620l055J917K941j512j594n4N32J982J107j917k500L109L367k905k657
$$ 1186 -434 -3489 -1572 1369 -143 -1737 -1791 -1259 723 1830 -87 -2587 522 3889 984 -1673
950a673J800K257p58j185l07N2K7J001J84k053j146J235K503j399m375R61M858
$$ -1673 127 2384 1626 441 134 186 213 1214 1398 -655 -1801 -566 1937 538 -3837 -2876 1982
967A982p27m878J020L651q69j793J842L2j951J600K894j593k915J436K739j22
$$ 1982 1255 -3623 -2603 1048 179 -1614 228 260 -1691 -91 2803 1210 -1705 -269 2470 2348
983B348k249j474K589J949k040k752R34J975j006q14J42j039J42K328j328k454
$$ 2348 99 -1375 1214 3163 1123 -1629 -695 1280 274 -540 -398 -1437 -1295 1033 -295 -2749
999b749R45K244j01j041l96n48J414K538j588l653K570M306j753m057J527L326
$$ -2749 -1804 440 339 -702 -1098 -1646 -232 2306 718 -2935 -365 3941 2188 -1869 -342 2984
1015B984j412k051R12N63j205L42J414j188k463N14L544n89m606j78M645K82n029
$$ 2984 1572 -479 433 996 -209 133 1547 359 -2104 -1590 1954 1365 -3241 -3419 1226 1508 -3521
1032c521K31M946q21l164J718J904j559n30K295L54k498K17K451L80k354j036
$$ -3521 -3290 1656 835 -2329 -611 1293 -266 -796 1499 1853 -645 -428 2023 2403 49 -987
1048i87K156R07j747j412J842j57q97J70n96r42N71J462q12j445J396Q42j227
$$ -987 1169 2076 329 -1083 759 602 -295 -125 -721 -1663 -1092 370 -442 -1887 -491 351 -876
1065h76K81Q37j618K71L083q9l556O82M141r52l517J095K759p84j657k77Q99m71
$$ -876 -595 242 -1376 -1105 1978 1889 -1667 -985 3156 2204 -1313 -218 2541 1757 100 -177 722 251
1083B51p62M15Q40j952p02K603Q41l687j378M254J091m645L21L703l56k470J069
$$ 251 -511 -96 744 -1208 -1910 693 1534 -2153 -3531 723 1814 -2831 -2510 1193 837 -1633 -564
1100e64J691j400j58K181k82k309R92K236j005k139N49J868j84j489p0M71l02
$$ -564 1127 -273 -431 1750 1468 -841 151 2387 1382 -757 -208 1660 1476 -13 -83 388 86
1117H6n54K47m18j474J256J624j680j480J855J232j769k93J968r5j237J198J089
$$ 86 -468 -221 -639 -2113 -857 767 -913 -2393 -538 694 -1075 -1368 600 505 -732 466 1555
1134A555j781o47K090N45j436m55J360N14j167q76R04L40j693p8J839j070j994
$$ 1555 -226 -873 1217 1762 326 -129 1231 1745 578 -298 606 946 -747 -825 1014 -56 -2050
1151b050J722J484k667p62K586P08l071L01K853j128j799K216R80k017K61K564
$$ -2050 -328 1156 -1511 -2273 313 1021 -2050 -1749 1104 -24 -1823 393 1373 -644 -383 2181
1167B181m96k157P45J589o41j455M42Q55n21o65j65P49m88j382J187R22k036j52
$$ 2181 1685 -472 273 1862 1221 -234 208 1063 542 -123 -288 461 -27 -1409 -222 700 -1336 -1488
1185a488J866n17j944J047K016j534r19J801N98j525L69J512m59j156J128Q17
$$ -1488 378 -139 -2083 -1036 980 -554 -1473 328 926 -599 -230 1282 823 -333 795 1612
1201A612j179m01J008L44j228l58J122j24j358k23J316p05j704J034J354j733
$$ 1612 433 32 1040 1384 156 -202 920 796 -562 -785 531 -174 -1878 -844 510 -1223
1217a223o03J880M42k280O70K339j149j441J593J000j159k51J135Q9o72K01O27
$$ -1223 -1826 54 496 -1784 -1114 1225 76 -1365 228 1228 69 -182 953 1042 370 571 1198
1234A198l63n66p3N51n2j371J23J447j015j516J225Q25j554n84J809k83j601J128
$$ 1198 835 269 196 747 695 -676 -553 894 -121 -1637 -412 413 -1141 -1725 84 -199 -1800 -672
1252f72J381j561n78K152L58j691O71J453p48j030R75N14n89k30L96Rj72p20O87
$$ -672 709 -852 -1430 722 1080 -611 60 1513 765 -265 710 1224 635 405 801 810 638 -82 605
1271F05O2r16m05Q47j59j400j3J697q62j317J550P86j362p9J669p62p55P80Q89
$$ 605 667 -249 -654 193 34 -1366 -1379 318 -544 -1861 -311 475 -887 -966 703 -59 -814 -34 855
1290H55r15j82J328Lp36L71M11l99o15oN15j57j103J46N13j28j143N35J035r40
$$ 855 -60 -242 1086 1089 353 724 1135 736 121 115 630 473 -630 -484 29 -99 -1242 -707 328 -612
1310f12o80J106o0q48M41R33o95k77J130J60q47N05R42o30k29J88J90k31J0j34
$$ -612 -1292 -186 -246 -1094 -653 280 -415 -692 438 598 -249 256 1198 568 339 527 717 486 496 362
1330C62J19J43o14j1J23Lq23O38k42j055M90J080q73o39J041M19r24L7R14j9m28
$$ 362 481 624 10 -1 122 125 -698 -60 -302 -1357 -867 213 -660 -1299 -258 161 -763 -726 188 169 -259
1351b59O22L34o48J2P90Pm18K05P8q8J94n08k31K93j55p42R8K02p72O9P10o19
$$ -259 363 697 49 61 851 858 440 645 723 635 829 321 90 383 228 -514 -416 -214 -986 -917 -207 -826
1373h26k00O53K91n70l9O73k26P0O10k45j66Q21R7n74K0K33K17k97J39n12J0M97
$$ -826 -1026 -373 -82 -652 -691 -18 -244 -174 436 191 25 846 943 369 389 622 839 542 681 169 179 676
1395F76m51q16M14J44n29Q3J67n36m3P17J1j022M90R01l25j9j19K33L61M24m56
$$ 676 225 -591 -177 -33 -562 -479 -312 -848 -891 -174 -163 -1185 -695 206 -119 -138 -257 -24 337 761 305
1416C05k78P96J21p29K17O31o43k91J167r96p41K64M16k32o83j50J37O94l27o31
$$ 305 27 823 944 215 432 1063 420 129 1296 300 -441 -177 239 7 -676 -826 -689 5 -322 -953
1436i53J43Q81j96q17Q41K77o82K18N87j79j61N53L15mp17L91N24P7n23r03O70
$$ -953 -810 71 -125 -942 -101 176 -506 -288 299 120 -41 512 827 823 106 497 1021 1098 575 -328 342
1457C42O49r30p96M82M36l05p86Q25n47l89N08Q4K2o09M60P82J11q98j07J407
$$ 342 991 61 -735 -253 183 -122 -908 -83 -630 -1019 -511 -427 -405 -1014 -554 228 339 -559 -666 741
1477G41M94j522l33J674K74j367P9Q53m15p63O02K45p24m05O05J75q17l64N6Q21
$$ 741 1235 -287 -620 1054 1328 -39 40 893 478 -285 317 562 -162 -567 38 213 -604 -968 -912 -91
1497i1o7j177N6J573k98r68M14R42l72j41O07Q7o44N66J80J04m51k27L77P74m58
$$ -91 -158 -1335 -1279 294 -4 -972 -558 384 12 -129 478 565 -79 487 667 771 320 93 470 1244 786
1518G86j056k50J321j86j699J8J349o15p61O35L23o04k65O09K31m95j64P80M90
$$ 786 -270 -520 801 615 -1084 -1066 283 -332 -1093 -458 -135 -739 -1004 -395 -164 -659 -823 -43 447
1537D47n62q07J314J422j434p04J409K59j456K58O30k78r82Q07N13r86k57L39
$$ 447 -115 -922 392 1814 380 -324 1085 1344 -112 146 776 498 -484 323 836 -150 -407 -68
1555f8K9l21p11K96N66K65j091K72O65l0n59O70L90m74L25N12m81j39M61J59n96
$$ -68 -39 -360 -1071 -775 -209 56 -1035 -763 -98 -128 -687 -17 373 -101 224 736 255 116 577 736 140
1576A40K40L85n19l7Q77j120q45J432L11j649M4P99j52j179M18N81k55l64N77
$$ 140 380 765 246 209 1086 -34 -879 553 864 -785 -741 58 -94 -1273 -855 -274 -529 -893 -316
1595c16J61R6m83L26N89m9p62O74J077q60o03R23M43j010j81J012l36j072O51
$$ -316 -155 -59 -542 -216 373 324 -438 236 1313 453 -150 773 1216 206 25 1037 701 -371 280
1614B80L08p21o02N43M46q72J21J09J69n13K5J42K79l78L61M74m06k30R76O1o51
$$ 280 588 -133 -735 -192 254 -618 -497 -388 -219 -732 -707 -565 -286 -664 -303 171 -235 -465 511 572 -79
1635g9L77O93l59l07P5K91p28J81L95l84o26O09K05q10l79O09k47l69L34k8J35
$$ -79 298 991 632 325 400 691 -37 144 539 155 -471 138 343 -467 -846 -237 -484 -853 -519 -547 -412
1656d12L5l14N99M22p43N9J027k98p73N03R70o44n22Q85N92j300j0P23n19n71
$$ -412 -377 -691 -92 330 -413 -354 673 375 -398 105 1075 431 -91 794 1386 86 76 799 280 -291
1676b91N18L33j181L3Q18l46m55k17M47j26r2J04O4J95k51L35j02L64l97O57O25
$$ -291 227 560 -621 -588 230 -116 -571 -788 -341 -467 -559 -455 -391 -196 -447 -112 -214 150 -247 410 1035
1697A035q32O3O16k63n59K90M48o03m38P37Q2q56M3M30m85m74M89N5m47j46K85
$$ 1035 203 266 882 619 60 350 798 195 -243 494 576 -280 -237 193 -292 -766 -277 -222 -669 -815 -530
1718e30K08k26l02M71M36l55M1R11j50o79L09P60n21n36P44J09n77O4N14k88q00
$$ -530 -322 -548 -850 -379 57 -298 -257 654 504 -175 134 894 373 -163 581 690 113 177 691 403 -397
1739c97O74m7o89R8K18k11j58j8o0J62j51p0M35K06l59n2R71l15n23P92L56o48
$$ -397 277 230 -459 -361 -143 -354 -512 -530 -590 -428 -579 -649 -214 -8 -367 -419 552 237 -286 506 862 214
1761B14j49Q32k26n89L37M85o72m41Q16l84o01K10k8J99m52J23K12k56k91K01
$$ 214 65 897 671 82 419 904 232 -209 607 223 -378 -168 -196 3 -449 -326 -114 -370 -661 -460
1781d60K92q4j30M49ql63J77N63L2l30J21N32m62n49Q38K95r71R1P61n68n09L84
$$ -460 -168 -252 -382 67 59 -304 -127 436 468 138 259 791 329 -220 618 913 -58 33 794 226 -283 101
1803A01R6n69l14L84K16j54n25L94O04o17j38M19K87m22l4O24j01o80Q57N18n13
$$ 101 197 -372 -686 -302 -86 -240 -765 -371 233 -384 -522 -103 184 -238 -272 352 251 -429 428 946 433
1824D33o27O22K43m20J00L80n04n05O29k95m03K10J39m36j82J63J73k69l33M78
$$ 433 -194 428 671 251 351 731 227 -278 351 56 -347 -137 2 -434 -616 -453 -280 -549 -882 -404
1844d04L10j01k72J80L45j46l74Q50L36p38Q7R87p65m23M70L92o44j70M42l47
$$ -404 -94 -195 -467 -287 58 -88 -462 388 724 -14 73 1060 295 -128 342 734 90 -80 362 15
1864A5m27J82M79n87k34k4L87j30k4j58J80k3j45L73K02k22J15N78j46j96P0M08
$$ 15 -412 -230 249 -338 -572 -596 -209 -339 -363 -521 -341 -364 -509 -136 66 -156 -41 537 391 195 265 673
1886F73m75k00O40m5m45N7J44l26o04R47k77n77K12K10o9k97j54L57n5q1l04N50
$$ 673 198 -2 638 593 148 205 349 23 -581 366 89 -488 -276 -66 -135 -432 -586 -229 -284 -365 -669 -119
1908a19J09m76M0M60j3k37O47M59r30L00N89p3l64j55K57m10O1j34q8n8J27K7
$$ -119 -10 -486 -446 14 1 -236 411 870 -60 240 829 756 392 237 494 84 145 11 -77 -135 -8 19
1930A9k82N3k9m88K31M56k50k67J62J28l68K58J38N17q9j67J06J36L08k99qL89
$$ 19 -263 -210 -239 -727 -496 -40 -290 -557 -395 -267 -635 -377 -239 278 189 22 128 264 572 273 265 654
1952F54q9m05J9L35k78l19K3K69l61l69q4M17j25k81J37L92pn64L95L79k00m04
$$ 654 565 160 179 514 236 -83 -60 209 -152 -521 -605 -188 -313 -594 -457 -65 -72 -636 -241 138 -62 -466
1974d66O35L2j11l4M79q3n7k46L95j20l4m90P8N59m83j72P1L33n79m35O71k7o00
$$ -466 169 201 90 56 535 452 395 149 544 424 390 -100 -22 537 54 -118 -47 286 -293 -728 -57 -84 -684
1997f84L97K74k36j71M46p8p7nq1M22J75j80k3J64M60n20n4L39j73m32J77K4n12
$$ -684 -287 -13 -249 -420 26 -52 -129 -134 -215 207 382 202 179 343 803 283 229 568 395 -37 140 164 -348
2020c48L60L1j32k69N4l26n6N35k45l71L60M36l57k81O45K50n02j44J105l65m65
$$ -348 12 43 -89 -358 -304 -630 -686 -151 -396 -767 -407 29 -328 -609 36 286 -216 -360 745 380 -85
2041h5K23M01k70l62N52J42m90j52L39J51k90o85O86J57n05l66L95o4k67L21J51
$$ -85 138 539 269 -93 459 601 111 -41 298 449 159 -526 160 317 -188 -554 -159 -223 -490 -169 -18
2062a8k48j90M35J21q6Q7k8NK28m11K80K50J21l21J24j0P4k69K90l75n8K97O4
$$ -18 -266 -456 -21 100 14 101 73 78 306 -105 175 425 546 225 349 339 413 144 434 59 1 298 362
2085C62p34j28N22m52k25P79l25o37P76J55k75m62O51K92o94K62O80l62l58O24
$$ 362 -372 -500 22 -430 -655 124 -201 -838 -62 93 -182 -644 7 299 -395 -133 547 185 -173 451
2105D51j09K96l35k5J26j97k80P3J82K04r21J07P81o51k75J54K72k71o9L86j02
$$ 451 342 638 303 278 404 207 -73 0 182 386 -535 -428 353 -298 -573 -419 -147 -418 -487 -101 -203
2126b03l20N22L77n51K03J15K75r2k72K75j8j74K05K7l61J63O5M1l64j69M44p8
$$ -203 -523 -1 376 -175 28 143 418 326 54 329 311 137 342 369 8 171 236 277 -87 -256 188 110
2148A10n09N6M71o85j5M69J64p37M00M93m76j20K49L82k31J12R5R5m7j40L08J91
$$ 110 -399 -343 128 -557 -572 -103 61 -676 -276 217 -259 -379 -130 252 21 133 228 323 276 136 444 635
2170F35k20l55K91Kn92j97P55K8o63m3J95j56j78J47K52l31P2K34k86j61O64k2
$$ 635 415 60 351 353 -239 -436 319 347 -316 -359 -164 -320 -498 -351 -99 -430 -358 -124 -410 -571 93 71
2192G1J76l32O28m56q2J56M96l32k75K15L00m88P8N5j22k37l10L17K67o13J04
$$ 71 247 -85 543 87 5 161 657 325 50 265 565 77 155 210 88 -149 -459 -142 125 -488 -384
2213c84J38j95l82N18K26k08M6J65n4QK26K72k27q3J02K57L3m09J39J15rn23N15
$$ -384 -246 -441 -823 -305 -79 -287 -241 -76 -130 -122 104 376 149 66 168 425 458 49 188 303 294 -229 286
2236B86Q2m47k49M14P0k97L6K66m70j02K85l14k83K54M40m03p0M48K37l37L2M04
$$ 286 368 -79 -328 86 156 -141 -105 161 -309 -411 -126 -440 -723 -469 -29 -432 -502 -54 183 -154 -122 282
2258B82J8P0q4J20j32J3k32M41j8o74L10J88k92k90J71K0l02l1M48l15j35K28
$$ 282 300 370 286 406 274 287 55 496 478 -196 114 302 10 -280 -109 -89 -391 -422 26 -289 -424 -196
2280a96l9j3k07M20J7l10M49lj32K32L1o4J16k7rN6j00k06M15k04k46j85M51j04
$$ -196 -235 -248 -455 -35 -18 -328 121 118 -14 218 249 185 301 274 265 321 221 15 430 226 -20 -205 246 142
2304A42m76L95j73l4l72L04l6j75j47O79k85r1J40J81j00J78J56l26L83P7K9j0
$$ 142 -334 61 -112 -146 -518 -214 -250 -425 -572 107 -178 -269 -129 52 -48 130 286 -40 343 420 449 439
2326D39m85J8K41K79m84j38K51J18p71L17J18k86M2K20p2l44L31J96m27J32L11
$$ 439 -46 -28 213 492 8 -130 121 239 -532 -215 -97 -383 -341 -121 -193 -537 -206 -10 -437 -305 6
2347Fk0j23L45j8m1k41oM73j41m0R3K2l3k62L00q2k37j84L20j24j20k60K02j00
$$ 6 -14 -137 208 190 149 -92 -98 375 234 194 287 309 276 14 314 232 -5 -189 131 7 -113 -373 -171 -271
2371b71j00J99r8k27J99L06j52P1j36M27J14k35qL89j23J21j4l02K06m03J59p9
$$ -271 -371 -172 -270 -497 -298 8 -144 -73 -209 218 332 97 89 478 355 476 462 160 366 -37 122 43
2393D3k66M26p9k64p8J85p7l54P4L22l83k65N22J99j72j26K85l0k1M1K44Pk13
$$ 43 -223 203 124 -140 -218 -33 -110 -464 -390 -68 -451 -716 -194 5 -167 -293 -8 -38 -59 -18 226 233 20
2416B0l0J13J76j82N1NK01l22j10L56k04j52J66j66o5n4K6j52k2J31j64L50k4
$$ 20 -10 103 279 97 148 153 354 32 -78 278 74 -78 88 -78 -143 -197 -171 -323 -345 -214 -378 -28 -52
2439e2J53m76N17N9j27j83K98N4n8K15l5r6m5j76J63Q5j26j44j54K32l57l26N12
$$ -52 101 -375 142 201 74 -109 189 243 185 400 365 269 224 48 211 296 170 26 -128 104 -253 -579 -67
2462f7l7j30q0L85k83j11K6J40Kq5J31Q3K59j96j02L28j6k83K76P9J2j44M1M8
$$ -67 -104 -234 -314 71 -212 -323 -297 -157 -155 -240 -109 -26 233 37 -65 263 247 -36 240 319 331 187 228 276
2486B76o6k72J40K31o06K49m1k43J59k47K64L5M4j87k95N23K48m55K85L0R9q1
$$ 276 210 -62 78 309 -297 -48 -89 -332 -173 -420 -156 -121 -77 -264 -559 -36 212 -243 42 72 171 90
2508I0O1N4J09o8L20m63j21K79k00J86o6j03k78K60k11k14J96N8o5j26K16J01
$$ 90 151 205 314 246 566 103 -18 261 61 247 181 78 -200 60 -151 -365 -169 -111 -176 -302 -86 15
2530A5l65K49Q7j01n3J31M0J22J00j11J01J06J7j07p3K28j00j69J5r6k36P3N0
$$ 15 -350 -101 -14 -115 -168 -37 3 125 225 114 215 321 338 231 158 386 286 117 132 36 -200 -127 -77
2553g7P1k27M7K20j32k73O5jJ54l69N01J65k16k72L60J56J94j69O0j05J47jj22
$$ -77 -6 -233 -186 34 -98 -371 -306 -307 -153 -522 -21 144 -72 -344 16 172 366 197 257 152 299 298 176
2576A76j64J75J4r8L3p9j22QL3k14j75J72O6j29K98j24J93j29k09j03J31J30J62
$$ 176 12 187 201 103 136 57 -65 -57 -24 -238 -413 -241 -175 -304 -6 -130 63 -66 -275 -378 -247 -117 45
2599D5r1K92P7p7k49K40K56m87J41K99j22o47O1P67n13k64L02j53J13j79j43N17
$$ 45 -46 246 323 246 -3 237 493 6 147 446 324 -323 -262 505 -8 -272 30 -123 -10 -189 -332 185
2621A85o52K64K53m6j78j77L78j19j07K50j5k24N80l00o6K60k2j96J69o5r9RN0
$$ 185 -467 -203 50 4 -174 -351 27 -92 -199 51 36 -188 392 92 26 286 264 68 237 172 73 82 132
2644A32q4M1k20K09j14j32J14k57P2L7j65J7K53R6k05o5N17m00q5L02L32k63k32
$$ 132 48 89 -131 78 -36 -168 -54 -311 -239 -202 -367 -350 -97 -1 -206 -271 246 -154 -239 63 395 132 -100
2667a00L97Q0l06q3K13j31l15J82M06k86k36J48j74j18J07L8n8J88m27M69j5N
$$ -100 297 377 71 -12 201 70 -245 -63 343 57 -179 -31 -205 -323 -216 -178 -236 -48 -475 -6 -21 -16
2689a6k97P17l25q9P1P1J74j69K02l14K9R7J4j2q7mL36l85j35J50ok93k01N29
$$ -16 -313 404 79 -10 61 132 306 137 339 25 54 151 165 153 66 62 398 13 -122 28 22 -271 -472 57
2713E7k85j09JJ98K8k23P0L61j18k92L87O2L7k64K65q6r9M08r7k08J0J69j89j21
$$ 57 -228 -337 -336 -138 -110 -333 -263 98 -20 -312 75 137 174 -90 175 89 -10 398 301 93 103 272 83 -38
2737c8o2k1pj50K00O2k54M2n1q9K62k39M31pm10J47R2O7j41L36mk42L10k03R2
$$ -38 -100 -121 -128 -278 -78 -16 -270 -228 -279 -368 -106 -345 86 79 -331 -184 -92 -25 -166 170 166 -76 234 31 123
2762A23j18J12J57m1j55ol3J24j40Q4J79n37j21M03k1jl21M40j95k93L10J73J40
$$ 123 5 117 274 233 78 72 39 163 23 107 286 -251 -372 31 10 9 -312 128 -67 -360 -50 123 263
2785B63m15O8K62j53j06M91k66n6J82M5m2k42K11j48o2j31K93j17l29J02N1j70
$$ 263 -152 -84 178 25 -81 410 144 88 270 315 273 31 242 94 32 -99 194 77 -252 -150 -99 -269
2807b69l1J57J06n9r0J67Ok66J14o6J93RJ92J74m87J20K91P2k67J15M1J32l36
$$ -269 -300 -143 -37 -96 -186 -19 -13 -279 -165 -231 -38 -29 163 337 -150 -30 261 333 66 181 222 354 18
2830A8J95l7l6j57K48m41m3N5N1L3K20l31J4J18k06R5J87J20j98K36Ql10K47J17
$$ 18 213 176 140 -17 231 -210 -253 -198 -147 -114 106 -225 -211 -93 -299 -204 -17 103 -95 141 149 -161 86 203
2854B03j1j64p9L41k93P7J60Ol86K30m2M6k46n1J5N1k43K80l2j49k5J54K86j53
$$ 203 192 28 -51 290 -3 74 234 240 -146 84 42 88 -158 -209 -194 -143 -386 -106 -138 -287 -312 -158 128 -25
2878b5m0Q9M1J07o3j36J30k2Q5J34l28j05L10M2k17J25j45j78l3K48nl50K03K5
$$ -25 -65 24 65 172 109 -27 103 81 166 300 -28 -133 177 219 2 127 -18 -196 -229 19 14 -336 -133 -108
2902a08Q4j76l6M9K39p3L5Kj6n8R7L44n00J57M07m03j31J56K01J15m66J37l6q4
$$ -108 -24 -200 -236 -187 52 -21 14 16 0 -58 39 383 -117 40 447 44 -87 69 270 385 -81 56 20 -64
2926f4K01k09P7k64n3k9J12J70l33J83M10k56n4O7K6j97M59Rm60M36r8j85L97
$$ -64 137 -72 5 -259 -312 -341 -229 -59 -392 -209 201 -55 -109 -42 -16 -213 246 255 -205 231 133 -52 345
2949C45k36J8O6j57L9R9l16K12j8l09J04J19J06l28K67j42K3j29p8M84k49l00
$$ 345 109 127 193 36 75 174 -142 70 52 -257 -153 -34 72 -256 11 -131 -108 -237 -315 169 -80 -380
2971c80M23Q0n0K1P7J67l58K94j90J13k03K1K43K5j21n2p4K28l73k04M46o9j03
$$ -380 43 123 73 94 171 338 -20 274 84 197 -6 15 258 283 162 110 36 264 -109 -313 133 64 -39
2994c9k92L02j94J24j26P6K4Q9n4J22l30L83r6Q1o7M36k10k54J79j99K88o9R1
$$ -39 -331 -29 -223 -99 -225 -149 -125 -36 -90 32 -298 85 -11 70 3 439 229 -25 154 -45 243 174 265
3017B65k04N0m2p7o0q0J77j25O4j82Q4q3l38M61N5J25j27L8O7R1j2L3l3L9J76
$$ 265 61 111 69 -8 -68 -148 29 -96 -32 -214 -130 -213 -551 -90 -35 90 -37 1 68 159 147 180 147 186 362
3042C62j65oM8p8q2P2p7l5p3R9n2j39j93M19k14o5J0L0J83q7k13%K84k59L84j72
$$ 362 197 191 239 161 79 151 74 39 -34 65 13 -126 -319 100 -114 -179 -169 -139 44 -43 -256 -256 28 -231 153 -19
3068a9K72k8J5R2k34j42J26J83L0j54p2m1k55L27J8k71N6q8R3j7q3j55J23j15
$$ -19 253 225 240 332 98 -44 82 265 295 141 69 28 -227 100 118 -153 -97 -185 -92 -109 -192 -347 -224 -339
3092c39L54m9q7J64j95L0L36j26j0r5J54L79m71J74k80K15q1p7QK23j51k81J65
$$ -339 15 -34 -121 43 -152 -122 214 88 78 -17 137 516 45 219 -61 154 73 -4 4 227 76 -205 -40
3115d0J19m8k37j62L97j48Ml12N60l68O1L89k34O5k15L10N2k18N7K00j40J34r6
$$ -40 79 31 -206 -368 29 -119 -115 -427 133 -235 -174 215 -19 46 -169 141 193 -25 32 232 92 226 130
3138A30Q6k01rj94K65j47J14l6NQ2l86J0Q3K58k29j70Q7L28k08Q8J60qq3k3O6
$$ 130 216 15 6 -188 77 -70 44 8 13 95 -291 -281 -198 60 -169 -339 -252 76 -132 -44 116 108 25 2 68
3163F8R3LO1m52J7K80O6k51J57k12K23NJ26j50Q0j16k10J74k95O4k8K39j50J79
$$ 68 161 164 225 -227 -210 70 136 -115 42 -170 53 58 184 34 114 -2 -212 -38 -333 -269 -297 -58 -208 -29
3187b9K1n7m1O8N5Q5l2J87k91N2J47J21k6o7l08K97k21J72j61n2q3J24j32J1l2
$$ -29 -8 -65 -106 -38 17 102 70 257 -34 18 165 286 260 193 -115 182 -39 133 -28 -80 -163 -39 -171 -160 -192
3212a92R8M7l11Q4J68P1j17K08l86L19j54J59M8J60J1m3N1j25Qj3M7K6m6j64L2
$$ -192 -94 -47 -358 -274 -106 -35 -152 56 -330 -11 -165 -6 42 202 213 170 221 96 104 91 138 164 118 -46 -14
3237a4L97j69r9k05jL7o4K8k12Q0M0J10N6l21L74j64J80K54n46L98L2j79J95J10
$$ -14 383 214 115 -90 -91 -54 -118 -90 -302 -222 -182 -72 -16 -337 37 -127 53 307 -239 159 191 12 207 317
3261C17k1l53L05Q7k21K85m19K26k86L8K04j40n7K17j95j45P8LJ02j76J72J50
$$ 317 296 -57 248 335 114 399 -20 206 -80 -42 162 22 -35 182 -13 -158 -80 -77 25 -151 21 171
3283A71k00j49K43J04k24P4K39j44j3R4k78K36j71O0RJ25o7j16%q9J97j60L1N8
$$ 171 -29 -178 65 169 -55 19 258 114 101 195 -83 153 -18 42 51 176 109 -7 -7 -96 101 -59 -28 30
3307C0jk26R6k36J23J19p5O9m6K15j4O1O1k89J32M5M5j01J07j8j11mK22k01j04
$$ 30 29 -197 -101 -337 -214 -95 -170 -101 -147 68 54 115 176 -113 19 64 109 8 115 97 -14 -18 204 3 -101
3332a01K47l14K38j10j12k22L72o8j87N3J39J1j10J92K56j38j3N6j4J1j10J73
$$ -101 146 -168 70 -40 -152 -374 -2 -70 -257 -204 -65 -54 -164 28 284 146 133 189 175 186 76 249
3354B49m1j58N6K38k57N6j90J53j33J67n2j75J91J2j48j92L33l47r6N34k42o1
$$ 249 208 50 106 344 87 143 -47 106 -27 140 88 -87 104 116 -32 -224 109 -238 -334 200 -42 -103
3376a03O8k05K53q0Q0j68J73J18J52k26m2O0j20J48M9r7j63K68l5j60n8K45n7
$$ -103 -35 -240 13 -67 13 -155 18 136 288 62 20 80 -40 108 157 60 -103 165 130 -30 -88 157 100
3399A00k06R5j21J84j16j94J65m5J78K7k46K56J35j84J9J10j67J17p9M6k5P9l27
$$ 100 -106 -11 -132 52 -64 -258 -93 -138 40 67 -179 77 212 28 47 157 -10 107 28 74 49 128 -199
3422a99R0M25l95J33j09J92m19R4J71k89J22j79N28j22j10k43K98j43P1J08J28
$$ -199 -109 316 -79 54 -55 137 -282 -188 -17 -306 -184 -363 165 43 -67 -310 -12 -155 -84 24 152
3443A52k20O9K59j85OJ07J26j64j21n2K62j64J37p1l62K39O2k04K19k99K15J18
$$ 152 -68 1 260 75 81 188 314 150 29 -23 239 75 212 141 -221 18 80 -124 95 -204 11 129
3465A29j84j11K30Q0m5j24P5M0R4k07l8K02o0N7J89l04L2M9J72j8j76J4Or2K2
$$ 129 -55 -166 64 144 99 -25 50 90 184 -23 -61 141 81 138 327 23 55 104 276 258 82 96 102 10 32
3490C2K42m67Qo8M03k36m4Q5j09L90n55J59L7M3Q2RJ28k58K00J73o7q3o8k12P9
$$ 32 274 -193 -185 -253 150 -86 -130 -45 -154 236 -319 -160 -123 -80 2 11 139 -119 81 254 187 104 36 -176 -97
3515i7L16j54o5Mj64K02k1k46j8K4K54j26J74l52J15n6q4J73oJ40P8p4j50J98
$$ -97 219 65 0 4 -160 42 21 -225 -243 -219 35 -91 83 -269 -154 -210 -294 -121 -127 13 91 17 -133 65
3539F5q1K35l31K13m2R0k43J66k07O8K33o8r6j33J22j03J31K1k46J04NNl7l8j22
$$ 65 -16 219 -112 101 59 149 -94 72 -135 -67 166 98 2 -131 -9 -112 19 40 -206 -102 -97 -92 -129 -167 -289
3564b89%L31m0O5J36j54J18k8j26Q7n3J63k91K94k57J68l57K37j68J04o2J78P7
$$ -289 -289 42 2 67 203 49 167 139 13 100 47 210 -81 213 -44 124 -233 4 -164 -60 -122 56 133
3587A33o7k65m2K78m9k4K36k88Q3pM7N3L3K21m16L13l89L69k71o3L85j76j79J60
$$ 133 66 -199 -241 37 -12 -36 200 -88 -5 -12 35 88 121 342 -74 239 -150 219 -52 -115 270 94 -85 75
3611G5l6J9k8J3j86k6Mn5NL32j45j80k45K63K05M0q9M9q1j52L60j54P0j41J48
$$ 75 39 58 30 43 -143 -169 -165 -220 -215 117 -28 -208 -453 -190 15 55 -34 15 -66 -218 142 -12 58 -83 65
3636F5J43j4j60J00j46J34K4Pk14L01l30k17K93Rj14J44j9j74O0m6j98K84J56
$$ 65 208 194 34 134 -12 122 146 153 -61 240 -90 -307 -14 -5 -119 25 6 -168 -108 -154 -352 -68 88
3659H8k08m8J87jn2J37j6O8l27K95p0J13l16J87Oj27j06O1L72k81j11P9l1j1J13
$$ 88 -120 -168 19 18 -34 103 87 155 -172 123 53 166 -150 37 43 -84 -190 -129 243 -38 -149 -70 -101 -112 1
3684Ak68L04K1m96L94l3qR7J5r9K88j57mR9J62j29l77M9L37k90K54m9m8j49k7
$$ 1 -267 37 58 -438 -44 -77 -85 12 27 -72 216 59 55 154 316 187 -190 -141 196 -94 160 111 63 -86 -113
3709a13r0n7P5K22j26P1K5k43K53l0n5o9J25J83j74N9r0J20l61K58K97M8L0l32
$$ -113 -203 -260 -185 37 -89 -18 7 -236 17 -13 -68 -137 -12 171 -3 56 -34 86 -275 -17 280 328 358 26
3733B6m9L1j77M31n62L52j74P2k67J21OM6R8k7n2k77M82kj76K24o4n7J02k33L66
$$ 26 -23 8 -169 262 -300 52 -122 -50 -317 -196 -190 -144 -46 -73 -125 -402 80 78 -98 126 62 5 107 -126 240
3758B40k08j3K3K9l09L58J49l33L16l61P2R6Mn8j72o4K65k46k5j8J69j67J61O2
$$ 240 32 19 42 71 -238 120 269 -64 252 -109 -37 59 63 5 -167 -231 34 -212 -237 -255 -86 -253 -92 -30
3782c0J79j63J8o2q7K51n6K63j56M6PO0j71M8p1J9j80K49k02j07J90jr1j74K33
$$ -30 149 -14 4 -58 -145 106 50 313 157 203 210 270 99 147 76 95 -85 164 -38 -145 45 44 -47 -221 12
3807A2n0m9M8k33Q9N9j28K68NM8j51J92j63J31K3J07n3J63q7oj91K44j89j57j15
$$ 12 -38 -87 -39 -272 -183 -124 -252 16 21 69 -82 110 -53 78 101 208 155 318 231 225 34 278 89 -68 -183
3832a83J41o0J7N0J0J08j82j62M11k76j70L37P2M5k02oL69k70j9L18j69j22j05
$$ -183 -42 -102 -85 -35 -25 83 -99 -261 150 -126 -296 41 113 158 -44 -50 319 49 30 348 179 57 -48
3855d8K06r1j39J31op7J50k22o6J99j26N7J54k15k44J47J94l13M65n11K44p4J42
$$ -48 158 67 -72 59 53 -24 126 -96 -162 37 -89 -32 122 -93 -337 -190 4 -309 156 -355 -111 -185 -43
3878d3P5o2k95K78n1K64oJ6j15M35j72l28j10J30J82k31J30k25K59J6n1k58J95
$$ -43 32 -30 -325 -47 -98 166 160 176 61 496 324 -4 -114 16 198 -33 97 -128 131 147 96 -162 33
3901C3Lo8K2P6j39j31J63nK25k45J40j1r5K25j79j45K02j49J37n1j0J25j11J60
$$ 33 36 -32 -10 66 -73 -204 -41 -46 179 -66 74 63 -32 193 14 -131 71 -78 59 8 -2 123 12 172
3925A72j99J33J5k85N5m6K17k19n3J53o8n0K54k70J57r1K07k57K64jj78O7pO4
$$ 172 -27 106 121 -164 -109 -155 62 -157 -210 -57 -125 -175 79 -191 -34 -125 82 -175 89 88 -90 -23 -30 34
3949C4o0M7M2J52j85j8k3J4Jj51m2q8M7K10k70K36k0L2J54m08M15j03K4j33L16
$$ 34 -26 21 63 215 30 12 -11 3 4 -147 -189 -277 -230 -20 -290 -54 -74 -42 112 -296 119 16 40 -93 223
3974B23K6q4k43J17J15m0j16J57l12j85L96O5K4j92J36k13r4p8K67l9%r7q8O6
$$ 223 249 165 -78 39 154 114 -2 155 -157 -342 54 119 143 -49 87 -126 -220 -298 -31 -70 -70 -167 -255 -189
3998a89j16J55K13p1j13J37J07N6k59K19J48k62j52j4J02K57J2j83p9J57p8k22
$$ -189 -305 -150 63 -8 -121 16 123 179 -80 139 287 25 -127 -141 -39 218 230 47 -32 125 47 -175
4020a75K27k60K28P6l73J84K4J95n5J34j92J18k36J2J32p9J13Lk00N4J14J03l13
$$ -175 52 -208 20 96 -277 -93 -69 126 71 205 13 131 -105 -93 39 -40 73 76 -124 -70 44 147 -166
4043a66K62j00q5Q5J16o7o6J28j49j9K6k2L1K02j24K2l2o6j79K29l3k02L45j49
$$ -166 96 -4 -89 -4 112 45 -21 107 -42 -61 -35 -57 -26 176 52 74 42 -24 -203 26 -7 -209 136 -13
4067a3k6J25j32J65J90j68P1j35L5o0o8L8M4J0j40J36M2k08P7k32M19m91l4K41
$$ -13 -39 86 -46 119 309 141 212 77 112 52 -16 22 66 76 -64 72 114 -94 -17 -249 170 -321 -355 -114
4091a14J21j14J57j46k24M55k05K64M7Q2j95Q7l4o1j54q2m8J4L57j88m2k06K50
$$ -114 7 -107 50 -96 -320 135 -70 194 241 323 128 215 181 120 -34 -116 -164 -150 207 19 -23 -229 21
4114B1K8k39J28J26j0o2j06j01j4L22R8k21l9m5o7K46K3J25r8j78Q6j37J53k37
$$ 21 49 -190 -62 64 54 -8 -114 -215 -229 93 191 -30 -69 -114 -181 65 88 213 115 -63 23 -114 39 -198
4138a98J90K20k65J15r9r0J26J10o5Mj57j05K2LJ18l88O30q7j8k2j4kk8R8q2j39
$$ -198 -8 212 -53 62 -37 -127 -1 109 44 48 -109 -214 -192 -189 -71 -459 171 84 66 44 30 28 0 98 16 -123
4164a23n9K04p7Q9J44k11K14j04q9N7l02L36rm4k62J66k69Q4j38K83J83k82K15
$$ -123 -182 22 -55 34 178 -33 181 77 -12 45 -257 79 70 26 -236 -70 -339 -255 -393 -110 73 -209 6
4187Fk94M62J8l04J11L41k63j10J69j03j67qL60o2k84J98N8l08J93p8r2K08l35
$$ 6 -288 174 192 -112 -1 340 77 -33 136 33 -134 -142 218 156 -128 70 128 -180 13 -65 -157 51 -284
4210b84K45J39k53M22k61k84J67K38n5l8J65l22J87l23K62j80K84j40J16j92R1
$$ -284 -39 100 -153 269 8 -276 -109 129 74 36 201 -121 66 -257 5 -175 109 -31 85 -107 -16
4231a6o2L31k85M9R9j97J29m5j4m9N6j98P6k25K02K98l70J91q7L27O7l60J5R2
$$ -16 -78 253 -32 17 116 -81 48 3 -11 -60 -4 -202 -126 -351 -149 149 -221 -30 -117 210 277 -83 -68 24
4255B4P8m36M23k23J27J08J36j40oq9j22K43j04J43p9k14Q8k02J61lJ59l09L56
$$ 24 102 -334 89 -134 -7 101 237 97 91 2 -120 123 19 162 83 -131 -43 -245 -84 -87 72 -237 119
4278A19j31J3J51j55J06j18k0L58k70p8m3N0K37J38l48J21k17K58j70l1J1j61
$$ 119 -12 1 152 -3 103 -15 -35 323 53 -25 -68 -18 219 357 9 130 -87 171 1 -30 -19 -180
4300a80Q6l6O1j67J02r7K32k1j35P0p9J7J68n3qn8l6J13L7j28K53j88j4K64j60
$$ -180 -94 -130 -69 -236 -134 -231 1 -20 -155 -85 -164 -147 21 -32 -40 -98 -134 -21 16 -112 141 -47 -61 203 43
4325D3L52j74j67k46K37J20k46J11j26Oj08J71P2kR6k02K31k92K29l0L1N1j46
$$ 43 395 221 54 -192 45 165 -81 30 -96 -90 -198 -27 45 43 139 -63 168 -124 105 75 106 157 11
4348A1M1p2K06j08j71R7q4P4J94k00r3K16j89K4K2J55l42PJ89j92J69K59j45O3
$$ 11 52 -20 186 78 -93 4 -80 -6 188 -12 -105 111 -78 -54 -32 123 -219 -212 -23 -215 -46 213 68 131
4372A31m3m0j69j27J88J00k18K68%j05M0K27j60j2j55K38J40l26j09QMLl2L58
$$ 131 88 48 -121 -248 -60 40 -178 90 90 -15 25 252 92 80 -75 163 303 -23 -132 -124 -120 -117 -149 209
4396B09l16n0K14j1m79L98J49k17J65k27J89j2J66k74Q9K64j32j64Q5q5j3J64
$$ 209 -107 -157 57 46 -433 -35 114 -103 62 -165 24 12 178 -96 -7 257 125 -39 46 -39 -52 112
4418A12J75j99M7N3l17J85q2r6K4J24m5j00J70J0M3k33Q1j29K69Kj08LmQ2k48
$$ 112 287 88 135 188 -129 56 -26 -122 -98 26 -19 -119 51 61 104 -129 -48 -177 92 94 -14 -11 -15 67 -181
4443a81L04j31k5N0K48j92J93l0l19J91j28K16K0k59R9k0o5O2O5j36J26J7k27
$$ -181 123 -8 -33 17 265 73 266 236 -83 108 -20 196 216 -43 56 36 -29 33 98 -38 88 105 -122
4466a22J9L92j84k18J02r6J96p5k3j06P1n6J0K73l52L53l56K75j50O4J9j41j29
$$ -122 -103 289 105 -113 -11 -107 89 14 -9 -115 -44 -100 -90 183 -169 184 -172 103 -47 17 36 -105 -234
4489b34M86j74r9J38k37K06j56o5K06j11r0J59j47K29Rk29l6M2N7J86o5K18n19
$$ -234 252 78 -21 117 -120 86 -70 -135 71 -40 -130 29 -118 111 120 -109 -145 -103 -46 140 75 293 -226
4512b26J96R9r6j40L13nq6K8j79Rq4P9L69l23k27K51N6k15j1J20pO3K36l55K00
$$ -226 -30 69 -27 -167 146 141 55 83 -96 -87 -171 -92 277 -46 -273 -22 34 -181 -192 -72 -79 -16 220 -135 65
4537F5J23j62N4N7q5k12J08J0J52o1k15K0K07j7J10O7l11J91l02j36J51K93k11
$$ 65 188 26 80 137 52 -160 -52 -42 110 49 -166 -146 61 44 154 221 -90 101 -201 -337 -186 107 -104
4560a04n0M3J20O0p3o2P2r2L8R6p6K38m07K68K55k75j54J5k4J00n0NJ13j91k0
$$ -104 -154 -111 9 69 -4 -66 6 -86 -48 48 -28 210 -197 71 326 51 -103 -88 -112 -12 -62 -57 56 -135 -155
4585a55l2K90k43J88o9J61M8j73K08lr6k38k20K93o9K50j16R8k57R3K32k52J0
$$ -155 -187 103 -140 48 -21 140 188 15 223 220 124 -114 -334 -41 -110 140 24 122 -135 -42 190 -62 -52
4608e2J71j06Qlpp2N3J51m8j33k00L94k44J71L5L1j55j93J59Q2N4K2l41M03k25
$$ -52 119 13 21 18 11 -61 -8 143 95 -38 -238 156 -88 83 118 149 -6 -199 -40 42 96 118 -223 180 -45
4633d5j28J61l1k36L54m5k5O4p2J01L0k27j57N05k74p0J27L1j01l3K92l41J71
$$ -45 -173 -12 -43 -279 75 30 5 69 -3 98 128 -99 -256 249 -25 -95 32 63 -38 -71 221 -120 51
4656E1J61k63j78J97K8R1q8J79j14p2l4J72j69L43m50J59K23k36J24l76J54J48
$$ 51 212 -51 -229 -32 -4 87 -1 178 64 -8 -42 130 -39 304 -146 13 236 0 124 -252 -98 50
4678E0n1J69j96l6M7k75L32N3j50k03M29J3j69m3j38M37j0l07J92l8p1j83M3J21
$$ 50 -1 168 -28 -64 -17 -292 40 93 -57 -260 169 182 13 -30 -168 269 259 -48 144 106 35 -148 -105 16
4702A6M8p9qJ1o4K97j42o0R9k41J57m7j34M0K21k02K1m7RJN9J90k14J94j87K66
$$ 16 64 -15 -23 -12 -76 221 79 19 118 -123 34 -13 -147 -107 114 -88 -67 -114 -105 -104 -45 145 -69 125 -62 204
4728B04j21j19j77K18J34q4j53n6M08l07J70p9q4j82R5L01j39n6K16j47p5M1J55
$$ 204 83 -36 -213 5 139 55 -98 -154 254 -53 117 38 -46 -228 -133 168 29 -27 189 42 -33 8 163
4751A63L8j94Q9l1Q5l09L41k29J40r1k20K62P8j98J00k7J54j87j2Q6j30j25j62
$$ 163 201 7 96 65 150 -159 182 -47 93 2 -218 44 122 -76 24 -3 151 -36 -48 38 -92 -217 -379
4774c79K72j27q9L13m0K57n06K90m5o8K28j73K40j2k21J55nl46J83J7j39K58k12
$$ -379 -107 -234 -323 -10 -50 207 -299 -9 -54 -122 106 -67 173 161 -60 95 90 -256 -73 -56 -195 63 -149
4797a49K26j76K17%p6J9j30JJ09m5k7j10J32L20l87m5Q2J60k89Np6M14j44Q9j78
$$ -149 77 -99 118 118 42 61 -69 -68 41 -4 -31 -141 -9 311 -76 -121 -39 121 -168 -163 -239 175 31 120 -58
4822e8j84K88p5J10N5r6M2j6o7K2L3j73O9j5J16k6j34Rk9pK10nQ4k88K74l39K33
$$ -58 -242 46 -29 81 136 40 82 66 -1 21 54 -119 -50 -65 51 25 -109 -100 -129 -136 74 69 153 -135 139 -200 33
4849C3l9n1K03j30J99k15P1J02j70R2j20k3o9K20l6k47J20r4J03j43J87o2J9N7
$$ 33 -6 -57 146 16 215 0 71 173 3 95 -25 -48 -117 103 67 -180 -60 -154 -51 -194 -7 -69 -50 7
4873Gp4L54l13J54j36M0j54J88J2j15J34q0nm8J58p9l8J74n7j6R2k66p6l1J00
$$ 7 -67 287 -26 128 -8 32 -122 66 78 -37 97 17 12 -36 122 43 5 179 122 106 198 -68 -144 -175 -75
4898g5r3J93k26j21K38o1m9K93K10n42J81O5p8K91k54o2m1N7o4J32J28o0j08n0
$$ -75 -168 25 -201 -322 -84 -145 -194 99 309 -233 -52 13 -65 226 -28 -90 -131 -74 -138 -6 122 62 -46 -96
4922i6M8j62L90k75O0q5L15l07J51j51k0O2k7L91j22l8m6j21j64J33R3p6K27p0
$$ -96 -48 -210 180 -95 -35 -120 195 -112 39 -112 -132 -70 -97 294 172 134 88 -33 -197 -64 29 -47 180 110
4946A10k6j00N1m21M63pj53J41P8Jk97K78m2k58J28l4M3J39j87J21k56K82j33
$$ 110 84 -16 35 -386 77 70 -83 58 136 137 -160 118 76 -182 -54 -88 -45 94 -93 28 -228 54 -79
4969g9Q0J67J28k07j90L61k44j37J44j69QJ04K0j60K96J0j68L0n6r8M5J73j99
$$ -79 1 168 296 89 -101 260 16 -121 23 -146 -138 -34 -14 -174 122 132 -36 -6 -62 -160 -115 58 -141
4992a41j12J26K6M2j36M49j45N7k20P4J4j1J28j11J00k11L6R8j47L66j86j98M7
$$ -141 -253 -127 -101 -59 -195 254 109 166 -54 20 34 23 151 40 140 -71 -35 63 -84 282 96 -102 -55
5015e5J84j01j9J69j20j27P8pqOq6J08j86l9L13k02K78k30K86l08P1K79l2k47
$$ -55 129 28 9 178 58 -69 9 2 -6 0 -86 22 -164 -203 110 -92 186 -44 242 -66 5 284 252 5
5039Ej3K7k13K60j76M42m07M8l1J16p5pPk2R5j07jq2K86kk73K99j44M7n0j89R
$$ 5 -8 19 -194 66 -110 332 -75 -27 -58 58 -17 -24 -17 -39 56 -51 -52 -134 152 150 -123 176 32 79 29 -160 -151
5066a51J71n9J93k56J88K44m40K38k95J84j53M8j34J09M0j99J44%O9k0K32j57
$$ -151 20 -39 154 -102 86 330 -110 128 -167 17 -136 -88 -222 -113 -73 -272 -128 -128 -59 -79 153 -4
5088dk71L9L59q7r5N8N9n9p2K10j84K41o2p2j69J56n6j6J72l18J47P5P6l6N6k43
$$ -4 -275 -236 123 36 -59 -1 58 -1 -73 137 -47 194 132 60 -109 47 -9 -25 147 -171 -24 51 127 91 147 -96
5114i6J51J06k02J75k13K53m1k64J84J17n5j35r2K7J96p7k48L92j96L4L5j84K41
$$ -96 55 161 -41 134 -79 174 133 -131 53 170 115 -20 -112 -85 111 34 -214 178 -18 16 51 -133 108
5137A08%j08M4k55M8K80k33M45m26L57k80m9P6l6j1R1j81k4J52L2R1n3J77k71
$$ 108 108 0 44 -211 -163 117 -116 329 -97 260 -20 -69 7 -29 -40 51 -130 -154 -2 30 121 68 245 -26
5161b6j38L30k00J6N1qr3R7j2k80L81K26k10l07j46M10r0k31J20N3j07k7K19j47
$$ -26 -164 166 -34 -18 33 25 -68 29 17 -263 118 344 134 -173 -319 91 1 -230 -110 -57 -164 -191 28 -119
5185a19Q3M7j34J65j80N3R1K85k97M0n1j61M50r8j03j44J05j41J50N2j74P2J25
$$ -119 -36 11 -123 42 -138 -85 6 291 -6 34 -17 -178 272 174 71 -73 32 -109 41 93 -81 -9 116
5208A16k11Jj9j48p1J16L3Q6j4L46k88J97o0j74l7K6K06K1j25Q7K49m23j84L81
$$ 116 -95 -94 -113 -261 -332 -216 -183 -97 -111 235 -53 144 84 -90 -127 -101 105 126 1 88 337 -86 -270 111
5232A11Q6j42r8L1lJ20j33L3k57L83k33L15j28k75O0N4jJ3J59k0j4j14K67m30
$$ 111 197 55 -43 -12 -15 105 -28 5 -252 131 -102 213 85 -190 -130 -76 -77 -64 95 75 61 -53 214 -216
5256b16J15J78n4P3J12j99J1J47j19K71j57l72M81j97Rj16J06k45J45l2j8R3k7
$$ -216 -101 77 23 96 208 9 20 167 48 319 162 -210 271 74 83 -33 73 -172 -27 -59 -77 16 -11
5279a1k07J43l2J25Q9R0j94J35j69j61M8P8M09j27n8k40jJ10j03j26J45k8j5J73
$$ -11 -218 -75 -107 18 107 197 3 138 -31 -192 -144 -66 343 216 158 -82 -83 27 -76 -202 -57 -85 -100 73
5303G3l22pj01K51l9J50k42K83o7n1J45j81L16j28k67J98j10K65k54%M5J5l5J18
$$ 73 -249 -256 -357 -106 -145 5 -237 46 -21 -72 73 -108 208 80 -187 11 -99 166 -88 -88 -43 -28 -63 55
5327E5l9M0l4j51R3k07K64j07K45j62L3k47J48K9p6J30R8J15l87K36n1K8J54j33
$$ 55 16 56 22 -129 -36 -243 21 -86 159 -3 30 -217 -69 -40 -116 14 112 227 -160 76 25 53 207 74
5351G4k33l3N09l90J56O9k48J94l2k7j8p2m6j14K70k08K00J04k10L33n03J90K33
$$ 74 -159 -192 317 -73 83 152 -96 98 66 39 21 -51 -97 -211 59 -149 51 155 -55 278 -225 -35 198
5374A98J15n33J54L6j1K37Mk54K41P7l37K05P7Ol07K84l16J09K8K57j88j35R6
$$ 198 313 -220 -66 -30 -41 196 200 -54 187 264 -73 132 209 215 -92 192 -124 -15 13 270 82 -53 43
5397D3J45q8P4j46p6M7k32M06p3r3l54L65M6J8j6j3L3N3j49j40J09j5n9K14J66
$$ 43 188 100 174 28 -48 -1 -233 173 100 7 -347 18 64 82 66 53 86 139 -10 -150 -41 -56 -115 99 265
5422B65l13K8j93K93k10p6QL08j53J79l6n8j30N1O2p3N8J22j38j50K34j70l3L7
$$ 265 -48 -20 -213 80 -130 -206 -198 110 -43 136 100 42 -88 -37 25 -48 10 132 -6 -156 78 -92 -125 -88
5446h8K52jl11K08q2m4K10n6j44K21k82J0J33l2q7J25o5q5k4k48N00k31K7J27
$$ -88 164 163 -148 60 -22 -66 144 88 -56 165 -117 -107 26 -6 -93 32 -33 -118 -142 -390 110 -121 -94 33
5470C3m6R0k23K19l4k05M49l80J29O2j1j17J33j28r5K79j38N1L6k30J30Q0j06
$$ 33 -13 77 -146 73 39 -166 283 -97 32 94 83 -34 99 -29 -124 155 17 68 104 -126 4 84 -22
5493b2Pq7J28j3M03l03J15k35J14j57R3j33nK92M7k92L0l02M11j31K4j11J38k07
$$ -22 -15 -102 26 13 416 113 228 -7 107 -50 43 -90 -95 197 244 -48 -18 -320 91 -40 -16 -127 11 -196
5517a96Q8J64NP8m7n3j02R2k54K09k3qK66j46l88M90j40J5j27N1NJ34K1k57K53
$$ -196 -108 56 61 139 92 39 -63 29 -225 -16 -39 -47 219 73 -315 175 35 50 -77 -26 -21 113 134 -123 130
5542A30j41n3j43J37J62k00J49L6o7k77J26J9K42r8j76J46J57m5J6p6k93p5L04
$$ 130 -11 -64 -207 -70 92 -108 41 77 10 -267 -141 -122 120 22 -154 -8 149 104 120 44 -249 -324 -20
5565b0J26k16K37J8j47j63O2j29L80k21J29J3j9K03k40k0K52k26r2K33l10J71
$$ -20 106 -110 127 145 -2 -165 -103 -232 148 -73 56 69 50 253 13 -7 245 19 -73 160 -150 21
5587B1J3j35J71j41n1L17k59k31J44J31k8J44M8k61j0L79k37k92L11J2l05J93
$$ 21 34 -101 70 -71 -122 195 -64 -295 -151 -20 -48 96 144 -117 -127 252 15 -277 34 46 -259 -66
5609f6J44o1J56l22P2N3M6J19k39RJ8kj56K90k64L22k73j47L14q4j0J49j28lK58
$$ -66 78 17 173 -149 -77 -24 22 141 -98 -89 -71 -73 -229 61 -203 119 -154 -301 13 -71 -81 68 -60 -63 195
5634A95j67J72k75J20l92L61K61n5l95K13j49J03j7j39P3J70k50K49j20LJ26m4
$$ 195 28 200 -75 45 -347 14 275 220 -175 38 -111 -8 -25 -164 -91 79 -171 78 -42 -39 87 43
5656D3j14J09p9k1J49P2k9q2MJ9l42L94l06L9R6R0k73K05n5k6J36j5l4r5k1j35
$$ 43 -71 38 -41 -62 87 159 130 48 52 71 -271 123 -183 -144 -48 42 -231 -26 -81 -107 29 14 -20 -115 -136 -271
5682b71J10L32N8j87k21K38o4n1K16p6J96j45j76k1m4L04k90J89J37j67j93L50
$$ -271 -161 171 229 42 -179 59 -5 -56 160 84 280 135 -41 -62 -106 198 -92 97 234 67 -126 224
5704B24l55P6L3K7k33J23O9p6J47J15q0j15n4pr7O6J93mk86J64Q5O1j52P0j06
$$ 224 -131 -55 -22 5 -228 -105 -36 -112 35 150 70 -45 -99 -106 -203 -137 56 52 -234 -70 15 76 -76 -6 -112
5729a12K16j27K58k5k88K03P8j95l4K7K33l29L3jJ56j74J07k08K73k7k14P7Q2
$$ -112 104 -23 235 210 -78 125 203 8 -26 1 234 -95 -62 -63 93 -81 26 -182 91 64 -150 -73 9
5752Ik25K61J01l86L6J83N16n54R7j60P0q1J95k92K20L6M7j37nM3j72j47L20J6
$$ 9 -216 45 146 -240 -204 -21 495 -59 38 -122 -52 -133 62 -230 -10 26 73 -64 -69 -26 -198 -345 -25 -9
5776il9Q4K65j64j80n8L40m40L2m0K28J65j86j77J83r7J58J67l63J93l2j98K24
$$ -9 -48 36 301 137 -43 -101 239 -201 -169 -209 19 184 -2 -179 4 -93 65 232 -131 62 30 -168 56
5799E6j02J1J44j05M2k29K96Ol11K95k14K3J57n7j70rL40j86JJ4K15p7j29K3q2
$$ 56 -46 -35 109 4 46 -183 113 119 -192 103 -111 -88 69 12 -158 -167 173 -13 -12 2 217 140 11 34 -48
5824d8J79j27m6l3K1k6N0L54l88o6m2K96j54k0P9J69p5m5J10j56N4p5K0j15k19
$$ -48 131 4 -42 -75 -54 -80 -30 324 -64 -130 -172 124 -30 -50 29 198 123 78 188 32 86 11 31 -84 -303
5849c03M52l6k26K17Jq9J6J14k75Nj22K70J98l97K85j72O7j71L68j06q2J09P4
$$ -303 149 113 -113 104 105 16 32 146 -129 -124 -246 24 222 -175 110 -62 5 -166 202 96 14 123 197
5872A97p7k74K34j24j16K67k14J23k46M14p6j4q3j78O4r9P0J01l4j14J65j5J32
$$ 197 120 -154 80 -44 -160 107 -107 16 -230 184 108 94 11 -167 -103 -202 -132 -31 -65 -179 -14 -29 103
5895A03j31J88l40K20m9p7J14r1j28J69J06N6j35J67j62j95M16n45M43J15k18
$$ 103 -28 160 -180 40 -9 -86 28 -63 -191 -22 84 140 5 172 10 -185 231 -314 129 244 26
5916B6Q0k11K40l51K33N5m8k27O4L06k02j62Q5K39k11j9j77K54Q5O3P1k70Q0J22
$$ 26 106 -105 135 -216 17 72 24 -203 -139 167 -35 -197 -112 127 -84 -103 -280 -26 59 122 193 -77 3 125
5940A25j85n6J26K36l21k64M24j58o8K86j42k06R8K54l24J19L3K7J08k24N1K0
$$ 125 -60 -116 10 246 -75 -339 85 -73 -141 145 3 -203 -105 149 -175 -56 -23 4 112 -112 -61 -41
5962d1l8J78P5k35R7K3p1k42L93Nl6p5Qq3K83r9j53o3J6l3K76j69K8jj55J27j18
$$ -41 -79 99 174 -61 36 59 -12 -254 139 144 108 33 41 -42 241 142 -11 -74 -58 -91 185 16 44 43 -112 15 -103
5989a03q5K37j8J57p4j99M48n76M90j65J02k31K33k03j58J34q3L28k36J87n0k63
$$ -103 -188 49 31 188 114 -85 363 -213 277 112 214 -17 216 13 -145 -11 -94 234 -2 185 135 -128
6011a28p5L3K61j10NK02k88J63N9j88j22O0R2j06J98R1o4q1P8rj50j7qJ94o7q7
$$ -128 -203 -170 91 -19 -14 188 -100 63 122 -66 -188 -128 -36 -142 56 147 83 2 80 71 -79 -96 -104 90 23 -64
6037f4J84j39K24k47k3N6Q0l47K89J58j41k03J96lJ47l2j60J82n2j85J93k34j12
$$ -64 120 -19 205 -42 -65 -9 71 -276 13 171 30 -173 23 20 167 135 -25 157 105 -80 113 -121 -233
6060b33J89J65j72k8J54k50N9q3L29j36J0J86k18J48p9K0M2k3K13J7k69O7n7j74
$$ -233 -44 121 -51 -79 75 -175 -116 -199 130 -6 4 190 -28 120 41 61 103 80 293 310 41 108 51 -123
6084a23m1K27k3j62kK5P1J29j62j22J79J98j71j7J64n7J7m11K42l0L3J02k17J51
$$ -123 -164 63 40 -122 -124 -99 -28 101 -61 -183 -4 194 23 6 170 113 130 -281 -39 -69 -36 66 -151 0
6108@n3l1M9L14j31k61J04J13n6n4J60j96RK43q9J48j60j06m9J87k79J9J7K12
$$ 0 -53 -84 -35 279 148 -113 -9 104 48 -6 154 -42 -33 210 121 269 109 3 -46 141 -138 -119 -102 110
$$ [...]
8191b25
##END NTUPLES=NMR FID
##END=
