##TITLE=1H_Pr AmMem2
 CDCl3,8 sc, 
 2.03.2021
##JCAMPDX= 6.0         $$ Bruker NMR JCAMP-DX V2.0
##DATA TYPE= NMR FID
##DATA CLASS= NTUPLES
##ORIGIN= UXNMR, Bruker Analytische Messtechnik GmbH
##OWNER= root
$$ XWIN-NMR		Version 3.5
$$ Tue Mar  2 11:35:19 2021 Russian Standard Time (UT+4h)  she@DPX200
##.OBSERVE FREQUENCY= 200.1315066352
##.OBSERVE NUCLEUS= ^1H
##.DELAY= (6, 6)
##.ACQUISITION MODE= SIMULTANEOUS
##.ACQUISITION SCHEME= undefined
##.AVERAGES= 8
##.DIGITISER RES= 18
##SPECTROMETER/DATA SYSTEM= spect
##.PULSE SEQUENCE= zg30
##.SOLVENT NAME= CDCl3
##.SHIFT REFERENCE= (INTERNAL, CDCl3, 0, 15.7039)
##AUDIT TRAIL= $$ (NUMBER, WHEN, WHO, WHERE, WHAT)
$$ ##TITLE= Audit trail, XWIN-NMR		Version 3.5
$$ ##JCAMPDX= 5.01
$$ ##ORIGIN= Bruker BioSpin GmbH
$$ ##OWNER= she
$$ F:/spectra/data/she/nmr/H-F/1/audita.txt
$$ ##AUDIT TRAIL=  $$ (NUMBER, WHEN, WHO, WHERE, WHAT)
(   1,<2021-03-02 11:33:31.75 +0400>,<she>,<DPX200>,
      <created by zg, POWCHK disabled, PULCHK disabled
       configuration hash MD5:
       00 E9 B6 7A A2 85 ED C7 34 08 36 98 17 FE 4E 26
       data hash MD5: 16K
       91 92 BA 0B EB 30 69 A7 F1 EE D4 D6 34 C5 A6 59>)
$$ ##END=
$$ 
$$ hash MD5
$$ E0 48 90 B3 B9 60 CD A7 08 B3 16 C6 35 7F 0E 22
##$RELAX= 
##$RELAX= 
##$RELAX= 
##$RELAX= 
##$RELAX= 
##$RELAX= 
$$ Bruker specific parameters
$$ --------------------------
##$DU= <F:/spectra>
##$EXPNO= 1
##$NAME= <H-F>
##$PROCNO= 1
##$TYPE= <nmr>
##$USER= <she>
##$AMP= (0..31)
100 100 100 100 100 100 100 100 100 100 100 100 100 100 100 100 100 100 
100 100 100 100 100 100 100 100 100 100 100 100 100 100 
##$AQSEQ= 0
##$AQ_mod= 1
##$AUNM= <au_zg>
##$AUTOPOS= <>
##$BF1= 200.13
##$BF2= 200.13
##$BF3= 200.13
##$BF4= 200.13
##$BF5= 200.13
##$BF6= 200.13
##$BF7= 200.13
##$BF8= 200.13
##$BYTORDA= 1
##$CFDGTYP= 0
##$CFRGTYP= 5
##$CHEMSTR= <none>
##$CNST= (0..31)
1 1 145 1 1 1 1 1 1 1 1 1 1 1 1 1 1 1 1 1 1 1 1 1 1 1 1 1 1 1 1 1 
##$CPDPRG= <>
##$CPDPRG1= <>
##$CPDPRG2= <>
##$CPDPRG3= <>
##$CPDPRG4= <mlev>
##$CPDPRG5= <mlev>
##$CPDPRG6= <mlev>
##$CPDPRG7= <mlev>
##$CPDPRG8= <mlev>
##$CPDPRGB= <>
##$CPDPRGT= <>
##$D= (0..31)
0 1.2 0 0 0 0 0 0 0 0.06 0 0.03 0 0 0 0 0.0002 0 0 0 0 0 0 0 0 0 0 0 0 
0 0 0 
##$DATE= 1614670411
##$DBL= (0..7)
120 120 120 120 120 120 120 120 
##$DBP= (0..7)
150 150 150 150 150 150 150 150 
##$DBP07= 0
##$DBPNAM0= <>
##$DBPNAM1= <>
##$DBPNAM2= <>
##$DBPNAM3= <>
##$DBPNAM4= <>
##$DBPNAM5= <>
##$DBPNAM6= <>
##$DBPNAM7= <>
##$DBPOAL= (0..7)
0.5 0.5 0.5 0.5 0.5 0.5 0.5 0.5 
##$DBPOFFS= (0..7)
0 0 0 0 0 0 0 0 
##$DE= 6
##$DECBNUC= <off>
##$DECIM= 32
##$DECNUC= <off>
##$DECSTAT= 4
##$DIGMOD= 1
##$DIGTYP= 9
##$DL= (0..7)
0 120 120 120 120 120 120 120 
##$DP= (0..7)
150 150 150 150 150 150 150 150 
##$DP07= 0
##$DPNAME0= <>
##$DPNAME1= <>
##$DPNAME2= <>
##$DPNAME3= <>
##$DPNAME4= <>
##$DPNAME5= <>
##$DPNAME6= <>
##$DPNAME7= <>
##$DPOAL= (0..7)
0.5 0.5 0.5 0.5 0.5 0.5 0.5 0.5 
##$DPOFFS= (0..7)
0 0 0 0 0 0 0 0 
##$DQDMODE= 0
##$DR= 18
##$DS= 0
##$DSLIST= <SSSSSSSSSSSSSSS>
$$ [...]
##$SUBNAM2= <"">
##$SUBNAM3= <"">
##$SUBNAM4= <"">
##$SUBNAM5= <"">
##$SUBNAM6= <"">
##$SUBNAM7= <"">
##$SUBNAM8= <"">
##$SUBNAM9= <"">
##$SW= 16.9725356469052
##$SWIBOX= (0..15)
0 0 2 0 0 0 0 0 0 0 0 0 0 0 0 0 
##$SW_h= 3396.73913043478
##$TD= 16384
##$TD0= 1
##$TE= 0
##$TE2= 300
##$TE3= 300
##$TEG= 300
##$TL= (0..7)
0 120 120 120 120 120 120 120 
##$TP= (0..7)
150 150 150 150 150 150 150 150 
##$TP07= 0
##$TPNAME0= <>
##$TPNAME1= <>
##$TPNAME2= <>
##$TPNAME3= <>
##$TPNAME4= <>
##$TPNAME5= <>
##$TPNAME6= <>
##$TPNAME7= <>
##$TPOAL= (0..7)
0.5 0.5 0.5 0.5 0.5 0.5 0.5 0.5 
##$TPOFFS= (0..7)
0 0 0 0 0 0 0 0 
##$TUNHIN= 0
##$TUNHOUT= 0
##$TUNXOUT= 0
##$USERA1= <user>
##$USERA2= <user>
##$USERA3= <user>
##$USERA4= <user>
##$USERA5= <user>
##$V9= 5
##$VALIST= <valist>
##$VCLIST= <CCCCCCCCCCCCCCC>
##$VD= 0
##$VDLIST= <DDDDDDDDDDDDDDD>
##$VPLIST= <PPPPPPPPPPPPPPP>
##$VTLIST= <TTTTTTTTTTTTTTT>
##$WBST= 1024
##$WBSW= 4
##$XGAIN= (0..3)
0 0 0 0 
##$XL= 0
##$YL= 0
##$YMAX_a= 739604
##$YMIN_a= -1095341
##$ZGOPTNS= <>
##$ZL1= 120
##$ZL2= 120
##$ZL3= 120
##$ZL4= 120
##$ABSF1= 10
##$ABSF2= 0
##$ABSG= 5
##$ABSL= 3
##$ALPHA= 0
##$AQORDER= 0
##$ASSFAC= 0
##$ASSFACI= 0
##$ASSFACX= 0
##$ASSWID= 0
##$AUNMP= <proc_1d>
##$AZFE= 0.1
##$AZFW= 0.1
##$BCFW= 1
##$BC_mod= 2
##$BYTORDP= 1
##$COROFFS= 0
##$CY= 11.3945322036743
##$DATMOD= 1
##$DC= 2
##$DFILT= <>
##$DTYPP= 0
##$F1P= 15.9154993809931
##$F2P= -4.1035820241983
##$FCOR= 0.5
##$FTSIZE= 0
##$FT_mod= 4
##$GAMMA= 1
##$GB= 0.15
##$INTBC= 1
##$INTSCL= 1
##$ISEN= 128
##$LB= 0.24
##$LEV0= 0
##$LPBIN= 0
##$MAXI= 10000
##$MC2= 0
##$MEAN= 0
##$ME_mod= 0
##$MI= 1.114404
##$NCOEF= 0
##$NC_proc= 0
##$NLEV= 6
##$NOISF1= 3.799351
##$NOISF2= 2.8
##$NSP= 1
##$NTH_PI= 0
##$NZP= 0
##$OFFSET= 15.70392
##$PC= 1
##$PHC0= -10766.58
##$PHC1= 19.80094
##$PH_mod= 1
##$PKNL= yes
##$PPARMOD= 0
##$PSCAL= 0
##$PSIGN= 0
##$REVERSE= no
##$SF= 200.130013532006
##$SI= 16384
##$SIGF1= 3
##$SIGF2= 2
##$SINO= 400
##$SIOLD= 16384
##$SREGLST= <1H.CDCl3>
##$SSB= 0
##$STSI= 0
##$STSR= 0
##$SW_p= 3612.71676300578
##$SYMM= 0
##$S_DEV= 0
##$TDeff= 0
##$TDoff= 0
##$TI= <>
##$TILT= no
##$TM1= 0
##$TM2= 0
##$TOPLEV= 0
##$USERP1= <user>
##$USERP2= <user>
##$USERP3= <user>
##$USERP4= <user>
##$USERP5= <user>
##$WDW= 1
##$XDIM= 8192
##$YMAX_p= 0
##$YMIN_p= 0
$$ End of Bruker specific parameters
$$ ---------------------------------
##NTUPLES= NMR FID
##VAR_NAME=  TIME,          FID/REAL,        FID/IMAG
##SYMBOL=    X,             R,               I
##VAR_TYPE=  INDEPENDENT,   DEPENDENT,       DEPENDENT
##VAR_FORM=  AFFN,          ASDF,            ASDF
##VAR_DIM=   8192,          8192,            8192
##UNITS=     SECONDS,       ARBITRARY UNITS, ARBITRARY UNITS
##FACTOR=    0.0002944,     1,               1
##FIRST=     0,             0,               0
##LAST=      2.4114304,     0,               0
##MIN=       0,             -1095341,        0
##MAX=       2.4114304,     739604,          0
$$ Real data points
##PAGE= N=1
##DATA TABLE= (X++(R..R)), XYDATA
0@%%%%%%qJ6j6J6k4L2m0N6p2Q8j12J37j62J98k39K83l33L92m61N38o20P12q18
29d37R38j071J216j377J557j755J971k208K469k754L065l406L777m182M624n109
45b682N638o213O843p534Q294r129J0055j1084J2231j3523J4985j6652J8578k0827
59a1020K3493k6715L0690l5725M2323n1350O4428q4988J21674k04715O79665k0652
71E27108j622449J671770m54279l54475M46346m42158N57731k88143l29043O13826
81C26234l21215r7926Q6218J15155k6975k64572L43747o69l65590K23395J67749
92A85551k59367o3333L20712j68131o7984R9488j34282K50211k48764o9009M27191
103B72283m39439J25348J71061k98329L35554k69758k0750L41910m05033J63063
$$ y = [0, 0, 0, 0, 0, 0, 0, -8, 8, -8, 8, -16, 16, -24, 32, -40, 48, -64, 73, -89, 109, -130, 153, -180, 212, -249, 289, -331, 381, -437, 501, -570, 646, -731, 826, -929, 1042, -1166, 1303, -1451, 1614, -1792, 1985, -2197, 2427, -2682, 2956, -3257, 3586, -3948, 4346, -4783, 5272, -5812, 6419, -7104, 7881, -8771, 9807, -11020, 12473, -14242, 16448, -19277, 23046, -28304, 36124, -48864, 72810, -131905, 547760, 527108, -1095341, 576429, 122150, -232325, 214021, -228137, 329594, 41451, -287592, 326234, 5019, -92907, -6689, 108466, 81491, -183081, 160666, 159997, -205593, 17802, 185551, -73816, -137149, 183563, 15432, -52552, 46936, -87346, 162865, -85899, -154908, 272283, -167156, -41808, 129253, -169076, 166478, -103280, -124030, 217880, -187153, -24090]
113b4090J10778j69957J05823r6519J23787p6292p4399J94586j89434Q3888N5922
124D4093j37587J46277r0493N053P6441j09350L9081N4896o680j04408J07142
135B4465N1854j97348J70266l0836q7911J59295j64154R9253M6814j70004J77685
146G9379r1516j3319J00160j47358J23006k3727n7362R1781j04483Q5041j2434
157B9168r0683J33139o8151k4158O8559o0057K3227J4348l4209P142K9515k5510
169B330j5640M3917m3553L0801J023o5744R3684m8411l3356P3780o3731M2611
181A7711j6167l7510P8272p1197K4568K0107n8557P7935n1352r637N3047n5546
193b8326L5779k1240r094M9911n6741K1256J9395k9236J8465j3635J1261j674
$$ y = [-24090, 86688, -83269, 22554, -73965, 49822, -26470, -100869, 93717, -95717, -11829, 44093, -93494, 52783, -37710, -32657, 43784, -65566, -26485, 28411, 21731, -82677, 24465, 76319, -121029, 49237, 18401, -69510, 89785, -74369, 24884, 71698, -98306, 79379, -12137, -25456, 74704, -72654, 50352, 26625, -30737, 61044, -43439, 41602, 29168, -61515, 71624, 3473, -20685, 47874, -12183, 11044, 25392, -8817, -1675, 27840, 2330, -13310, 30607, -12946, 17855, 18878, -46866, 46818, -1593, -34949, 38831, -24900, 17711, 1544, -35966, 42306, -28891, -4323, 15784, -42773, 35162, -16190, -25827, 27220, -28326, 7453, -13787, -22881, 27030, -29711, -8455, 10940, -18296, 169, -13466, -2205, -3879]
205c879q722J6884j7880J5678m092r778J7980j5900J1005m758m617J7812j4765
218e032P169p083P088J0184l2210L4061n463k4318L5557k8119J3298J1233l4253
231a7888L4261j1458q310J6309k2265K3556n211j7962K0681r877K711j534m215
244a202J2043j1135K699j37L74M707j2107Q648l109J106M433j5584J6201m082
258B855r117J1949j3919J3340k027j6794K3288j1793n040J0469j0381J0406o353
271c117m081Q637m746L281o564L806N626j1414Q143k596j33N772j1779J0487j487
286a65n906Q534q979P753L99r017J0090m149J483N97n682Q957l476k594L202p60
302B87K828m968K429K179k548K096m135O397k274m831Q251p106M255J559r033
$$ y = [-3879, -12601, 4283, -13597, 2081, -2011, -11789, 6191, -9709, 1296, -3462, -8079, 9733, -5032, 2137, -4946, 2142, 12326, -19884, 14177, 8714, -15604, 19953, -8166, 5132, 16365, -17888, 16373, 4915, -3395, 12914, -9351, 14205, 8994, -8968, 11713, 1836, 4547, 3013, -1202, 10841, -294, 2405, 2268, 2642, 7349, -4758, 3890, 781, 1887, 6320, -9264, 6937, 2855, -6262, 5687, -8232, 5108, 3081, -13713, 9575, -2218, -7258, 3211, -7170, 3236, -3117, -7198, 1439, -3307, -26, -6590, -2784, 2842, -8572, -429, -3025, -3158, 2614, -9165, 1322, -165, -6071, 2463, -6516, 1237, 1636, -7381, 2709, -1440, 43, 640, -5042, 3915, 439, -2155, 1047, 287, 3115, -1853, 576, 2755, 207, 2303, -1832, 4565, 2291, -2540, 5711, -1395, 2860, 4419, -4614]
317d614J1162n248k510O984q137O551k441m286Q416p141K781M08l734O884o539
332a464J045L172l935L459m007J363L152n121K627p94M48M16l455L850j139n53
348i36j57j022L312l468P38J042j629L011m120J973K258m130L720l249J593K845
364A781o378N775j492k112M466n628M365N84m829N309k608M36J769l960L999j045
380D32j404J889j385J697j064l59J155l64K62j303K095p56j476K452k084J877
396A664o33k402M184k601k73J910k938L515k436p25L325l706K202m48j824L346
412B160k788N97O58j497K323k318L46J433j532Q40j138J019O06k378J684j79K5
429a39o09k37J675j679J41Q31p25R99j533R95N65j781J948j091m2J115j662J713
$$ y = [-4614, 6548, 1300, -1210, 5774, -2363, 4188, 1747, -2539, 5877, -1264, 1517, 1925, -1809, 5075, -1464, -419, 2753, -1182, 2277, -1730, -367, 2785, -2336, 291, -503, -55, 361, -3094, 756, -383, -936, -1093, -2115, 1197, -2271, -1533, -491, -2120, 891, -3229, -1256, 1002, -3128, 592, -2657, -1064, 1781, -4597, 1178, -314, -2426, 2040, -3588, 777, 1361, -3468, 1841, -767, -331, 1438, -2522, 1477, 432, -972, 917, -468, 1229, 165, -194, 961, 597, 859, -444, 1651, 895, -581, 1871, -213, 1664, 1031, -1371, 2813, 212, -61, 1849, -1089, 2426, -10, -735, 2590, -1116, 1086, 638, -1186, 2160, -628, -31, 627, -870, 1453, -865, -519, 914, -618, 222, -916, 103, 709, -1669, 15, -164, -139, -748, -985, 690, -989, -848, -17, -742, 257, -1276, -281, 284, -1497, 451, -640, -682, 433, -1229, 484]
447D84j016j73J850k676J670L02j294J225j077J153j81j177J519l74j82K2j31
464e6J029j231R1Q80n57L79q43Q20k5q19J243j100O60K02j076J323r51J93O22
483G84j447J299k57n40P99r25J014n40p04J231r81J54L16m07O68o98K31J60k13
502e6J57m79N52m5n86O41m96K59j62l92Q39n55K26k06k52J073j140K79P38r64
522e69P86n53qN16p73Q79m02k02N36n29M67j37l59O11q44P34j0m19L75PR4j53
544D7j63N92m07j42K03j71L56l61O5O4j3J5j16L49k40j81L01j61n1J58k24L96
566C16l30Q1R3k16K25j50j17K87k90J08j11j73L97m75L60R5j46J84k65J77O3l40
588b27J16O7m6r0n5K85j17Nm0j9L14k39j7j1j69K53m6k33M48l50K14j07L2L9k26
$$ y = [484, -532, -705, 1145, -1531, 139, 441, -853, 372, -705, 448, 267, -910, 609, 235, 53, 75, -56, 973, -258, -167, 713, 156, 535, -308, 512, 487, -332, 911, -189, 471, 673, -403, 920, -31, 162, 784, -663, 636, 379, -161, 638, -287, 727, 187, -517, 714, -267, -113, 203, -204, 464, -234, -3, 157, -56, 101, -378, 174, 129, -457, 184, -312, -53, -215, -607, 232, -323, -97, -303, -555, 518, -622, -343, 395, -569, 217, -336, -344, 172, -601, 278, -124, -326, 210, -319, 148, 11, -348, 263, -581, 153, 143, -276, 99, 106, 200, 47, -116, 476, 69, -73, 130, -41, 315, -46, 19, 83, 70, 85, -31, 318, 78, -103, 198, 37, -14, 144, -80, 316, -14, 67, 160, -56, 169, 19, -98, 189, -101, 7, -104, -277, 120, -355, 5, 100, -46, 138, -127, 50, 113, -227, -111, -44, -90, -180, -235, 50, -67, -62, -102, -121, 193, -46, -63, -74, -243, 10, -36, -269, 179, -171, 43, -64, -32, 7, -219]
613b19L29k30l2L27k40J43j11mN6R2j45r2K42J56k67M9Ql25L14No0J15k0j10j0
638b9K37j37k9M0k3Lm6j48K24Kj62N5j5J36K9l15L46j38J6j7j22K18k50J44m2
663b3j18M7j18K25M6j84J55j97Q9L6K9N9m7M2j29M7J06j50Q2O7j54J14m2J08j7
688G3k81K24m1j73J10j25K51O0j46O8M9m3p4N9o5J12k2k2lO5R2r8k03J34J3m2
714b8j3Q6M0M1o2p7J12r9K04k72K36r9j51J92j25J90n4l63L07Oj52K37l73J54
738f3M2J40n1n0q0L3J09L5l0j81J13rMj95J88O1k81J92rLl6Q9j22K3J40j32JP8
766A2l7J35j57M6q5J49Qo3o3K0n0N9L4o3R6L2r5J1R1j5l2K07k46O2Mj33J3P6M1
795E7k1j13J02j14O0L6j41K78k06J11j29P0q5lJ28j43J43rN0k73O9O6J8K97k68
$$ y = [-219, 110, -120, -152, 175, -65, 78, -33, -37, 19, 111, -34, -126, 116, 272, 5, 54, 62, -263, 51, 56, -4, 111, 91, -19, -29, 208, 71, 42, 82, 59, 62, 16, -132, 92, 94, -68, -13, -28, 108, 137, -178, 168, 30, 46, 29, -93, 125, -125, 19, -23, -141, -94, -212, 13, 59, -125, 30, -167, -78, -42, -13, 46, -1, 41, -88, -41, 65, -85, -3, 64, -90, 24, -18, 90, 73, -208, 16, -25, -198, -88, -213, 38, 98, -48, 20, 69, 26, -48, 11, -54, 58, 36, 14, 11, 76, 168, 70, -133, 1, 14, -28, -41, 45, 85, 126, 64, -13, 99, 0, 204, -68, 168, 69, -82, 110, -15, 175, 121, -242, 65, 71, -81, 156, -217, -63, -21, 119, 68, 18, -62, -29, 80, 115, 85, -96, 17, 8, 12, -183, 5, 66, -215, -23, -32, -29, -65, 24, -98, -75, 65, -67, -66, 12, -25, 110, -47, -1, -86, 63, 71, 8, -55, -35, -85, -26, 8, -55, 41, 73, -22, -11, 80, 65, 33, 240, -6, 56, 60, -73, -60, 16, 57, 36, -77, 25, -89, -29, 7, -134, 144, -62, 49, -80, -10, -95, -98, 30, -113, 30, 21, 71, -202, -133, -67, -49, 248, -20]
820b0n2J19k53L10M4j5j04m4L3l8O1j53J70L5l4J9j42J7o2O4MP1K5j57k5K34j36
847b9r8J97%j1k57J45R4n8J37r2k2J15m9n9P0j20J91n1j30ko1J80J9n3j88N5J39
874F2o0m3O6j1j36N6J74j23N9m5R3k39K16k41J90n4L8j35J36J5L5k01P3J2rJ87
900A15j83R9n1j10L4n0J00k0m2P8M4J14j76k4J5L8l1L0j%Lm3K0J13L6o6p8Q0j63
929a19J61k0m1j9j86K18l7o9J68o2ro6J06J5j0J4q3j9L4R7n0J9r3P5o2lj5K21
957A65j22k3n4R6p0M9k33J33K7J35j0O3j34N0n8m4N9q1J10k98K63q1J02j27O9
982a4j31J26L0k7L2O7K0j33J20j85L9M6l0j64L28j53L1j28K99j11k24J40P7p0
1006a5J06j81P2km7P3j26P1R6j8j35J17K1j43J36O9nn9k7J00j78K0M3J07k20J39
$$ y = [-20, -72, 47, -206, 104, 148, 133, 29, -15, 18, -20, 41, -112, 58, 93, 59, 78, -64, -47, -109, -45, -41, 30, 55, -102, -127, 107, -29, -127, 70, 70, 59, -198, -53, 41, -17, 120, 28, 6, 121, 72, 13, 83, -37, 154, 103, -27, -29, -90, 90, 109, 56, -132, -77, 62, 2, -41, 25, 14, -122, -66, 108, -15, 44, -1, 92, -147, 69, -172, 18, -36, 2, -133, 3, 18, 53, -148, -75, -63, -72, 115, -68, 31, -20, -130, -96, -146, -46, -66, -108, -30, 14, 128, -48, -72, -57, -19, -50, -20, -21, -21, -18, -61, -41, 72, 108, 42, -36, 44, -119, 42, 22, -19, -38, -224, -6, -43, -112, 56, -6, -15, -81, 25, 40, 30, 44, -39, -58, -24, 73, 23, 42, -51, 24, -38, -41, -56, 165, 43, 20, -34, 62, -8, 41, -192, -59, -32, 103, 93, 156, 22, 72, 14, -30, 29, -52, 58, -240, 23, -58, 44, -83, -14, -145, -19, 11, -16, 16, 83, 103, -30, 90, -95, -56, -10, -40, -204, 124, -29, 2, -126, 173, 62, -162, -22, 55, -15, 91, -90, -18, -20, -67, 6, -120, -49, 47, 29, -106, 11, 32, -111, 25, 94, 89, 30, 3, 103, -75, -55, -12, 95, -125, 14]
1032A4J22k96K35Q0j34j55P3j24K00j01L9J44k3j26%O6j5m3P8j3K11q7m4j14m8
1057f1M2o1jO8P1O3p6j02J25k28J08R3j11J09L1j18oL3J13j70K08j29j5k5P1J38
1083A70j84p3R4N8l1o8J1L2J3M6j52j15J89j0qm2J14r4J59j01j0p3L9J24J6M0
1109A44l09L27k30N1O2j6n3L1j66J28r7J62j7j60J99K1p3k25J39O6J00j81J22
1132B5j14M6m2J54q1M5K01j23j3n4j25o3j0K09o1RJ56k47P4J20po2Q4m9q9j7J72
1159A38k15R0q3O0K1o2N5N7j9p6J2J1N1k47J68j6R2r6j15J29J74q4r6R6j49Q2
1185b2J27K2j15l6K2j05J00J7J02J6j52JJ91l00J08J28r1L7p1n0Q3J46j56r2j8
1210a08J05n7L1O3J6l5o2K7L0J26j87jJ46p0j06J96j14L8o8J2l0J34j67J05k00
$$ y = [14, 136, -160, 75, 155, 21, -134, -61, -185, 15, -86, -47, 97, 74, -52, -52, 14, -1, -44, 34, 21, 232, 145, 101, -13, -61, -19, -80, -81, -13, 58, 121, 45, -57, 68, -160, -52, 41, -70, 39, 70, -48, -54, -21, 92, -78, 130, 1, -14, -39, 32, 170, -14, -87, 7, 65, 34, -34, -23, 9, 22, 68, -84, -199, -10, -20, -28, -70, 44, -50, 109, 8, -2, -75, -36, 88, 104, 144, -165, 162, -68, -17, 45, 29, -24, 7, -159, -31, -128, 34, 17, -143, 56, 77, 4, -221, -82, -16, 84, -97, 25, -89, -43, -85, 69, -12, 33, 234, 111, 98, 44, -81, -144, -154, 55, -6, 3, 159, -88, -14, 106, 99, 37, 121, 72, -17, -34, 138, -77, 13, -70, -10, 11, -51, 4, 61, 42, -34, -22, -11, 40, -207, -39, -55, 37, -59, -174, -45, 129, 45, -51, 45, -104, -22, 105, 127, 12, -24, -2, -107, -7, 10, 112, 128, -24, -23, 168, -132, -24, 104, 13, 50, -21, -71, 12, 158, 2, -90, -108, -3, -60, -29, 34, 50, 15, -47, -20, 10, 136, -51, -52, 94, 24, -82, 114, 0, 38, -30, -18, -48, 86, -81, 24, -176]
1235a76J23L1P4o4PJ15j46K8J22j34N4n3K3L7j2r0J7J60j44k8K18j88Q1Jkj59
1261a05N4Q8n1M4j81Q0J12k7j91K05o6L4n9J1RJ35j12K2N9k44J40J47r2Or2n7
1287a31K86k19J22M5L4k55K03m6j8p5J81o3j96J18J30j88J1O4j12R0j26J75R0
1310A20j34P8q8J20q9r2J09q2Q0l5K1r5R9JJ8m5J10m4q2P7m4J6N4lj10K5J58k09
1338f6R4j9O3j85J93p9l9J23k16J66K7j40N6Q4Qj70J41J94j13j08pN0j40j1J32
1363C8j00N8K08j64Q3j98J11p2lJ08j85J39m3p4K44j17j04m0j4K05N8j82L1P4
1387F1J20j60pj4j17J28R3n8j23J44Nj29O4o5l3j9J7L1J01JJ3j46%n7J54n0q3
1414a29oO8N4o4J9L1J72j4l49J36n0L9R6K2O3k08J05q6%J60o2o2J15q0J30j87
$$ y = [-176, -53, -22, 52, -12, -5, 110, -36, -8, 114, -20, 34, -19, 4, 41, 29, -61, -44, 116, -28, -56, 162, -26, 55, 56, 54, -105, -51, 37, -14, 30, -151, -71, 41, 14, -177, 28, -38, -4, -63, -52, -43, 92, -20, 2, 61, -183, -43, 104, 12, 18, -74, -131, 155, -64, 58, 103, 137, -118, 85, 39, 21, -54, 127, 64, -132, -14, 116, -72, -61, 3, -109, -19, -145, 30, 120, -14, 64, -24, 96, 7, -85, 24, -58, 22, -13, 8, -87, 12, 13, 31, -14, 96, 52, -30, 47, 3, 19, 73, 70, -40, -15, 143, -66, 28, 9, 72, -113, 80, 1, -38, 85, -131, 35, 62, -78, -22, 62, 70, -100, 41, 235, 122, 14, 7, 57, -83, -94, 38, -62, -4, 204, 40, 123, -75, 36, -36, -39, 69, -116, 23, -20, -94, 150, 33, -71, -111, -125, 80, 138, -44, -13, 61, 181, 21, 14, 0, -117, 11, 104, 46, -77, 67, 72, -57, 7, -58, -91, -110, -93, -62, 39, 40, 53, -93, -93, -150, 4, -46, -129, -135, -67, -13, -77, -58, -27, 145, 131, -218, -82, -132, -93, 3, 25, 88, -120, -15, -101, -101, 59, -3, -65, 50, -30, 100, -87]
1440h7kJ04M9j78QON8J07J19l54J97J19k71Q8O8n5oJ3N5j92J53P1r2J82k43J19
1466C6N6j30n8O1K4o9J32M8O8j73j43J00P3j46N5J50M4q7n0J46q1N3m8q0p6K2
1492g3q6J24pJ26o6n3N4j15R8j00K32j35lO2j02j12J25J6qN5k82K56m4Q3r3J80
1518A32p4m9J8K1O6M4j33J01k05Q7K3j80Q3M2kQ3k5j9J9k9J3J37j63J45j26j05
1544i6m3J46R0j34R2J7k21J03K0Q3j76o2K30n6oj62J95j20J65N6n5j04%qM5N2
1570E1j20R6q5J10P6j99J32K2Oj28n5J92Q8l3j92J2o8Q7%k8%J64j59M4j91J27
1596e1J87r1k0o8M6J83j73j50J38J61q5j01N0K4r3P8j37P6m4P2J05k27K00n0j59
1621a29O1J57k23K76j58J6J31k65J58j00P4M2N0p5o7K6J76j79L9k1qj18J75L1
$$ y = [-87, -89, 15, 64, -114, -106, -100, -42, 65, 184, -170, 27, 146, -125, -37, 31, -24, -30, -17, 38, -154, -1, 70, -22, 160, -83, 36, 92, -38, -96, -35, -11, -80, 52, 100, 168, -5, -148, -48, 25, -121, -66, 84, 128, 41, -9, 137, 56, 109, 61, -19, -95, -73, -159, -35, -42, 84, 18, -35, 19, -96, 2, -98, 134, -1, -4, 58, -44, -156, -31, -15, -23, 32, -250, 6, -38, 45, -48, 132, 58, 9, 27, 48, 114, 158, 25, 126, -79, 8, 31, -149, -66, -24, -26, 57, 32, 13, 32, 3, 16, 153, -10, 135, 9, -96, -139, 7, 97, -37, 55, 72, -149, -46, -26, 57, -119, -181, 49, -7, -13, -175, 20, -100, 65, 121, 66, -38, -38, -46, -1, 51, -69, 27, -58, 52, 128, -71, 61, 83, 89, -39, -94, 98, 186, 153, -39, -27, -95, -8, -8, -36, -36, 128, -31, 13, -178, -51, 136, 45, 25, -43, 3, 186, 13, -137, 1, 162, 77, -24, 26, 50, -43, 35, -102, -26, -70, 2, 107, -120, 80, 30, -129, -68, 89, -134, 142, -16, 0, 131, -134, 24, -76, -2, 40, 90, 15, -52, -26, 150, -29, 10, -11, -19, -137, 38, 69]
1645F9j12J90j84l4J34r3o8k3J09kj9Q9j30K03p9L4%k36K39q4N7j46L8Q0N6j14
1671b6r8J46j60K01j28J00J76k17j5m7Q7mQ9jm6r3J49j29o0P2J03K2l37K20j34
1696a30K23p4L1mj06K8rO5q8J24n0%M9qp8J03j51j6K34k0j39P4j58J08j11J51
1722D8j95J33J47j48j09J34J17Rj34J23J3j89K14k16k1K3R9o2P7q2O3l16K75r2
1746h9K09j28p8R6j57K48l5r6j65O0Q8Q2Kj10Ok2LR4j15K01k03J59J8J9j33J93
1772A47j30J56k61J24r6n7O6R7m3K19k03Kj37J20J59j27j49j07K47k8O6j1k0q6
1796e2J47j81K02j49J35k02J44PL5j05K3n3J36j28J34j57L7J8L1R4j02J8Ro5K9
1821Eol5J06J43l23J17P1k01O8RM9j45j0J06P7J09k20n9J15J42j55Q3j46N3j63
$$ y = [69, -43, 147, -37, -71, 63, -30, -98, -121, -12, -14, -33, 56, -74, 129, 50, 84, 84, -152, 87, 3, 60, -86, -48, 32, 88, -26, -124, 22, -138, 63, -65, 35, 211, -6, -21, -68, 19, 15, 104, 103, 57, -36, 113, -16, -76, -4, 99, 121, -216, 4, -130, 93, 19, 50, 46, -60, -32, -41, 24, -64, 60, 10, 10, 59, 51, -27, 76, -75, -91, 143, 123, -16, 58, -100, 8, -103, 48, -147, -14, 133, -15, -124, 10, 127, 136, 2, 125, 138, -51, 163, -53, -74, -51, 48, -14, 63, -19, 44, -272, 3, -89, 120, -8, -86, 10, -147, 101, 66, -30, -195, -135, -47, 35, 37, -73, -67, -89, -86, 8, -107, 94, -109, 50, 68, 87, -46, 147, 17, 173, -88, 36, -60, -117, -51, 46, 3, 222, 19, 21, -116, 4, 163, 36, -113, -220, 27, -1, 65, 54, 34, -52, 95, -86, 116, -33, 102, -100, 44, 51, 86, -19, 4, -49, 87, -41, 93, -64, -27, -9, 22, 116, 14, 32, 41, -24, 5, -1, -36, 70, 213, -110, 7, 78, -123, -55, -46, 3, -142, -152, -46, 31, 140, -80, -139, -24, 118, -37, 46, -100, -47, -210]
1846b10J13j7K06N1K6k68J1P3J02q7M3j45J58j11L3N5Q2p3pp5n5J11m9K5j14J37
1872A5rj2J21j82J99k51o0J33P4j12J15j5Kl1Q9j25O9j6k08P6l5J76J33p6j10
1897d0%o9J52K0j01j3J10j2j57N2O6j15p4K42k44K88q4k2l4L0j0PJ1r4J33L7r
1924G0r5j35M3K78j89P7L8j75K54k19J23K2jJ4j08Lo7J05j44K03j93R3Qq9J1r
1950h2K53j77J6q1J66r9L7j05J81j76J3J80q2j9j27J32O7o4j24P7k1P3j74J14
1974b2Q0j46j27P5J82J0J47pj35k00J35O5j07J30j95J3J94rp3m4L3L1J9j03O6
1999A2l1n3K03k26M2P4n8M6o6O9m1M1n2J57q4n6oJ83k26P0M1O3Ko9l5n3J5J34
2027I6p2n8J57j73O0l7O3j08n6J9K4J50n7qO3o5J53r2j42lJ2N3K1k1qk1l8R6j34
$$ y = [-210, -97, -114, 92, 143, 169, -99, -88, -15, 87, 0, 43, -102, 56, -55, -22, 33, 115, 42, 35, -40, -95, 16, -33, -8, -122, 15, 6, -6, 115, -67, 132, -119, -179, -46, 28, -84, 31, 16, 18, -13, 76, -49, 20, 4, -204, -128, -163, 13, 146, 70, -40, -40, -109, 43, 63, -38, -51, 59, 47, -110, -58, 8, -107, -181, 61, -183, 105, 21, -1, -35, -5, -15, -8, 3, -91, 42, 79, 70, -25, -160, -117, 161, -28, 49, 87, -88, 166, -53, 70, 92, 91, 105, -3, 0, -67, 38, -106, 97, -96, -3, 5, -84, -73, -82, 171, -6, 10, -71, 95, -4, 33, -72, 109, -67, -54, 126, 44, 25, -102, 30, 97, 33, -91, -14, -35, 38, -136, -22, 58, -88, -215, -140, 42, 52, 199, 192, 57, -143, -8, 57, -50, 80, -115, -102, 92, 83, 10, -34, -1, 30, 49, -54, 12, -19, -72, 131, -95, -53, 21, -37, 9, -57, 12, -29, 12, -40, 117, 33, -23, -29, 154, -72, -2, 39, 102, 104, 35, 0, -53, -38, 96, 24, -34, 123, -50, 10, -27, 36, -72, -128, -109, -85, 65, 8, 0, 63, -2, 151, 59, -83, -86, -74, -21, 0, -21, -29, -50, -88, 8, -126]
2056a26J09j71J04J53m4J31j48J7n9M0j42n4qL4K22j6n9r8Q9P7j29Q9J94j62k15
2081a72L41j41r9R8Q4j60l7J40J42q0l0l1R1Jk65L3J83j57l2R7q8RP6n9R3j08
2107g1J27j35r1L19j90pJ0J51r5j5jo9K00j86j01K74Lj24p5O2N3J1Or3P8m7j31
2134a37M1k3o0K29p3o7K56k10J35m8J7j42Nj3M2Jm5J02%j3J40j12l1j4J3K8K2
2161D3k2p1j9Q9R3k82L10j04K59l14M9j11J39j08Nn8J10N9k53J53O3L2j4J12k17
2186e7J6q3R5j47J23NJ71j06j97J88l4L3p2J63k14J22K4J3P1l7J1j71J09k16J73
2211a7Nk1M3J5oj21L3L9j7P4l5P2j83J02O3q7k5Q5j04J78j66pJ67j00rJ1m0r3
2239a44J44j15J10j43Q1J79r4J59j7j84l3oKJ10r1o7J54OM1j42k1K2J76q2n9J
$$ y = [-126, -17, -188, -84, 69, 25, 156, 8, 25, -34, 6, -136, -190, -198, -164, 58, 42, -17, -115, -26, 51, -78, 11, 205, 43, -172, 169, 28, -71, 27, 111, -49, -86, 54, 196, 116, 86, 55, 146, 147, -118, -85, 98, -59, -91, 6, -82, -73, 3, -56, 37, -71, 56, -79, -170, 149, -41, -48, -38, 113, 18, 3, 2, -67, 133, -53, -154, 120, 123, -1, -76, -14, 39, 50, 56, -37, 41, -6, -137, -96, -119, -179, 50, -23, -90, 166, -44, 91, 43, 60, -82, -77, -90, -48, -47, -92, 10, 10, -3, 137, 25, -6, -20, -7, 21, 43, 21, -50, -69, 20, 113, -169, 141, 37, 296, -18, 31, -80, 59, -49, -44, -102, 8, 67, -186, -33, 30, 62, 48, 160, -57, -41, -124, -29, -176, -53, -48, 123, 17, -180, 8, -26, 7, -65, 98, -116, 6, 30, 43, 114, 77, 88, -83, 26, -190, -17, -12, -33, 10, 25, 19, -102, -69, -30, -47, 27, -8, 64, -119, -17, 46, -41, -66, 19, -85, 93, -73, -80, 87, -13, -22, -11, -51, -144, 0, -115, -5, -148, -67, 112, 18, 177, 160, -24, -57, -63, -61, 49, -42, -109, 45, 51, 92, -50, -71, -49, 127, 45, -14, -13]
2265a3P6j76J01R3j85J45M7j57MJ5J49p4K4q4k3p1R1q9K04M1j09l8J11j31r9J47
2291aM7Q3j75K6j5R1p4J36j43j2j14Q6R6k01J21R9J6m9K0K0j52J89p1J24j61j84
2317a98K76lo3K2j35N1J74j17R2j77N9Q9J5j12J07p9J8nk6m7J26r2R1j30o7R4
2343c7M0k0N0j77Q6JO3O7k20J34R5p6k2J62k28J3k9Q7O7k7j79J90q1k1J11l7n5
2370d3o0J13l1L5l0J28n6r3M5N7M3j47j9L4k5R5J00j09J3K0q7j65J30Orl9J05
2397A1o0J83j10j7k8J9pr4J59m1m1j04J66M6j7m1L5P8k25J69j16Q9k29J45P6j25
2423g9O7r9J47j31J24n5kJ80k36jJ99l13J0L47n6r2pJ69j67OP2j45N6j58J85k6
2449eJ36l8K6j43K8o2K00l22K84j26P7o6k33J68M0J6Q8j4o6m2J67j45N3j38J53
$$ y = [-13, 63, -113, -12, 81, -104, 41, 88, -69, -65, -50, 99, 25, 49, -35, -58, -129, -38, -127, 77, 118, 9, -29, 82, -49, -148, -1, 46, 129, -46, -20, -35, 56, -18, 118, -25, -37, -151, -65, 31, -170, -49, 50, 66, 17, 37, 57, -95, 94, 23, 147, -14, -198, 78, 75, 12, 34, -101, -50, 124, 7, 99, -78, -19, 70, 85, -27, 80, 1, 19, 14, -12, -59, 67, -25, 66, -64, -131, -37, 3, -17, 33, -144, -58, -57, 6, 73, -147, -13, 82, 6, -16, 146, -82, -69, -98, -11, 56, 29, -150, 40, -41, -62, 49, 12, -43, -103, 10, -21, 14, -16, 112, 56, -37, 8, 65, 108, -39, -58, -24, -49, 46, 146, 37, 50, 70, -17, -182, -52, -46, -55, -94, 11, -49, 134, 24, 7, -21, -2, -9, -103, 56, 15, -26, -130, 36, 82, 65, 24, 59, 137, -88, 81, -35, 54, -175, -30, 46, -79, -12, -111, 36, -95, 29, -26, -28, 152, -84, -85, 114, -199, -189, 158, 102, 10, 3, 172, 5, 11, 83, -62, -6, -164, 21, -5, 131, 93, 119, -24, 4, -58, 142, -180, 104, -22, 55, -11, -244, -76, -36, -20, 68, 54, -12, -54, 113, -32, 21, -117, 36]
2474C6L3j48K02j33n4L2O4j16K81l11L6J06m1m0q0O0Q1p2J39j33J7j9J73r2J50
2499A71j33o5O9r9k1J99p7o8K8O8m5j33J49j12K6O8n2P5QN9j18J4q9O1M0r4p8
2526a49J01J79K7j18P2j05N4j04R2M0rj21n6l5J83N8Pn5k19N6M8k0J44k1O0k9
2552H0j33R9M5j21o3M4j27J87l7k7K30k39R4p8P0k07J65Q5Oj40O3m5j3M3O1Rk16
2579a65J51l7J56q8j53J71M8p0m1o9M2K7J8r4L5pJ35j17j1k5nK51j28j20K9k4
2605i1J77j50j6J66K0j65O9j77K43n6j27J45o5L6j20j17J89R6P2j5j54k9R4p6
2629e1o5J62m1m4J70j66L8j9L4J11n0K9k06L0J84l8k07J45p5Q6r6P2J63j66p3
2654g3J12pK9J1j68rJ97q5k2j1l7M9l4O1R4p3j05M9j6J67j40o1N3o8J43K3j82
$$ y = [36, 69, -79, 123, -10, -64, -32, 32, -84, 197, -114, -78, 28, -13, -53, -133, -73, 8, -64, 75, -58, -41, -60, 113, 21, 171, 38, -27, 42, -57, -78, 121, 44, -24, 4, 72, 27, -106, 43, -69, -43, 25, -27, 48, 56, 115, -3, 11, -78, -17, 23, -71, -149, -48, 131, 158, 40, 112, 7, 61, -43, 49, 89, 80, -41, -97, -132, 51, 109, 116, 61, -158, -102, -54, -74, 70, 49, 109, 80, -53, 46, 91, -30, -93, -49, -176, 11, -26, -53, 177, -62, 32, -46, 24, -183, -18, 67, 73, -67, -4, -49, -62, -19, 42, 51, -165, -14, -51, 105, 17, -136, 35, 83, 13, -28, -97, -55, -28, -10, -104, -69, -76, 59, -58, -69, -94, -99, 152, 24, -96, -67, -91, 86, -64, -80, 86, 106, -59, 10, -167, 76, 20, -107, 38, -27, 9, -111, -228, -39, 57, 129, 114, -40, -69, 25, -51, -116, 46, 5, -39, 131, -35, 3, -16, 18, 129, 79, 108, -98, -68, 116, 78, -129, 16, -59, 27, -69, 3, 166, 0, -73, 39, 32, 61, 72, -96, -105, 92, 7, -15, -26, -63, -14, -48, 13, 107, 34, -71, -22, -38, 129, -11, -72, -19, -87, 56, 79, -103]
2681a03L6M9%p6J1J14N8o0m9J63j14k9R1K6k09j2M8n6J8L6Rj14J78P2K6p6n9j18
2709a40k4K45m0m8P3kl2q0o8J66k0pL7K0q1Q3n5k05O6K47k14Q2p6J64n7m4L6q3
2737e7K2K2R9l1j2j63o7J92oMJ39k13J00j7k5K4m8Q9o6j48J57M1l8k6p7J47m6
2764drn3j3L3P8R2o4k00N3qJ54l8j88O9kK45j10n4J05j56J45j06pr2J15J37l28
2791b06K14k38K94j10J30j59J73j31n9O9K9n1j00P9K35k03L6M5q0J08j82J70J9
2814H2j74l9j4J28r6J14J79j90J89j51r2OM8n6N4p1J12r4n2K05j55j6N2%L5K2
2840B6j49P6k2l1lJ11k5N5n7J64k07J64j52J15k2r7l0J25j2j17J8O2j22J75l1
2865A4Nk6j20L8M2j6J16p2n0Mk6l8K35p5n1N0m3jo2J30k7N0j21qJ27j50J5J80
$$ y = [-103, -67, -18, -18, -94, -83, 31, 89, 29, -20, 143, 29, 0, 91, 117, -92, -104, -56, -112, -94, -58, -49, -163, 15, 87, 113, 37, -22, -140, -164, 81, 41, -7, 66, 64, 32, -48, -116, 50, 30, 23, 60, 80, -1, 82, 27, -178, -112, 135, -79, 3, -73, 91, 34, -10, 26, -57, -35, -13, 86, 55, 43, -120, -187, 5, -1, 3, 142, -71, 29, 12, -13, 11, -37, 52, -14, -162, -5, 36, -2, -28, -105, 42, -4, -13, -66, -79, -46, 32, 124, 60, -140, -87, -95, 59, 21, -167, -98, -100, 145, 35, -19, 86, -70, 75, -31, -38, -130, -15, 122, -206, 8, -230, 64, -46, 84, -75, 98, -33, -92, -23, 6, -45, -145, -66, 169, -34, 2, 47, -33, 75, -107, 63, 82, -92, -131, -145, -17, -113, 1, 180, -10, 179, 28, -64, -58, -10, -66, -12, -83, 29, -65, -117, 88, -67, -83, -31, -31, 4, 26, -123, -47, -69, -100, -103, 8, -17, 38, -19, 145, -62, 102, -50, 65, 43, -54, -84, 41, 29, -88, -70, -8, -130, 45, 14, 19, -7, -127, -89, -47, -63, 53, -19, -69, -65, -91, -129, 106, 31, -20, 30, -13, -14, -76, 54, 27, 77, -44, -52, 75, -75, -60, 120]
2893A20o4j12J83j46j6M3K8q7K4l2P0O2r2K05k25K3Jj81J38mJ34l7k19L54J1j12
2919F9j01k0J11j00p1J06p9K30j55J03k10J72q1K9l2M8M3j30L9R3r5m3m8J84l0
2944C2n6P0N%j78J60J02q7j45K8N8Q2j0m7r5J26j62J3M2J54k39Q0kR2L6m5o9o0
2972a15J89j96M5R3K1q3K6L8O7j79J89j15n2J15r8j5j41K28j4oM5M1j35R9k6k7
2998fJ0j75K75j60R1k4N5k9j85K15Lj20j11L52j90j26oJ95n8K5j1K3J1n9oJ15
3024A04jL0o2j71J72j55Q4j54J84R1r4N3o4N9q1M4p2K67k29J2K3q4n8L2N1mP1
3051D8o5K2p8J18n0l4r0J30Q9J7k75J99j5j5J25k01n5J84K8P5k01Nn6J59n4K2
3077C2m2J2r3m3J47j1J9j6j2j21K03k44J30K04k12%n3L3J04q6K0J26k13J4J38
$$ y = [120, 56, -56, 127, -19, -35, 8, 36, -51, -27, -59, 11, 73, -19, 186, -39, -16, -15, -196, -58, -62, 72, 35, -184, 170, 181, 69, -32, -52, 59, -41, -112, -6, -85, 145, -10, 93, -117, 55, -26, 3, -29, 19, 62, -68, -29, 64, -31, -74, -122, 62, 32, -24, 46, 51, 51, -127, 33, 135, 48, -97, -69, -11, 71, 61, 14, -81, 45, -117, -104, -62, 92, -147, -67, -69, 23, 59, 14, -55, -115, 74, -122, -77, 16, 37, -46, -20, 18, 85, -94, 95, -20, -72, 43, -55, -70, -211, 17, 3, -3, 42, 83, -52, 47, 21, -6, 4, -171, 104, -56, 35, 11, 66, 37, -148, 67, 70, -50, -161, 191, 1, -125, -131, 64, 6, 31, 20, 43, 54, -5, -11, 104, 103, 133, 71, -100, 72, -83, 1, -153, 31, 122, 28, 81, 17, 76, -5, 39, -33, 234, 5, 17, 40, -44, -102, -70, -19, -23, 48, -17, 5, -73, 45, -5, -39, -129, 1, 90, 107, -168, 31, 16, 1, 126, -75, -130, 54, 82, 157, -44, -39, -95, 64, 10, 32, -10, 2, -91, -134, 13, 2, 21, 5, -7, -128, 75, -169, -39, 165, -47, -47, -100, -67, 37, -49, -29, 97, -116, -102, 36]
3102C6o7m9J48j42J77j1j10o4J47k24J88J0o7K4K6k0p6L3J42j84N8l1m4L2O3M1
3128C6n4j4R7k7K4P8j21J9o8o8J4l9K00J03J8j34L4j3k13N6J3J27o6p7J36j27
3154f6m8K0o6J60J21j11J6j61R5P2r5J15q1J47j8j06K7j30J55L8j18J13j4J8j34
3179e1J55j39kJ38k1j00L5r8Q7o2j31J24J73n3l6K4j10J88r7j15K32m6j07L4k57
3204b35K09l0Kp4P8P8j51J58j12nK24j05j2M5n8j02J12K1m1Lj7P1q9K0K5l6n6
3231g7R8j9j18J04n4QJ11l3j43J99j55J05p3L2J01j65J72o5n0l8L9O4ML8o6r8
3257g9J71qq3p1R3L2p5L9j04o1J40J13Pp5J22k01nL0J30r1j29J28r4m9O7K7J02
3284G6j58J06k6O9q3M2J26o6j57J43K9j11j5P1j04J14m%m8j16J3N7Q9j19qK5o2
$$ y = [36, -31, -80, 68, -74, 103, 92, -18, -82, 65, -159, 29, 39, -28, -4, 22, 2, -74, -41, 101, -83, -25, -56, -100, -68, -5, 36, -18, -32, 65, 38, 62, 140, 19, 38, -30, -98, -84, -123, 77, 180, 198, 64, 98, 85, -128, -72, -59, 68, 2, -75, 61, -66, -114, -94, -160, 0, 121, 10, 26, -135, -40, 32, -63, 52, -29, 118, 100, -6, 21, -109, 46, 84, -34, 79, 65, 83, -51, 104, -35, -37, 101, 80, -20, 15, -83, 4, -58, -189, -65, 108, 55, 19, 43, -67, 121, 24, -91, 141, 95, -12, 22, -235, -26, -56, -54, -128, -50, 28, -123, 35, -77, -82, 142, 37, 25, 70, 12, -90, 22, 43, 2, 5, -12, 59, -30, -10, 15, -21, -77, 21, 2, -116, -12, -66, -58, 53, 20, -123, 76, -79, 26, -47, -15, 86, -79, 93, 28, -22, -60, -21, 43, 47, 85, 19, -79, 92, 84, 1, -70, 23, 55, -20, 19, -85, -146, -6, 107, 114, 39, 161, -40, -45, -15, 115, 24, -105, 23, -71, -120, -53, -26, 76, -82, 24, -2, 67, -16, 26, 152, 86, -71, 72, 101, -10, -25, 46, -58, 56, 52, 52, 4, -112, -99, -42, 47, -72, -80, -55, -117]
3311a17O0j7k9J75q0P1j66K07j99J57j01kk8m4J03J7m9P8K3n7m3n1J71q8N6r9
3337e2J9J1J68j90J9j05J32l8J59p0QLj51Q9k7p7N0l7J97j27P6j13o8J15n6P1
3363FLm9j12K05J0m5J3j0j75J05J13k38K05p0pJ9K04k30J21j81J2J70m0qnj15
3389i9J79m2K06l10m5J22N5r3Q1j24j11J22J13L0j17L3q3j3Q1R1Qj13m9O5L1J
3415A9K4m0L9r4J53j52J45r3m0J24k08K08m0Kn8Q3j32L9L7P4l0L0Qk51N8J1J51
3442F7p1J15j19oL3o4J80j80k5L2j38L21p9L3O1k15Q0j03M6NM5K2j88k6J90j0
3468Fj9N2p4P8p5J7j58R5k1j4J59j47J1K39j05o4mj0L1r6j2J80J8j71M8O6q8R4
3496C6Oj45j00M04k78J45j63O1j6O1K1M9P6l3k47J16J6j48J86R3j61j98J28Jp
$$ y = [-117, -57, -74, -103, 72, -8, 63, -103, 104, -95, 62, -39, -41, -69, -113, -10, 7, -42, 36, 59, 2, -41, -92, 79, -9, 47, -52, -33, -22, 146, -44, -25, -130, 2, -36, 123, 53, 61, 64, -87, 2, -25, -102, -52, -89, 108, -19, 57, -56, -124, -9, -65, 6, 9, -40, -152, 53, 63, 18, 31, 21, -154, -49, 64, -174, 31, -39, -46, -27, 177, -53, 68, -113, -101, 69, 29, 21, 16, -99, 80, 38, 244, -66, -111, 11, 66, -27, 54, -70, -181, -59, 54, 84, -33, 0, -83, -96, -15, 76, 84, -29, -78, -13, 18, 19, 43, 3, 42, -52, 101, -51, 94, 1, -39, 85, -123, 85, 45, 47, -11, 72, -60, -21, 16, 90, 60, 90, 98, -153, -95, -84, 67, -4, 111, -8, -14, 19, -45, 135, -45, -70, -38, -176, 145, 66, 99, 160, -55, 25, -78, -32, -27, 18, 40, -148, -174, 16, 6, -13, 39, -35, 43, -32, -15, -173, -78, -99, -113, 46, -101, -90, 149, 44, -20, -24, -34, -3, -99, -111, 69, 87, -84, -36, 30, -58, 36, 42, -103, -203, 201, -77, 68, -95, -34, -50, 11, 32, 81, 157, 124, -123, -7, 9, -139, 47, 140, -21, -219, -91, -90, -97]
3521i7k1P2J00k6p5kQ1k39J05J75k43l4J97J9r8Q7pO8j24J65l7j28J01l9N3j43
3547i0K2J16j5r6K18j93j9J2o9L3K08k06n3K51O1k64J5pO0J11j91O7j10R1J53
3572A05j35j23J63J4j86J22N2p1Q8p8m6P6J15n7o1J58j00J12q4k29O4J22k7m4
3596e0J33n3k2j0m1j35K12j72K47k84J92Rp3Q2r6N8j20J40q7Q1k8M0j86J50j09
3621a22J64n4R5j45N5J12j25J7j89J57p8K14j99N3l5J36j18m7K17j50J65p4K7
3644G6n9J05k90J49L5l3n7K52p9k14J52J7J54k94k8J96k3k54L00j83J50k16K58
3667A14j87P5o6J22j27J69o4n0K9P6n1k0j24R3n4N8J35j80QP8qO5l9k40J07J40
3693E9j68K18j11Q8j80J61Jj12M3J24p9q4K5j0J23j0r5q9J97j58k6R1l5j8N4j54
$$ y = [-97, -118, -46, 54, 28, -47, -49, 32, -207, -102, 73, -170, -204, -7, 12, -86, 1, -6, 62, -62, 103, 66, -62, 39, 0, 53, -90, -68, 48, 33, -63, 155, -38, -57, -45, -114, -81, 127, -79, -132, 119, 180, -84, -69, -76, -16, 95, -96, -29, -139, -48, 105, -30, -153, 10, 24, -162, -40, 12, -59, 29, -49, -95, -19, 96, 39, -22, 136, 36, 148, 64, -165, -101, 21, -6, -50, 83, 30, 8, -2, -43, -178, 34, -138, 109, -175, 17, 26, -47, 35, -61, -3, -123, 17, -70, 11, -17, 23, -163, -13, -122, 42, -12, 83, -62, -7, 105, -20, -3, -192, -35, -113, 101, -98, -45, -80, 56, -62, -109, 108, -42, 123, 49, 76, 17, 122, -168, -19, 16, -17, -74, 178, 99, -115, 37, 54, 208, -86, -114, 82, 59, -195, 105, -78, 72, -144, 114, -73, 2, -64, 58, -69, 100, 36, -14, 15, 91, 40, 20, -104, -11, -65, -7, 128, -52, -44, 34, 26, 91, 52, -188, -81, 59, -109, 109, -2, 86, -94, 67, 68, -44, -1, 123, 44, -40, -15, -25, 98, 88, -7, -96, 101, -57, -83, 8, -27, -45, 9, -145]
3719a45J16k0J07o0l0p8K11j01k9mo9Q0m4R3j16J90j52J33O7j05j21K50m6r6r1
3744f0J9lJ13p7O0R0j48K1m1l4RJ57j37ql9M1nJ52j32j7pk24J75J99P6j56k8o5
3772f9J00Lj08K49l07J04J00j1p2j11N5Q8R0j1L0Rk07J48J32j91j31k2O5K86j82
3797C7m6m8l6J97r1j42K46j2j48J2J06j00Lj24N5J5K5R5l1Q0j01l0J20l7q1nq9
3824a30P7p0P2N4K15j33Oq8q1P4k7J00m7j08J78j13O6j07J21l0n6Pj35N1pl0k8
3851a69J93k2j36J37J10j45J38p9N1j47j1L1R7m7J12k50K28q5o8Q8M0j02J18j42
3875f0J22o2j30J11k1nL2q8J82n2nj95M2J82l1r6jJ44r0k3N9qM1J6r2lK1J62k39
3904h7K15j34J45k02J57L0k37J84J10j54j35K65k51J06K9pj48J57kKJ12j91j78
$$ y = [-145, -29, -49, 58, -2, -32, -110, 101, 0, -29, -33, -102, -22, -66, 27, -89, 101, -51, 82, 149, 44, -77, 173, 127, 31, -60, -41, -44, 69, -8, 52, 142, -6, 15, -26, -60, -51, 106, -31, -39, -78, -37, -42, 110, -22, -39, -46, -270, -95, 104, 180, 24, -4, -69, 31, 34, -74, 175, -132, -28, 72, 61, -11, -122, -67, 21, 111, 100, 130, 139, -68, 80, 212, 21, -110, -132, -67, 219, 37, -9, -57, -93, 104, 13, -129, 117, 105, -43, -31, 75, -25, -22, -146, -91, -76, -51, 44, 13, 93, -8, -38, 82, 45, -36, -41, -130, -53, -123, -51, 3, 218, 85, 91, 3, -78, -4, -31, 69, 22, -86, 92, -21, 45, -62, 59, 29, -27, -20, -155, -104, -111, -141, -169, 24, 2, -134, 3, 113, -32, 106, 27, 78, -69, -80, -49, 48, 1, 113, -137, 91, 6, -62, 26, 66, -36, 82, -60, 62, 0, -130, -19, -40, -45, -13, -101, 81, 29, 24, -171, -129, 53, 22, -74, -75, 69, -21, -44, 15, 7, 48, 64, -28, -31, -10, 152, -87, 128, -6, 139, -63, 94, 124, -113, 71, 181, 27, -108, 157, -94, 12, 41, 34, -114, 43, 41, 43, 155, -36, -214]
3927b14L08j40J30r8P8m2J3n5J16n8p1J0N8Rn2j36J17j04J32j0m7MJ50j39M2P9
3953H0k70K36j14R7l6K2p9J29j02j28J76j30J31oJ8K5k11J52Q2j05j23K57N9j58
3977Bl6o0K60k82J09K1o4K1p2K92k63M4N1J5J0Pj47K83m9p6j27O9m0K4rO3oj54
4005a14K3J25n6l1P0k09K13k5j09J47j4l7j60J75Q7j44OJ17j45M7j03Q7M5rK9
4030A5M5Q2j17q7O8P5j11nP3kj64J24j6O7m7q1J6N4o1J7L8J28q3j92J38j7Mj24
4058a63J85l8j7j15J61k3%K5K03j95J0l4m8LK16k64K0k9J88q8o8J38mnM7j01q8
4085h4J32r8mj19K00O9o2K6K7l0r8l3p4J32j02J83j83J09J9K04k20j05J73j22
4109f0OP2j00Q8O3l3n0L8N3J06j17K2j62K39j91Q8j77N7N6r5J05j17L7j3O2J7
$$ y = [-214, 94, -46, 84, -14, 64, 22, 35, -20, 96, 38, -33, -23, 35, 44, -8, -144, -27, -131, 1, -9, -56, -52, 98, -41, 1, 80, -190, 46, -68, 29, -7, 15, -64, 65, -37, -165, 11, -119, 12, 6, 24, 49, -162, -10, 72, -33, -156, 101, 160, 2, -34, -94, 166, -116, -7, 14, -50, -29, -101, 191, -72, -28, 23, 38, 48, 55, -92, 191, 142, 66, -61, 8, -32, -8, -17, 46, 40, -114, -91, 34, -22, -53, 17, -192, 21, -4, -113, 34, 20, -17, -177, -2, 85, -59, -53, 64, -81, -34, -137, -50, -5, -14, 15, 60, 142, 25, -62, 6, 81, -30, -35, 38, 36, -128, -4, -20, 47, 0, -81, -65, -11, -72, -55, -17, 111, 28, -164, -26, -43, -39, -163, 22, -16, -33, -148, 13, -10, -10, 15, 218, 23, 33, -1, -49, -46, 170, -94, -74, -103, 85, -3, -71, 67, 63, 58, 105, 4, -84, 48, -50, -54, -173, 27, 96, 34, 60, 87, 57, -41, -74, -148, -16, -118, 65, -118, -9, 10, 214, -6, -111, 62, -60, -54, 18, -82, 6, 69, 36, -14, 24, 77, 183, 66, 88, -74, 165, -26, 62, -115, -58, -2, -97, 8, -109, -72, -85, -23, -6]
4135fJ4J9k28K63l6n8J08j15j2J01Km4K1k14L07r0n3N2nj09J24L5j90N6n2o9J93
4162A4m2J17k26K03Kr3q2O6jp9M9o6J51K0j01J18j53J27L2Qq8P6Nj05Q6O8k25
4189a19J94r5m7J86j37lo9J46j89J37jr2N1N9p6o4J97n2p0J12r1J3M1M8j56J22
4215D5J7j6L9j55J44mj40J06J7L9j53p1L64k11m4K29k61K6J75l3j37n5Q6N1K7
4240H5j42R3j07N7m7L7O3m3l0q1J45m2o6M2Q8pj59J72K6M0q4k5O9j57L5j2J10
4267F0k8p6P7%o4M5r7P8N4q4O6J9j43KJ61k8j63M3N8J8l3n9J36j06ok4J2M9MK0
4297iq8J58j08J24j34R5o5K4O4NQ5l21J44j10J85p8J24j90J08J01l2j09N5Q9j04
4322A3j20J40o1M9j56J67j9j45J62l1j48K2k1J40k6P9n9O0j15J37o0j2k5q9K07
$$ y = [-6, 8, 27, -201, 62, 26, -32, 76, -39, -51, 50, 52, 8, 29, -185, 122, 32, -21, 31, 26, -83, 41, 76, -114, -58, -110, -179, 14, -28, 89, -137, 66, 68, -25, -107, -41, -42, -121, -72, -138, 13, 33, -68, 50, -103, 24, 56, 64, -24, 52, 57, -48, 38, 106, -119, 75, -20, -67, 119, -18, -21, -90, 56, -133, 4, 3, -89, -38, 21, -55, -119, 78, 26, -44, 68, -23, -10, 31, 79, -77, 45, 62, 46, 85, -70, 74, 70, -70, 36, 53, 92, -61, -132, 232, 21, -23, 206, -55, -29, 146, 113, -24, -79, 7, 58, 85, -57, 36, -71, -14, -61, -24, 39, -4, -34, -115, 30, -12, -78, -36, 52, 45, -114, 58, 84, 124, 40, 15, 84, -73, -38, -50, 60, 32, -44, 33, 33, -31, 14, -83, -5, 49, -35, 31, 50, -93, -91, 70, 42, -121, -78, -20, -2, -35, -94, 42, -64, -70, -94, -82, -33, -29, -9, -97, 61, -47, 77, -57, 38, -27, -3, 61, 66, 151, -170, -26, -136, 49, -29, 95, -95, 13, 114, 82, -27, 28, 117, 13, -107, 33, -28, 21, -135, 32, 13, -132, 30, -1, -149, -127, -148, -8, -34, 45, -14, 46, -69, 68, 8, -4, -29, -118, 89]
4347H9p5m1k0J38p6j09K41j71K05k06K9M6r9k2J04N9o5q5r6J57l8k5R1L5j44Q1
4373CQ5n7j02O6J5J04q3q9N5J5J78j89Q4o2L5r6M4j7M2l9O5j23J02l2m5L3J8k3
4401a3J8j13K39k14P9l1Q2O5l0r8P0%q1N1j80NK84j68j6L3K35j24j2j91l2J40
4427b%o2J15j06q4J02p1M4J53j88K10l2j59J53n1J45k59L0j34L17j62n9Q7j3N6
4452C0j16J13M1r7N5Q6k54l0J42J6O2l8M7rk13K60j02l2K8k2Jj05R3l6N4j21K68
4479A21l3j13K4n6P1J2OR0q5J5j70J70k4j73M8k8O3Q9R3J3j92J26n8J2N1o5kj61
4507a56J22j18K41n2Q3k13J84m8j38J02K1L7l1j00N9PL7n8J77j83j20J50r3J7
4531g3l0j58L25j40J25j12J51j58n8J53M2K5j30J41j19M7j49l1J02J08n0p0J75
$$ y = [89, 14, -27, -47, 91, 15, -94, 147, -24, 181, -25, 4, 50, -49, -71, 33, 92, 27, -58, -154, 3, -35, -60, 31, 66, -78, 3, 88, 31, -71, -5, 10, 114, 31, -58, -3, 12, 190, 1, 85, 23, 58, -38, 6, -11, 31, -8, 57, -66, 36, 4, -41, -8, 10, -13, 5, -108, 131, -83, -4, -35, 47, 112, 82, -16, 54, 54, -27, 24, -156, -151, 133, -35, -51, -18, 217, 93, 81, -110, -142, -2, -2, -64, 51, -55, -139, -37, -108, -64, 89, -99, 111, 79, -80, 73, 22, 167, -92, -62, -196, 121, -41, -100, -13, -26, 30, -86, 27, 68, -29, 26, 112, -142, -172, -30, -14, 48, 10, 57, 48, -165, 95, -7, -39, -11, -33, -32, -137, -44, -80, -26, -147, 121, 88, -25, -1, -57, 14, 26, 32, 122, 37, 52, -118, 52, 28, -145, -97, -125, -62, 27, 120, 133, -59, 67, 9, 21, 72, 7, 5, -156, -34, -152, 89, 37, 120, -93, 91, 43, -95, 7, 28, 65, 34, -66, -7, 0, 37, -21, 156, -27, -147, 3, -90, -73, -103, -261, 64, -76, 49, -63, 88, -70, -128, 25, 67, 92, -38, 103, -16, 31, -118, -149, -47, 61, 11, -59, 116]
4554A16r3p0P4j07K31o3k51qJ58R3o5M4o5O1n4N4j2j62K0N3ql4J49J6o1l8R1r9
4582c0N2o5P2o5j23R4J00k14K09K4j49l8P2J39l6l6l7K0r1J32q9J05p9l0l2J86
4608I1o0q3R0m4L0r9J06qj8pj40J75M0j60K26k12o1O0M3N7N7JKo2n5M7o7j32K03
4637B0p0R2k41K44j10JqK7M3J5p4j00K23j09r3J33j76J52J44j73N5%N6j22J4p0
4663a27lJ31k1L6K4p2l9J56j56J4K98l48J61k2P4k18P0K9j01J38l4J88k14m6R1
4688Im5M4l1K4m7R0J62k37j09J26j32L28k57K02K7r4o5o3J48l8k7P7j49k2R5k10
4714a94K54r1J89n4m3K8r3L4L2k07P1L5N4N6j79J95k30J26J58k09J1J7p8J98q1
4739ak5l6K4J0L8J33q7p7k1J07j4N7m3O5j68o8O4K29k16m9K19l07J99j03J37l9
$$ y = [116, 23, -47, 27, -80, 151, 88, -163, -171, -13, 80, 15, 59, -6, 55, 1, 55, 43, -119, -99, -46, -54, -88, 61, 77, 16, -22, 69, -30, 22, -43, 29, -36, -159, -65, 35, -179, 30, 54, -95, -133, -61, 78, 42, 6, -31, -11, -102, 30, -59, 46, -33, -63, -95, 91, 31, -52, 38, -6, 24, -75, 31, 23, 5, -2, -142, 33, 73, -87, 139, -73, -134, -74, -31, 26, 83, 84, 86, 24, -31, 16, -51, -183, 20, -50, 42, -199, 45, -65, -64, -72, -45, -2, 13, -61, -161, 62, -47, -140, -7, -183, -31, 113, -60, -5, -5, 51, -71, -57, -127, -130, 1, -20, 16, 40, -32, -71, 85, -71, -57, 241, -107, 54, 32, 106, -112, -42, -13, -114, 24, -10, 178, -36, -82, 9, -36, 8, -23, 1, -46, 44, 206, -31, -140, -14, -146, 182, -75, 127, 154, 60, -5, -68, 80, 42, 15, 92, -57, -79, 16, -194, 60, -31, 158, 104, 61, 89, -4, 30, 62, -145, -74, -39, 15, 71, -108, 87, -143, -17, 141, -68, -57, -40, -118, 80, -1, -26, -62, -38, -28, 10, 143, 56, -21, -42, 65, 51, 108, 65, 130, -38, -106, -42, 187, -29, -78, 141, -166, 33, -70, 67, 28]
4765B8p3%J27J01k14K8k4p9J16n8J35K2M6j94J42j10J6J57Kj16j48J1K21q9j09
4790f2O4l2J47j00k9J11m7rO7j73M1m0J08n8j42P6P0qm6J29j24R9k8q9K7K47j14
4817H5j30J04m1m3qJ60j67q8K79%k55O2R2M7j01J03o7M5l0l4q3o8K85k09P1Pq7
4844g1J6l7K3K58j21j58m9J67q8n3QK82l15J28j81J21P3J30k65K40k2j88J56j80
4868a26p5K40j00J70j27l8Q4j59J98J33l10mK53j09j02P3J0l4J89j53r3J26J13
4891A59j38j02M7N2n6L4Qmj54K02j17q7K36j07m0q6J0J50R8j07r6m4J92RO4k08
4917h5R2K13j41m4r1N7j7L5k3n5p6J96r1l0k9O0P0j46M7Q3p3P1m7k7R3j87J53
4944HJN9k8n0k7K26k67J28mj45m5J97r3J08k2j26k4M3KR6LN5j73K0J10l6j2O8
$$ y = [28, -45, -45, 82, 183, -31, -3, -27, -106, 10, -48, 87, 109, 155, -39, 103, -7, 9, 166, 168, 52, -96, -85, 136, 47, -62, 2, -30, 117, 17, -12, 99, 52, 43, 110, -63, -22, -62, 46, -12, -154, -78, -8, -16, -62, 67, -57, 42, 14, -75, -48, 199, 85, -45, 59, 18, -25, -33, 127, -40, -128, 151, 151, -104, -42, 50, 97, -4, 99, 32, 77, 47, 13, -70, -138, 147, -62, 9, 16, -71, -55, -92, -69, 189, 68, -90, -139, 28, -60, -113, -105, 177, -138, -10, -191, -70, 3, 133, -132, 108, 86, -102, 54, -126, -201, 39, -61, 109, -18, -56, 28, -131, 67, 200, -110, -114, 139, 30, -72, 1, 11, -23, 166, 13, -80, 46, 159, 21, -81, -34, 18, -38, -4, 4, 0, -154, 48, -69, -156, 80, -27, -67, -153, -143, 7, 105, -2, -98, -142, 50, 59, 123, -85, 7, 220, 79, 35, -56, 1, -16, 19, -4, -59, -135, 61, -30, -60, -89, -29, 41, -105, -58, 25, -48, 23, -24, -51, 42, -145, 8, 9, 68, 40, -10, -37, 189, -78, 50, 46, -99, -144, 53, -40, 68, 46, -80, -104, -61, -59, 37, 40, 95, -78, -58, 52, 16, 4, 72]
4972G2j87JK4J41j44J01J6j17L8r2R8mL3P8k0J37j98j75K39j30L8M6j5r6K25j26
4998a7k3r3J98k13L13j55j46J20j4J32q7k6J0K2l4k5j10K05n5k7O2p6N7j9r4J27
5024C2j65K87k25K17j10rj83J51r9J01j2L4L2Lj21n1J95p6q1J55j69J52l0mj7
5049GN0j11M7rj1j6J68q6j19J79r0l7Q0rrJ8j27J56k20J9K32j36P9j67J35m0Q9
5076G2k2qj34q3J58j6N3o7mJ39j15k9l1K3R5J13j30q9J5Qj7O2n7J38j06J20j28
5103d0Q7j2j96O2k1J83j05L6k0PJ02q3j0M7k66K36L1r1N4j03J64o0N5q0J8K4p0
5130e1JJ69J0k46O1j48J41J8P1j54J49q6N0L6O8j08L3n2j1J04j28K13l06J88K1
5155D3q8K9L3q7J24m8J2K4J48k61J13p7M2K9l4J88j89j2rk4P0j33K33k04J50P0
$$ y = [72, -115, -114, -90, 51, -93, 8, 24, -93, -55, -147, -49, -53, -20, 58, 38, 175, -23, -198, 41, -89, -51, -5, -20, -116, 109, -17, -40, -133, 65, -148, 165, 10, -136, -16, -30, 102, 15, -11, -1, 21, -13, -38, -148, 57, 2, -25, 37, -39, 18, -1, -95, 32, -133, 154, -71, 146, 36, 27, -156, -5, -104, -3, -15, 19, 51, 54, -67, -118, 77, 1, -80, 75, -94, 58, 28, 24, 7, 57, -54, -7, -16, -27, -43, 125, 39, -80, 99, 9, -28, 52, 43, 34, 52, -75, 81, -139, -120, 112, -24, 55, -112, 23, -17, 72, 50, 42, -92, -175, -17, -33, 20, -47, -51, 88, -27, -56, -87, -64, 31, 144, 14, -75, -60, -52, -69, -7, -64, 74, -32, 88, -40, 47, 35, -161, -99, -120, 63, -42, -6, -26, -19, 83, 0, -10, 37, -229, 7, 38, -53, 1, -102, 62, 2, 57, -23, -5, 19, -51, -50, 119, 129, -117, -56, -204, -63, -45, 26, -128, 21, -65, -15, 21, 89, -19, 14, -38, -49, 55, -73, 140, -166, 22, 43, -45, -16, 17, -70, 54, 6, 18, 42, 190, -71, 42, -35, 7, 36, 2, 190, 1, -11, -20, -44, 26, -107, 126, -78, 72, 142]
5181A42k17J11j51K7Q3r2K03q2N9Oj99O7L9q1Q6mn8R4Q6j33j20J50J4R3k3k6q8
5208a4m0k6OK9K6P2m7j27N3J50l3L7j01m1J19N2j77k1k6P3m0P0m4n7qJ99N7j81
5236d0J7K31k85J00p7J31n0J7o3J22j53j5R6O2P0k32M2JJ70k10L2J3o5P5K6J06
5262A21j05O3j85OJ7O2o6R2Q6J8j79N6j5N0M0o5j01O2m1L5l4M9j36J39L2K7o7
5289c9K18p7r2l7jJ07o0r5O2K2K8j08N3J09n1p4R7KrJ26j38o0o2K17k66J62j27
5316i3J77o9q1J03j25J95p9O0k1j27J37k1j4j19J77p0o3J41j67M9m4k2jK8L3P2
5342E6L7j11j37J76j11J37N1m1j29J54o9k1k6m0J74q4J18o7K3p9r5R7J2q4M9n6
5368f6nO2m6j07K47Nj44N3J31j5j76J96rk30K09M5k35J30j39R0p0R4p8J02Q2j37
$$ y = [142, -75, 36, -115, -88, -5, -97, 106, 24, 83, 89, -110, -43, -4, -85, 1, -3, -61, 33, 119, -14, -134, 16, 30, 123, 100, 74, -14, -54, -80, -74, -45, -19, 53, 6, -121, -68, 82, 49, 86, -15, -56, 63, 115, -62, -83, -109, -36, -76, -6, -50, -107, -115, 84, 141, -40, -23, 208, -77, 23, -54, 77, 27, 44, -19, 103, -50, -65, 31, 93, 163, -69, -27, -26, 144, -66, -34, -21, -86, -11, 15, 121, 16, 79, -106, -100, -83, -21, -87, 5, 91, 109, -70, -14, -29, 21, 61, -4, -105, -43, -84, -49, -83, -34, -170, -31, 1, 28, -39, 179, 102, 10, -27, -28, 79, 19, -76, -14, 8, 36, -72, -19, 90, 39, -35, 62, 64, 55, 181, 43, -17, -79, 138, -128, 34, -93, 84, 15, -66, 37, -88, 107, 28, 88, 67, -60, 77, 56, 42, -77, 100, 30, -33, 108, -59, -10, -54, -76, -77, -49, -16, 56, 93, -18, -155, 21, -90, 47, 98, 57, -72, 82, 13, -8, -34, -74, 100, 16, 134, 67, 90, 11, -84, 13, 25, -59, -10, -66, -71, -9, -55, -162, 85, 90, -54, -1, 130, 115, -61, 135, 126, -104, 105, 150, -85, 45, -94, -4, -74, 20, -58, 44, 126, -11]
5394a1q0J14k7M3j77O2MkJ01n2P5j83K7J39R2j34L7J54j89k3o0N3R6n2L9j27Q6
5421EK14k00L9j27J73j45mM9JR0p0j05J63R7j22L8j18P8j66L6n5J68J73k38J09
5446H3j22K31j74j7J09k6q4j17J2J67RMk00K20j4j10J81N0k54L3j29P5N3q0J27
5471B7OP5j81j0r4J07l8J05J1nO7N0j22q9R6L6P0j32l0j59K19r3J04l1O0J00k45
5498i6N4P8k03K99p3l4K5o2l9m7K05r1p3M0M7P2j63O3J13k43K98j81pO7k8p0k9
5525g8J9n2K23j50M8J32mp5j75J84q4k9j16J64j3N8p4J06j31j14k4K21K4J24j79
5550Ej26M4J29k25M07j56n0Q3j20L1M1l7q8Q7q8Q2r4J0J2j9J09m7n9J4J38j30
5576d7O7p7l8J8R0JN5j9O3j21j62K29k4q5j6J49l5n8J25j82R4m2%N5J04o8J08
$$ y = [-11, -91, 23, -4, 39, -138, -76, -72, -74, 27, -25, 50, -133, -106, 33, 125, -9, 28, 182, -7, -30, -90, -37, 59, 7, 46, -81, 5, 219, 19, 58, -69, 104, -41, -45, 4, 5, 95, 25, -80, 83, 180, 58, 96, -22, 56, -110, -74, -129, 39, 212, -26, 83, -39, 192, 18, 1, 110, 84, 0, -117, -105, 62, 71, 75, -125, 95, 81, -29, 152, 202, -52, -19, -148, -73, -20, -100, 27, 33, 108, -73, -83, -177, -70, -108, -3, 8, 3, 70, 120, -2, -91, 5, 41, 111, -21, -51, -210, 9, -84, 20, -11, 49, 149, -96, -42, 36, -167, 132, 59, 25, 50, -12, -51, -98, 107, 16, -57, -17, 30, 102, -61, 2, 115, -128, 170, -11, -18, 49, 21, -49, -78, -59, -111, 112, -38, 10, 142, 138, 63, -112, 72, -12, -41, -157, 7, -6, 52, -22, 84, -47, -161, -185, 36, 60, 184, 5, -121, -77, 52, -173, 234, 78, 28, 111, -9, 22, 63, 26, -62, 25, -63, 19, -75, -65, -53, -72, 37, -10, -69, -55, 83, -47, 20, -57, -95, -77, 13, 14, 69, 50, 113, -8, -170, 59, 35, -50, -66, 83, 48, -10, 115, -67, 27, -15, -15, 40, 144, 76, 184]
5603A84p9k0Nq6L7p3j10J07k30J87J13L4M2p6o4j5K4J7J38k52J44K3J8j37L3j08
5629a44J07J58q9Q6j3J55l31j69J58J0K6J23pL3q1K54k26j67J64J13j92J40o0
5652D8n2J90k23Jk1J66k32J16R9k35J37k0Lq3O7j7m0J7O3j7p1K46n1o4m4j2qJ61
5680A24k22MJ88j86K06l0j31M0j5Q7j65J88Lq8K9j24n3K29q8j53K20r5J9k00J65
5705d8O3j05L3J07K8j0j09M9j8m1K9N8R0O1l49J00K5r0J78q0J16Q7j44N9j64N8
5731a7n2L20l31J68L5N5k16r0L9P8QJ21Nj86J05J01o2k9l7m0j1kN9M4Q7j94o0
5758a02J90Qr8Q3j15j60R4K37n6kj7j19l4J89l9j49N6p8J19Q6p0o2L3N5m8R0j57
5785f6j23J85op4J41o5n0j03k0K13m2l2R8p8L7n3P3k50J98mO5J1rP7n0k13J44
$$ y = [184, 105, 85, 90, 4, 41, -32, -142, -35, -265, -78, 35, 69, 111, 35, -29, -44, -20, -3, 135, -117, 27, 50, 68, -69, -36, -144, -37, 121, 32, 118, 105, 260, -71, -240, -82, -72, -46, 77, 70, 103, 22, 276, 50, -117, 47, 160, -32, 108, 48, -4, 186, -37, -36, -57, 109, -123, -7, 92, -143, -6, -26, -23, -106, -39, -56, -96, -79, -16, -33, -104, 142, 91, 27, -17, -29, -37, 124, -98, -94, 94, -92, 114, 84, -47, -7, -22, 65, -100, 88, 91, 3, 32, -92, -145, 84, -4, -157, 63, -32, -13, -213, -48, 15, -90, -57, 50, 78, 68, -41, 8, -10, -51, -22, 36, 126, 187, -162, -62, -37, -127, 51, -29, 87, 174, 30, 89, -75, -17, -69, 251, -80, 88, 123, 178, -38, -128, -89, -11, -3, 118, 123, -63, 42, 143, 81, 52, 15, -25, -36, -38, 21, 65, 152, -42, -102, 88, 96, -2, 81, -34, -194, -100, 137, 81, 79, 62, -57, -91, 98, 59, -90, -34, -112, 7, 93, 23, -39, -6, 49, 1, 91, -66, -189, -4, -10, -84, 57, -8, -58, -161, -181, 32, -10, -42, 56, -22, 15, -38, 35, -215, -17, -21, 44, 55, 46, 123, 73, -140, 4]
5812DN9JJ4o7J6n0K9m1L3j14J24m4NJ47j91P1Jq4L3J93k00K85l51N6P2j8p9J18
5840B2P9j76J18k53K39jj54K00j03O2l4N5j16O2q4J10j37K24k37J71j38L6N8J67
5864A70k01J94n2j35L6j11Q7O6Q1j59j24J56j02J38K3j93L34j60j65K76j74J79
5886A64j69P3o1j63J68l8Q4j02O2N3r0j30R7J91j00o5K9n9J11j84K00j59J60j07
5910c5P2m6j3J7r1P3O7J1j27jq7J16l4K53k97J4J71j04l0J64M3o7r3o0J91j06
5936AQlK2J29k47J03Km2JL4Q6k21J62j24J03j3r8O3J28M7L2j12o6J56m3k23J33
5963A8m7J00K3j27O9O1p5J3j6M2n1j52J69j39M7P4j11K13m3j48J37L9q2l9QJ46
5989A29j44J50k67n6J87%J64n0j54j4J18r4L5o3P9l7O0p8J22j71Q3k7L4n1M5J8
$$ y = [4, 63, 64, 78, 11, 27, -23, 6, -35, -2, -116, 8, -36, -31, 116, -75, -4, -3, -87, -54, 139, -61, 224, -127, -71, 1, -17, -96, 22, 101, -75, 43, -210, 29, 28, -126, 74, -29, 33, -1, 54, -62, 0, -84, 26, -111, 113, -124, 47, -91, -55, 3, 170, -31, 163, 111, -24, 12, -99, -12, 54, 135, -24, -148, 8, -94, 44, 67, -126, 208, 48, -117, 159, -15, 164, -5, 68, 7, -156, 12, -26, 58, -44, 18, 71, -19, -149, -52, 139, 39, -26, 3, -56, 55, -129, 71, -88, 72, -35, 37, -9, -22, -5, -96, -23, 44, 55, -72, -73, -160, -44, -78, 175, -122, -108, 63, -41, -71, 93, 136, 69, -24, -84, 107, 1, 9, 6, 28, 157, -90, 13, 15, -27, -26, 8, 94, -127, 35, -89, 14, 1, -97, -34, 94, 141, 173, 61, -5, 151, 108, -115, 18, -29, 71, 94, -33, 36, 97, 22, 35, 19, 61, 10, -142, 27, -112, -65, 9, -102, 111, 68, -80, 57, 96, 14, -25, -17, 129, -15, 135, -132, -188, -1, -1, 163, 113, -41, -55, 63, -31, 4, -59, 20, -17, 43, -35, 87, -84, -1, -28, 6, -45, 0, 18]
6015A8K5n3l2j0K6j61J60o7l7P8M8K8j23P9J36j02q9K56k01R7j55M2o4K16l7j66
6041h8J15J01q9P6o9n1L4n6J2k3Q9K1Pk0J2j06J1j9M8m6n4K26K6k67R3R3n6k5
6069eO7J77k24l3N9p1m9R6Mq3J13n1J16r5M2qr2J42j56l3J4O4l9J09l2j7PL2j08
6098e4PJL9K26j53Oj7m4OK6j32J5K7J18j22P9j68K56j05q9M1Q3j28J20k5M1ln7
6126fP6l4o5J0j28J57krO5k39K73m3N3m2j39J33j95R6m0J24m9o8R8N3K2j43P6
6153C4r4o5J11M7J0o9M2n3Nj21J70J86o3j27j45J00K3O0Nm2n5N1K7O9j38O6jq8
6181e5K7nj9J39k6j5L3q6j1J64k11K1R0qj21j9J13R1p8m7K00q2r9m7J53l6r8R1
6209E9pn0K4k24J91jJ3P6N2J0j62J42J20j86lo7j1O5k9J80j96l3J3rN8M9Mm9R4
$$ y = [18, 43, -10, -42, -52, -26, -187, -27, -94, -131, -53, -5, 23, -100, -21, 115, 13, -76, 180, -21, 76, -79, -37, -101, 115, 78, -88, 27, 128, 39, 115, 46, -5, 29, -27, -15, -38, 51, 72, 79, 59, 71, -35, -24, -43, 5, -41, -95, 131, 157, -110, -17, 76, 20, -5, 62, 239, 15, -18, 41, -30, -79, 17, 21, -62, 51, 0, 116, 21, 63, 55, -37, 105, -51, -84, -70, -6, -45, 64, 32, 15, 22, 54, -54, -47, -46, -7, 219, 66, 72, 55, 11, 17, 43, -89, -74, -47, 71, -51, 28, -140, 116, 11, -78, -37, 46, -82, 38, 13, 54, 51, -6, 70, 36, -29, -19, -147, 10, 8, -1, 64, -175, 98, 55, 108, 66, -73, 60, -135, -39, -79, 45, -4, -72, 26, 79, 101, -42, 34, -60, -125, -14, 33, 43, -26, 16, -37, -32, -153, 17, 203, 140, 13, -132, -32, -9, 51, 56, 14, -41, 10, 37, 106, -32, 34, 33, -55, -28, -33, -52, 87, 61, 46, 79, -7, -18, 146, -65, -44, 46, 38, -83, -102, 11, 102, 24, -23, 177, 95, -4, -51, 102, 66, -32, 59, 52, 2, 26, -198, -7, -8, 5, 81, 133, 143, -19, 123, 243, 57, 54, -13, -24, 41, 12, 192, -4, -37, -24, -33, 25, 74, 78, 29, 123]
6238A23j6n2r9PK5L7k1Q0q9N7Ln4Nkq7k0P3Q1k2m3j05J4nJ54L2Pk5o5K9O7N1j9
6270A21j26Kl1RJ30j18j17P2k28J62J14K1rj0P1m5%k5k3J11k9r6J85k15O6j9j65
6297a92J12O5J83j45LJ1j81J67K1j16K50j12P3k09j5J20M7N8j45O0j02J11j62
6320i8J92j36J41j28L0j91K58j20o1J57r4n4J81qj16J20j07m5Q6O3o9N7k39L14
6344A33j00n8L2Jn1k5J95j49O4l9K8K8l1n5J57l63L43j35J41n1j14R3M4j53l8
6369a03J92j58M2K6K00l14K06j97J48Nm3O8o3k6l7J33j28J55k02j0J19nO5j56
6393h3J38K3k01J55j4j21r1K83j19k2J60j88P1n1J22k6nJ21j32r2L6o9l9LQ3R9
6419D1j4j22L3K03k37Nl3R5R1j38N4J14o7k7J13p1j37K68m3j58m4O6M1j8J06j44
$$ y = [123, 107, 55, -44, -37, -12, 25, 4, 84, -5, 52, 55, 1, 6, 4, -83, -103, -30, 51, 29, -14, -119, -105, -110, 44, 76, 83, 58, -7, 22, 89, 140, 121, -5, -3, -34, -25, 105, -13, -130, -58, -286, -124, -10, 11, 2, -8, 63, 18, 18, -7, -30, 81, 52, -44, 141, -74, -8, -27, -192, -80, -15, 168, 23, 26, 37, -144, 23, 44, -72, 178, 66, 139, -70, -85, 35, 82, 140, -5, 55, -47, 64, -98, 94, -42, 99, -29, 1, -190, 68, -52, -113, 44, -50, -104, 77, 69, -47, 73, -34, -79, 7, 70, 1, 58, -181, 133, 33, -25, 7, 8, -43, -68, 127, -22, 42, 3, 31, 59, 28, -27, 130, -233, 110, -25, 116, 65, -49, 44, 88, -65, -103, 89, -69, -27, -1, 199, -115, 91, -106, 42, 47, 4, 72, 9, -17, -54, 79, -49, 106, -96, -106, 13, 8, 73, -83, 55, 78, -123, 32, 18, -103, -194, 89, -30, -52, 108, -80, -9, -60, 62, 36, 31, 152, 20, -72, -36, -105, -144, -141, -58, 41, 27, -95, -62, 141, -96, -91, -124, -29, 62, -76, -22, 92, 25, -2, 111, 40, -97, 171, 128, -30, -74, -8, 33, 15, 121, -23]
6445b3l0K5P9j53J61l1J9q7P3N3p0o6j89K29j2k03J89j11K00j63N3m5l0J70m2
6470dj10K9N7P9j30J47qj61M9R4j47P6N6kl2J77k42M2L5N4n4P8j09p7J44p0J62
6497A33j87J24mK9k9r7J36j17j21J97k9j62K08O0j80N1Q8jj63j1J78j00q6JoK4
6523f4Q5R3k26K21M0j44n3R3j2j34%Q6J22j22j1J11J81j86j29j8L7n1M5J68j57
6548b5J04n7k9j64J44j9k0M5P0Lj40L7R9m2q5o1R0J26o4j2j6M7p6J68Lj88K7m2
6576g7N8l3J45j29J09k50M9n2K84q5r8N4j9Q8k0QM3P8m8j03j08J72l04K77j0l6
6602gJ73k9l44J39J68j02k7j2L4O0j31J48j71J85m4M0K9K1k33K3Q7J8j66K51j39
6627b9M9m2oO8m1K8P8j3k22J72j71O3J44J01o3pj63N4Q0j24%N3j10J53M0L0j47
$$ y = [-23, -53, -28, 51, -102, 59, 28, 47, -40, 33, 86, 16, -50, -239, -10, -22, -225, -36, -147, 53, -110, -57, -102, -132, 38, -4, -114, -85, -28, 51, -79, 68, 60, -101, -52, 42, -105, -29, 27, 25, -7, 170, -72, -30, 5, 59, 5, 83, -26, -103, 41, -29, 133, -54, 70, 66, 95, 66, -31, 105, -12, -133, 64, 35, -127, 81, 141, -39, 12, 100, 99, -64, -75, 103, 3, -83, -82, -88, -64, 21, 114, -112, 109, 149, 5, -48, 45, 33, -101, -101, -15, 107, -15, -26, 85, 266, 80, -49, -67, -30, -81, -36, 132, -25, 79, 22, -7, -171, -27, -46, -66, -21, 49, 52, -88, -51, 48, 6, -79, -140, -50, 76, 12, 0, -16, 31, -45, 123, 126, -62, -35, -77, -19, -52, 93, -36, 73, -177, -128, -180, 104, 19, -79, -25, -44, 44, 24, 32, 75, 153, 105, 2, -106, 66, -238, 39, 29, -7, 166, 137, -207, -68, 100, -2, -29, -41, -7, 53, -78, 70, -101, 84, 40, 80, 109, 130, -103, -80, 7, 25, -141, 110, -29, 20, -22, -28, 40, -1, 27, 105, 92, -130, 42, -129, -66, 78, 179, 116, 109, -54, 0, 80, -44, -44, 9, -101, 52, 92, 122, -25]
6654b5j8N4p9O2M6l5L2J9j42P3J9o8j29J80o4Q2K6j72J82r1Q0J08k6q9o2K02k67
6681a02O3L1o2J54o9j50J65j27J26m9o0J39j22R8j12LJ37j09o%o1QK05j02j24
6706a26J33k2L8pL5k20L16j57J23j62J69j6j09RJ1p2l0M7n6R1J18k25K17j29O2
6731C8l1j22J09o5n3P7J99l40K05j19RJ90o2j28J28N4j04j1L6L8l2l1M9O4q9N4
6757F3k04K01N3j22N2l3R7k1j53O5k1q4K07q6K0l7K1r1J15j0M4p6K5j05p9J52
6783gQ9o7k7p1L9Ml7J8j5J03q7Q0J3l7J43k47K22j38J45p2O8l1j68J21qJ0M1p2
6811A2J18l65J53K4m5p0J54k0L5O2j23q9L13j06j30R8p9m8L5J37k33J59M9Rj48
6836i8M9o3kQ5J02m6j10K12q4qK8p9Q6r2J73k2l4j58M0Q7k5K0j34M0J18j00J4
$$ y = [-25, -43, 11, -68, -6, 40, 5, 37, 56, -86, -13, 6, -62, -191, -11, -75, 7, 33, -139, 43, -48, 32, 140, 114, 25, -37, 165, -102, -39, -8, -70, 84, 15, -135, 30, -97, 29, -20, -80, 59, -63, 35, -77, -74, 63, -46, -52, -52, -113, -105, 100, -2, -126, 7, -15, 23, 16, 51, -169, 147, -10, 113, -49, 120, 104, -5, 4, 15, -57, -87, -40, -96, -5, 113, -112, 105, -24, 38, 7, -115, -6, -71, -124, -47, 152, -188, 17, -102, -93, 97, 35, -93, 35, 89, -15, -26, 10, 48, 16, -15, 34, 98, 9, 63, -141, 60, 113, -9, 43, 10, 107, 86, -67, -2, -23, -107, 100, 14, 34, -3, 18, -73, 42, 32, 76, 0, 25, -80, -159, -7, 82, 15, -12, -83, -44, -40, -77, -59, -74, 29, -58, 22, 35, -2, 141, -106, 116, -22, 123, 51, 119, 88, -80, 41, 33, 43, 84, 12, 130, -235, -82, -58, -103, -173, -19, -39, -4, 58, -65, -154, 159, 53, -77, 21, -58, -106, -71, 66, -167, -8, 41, 50, -98, -49, -112, -114, -29, 73, 27, -83, 129, 45, 37, 65, -14, 72, -20, 153, 131, 97, -61, -21, 66, 41, 61, -73, -33, 85, -15, -1]
6863ar8L9n9J46m9R9K8j59J48j62q0K91r9O9o9m4Mj83J25MJ80Qmj59P4j8j01J64
6891I4j44l7K12j07m7j07J52No6J30Q1j20J65k84l4K03q0o1M2m1M3O9j15J89j35
6916GM5j81K18k23K23k30O6J86j15J35o3j10p2J98j79K04j41K0j08J04j6J31r7
6939BM8j38P3mR2j1M9j46J05Rj77J13m7lk7J31j24J05K8K1m0n1J61j67p2K8M3
6966An9N4j31J52N5M8j42l3Q2n1j5k6J00j17J03q8J91j29m0n6P5K9J09p9j5QJ29
6993A55k76K55j9j19J40j23o8o9J95K9l2n1j3rq0P8O8l2Mpk9K6J37k48J87p6M1
7020F4q2PP3o2j06J04J4p9J2R8k05J43P5J04k68jJ83j94J43K1N6o3j52J97k22
7045a40K29l6O1j20l7J25k0%q7MQ8p0q0K5J95j47p3P2K5J29r8k7k7J4p7J30l4
$$ y = [-1, -99, -60, -119, 27, -22, 77, 105, -54, 94, -68, -148, 143, 44, 113, 44, 0, 4, -179, -54, -50, 130, 138, 134, -25, 49, 31, -70, 94, -50, -87, 125, 18, -29, -136, 16, 21, -45, 85, 166, 46, 211, -73, -107, 96, 16, -45, -3, -44, -1, 68, -47, 142, 7, 52, -129, 89, -134, 89, -141, -75, 111, -4, 131, 68, -42, -114, 84, -95, 109, -32, -12, -120, -16, -32, 99, 2, 50, -88, -15, -19, 73, 62, 111, -35, 70, 79, -98, 15, -32, -35, -62, 69, -55, 50, 78, 99, 59, 8, 169, 2, -70, -42, 1, -58, -4, -135, 17, 72, 120, -22, -55, 27, -24, -39, -65, 35, -82, 21, -67, 124, -5, -45, -101, -26, 3, 112, 33, 18, 26, 155, -121, 134, 115, -4, 136, 13, -55, -124, 71, 100, 68, 17, 4, -5, -85, -7, 61, 29, 33, 26, -3, 23, 160, -88, 99, 23, 64, -18, -11, 62, 0, -106, -2, 12, -67, -55, 43, -162, -19, 56, 160, -108, -109, 74, -120, 23, 44, 100, 37, -115, 82, -140, 89, 53, 114, -6, -43, 82, 62, 62, -25, -21, 67, -3, -83, -58, 137, -10, -83, -11, 14, 143, 45, 18, -9, 5, -72, 58, 24]
7072B4k27K98j89j1J34j90J56n4M1L5o3r7K30j04J05o4L8l9j6j07%J44l23K34
7096d5O0k0P1j4j81L12n3o6K1q5q9J16r0R9j2O1j54K27j30j0K6k23K06k9l2K4
7122a0n3K31l01J98j66J42l0k4mP1j56j9L24k07P2k1j69N8M0m9O7m1J38o1P8k24
7148a16K27n1j89J08O3l1j1Q0j18Q6k14K79o3j6n5J8P4r7n1J2J36q2K9n0J27m5
7174E0q4N5o5l5M7K0j67J90j0J7k0J48o8j43K8J0pM0K7J0q9J6NR6o7m2J26K4o9
7203D3p8l5J63o1M7j76J28M7j50QL4R9q1j7j1P5R2k0n7L4k45K93k30J75j51m0
7229a14J94o1R6k02J09M9J0j6J3o5j30J31l7p8K46j16K6k80K17J3l2J20J0j16
7253a3j11J07L1O1q6J75j02k5J42k49K07k02J56k37L2N4j01K22k10J85q3J94q9
$$ y = [24, -203, 95, -94, -105, 29, -161, -5, -59, -18, 17, -46, -143, 87, -17, 88, 24, 62, 23, 7, -100, -100, 44, -279, -45, 15, -5, 66, 52, -129, 183, 130, 64, 85, 0, -89, 27, -63, 36, 24, 85, -69, 158, 28, 18, 44, -179, 27, -2, -34, -10, -63, 168, -133, 65, -101, 41, 11, -13, -17, 54, -102, -121, 203, -4, 68, 47, -122, -64, -24, -73, -6, -47, 91, 30, 108, -116, 111, 60, -129, -21, 42, 11, 0, 80, -38, 48, -166, 113, 50, 34, -21, -3, 71, -26, -77, -65, 71, -11, 18, -32, 95, 50, -34, 21, -44, -79, -32, -12, -179, 11, 1, 18, -2, 146, 78, -65, -37, -27, -34, 6, 33, 43, -46, -30, -25, 71, 4, -38, 88, 112, 43, -35, -70, 93, 32, 79, -97, 31, 78, -72, -64, -30, 69, -12, -29, -40, 35, 127, 107, 50, 84, -161, 132, -98, 77, -74, -114, 80, 19, 115, -87, 22, 71, 81, 65, 78, 13, -117, 14, -23, -101, 145, 29, 55, -225, -8, 5, -27, 93, 103, -13, -124, -17, 14, 75, -11, 164, 62, 37, 179, -70, 137, -65, 91, -146, -114, -60, -161, 61, -149, 36, -47, 147, 58]
7276E8j51J66k45J26J31j82R5L0r3J49j61P9M5l4j01J70k01O3J02K4o5q8O8j8
7300c3m3M6J14k04J90l9n8J6o1J0n4J11p6J60p9L9j33K82j01o8K22l74K24k01
7324a10J12J6q3J20m1j31J40r7M0n0P8J9k7L4k8J10k80K53n6j01K14j0o8pk94
7349b47J53p4J05r1M7J36n0q0R3p2J72j06j00O0JN2O3j56R8K6J34j04j26J66j66
7374f6LK06j82j0J05n4m5m2Q2MM6l3kn7q3K27o1j23J77j74J46K4o1j76P2O9m3
7401e1J7J56m0j39K3J23nL4k70K11p0O8N5j56K2m5J66k03q0K21j16O3K4j07J18
7426A9j6P5j88J93j5Kj79O0m4J48L7Kp5Lp5N6j01J81q4m6N2m0l7M6R5r6m3l7O4
7455d3P1n6J84j16k2k6K9J32r4q8J81q0N0n5n9Q8k44J81j19l3R8P7O5o5j52L2
$$ y = [58, -93, 73, -172, -46, 85, -97, -2, 28, -65, 84, -77, 2, 47, 13, -88, 82, -119, -56, 46, 70, 5, -83, -15, -33, -76, -30, 84, -120, 70, 31, -27, -11, -72, -62, -116, -5, -81, 79, 0, 39, -94, 188, 87, 19, 241, -133, 91, -110, 2, 18, -65, 55, 14, -117, 23, -74, -34, -84, -6, 13, -14, 20, -8, 102, -178, 75, 19, -82, 132, 122, 54, 47, -247, -94, -168, -63, -154, -107, 29, -21, -101, -8, -80, 92, -14, -114, -54, -53, -1, 62, -94, 4, 30, 164, 60, -66, 100, -66, -63, 143, -39, -49, 56, 2, -43, -85, -3, 1, 47, 14, 12, -45, -128, 99, 38, -85, 92, -82, 64, 88, 27, -149, -77, -8, -51, -34, 122, 82, -57, -34, 89, 84, 118, -152, 59, -11, 57, 112, -44, -22, -67, 99, -104, -184, 37, -79, -16, 8, -99, 19, 3, 78, -110, 83, 68, 70, -109, -49, -93, 55, 92, 94, 19, 22, -53, 3, -98, 83, -1, -47, 5, -35, -72, -26, 69, -27, -70, -107, -43, 28, -28, 156, 40, 18, -8, 21, 153, 59, -29, 152, 72, 122, 67, 8, 96, -148, 33, -86, -119, -21, 56, 121, 56, -96, -64]
7481f4J91k28O3J4P5j1qo2M0J21r8l5P8P5j24o0P1j28J50L6j16O1j1p0J07R8j50
7508A5M4m2j2k8J9r9M3k4j44L19M4k51Q6J21lk4j38M1J31o8j33J04O1j27M8l0
7534d7J01Lm9Q6k15N9K03k40J70m5J20j59q8J75n9K0p0p5J07K5l8pP0l8Jj24J14
7561@n2K59k06R5q6O6l5R9Pj13n2K43j55l2q6Q2j2j08k3P9kk9PR5n3J20j28%Q7
7590F7j30Q3o6j1L2J15j0J7ok32J95J6o9J58q1n6m3L4j2K08j91P7j12J36k29L15
7616B05k04n6M8R9n1j96L79j40J7j50J9Q8nj68J2K1P1J55j01M8k22J37J04j13
7640cO3j08J02J44r5q9l9l8J13j2l6J18k06pK08j86Q6Pj01J8J8J56n5j9j88J43
7666fK5M4q1J25k14k8J33j25K95j28M0k35J20Q8q6KJ5k4q5R1o4M0k5K22l4q1o9
$$ y = [-64, 127, -101, -38, -24, 51, 40, 32, -30, 10, 131, 33, -2, 76, 151, 27, -33, 38, -90, 60, 96, -20, 41, 30, -40, 67, 165, 15, 59, 17, 5, -23, -4, -103, -60, -84, -228, 91, 135, -116, -30, 91, 88, 64, -74, -33, 98, 30, -103, 1, 62, -65, -17, -47, 54, 57, 8, 94, -121, -62, 141, -99, 71, 26, 146, -13, -101, 74, 15, 35, -35, -110, -3, 22, -16, -23, 47, 9, 10, -114, 0, -52, 207, 1, 96, 10, 76, 41, 140, 147, 34, -18, 225, 70, 38, -48, 34, 22, -86, -109, -30, -32, -61, -54, 41, -12, 108, -20, -20, 67, -63, 20, -46, -57, -25, 90, 80, 97, 91, -141, 54, 70, 1, 159, 78, 22, -21, 13, 1, 209, 18, 95, -17, 119, -110, 205, 1, -55, -7, 92, 41, -155, 224, 84, 101, -49, -30, 58, 53, -115, -103, -82, -11, 144, 43, 91, -131, 6, 110, -3, 60, -48, 54, 198, 103, 14, -25, -63, 50, 38, 2, 120, -86, -93, 115, -71, 15, 22, -79, -61, -43, 113, 58, 39, -149, -6, 19, 63, -18, 107, -107, -135, -2, -127, 168, 40, 80, -155, -35, 53, -33, -31, -16, -40, -125, -34, -98, -58, -83, 139, 105, 24, -45]
7693d5J18q0r7Q1J36q6p9J02Pl4p4JK5N3p2K46j22j29n9J9Q9K5k9L1j51K28l9
7720F5k6j33k4N1J29n6J73k51R5J83k69J09l5Rj8k34M51l26J42m5M0p7PJ45n0
7745E5k9P3n7O8k46J67k2O8r6l0O8k0l7j05J92j8j54J25o8J31j90P7J21P6J1k03
7771d3j0K35j38q2n0R9N6m2o3m7R3j13Q2O0j4k6J6J16j62Joq5K8J57J9j43J20
7798E8M1j29Mo9J58o2J06j6pk25K52j97P6K9Nr5l9J05j02J42J6j72J66j59k5J49
7824A0K1M3r4M9P4p0m4n2o6J88j60J98k73J36J08j31J22l3r1m6R6q1J03J7q2J09
7850E1Q9j21m6P5r1k0J18j47O5P9q4j0m2j5L2RJ39M0j28L9JJ0J3M1L8j57L6NJ91
7879B10k26rM1o9J72o6o8Mq4N1J38Kj92J5J52N3n8j21J19J0l5o2J34q9l6l3J15
$$ y = [-45, 73, -7, -104, -23, 113, 27, -52, 50, 57, 23, -51, -50, -25, 28, -44, 202, 80, -49, -108, -89, 0, 25, -4, 27, -124, 104, 65, 39, -94, -118, -67, 62, 6, 179, -72, 23, 206, -63, 46, 11, 20, 2, -232, 219, -107, 35, -10, 30, -47, -40, 105, 55, 26, 99, 42, 110, -136, 31, 9, 77, -19, -49, 19, -1, -38, -143, 49, 31, -123, 2, -66, 65, -125, -48, 73, 149, 160, -43, -53, 182, 44, -38, -88, 11, 67, 25, -38, -85, 8, -105, -23, 37, 23, -3, 13, 129, -33, -32, -38, -123, -95, 62, 81, -62, 58, 99, -30, -26, -95, 63, 1, 107, 91, 84, -141, 111, -86, -10, 19, 24, -71, -110, -5, -107, 35, 51, -121, 45, -114, -139, 10, 31, 74, -20, 29, 103, 33, -11, -63, -129, 59, -101, 97, -176, -40, 68, -63, 59, 26, -65, -111, -15, -96, 7, 24, -58, 51, 140, 19, -27, 48, -43, -63, 55, -92, -27, 52, -32, -42, -84, -99, -67, -58, 81, 121, -7, 32, 33, 43, 56, 97, 135, -22, 14, 19, 210, -16, -25, 16, -53, 119, 53, -15, -11, -95, -44, 94, 96, -96, -81, 71, 124, 66, -55, 64, 74, 39, -23, 111, 22, -14, -47, 68]
7906F8r1N1M0M8j34m2J40k3J8o1J2j04l0K38J39k51Q5k38K37k87K90r1j02n5L57
7931B14q2p2q3k8K06k0k21Q3m4q2M0J89j01m9J09j09Q2j52J23K7j07L8o6K43j72
7956c4J1J60j81k27J19K8OJ61L6Q9k14O8qp0P6N9m1o9j6J34q2J3j27J11k52L65
7982A15j25j22J34m3P5j54qJ22Mm2l6L2K8j35M5O8L2K00k02O1J31k50R4R2J17
8007B33k14k11K32oj2n7l2R9k08K97k28J0K12Nok41R0N9rJ9L6R7j26n5j67L26
8033A43j30J18q6M6r5J41j69P5k5j56L37l6k60JN3QK2J56m9j88K1j5J08P1j97
8058a06J67o2J13j6l0k19O4Q8M3L3j4j58N9N9j63MJ18M5q8J4m6J68r3Q4p1j25
8084a32J82N0j13J0K2o4L1LK9J29j36J1j11Q3l6k6J51j99J03J37l5m5P1o8O0m7
$$ y = [68, -23, 28, 68, 116, -18, -60, 80, 57, 75, 14, 26, -78, -108, 130, 269, 18, 103, -135, 102, -185, 105, 14, -88, -143, 214, 132, 60, -23, -51, 155, 135, -86, -3, -47, -129, -89, 100, -1, -50, 59, -50, 32, -120, 3, 30, -77, -39, -105, 138, -34, -23, 137, -44, -271, -152, -124, -118, 43, 79, 168, -46, 22, 14, -56, 20, 79, 38, -31, -47, 87, 5, 18, -109, 2, -250, 115, -10, -132, 2, -41, 34, -120, -128, -6, -2, -44, -80, -48, -20, -155, -110, -42, -10, 190, -12, 49, 180, -70, 24, 116, 233, 19, -192, 40, 34, 22, -35, -67, 32, -176, 121, -107, -97, 115, 120, 114, -127, -37, 22, 13, 32, 68, 165, 39, -16, -183, 143, 13, 131, 45, 91, -4, 137, -32, 43, 18, -138, 199, 163, -97, -96, -43, -35, -13, 143, 94, -94, -73, -88, 20, 91, -106, 61, -1, 112, 96, 66, -153, -89, -1, 42, 75, 61, -97, -38, 21, -142, -138, -20, 25, -63, -49, -95, 73, -20, 64, -7, -132, 50, 100, -13, -3, 19, -45, -14, -11, 18, 147, 11, 22, -89, -6, -42, -68, 83, -116, -13, 124, 89, 44, 115, 47, 107, 60]
8110F0j02o1J76j0p4J04J40k44K5K6k09N9K6J60j51J66O7k03MM9KK8q1j4K7M7
8136A7j39k0K66k1j47LM0j0J27k44J77l5N0j30p1K71o8j33K04O4k13r7K24k43
8160a28J35j66J24N4j2n4kk6O2J27k26J22P8j8J38k63J96j35j1O4j29m7l3J44
8184fK6Q4j59J15k10J08P9
$$ y = [60, -42, -103, 73, 63, -11, 93, 233, -11, 14, 40, -169, -110, -84, 76, -75, 91, 158, -45, -41, 8, 10, 38, -43, -57, -30, 17, -122, -142, 124, 103, -44, -41, -1, -11, 116, -128, 49, 14, 64, -66, -137, 134, 66, -67, 137, 201, -12, -109, 115, -128, 7, -159, -35, 19, 7, -47, -49, -75, -13, 114, -112, 10, 88, 70, 208, -55, 141, 6, -5, 59, -70, -117, -150, -6, 20, 104, -55, 60, -150, -42, 37]
8191C7
$$ Imaginary data points
##PAGE= N=2
##DATA TABLE= (X++(I..I)), XYDATA
0@%%%%%%%Qj6J6k4L2m0N6p2R6j24J52j88K31k79L36m03M78n65O64p77R04j045
29e60J207j390J592j816K064k340K645k979L350l757M202m691N225n807O443p139
45c751P899q730R636j0626J1709j2897J4204j5644J7237j9006K0982k3204K5722
58A3531k8600L1922l5812M0440m6050N3018o1943P3838r0591J16253j62357L84307
70B87956j203477R89089O66036j352560Q55415l71347K02214J25399n65498N69560
80B02787m9859l95129K91770j9899L6174k62067K10033J66625l79509J42849K56133
91A99908k70358j27540K90884l6900k34432K21319r4968R2127j4094k57079M30584
102A99451k29562k03404M23440l31670J58005M7136k71005M21903k79459r7756
$$ y = [0, 0, 0, 0, 0, 0, 0, 0, 8, -8, 8, -16, 16, -24, 32, -40, 56, -68, 84, -104, 127, -152, 184, -219, 259, -306, 358, -419, 485, -560, 647, -743, 849, -967, 1097, -1243, 1402, -1577, 1773, -1984, 2218, -2473, 2752, -3055, 3388, -3751, 4148, -4582, 5054, -5572, 6137, -6760, 7444, -8200, 9037, -9969, 11013, -12191, 13531, -15069, 16853, -18959, 21481, -24569, 28449, -33494, 40344, -50247, 66006, -96351, 287956, -915521, 73568, 739604, -612956, 242459, -128888, 73326, 198725, -366773, 202787, 152928, -242201, 49569, 29670, 65844, -196223, 13810, 180435, -199074, -56225, 199908, -70450, -197990, 92894, 55994, -178438, 42881, -52087, 40040, 25946, -231133, 199451, -30111, -233515, 189925, -141745, 16260, 63396, -207609, 214294, -65165, -162921]
112a62921L22893k52156Q0528J4349J387N6797j69133J89131q1394p4605J76167
123A01043j69449Q8301K5126r6048J27886r1328p763P3068k8672o3141L7471J19499
135A15993j81976O4852J07403j88160J46920n8113n1954J60589j92334J00556
145B3776M7364j38565J51023j12729J6547Q3292j33244J04221m4788q222P4335
156F3010j30613R6191N930r6247R6688l7880j7576M3175l8649J964K6653j3000
168c54l2267M0763j4914j4092M3536o7838N4819J4639q8506Q6168l0042j5779
180b3867M3828o6059O8634k3907l8196O9733o6785M3393O567o1359P7778l8971
192i211l058K6112m1132N2054l3138j5466N1132l7147R771M726p411J3342j8185
$$ y = [-162921, 159972, -92184, -11656, 2693, 4080, 60877, -108256, 80875, -519, -75124, 101043, -68406, 19895, 45021, -51027, 76859, -14469, -22232, 50836, 22164, -40977, -3506, 115993, -65983, -1131, 106272, -81888, 65032, 6919, -45035, 115554, -76780, 23776, 71140, -67425, 83598, -29131, -12584, 70708, -62536, 41685, -3103, -11325, 63010, -67603, 28588, 34518, -61729, 34959, -2921, -20497, 22678, -15971, -14007, 12646, -354, -32621, 8142, -6772, -20864, 22672, -45166, 9653, 24292, -64214, 21954, -8088, -23867, 19961, -46098, 22536, -1371, -39567, 30166, -36619, 6774, 13341, -48018, 29760, -9211, -12269, 13843, -27289, 24765, -8373, -23839, 27293, -9854, -83, 4643, -2768, 10574, -7611]
205g611J6847p909j710J2880k0081J9345o428m428R599j5333J7400q519m560Q901
219H393o878J5998k5809J0994K0243m0145L0050m707j7090L0712l4580J6984J3307
232A7472l0778K3186j4412M527J3606k8046J9449N65j1343P804r230J1288n331
245a243n663Q274n350O011q837K400O128q539Q395j1625O567Q947j7687J3262
259A040n199j356J1156k1000J6911K844j7890J6935p111J778L696j0513J1376
272B667l441j150O18k254R910j0185K080N550p303Q348p898K665P736j1852Q478
287C969l180j021P787j1986P400K092n577N044n926N450J083p328N202p98R38
302C149j942j357N148m285J025j425J499K755q293P052j842l360P108r721O025
$$ y = [-7611, 9236, 1327, -383, 12497, -7584, 11761, 5333, 905, 10504, -4829, 12571, 4052, -508, 8393, 1515, 17513, -8296, 2698, 22941, -17204, 12846, 8139, -8951, 21761, -12819, 4165, 17472, -13306, 9880, -4532, -5, 13601, -14445, 5004, 5569, -5774, 2030, -7200, 4088, -1243, -6906, 1368, -3982, 2029, -6808, -4408, 1720, -6819, 1576, -10049, -3482, 5465, -12222, 1040, -4159, -5515, 5641, -15359, 1552, 4396, -13494, 3441, -3670, -1892, 1804, -8709, 2667, -774, -1924, -1306, -3560, 6350, -3835, -1755, 3795, -3508, 4840, -3058, -393, 7343, -4509, 3969, 789, -232, 7555, -4431, 2969, 5061, -516, 4528, -1398, 4052, 5135, -2193, 3009, 2211, 3149, 1207, -150, 4998, 713, 1738, 313, 1812, 4567, -3726, 3326, 1484, -1876, 5232, -4489, 1536]
317A536K392r629R148m834R5M348q671P996k687l734N986n889N207k242l910O895
333B007m505J348j03k327N279m713P75K383k147J956l124K462J270l145J995j095
349a684K541j425j670L334k376K090j514j267M730m396J808P07k332M943n563
364b074K145L287n617M962k730m74M541o358L653Q63l237L761l472J776J727l767
380a014K554p04n7N27j594J604n98j40o17N12J096k542J792n00n92J788l538L173
398A150l77k772L322k525J233Q90l362M001k199p57K342l015K486n54j689K383
414E57j923J334k84j593K667j479j0P4j34J546k226P40J234r75J70n96J572p46
432g2j045J723r61M29k87k96J706k085R59N99j332J704j485P16O37j600K142j733
$$ y = [1536, 3928, -5701, 3447, -1387, -1292, 3056, -5615, 2381, -306, -4040, 1946, -3943, 1264, -978, -4888, 2007, -2498, -1150, -1253, -3580, 1699, -3014, -2239, 144, -2003, -47, -3171, -709, 561, -2584, -589, -1684, 857, -568, -2238, 1096, -1280, 810, -704, -1971, 2759, -1637, 171, 878, -1454, 3489, -2074, 71, 3358, -2259, 2703, -27, -501, 4040, -2318, 1335, 2198, -1039, 2722, -750, 1026, 2753, -1014, 1540, 836, 779, 1306, -288, 1316, 718, 578, -39, 473, 1569, -973, 819, 319, -273, 1515, -2023, 1150, 773, -1999, 1323, -1202, 31, 921, -2441, 1560, -639, -1396, 946, -2069, 417, -137, -1826, 557, -1366, -32, -316, -1909, 758, -721, -731, -657, -791, 755, -1471, -731, 503, -472, -302, -898, 674, -72, -1117, 606, -355, 74, -213, -509, 1197, -888, 71, 670, -662, 1042, -443, 273, 910, -690, 1452, -281]
450b81r8K037k124R89m6k16R30j878J211M37j010L04l62J012n08o68J139n97M4
469C15l67J38M83j055J011l93n25J116j307P75K42j138J381j233K20O58j166J136
487B91o18k8O60j249J123j94p13R50o70L09jk32M99m09K92k96J21K51o17N63j04
508g2j98L19m28M62j68l84M46l74P54n29j66Q36p81L08K17m45P23o38J71K89o48
529c06R62q00O3O67o52M72k66j72N70p88M02K81m39J97o4J91j36k43L58k44M2
550I5n8m4K62m03J25jQ4J88n34M35n6l86O31n67J87j5k01L67k26J02J37n38M46
573C0O5l18L27l19M07l38j65M48k89J48j86J04J68m13L06J36k46J38j68K66l2
594F9kLj95J77j7o9O5j90K70o9j61K76j95k5J80j19J01j01J7J91j91J44j7J01
$$ y = [-281, -379, 1658, -466, 523, 477, 261, 1191, -687, 524, 961, -49, 255, -107, 905, 397, -271, 868, 271, 315, -52, 86, 569, -486, 525, 132, -393, 723, -584, 191, 433, -705, 676, -557, -337, 321, -845, 291, -327, -355, 305, -944, 179, -15, -728, 222, -448, -139, -140, -372, 127, -282, 10, -286, -165, 86, -531, 32, -72, -270, 49, -379, 83, -85, -469, -23, -397, 357, -172, -338, 498, -283, 25, 242, -203, 520, -118, 53, 342, -306, 656, -144, -81, 586, -66, 406, 140, -32, 538, -250, 152, 433, -6, 191, 127, 318, 182, -61, 297, 53, 95, 37, -7, 255, -148, -23, -24, 60, 248, -286, 149, 93, -293, 338, -229, -42, -57, -258, 109, -117, -15, 122, -416, 30, 95, -223, 104, -215, 192, -146, -311, 137, -152, -4, -190, -86, 82, -331, -25, 111, -135, 3, -165, 101, 69, 67, 70, -125, 52, 35, -34, 31, -159, 111, 42, -119, 157, -38, -63, 117, -2, 99, -2, 15, 206, 15, 159, 142, 243]
618B43k61m9K11l0r4J51k72K16j65L22k46n2J2j8j36K48l1j16N2n2P9j19J70j11
642d8M2l6L0M6n6l2K37k98J8J21n1N6j30O9K9q3J06o8J2K02k40J8M5qP2j84k7
669a58Q7K0p6R0Q1q5K4P6j44N3R1p8m6j45K13p6N5O0j18J09o8M4m9J22j07L6m2
696c1J27Kj7Q1j03r9J06j1j11pm8J97m2k8O9P5k78J51R3j00j43J71m8o4J02n1
722gk13L71r1Pj67J66k0N4j64Q7q0J08N5k42J70k8J1p1qJ03n7J10j36J0j32J32
748c2N6M0j99L06j17j22N7q6J1J16j2k7j01J90j58n8J89j25L0n8O6Q3q2o9J73
773G1j35J33j09j46J91J3J54ok14K5oj07K59q2L7k46L39k60R9n9Q7l1J19L1m43
798b86K28L5o5R4l6pk9J36j05M0J9k44K57mM2n4r7K19j54j48P7J91n2l2R9j98
$$ y = [243, -18, -67, 144, 114, 20, 171, -101, 115, -50, 272, 26, -26, -14, -32, -168, 80, 49, -67, -15, -67, 12, -107, 63, -48, -6, -42, -12, 34, -22, -54, 183, -115, -97, 24, -27, 29, -101, -32, -3, -86, 20, -48, -36, 166, -74, -56, -11, -19, 53, -131, -158, -71, -51, -127, -37, 44, -41, -17, 59, -85, -32, 59, -19, -65, -210, 3, -73, -18, 42, -76, 33, -35, 9, -40, 82, -25, 11, -31, 96, 98, 81, 162, 59, -40, 66, 55, -56, -63, -111, 86, 44, 16, 85, 160, -118, 33, 126, 26, -117, 54, 6, -58, 44, -7, -220, 151, 60, 67, -100, 66, 46, 100, -64, 23, -57, 51, 106, -136, 34, 6, 17, -54, -62, 41, -16, 94, -42, -32, -164, -32, 24, 64, -135, 171, 54, -68, -11, -97, -86, 30, 18, -9, -110, 80, -78, -136, 53, -72, -42, -100, -34, 49, -33, -102, 71, -64, 69, -40, -186, 5, 18, 172, 166, -48, -23, -29, -136, 123, 41, 78, -168, 171, -89, 10, -49, 38, 7, 126, 157, -286, -58, -23, -88, 6, -30, -37, -66, 70, -35, 5, 24, -220, 37, 33, 75, 21, -76, 143, -11, -159, -82, 109, 57, 25, 124, -74]
824g4M5J17o3q6QP2r6J28Rk01J9M9K11o2j00l6O8K8j08J2J27j54J56j22J21j61
850i3J10j10R9mj7%R1pJ0m3j26J3O8j20J18j2O4j65J67J23K8j74L9j00P6j01R1
877B5Kq7n1K04m6o4M5q2J20j62L6L10j86j39l9K79k85R6kj58K80m0K1j78M0J57
903I6j58M3P7j33m4K54J11k08p2K6J7p2K40k91J36J10j17j51K00K6k00J56L1j16
927c9l8N5n7N3J91k07N8K5n5j32J75q3J09p4L8r3N5J5j06J03m8J94q1J15j21j36
953h4J32K2j82O7k1L8J5O1o0k9l6O8K1P6j46n3K54j83j12P2P7Q0p9r6N7J75k16
980h2K16r7j2o6J39j08j10J26J43k22O2M6jJo7oP3k3k1j49J28J53k40Q2J15P0
1006A50j55Q8j20J44j0j80j20L18Kj38l6qn4J52j49L4K8J55j25p9K6j1J6J80j13
$$ y = [-74, -29, 88, 25, -61, -53, 19, -77, 51, 60, -141, -122, -73, 138, 76, -24, -60, 8, 36, -72, -60, 67, -87, 69, -53, 68, -93, 17, -93, 6, 2, -15, -15, 76, 69, 79, 36, -90, -77, -9, -129, -11, -23, 41, -124, 43, 166, 194, 20, 59, -41, 35, -66, 25, 27, -60, -111, 93, 47, -17, 28, -54, 66, -96, -60, 250, 64, -75, -114, 165, -120, -24, -26, -184, 96, 56, 77, -101, -61, 96, -62, -19, 58, -75, -119, 135, 246, 38, -34, -8, 9, -63, 177, -114, 22, 132, 15, -136, 64, 90, -110, 46, 77, -39, -77, -22, -79, -26, 165, -42, 16, 41, -14, -146, 29, -54, 55, -19, 19, -74, -19, -4, -110, -7, -55, 139, 58, 173, 52, -84, 48, 70, -112, -45, -66, -28, -13, 48, -12, -41, -77, -9, 12, 88, -58, -111, 143, -40, -152, -80, -3, 77, -2, -98, -41, 134, -82, 134, 37, 25, -41, 98, -10, -120, 6, 149, -73, -11, 35, 34, 35, -32, -38, 35, 12, -9, -158, -30, 123, -117, -35, 80, 150, -5, 83, -37, 107, 97, -83, -203, 115, 117, -21, -57, -65, -119, 33, -116, -82, -54, 101, -24, -103, -77, -88, -72, 108, -5]
1031eq7J73j49J54k2k8j57R9j62J05J25M3k32J09r2R5J51j80J22N5q6l3j04J09
1055CN8Lm2m3p0Q3p3K25j77K3lP1j76J77o1j06K66k29N2j9Q7N7j63RJ19q4O3m6
1083Dp4P1P1j8L4j46N7no6j1J12p3k2O1OR7j47R0L3j55O8O6prL4j29J70n4K3r2
1113a1P2j73J42jK2J07k56l4k2K47j12J61k93J02q4J09N5q5R2J7j33N8nk8Oj2
1139e9mK8O0M2q6r1K35o5Q8k17r3J99Kr8J67l2k0J16k87m3K11L9k05J94m2L5j03
1166b9n4M6M1Q5M0k53J62Ol8M9L7j03k2M7M2l0p1J68q1j5j31k8K06r5J84k22M0
1193a9KJ17o7j02J0K5N2j26J21l0q1K35k29R9j96Q7j24Q2J15j12K76q5j15Rn2
1218a08J48k21K74j8r3Oq3J91n0R4j79p5R0j19L7P4PJ29j68p9K21k5J30k65R7
$$ y = [-5, -92, 81, -68, 86, 64, 36, -121, -22, -184, -79, 46, 89, -143, -34, -126, -31, 120, -60, 62, 117, 31, -2, -106, 3, 61, 64, 22, -21, -91, -8, -81, 144, -33, -10, -13, 58, -118, 59, -2, -108, 158, -71, -19, -38, 49, 106, -57, -48, 71, -13, 50, 4, -70, 1, 72, 54, 88, -58, -1, -6, -72, -83, 29, -44, -66, -5, 1, 98, -49, 41, 74, -81, -13, 53, 46, 37, 71, -58, 112, 58, 81, -11, 61, -112, 30, 29, 51, 158, -98, -132, -154, 93, -19, 142, -151, -49, -133, -24, 31, -54, 38, 55, -78, -20, -25, -53, -47, -59, -63, -35, 25, 67, -19, -110, 125, 60, 148, -69, -162, 37, 39, -59, 108, 76, 56, 172, -115, -158, 53, 92, -113, 81, 39, 74, -29, -83, -37, 4, 89, 129, -124, 38, 44, 6, 55, 92, -11, -33, 14, 56, 26, -45, 123, 42, 27, -104, -132, 74, -21, 163, -59, -19, -17, 100, 33, -69, -59, -34, 18, -108, 13, -17, -98, 137, -92, 7, -189, -102, -226, -144, -29, -141, 135, 50, -65, -56, -108, 40, -181, 93, 75, -18, -12, -95, 96, 46, 140, -39, -114, -24, -143, -106, -32, -25, 104, -64, -143, 78, 53, 183, -82, 15]
1243A5O3nr9p8K42j14j43J85j43J04J4pQl9n9J12j6j05Q8j6J26j50j0R6J3j47
1269f5J38m7Q6lj57J2p4N4M2m4j4ol0J99o5J01j42K9J0p6k4m1P4Q8r3J22qQ0k12
1298f6N6n3J95k6M1k7q5k5p8K9P8J21j28QJ1N2l02J83qJ24r6Q4n6o4M5m8N1rN4
1327F1j3j16J35p2m0j02O1NpQ3p9J01m1J56r6q6o1J34l1J12q9J1J78j33j46j7
1353i2J60q6J02j46Q6K2q4K7j43L25j82k0j39K32j66J10J32l1l31K86P9j26K6
1376D1j24J03j03N2N8j87J33J77j80n0K22j51Q1p9j3oL5m5M1Q1p0j16J15m0J14
1401H9j35N4j47J79M6j99M1QJ6J02P8K9j60n6J70k03O5l8Q9o5M3j26R8k7o3J60
1427D8n6J34j02j07p7J79o9N6R9o7Q6j22M1Oj15O7k0p3P2j28J80j11J99j47P7
$$ y = [15, 78, 73, -26, -104, 138, 24, -119, 66, -77, 27, 41, 34, 42, 3, -56, 56, 40, -65, 23, 7, 133, -17, -27, 69, 82, -65, 73, 26, 112, 109, -48, -36, -110, -56, -14, -58, -72, -78, -108, 91, 26, 127, -15, 14, 24, -52, -76, -117, -43, 45, -48, 74, 66, 146, -66, -10, -63, 132, 106, 147, 120, 35, 10, -68, -39, 39, 160, 32, 40, 51, 103, -199, -16, -24, 100, 4, 88, 32, -32, 13, -35, 16, 7, 61, 48, -68, 67, -5, -45, -147, -86, -81, -88, -5, -84, 17, -24, 132, 36, -50, -111, 23, -8, 104, 15, 26, 204, 71, -75, -92, 68, -18, 84, -62, 24, 46, -38, -11, -154, 171, -11, -31, -170, 62, -104, 6, 138, 107, -224, 62, 141, 15, 41, -83, 20, -83, -31, 27, -160, -27, 150, -30, -80, 142, -9, 72, -7, -20, -26, 9, -36, 5, 86, 16, -100, 15, -25, 89, -46, 8, -139, 40, 86, -113, -72, -64, -48, 54, 132, 161, 1, -55, 115, -88, -23, -61, 28, -37, 6, -120, -22, -49, -112, 48, -8, 126, 24, -83, -160, 19, -50, 6, 105, 38, 124, 2, 43, 49, -66, 1, -19, -92, -20, -148, 32, -79, 120, -27, 50]
1452E0j06M5j6K3P7j95J84k05K37j72J38J34k01P9O4j20J55k27P0j69K42k19k4
1475a56J96Mq9K43k91Q9m0RP4M7j47O9M1m8r1J54l3p8m7J21O0o3j8q0m6M1k4J66
1503F3Mm3j26J86P0j01j34m3K06q5J39L2j22l7j50J34J33j03n1J5R6m6j33O7j59
1528a88K00r5K6J8J37k9o9p1j2N5m4J25K8p5r8J34j23J38q2J3K06k16j4Kj10K18
1554G4j4l9q2J75j44J29j14k3J91j54M2k9j44J84J1k72J95Q3j9j08K5m1K02j15
1578A3M0l7j19M1J77q9j10K04K1k49J03j20J71k1k3o0M6J3j43O5K10j11J17j66
1602b7O7j31M6J9j2J66j24q7j01K06l3q9J71j21m4J38J55j88l5K5j11R4J33q5
1626C2M0k7k8r3j5J8P4m8qP2j12j25K95n8j84K09r7J47j05j7P2M5j61K8N6r3l7
$$ y = [50, -56, -11, -27, -4, 73, -122, 62, -143, 94, -78, 60, 194, -7, 72, 136, 16, 171, -56, 14, -155, 87, -132, -156, 40, 44, -45, 198, -93, -4, -44, -35, 39, 86, -61, 8, 49, 1, -90, 64, 31, -47, -94, 27, 87, 24, 6, -74, -120, -79, -103, 63, 67, 24, -102, 84, 154, 53, -81, -124, 82, -3, 136, 168, 46, 9, -141, -7, 126, 23, -28, -13, 83, 37, -96, -29, -188, 12, -83, -57, -39, 98, 69, 0, -71, -83, -28, -72, 53, 81, 6, -92, 42, -81, 57, -25, -12, 194, -22, -36, -34, -144, 74, 60, 21, -61, 114, -30, 99, -15, -38, 153, -1, 41, 12, -132, 52, 63, -209, -14, 69, 50, -58, -33, -74, 128, 13, 53, 16, -103, -62, 115, 26, -84, 120, 141, -108, -5, -125, 46, 25, 2, -58, -12, 1, -142, -77, 133, 22, 139, -27, 40, -91, -45, -26, -38, 128, 4, -83, -184, 22, -11, -100, 71, -50, -94, 44, 199, 11, -24, 1, -110, -16, 117, 32, 72, 45, 17, -76, -91, -73, 1, -47, -55, 17, -95, -220, 75, 17, -167, 42, -55, 92, -13, -30, 42, 87, -74, -46, 10, -83, -120]
1653a20J70p0o8L9N4j03Q0R5j16m4pN1J51j44O5j29P9O2QKj0N0KJ49k56N6P9q3
1681D2J02j25j12J00p3M1M4J26j14o5P0J89k97J3R1j43R2r6J29Nj47QJ48j22J47
1706E3K7j42M9r3J19J65j43J9r0L2o7J33k3r5J25j17o2J37P4r1j9o6M8P4j15Q4
1732A6j01J09m4j8J0kL3pl4J05M8j56K67j56K2p6J33k25J89n7k10L7J32O7m2P9
1758A19j45Q8l2M0l4K33k75j7j13J75q7N8j12P3J01P7j91P0J17j29O9k11m6J60
1782a2lk4J95j27n5K7P6n5Rq4J14p0k4M5m8M8j4l3KM8oQ3m2r9N3Q1j44NQ3n5j63
1813a89J70pK6l2Q6p1l1R9J63j99j58J00K3O7pn3r6Q2J93j43K0k6Rj5L5l4l4k18
1841b40K33o1O3M4n4J57j74m8K1J37j40J11m2J6J8j4o3j65K12N6j55K1R2l6j21
$$ y = [-120, 50, -20, -88, -49, 5, -98, -18, 77, -39, -83, -90, -39, 112, -32, 33, -96, -17, 45, 53, 55, 45, 95, 97, 246, -10, 46, 125, 42, 144, 19, -93, 7, -66, -25, 19, 145, 31, -34, 36, 225, -72, -59, 32, -111, -19, -115, 14, 19, -128, -120, 28, -94, 53, 80, -62, -13, -106, 13, 178, 35, 54, -36, -4, -71, 62, 39, -56, 69, -48, -110, 27, 101, 10, -9, -75, -27, 47, -68, 16, -85, 24, -20, -38, -28, -30, 3, -4, -38, 67, 115, -41, 226, 70, 92, 16, 149, -76, 113, 56, -154, -117, 15, 82, 40, 119, -26, 62, 30, 70, 36, 269, -6, -23, -136, 39, -48, 10, -102, -29, 72, 149, -42, 28, 145, 16, 85, -126, -172, -12, -15, -39, 156, 29, -26, 1, 77, 22, 31, -53, 61, -9, -33, 12, -36, 12, -2, -35, -33, 15, 9, 92, 50, -49, 4, 85, -59, -54, 29, -26, -189, -19, -26, 0, -32, 54, -17, -48, 51, 214, 15, -143, -43, -20, 47, 40, -13, -109, -27, 166, 23, 43, 17, 26, 11, 46, 12, -22, -240, -7, -68, -5, 39, -15, 142, -32, -80, -59, 78, -62, 49, 7, 23, 41, 27, -36, -201, 11, 67, -88, -67, 25, -11, -132]
1866a32J23J3M4n9q8R6Q9k53J71mJ04r0q7L14k88Q9M6j66m2j0L6K5J59j87J02
1891Ek9j21J03J56k34J12M9K7j27J02m4P9j18K8N7j99K53n9Q4Kq5l9j2J09j98
1916i9J6L02k12rM5N1j15J11j75l9O4J32j33k2K3p4R4j2L7j30J49J02j88J33l5
1941A6p2k9O4n4J52j66M4j0N5N2q3P2r2J82o8q5O8j08L07l40P7j14J56p5J00l8
1967A1N8k4k6op2K6j6J7j46K6J72r8Q6j55J44Mm8J26k19R1J27q3M4p1J64j05O3
1994I0L0j71P5j11n3J28l5L1j3J1Q6j23N8p7O7j8j7nJ6n8J78j06K2R8r3J13j18
2021EN8N0J7q4j21K14o4k4n7J07P2r7j32n5J70p5k0J1jKJ5J7l8J18j68Q4J46r1
2049E9R8p3o6J06k58J24L1J23k54J31J2r4n9J33J33k16q9J57mJ52o1p9j25rK36
$$ y = [-132, -9, 4, 48, -11, -99, -3, 86, -167, 4, 0, 104, 14, -73, 241, -47, 42, 88, -78, -120, -130, -94, -69, 90, -97, 5, -24, -145, -42, 114, -120, -8, 41, 68, -59, 43, -1, 78, -40, -12, 45, -154, 99, 40, 124, 126, 41, 2, -10, 99, -99, -83, 219, 7, -2, 43, 94, -21, 90, -85, -124, -60, 72, -61, -83, -60, -134, -40, -52, -15, -145, 4, 106, -82, 51, 16, -56, -85, -21, -75, 77, -89, -45, -55, 0, 52, -31, 41, -51, 131, 63, -22, 46, -62, 245, -95, -18, -132, 24, -51, 49, 11, 69, 45, 19, 13, -59, -33, -49, -32, -178, -152, 20, -78, 8, -147, -3, 1, -47, 79, -140, -49, 78, -5, 39, -32, 132, 27, 90, 120, -51, 24, -87, -140, -12, -47, -16, -29, -18, 68, -55, 3, -74, -7, -25, -42, -47, -31, -89, 89, -17, 5, 103, 10, 123, 5, 63, 113, 130, 46, -75, 139, 75, 51, -6, 101, 173, 76, -56, -111, 59, -16, -36, -25, -26, -24, -9, 8, -30, 88, -80, 4, 150, 59, 157, 84, 18, 124, -134, -10, 21, 144, -110, 21, 33, -61, -120, 13, 146, -70, -159, -2, -6, 146, 85, 6, -119, -128, 108]
2074A08M8j06r4n1Q2Ln3O4j4p4L1J9O7j8j12J01K0j13M0K2m3P2Jj62J20J22n7
2101B3j1q5l6J12n3j5J24k1J37k11J6m3O9J11j23J4R8n4k11J50R9r8N3j53M2M5
2127b1m1J19k30Q5O2l2J9k9j05L16o4j95K09q7M9o0K0j42K29o7J03j54nJ01q0
2152@J8n9O2J13j12k1j37J86j11J61j83J3J09j34Q1M4k74L09j16J11pQp7J11r9
2177dj2m2K3j31L8R8l3J14P5j01j0N1r4N8k3k0L6L0p3m0NK18k98P7K05k00q7J89
2205D9k94J87J7M9K1j19J63j56QK37p9j20pR1j71J71l9J11O7k49J17j25L6J10
2229G5O6o8Q3j99l1k1J78k16L4J77j58jJ06j39R9p8L5j24K4O1K14k13J58r1k8
2254e7p9J82j22J92j56J45j69P9J9J21k14J62j0j75J38j52J56j99J92p3J09j41
$$ y = [108, 156, 50, -44, -95, -13, -10, -63, 1, -13, -87, -56, -37, 30, 12, -100, 1, 21, -92, -52, -30, -73, -1, 0, -162, -42, 80, 23, 12, -73, -109, 3, -50, -65, 59, 38, 175, -36, -20, -63, 6, 117, -6, 8, 106, 52, -159, -9, 90, -8, 45, -108, -66, -21, -62, 57, -173, -88, -26, -58, -39, -68, -173, 143, 79, -116, 93, 6, 55, -5, 15, -127, 102, 35, 138, -16, -21, 80, 0, 18, -41, 21, 134, 22, 1, -136, 50, -61, 100, -83, -70, 39, -95, -14, 30, -244, 65, -51, 60, 53, 61, -16, 95, -4, -16, -58, -35, -166, -128, -30, -63, 51, 126, 25, 15, 66, -28, 30, 7, -13, 23, 53, -20, -60, -55, 163, -135, -58, 147, -53, -140, 49, -245, -58, -41, 8, 29, -90, 73, -83, -75, 162, 83, -37, -44, 47, -124, 47, 8, 119, 186, -63, 54, -71, -35, 75, 141, 73, 156, -43, -74, -95, 83, -133, -99, 78, -80, -81, 25, -114, -15, -93, -58, -182, -158, -97, 117, -96, 62, -29, -57, -136, 46, -76, 116, -40, 105, -64, 15, 34, 155, -59, 103, 93, -82, 56, -96, 60, -139, 53, -20, 89, -52]
2276e2J85j07Mp1N3j00J48K7k04J36j61J75j23N3K22k63m2M1Q6n1J04L4n5j0r5
2301f6J61k47J78K8L2j71K2J43r9J30j11k9J7K0J33j30J9j21J24Oqo0N8Nj8mj3
2328an6p3R5l3L1N1j49N4J83j56K01j99o5J39n1O0M4j16O5r0n3R4J44q2mm0p5
2355h2J30j8J3j68J77Q3j41j51J46p4J22p1j4M1J97j90p9J4M2R3k24L51k30J5
2379a8k9O1o2R0k13K68r1j6j19J33M0j1J6l1l2lN2m2J13p8r0Q8k4N2j21M8p8K3
2407g4M2j0o1J82k9j46J54j72K03q4l2J16n4j31J68r9j15K07j22k3J9J08N4j76
2431g5J63j58J03j15J91j28Jj6J33r6r1J57qj69J9N9J1N9l0J21n1j64N3r2J01
2456b2M9q6Q7j18R3m1J4l6P9o6KO5m6J36j44N4o8P8l6Ok4nJ10l9J6r5Q6j03J47
$$ y = [-52, 133, 26, 30, -41, 12, -88, 60, 87, -117, 19, -142, 33, -90, -37, 185, -78, -120, -79, 7, -44, 60, 94, 39, 29, -66, 95, -152, 26, 54, 86, -85, -63, 80, -19, 111, 0, -29, -12, 8, 141, 11, 30, -91, 33, 39, 31, -29, 29, 34, 16, 12, -1, -57, -130, -35, -68, -37, 14, -135, -81, 102, -54, 147, -52, -117, 22, -29, 31, 75, -41, 24, -66, -119, -25, 119, 37, 33, -7, -82, 48, 30, 43, -125, 52, 135, -6, -157, -11, -85, 37, -34, -48, -7, 190, 0, -79, -65, -23, 70, -154, 197, -33, -18, -47, 14, -48, 42, -171, 97, 6, -10, -129, 4, 44, 33, 49, 18, -14, -17, 35, -7, 106, 28, -62, 26, 2, 54, -67, -19, -97, -74, -32, -42, -103, 79, 50, -96, 58, -114, 89, 5, -27, 89, 35, -96, 72, -27, -142, 65, -57, -80, -61, 47, 101, -75, 88, -70, 33, -82, 109, -19, -18, -34, 99, 3, -88, 69, 61, -108, -89, -30, -19, 40, 10, 131, 80, -84, -31, -123, -22, 27, -59, 28, -90, 3, -38, -24, -60, 19, -47, -45, 20, -26, 110, -34, 20, -48, 30, -6, 0, -24, -29, 81, 42, 58, -37, 49, -54, 93]
2485I3n6P5j22oM1Q1j21l7K5j01J24j81K04q2K14j03R6n8lQ4k17J04rl4J23r6
2511C8l4M1O1r4O0n4j18J59k34NK53j93J14J31q2j39j08J11J28N8j03m3J45m7
2535E5L5m0k89K65P0r0Rq9m1R0k0N3J55p2p0o8j2Q3Or7J59p3q5n7J62mnn6O5q6
2565d7M7M0j34M2N8J5m5J1j14J42n3N4o6j13J64j87J75P8K6K0Rp8j13J12m4qR
2592@J5n9MJ78j60O5J7P5n5k2Mk0J37j96Jo6J7q1N7N7Ro3O1n3j2J80j16R4j59
2621i1%K88j36q9J23M6o8m7J03j47o0J46j7n4M0n3R7O8j30J42j11%j30K32J8j77
2647gRJ6n6L5r3J77m3j25N7q4K43k55K45j38r6J06K8O6k7j34J12l3j32M7J28K8
2673G4j10m9K06k62L44k48J05j9j5n2N8m2n1N4J39j77K6J7n7K00q1k9j06J34k23
$$ y = [93, 37, 112, -10, -16, 25, 106, -15, -52, -27, -128, -4, -185, 19, -63, 151, 48, 144, 86, 83, 167, -50, 54, 45, 11, 134, 38, 4, 45, 106, 12, 72, 18, -100, 59, -175, -170, 83, -110, 4, 135, 53, -86, -194, -83, 45, 103, 0, -43, 102, 55, 90, 50, -239, 26, 96, 6, 15, -74, -115, -25, -45, 8, 163, 91, 21, -47, -59, 24, 30, -67, 92, 19, -66, -123, 39, 35, 30, -26, 39, -47, 0, 40, -94, -52, 6, 21, -24, -13, -127, 15, -38, 16, -50, -163, 1, -186, -11, 67, 93, 113, 122, 44, -69, 43, -1, -9, 0, 15, -44, -40, 138, -22, 43, 60, 135, 80, 58, 62, 42, 179, -17, -16, -82, -65, -146, -89, -32, -23, -86, -25, -78, -90, 90, -26, 68, -91, -91, 197, 61, -28, 95, 141, 73, 26, 129, -18, -78, 68, 51, -3, 37, -16, 81, 149, 19, 161, 50, 50, -80, 152, 170, -7, 2, 18, -38, -3, -96, 81, 38, -87, -30, -114, 129, -126, 119, -19, -115, -9, 19, 85, 58, -76, 36, 3, -129, -82, 46, 74, -36, -85, 121, -141, 203, -45, 60, 41, 26, -26, 32, -10, -61, -7, 132, -45, -19, -2, -59, 141, 60, 31, -75, 59, -164]
2698a64K31q5O2k3j37N5JK27l18K42j82j9O3J30K5j31O0O3k03J67m1o3K06j61
2722Ej3J3l6O2l8o0o2L1K17k14L8J64rp0N4j00j3k9N5Q1l1R6j98J31Q2j74MpN9
2751C8r2J73o6P5j30ql4j9J58j06L6k28J82J30m5P6p9J9j11O2j8O6pj63L9P2n9
2778c9J45k07R9l3J5K7J04j92K42j12m5L3k4N1n5O8j40J6R8J61j64o9J20q4r1
2803g6J47j49O3J24o3P8j58l4K14k35P9n8N3L0M6L6K2o3m1J05o9P8j71J9L0q1
2829g4q8K56Q9k53Q2j27J92j69J15l5J21j55JJ4n3R9p0N9J6j79K07p1L0J7j13
2854h9Q3P2k4j4J52j51M5j56K8J51k09J78kj21P0j6O5j97J06Q8n3o5l6P4L7M3
2880E9p8%J8Np1P8j0J7r1nJ45J76j94k17K10pn4l0P2j81J92n8Q9j01N3j44J27
$$ y = [-164, 67, -18, 44, 21, -116, -61, -60, 167, -151, 91, -91, -110, -47, 83, 108, -23, 37, 100, -103, 64, 23, -40, 166, 5, -8, 5, -31, 31, -7, -67, -129, -98, 119, -95, -57, 107, 98, 28, 82, -18, -31, -60, -5, 76, 45, 141, -57, 74, 156, -18, -14, -21, 38, -54, 119, 53, 128, -2, -10, -44, -63, 95, -11, 25, -203, -21, 109, 64, 140, 61, 80, -31, 31, 13, 79, 72, -91, -52, 20, -39, 106, -101, -2, -35, -20, 7, 111, -81, 161, 49, 4, 37, 13, 64, 9, 77, -63, -47, 51, 212, 48, -21, 99, 15, -76, 71, -78, -15, 109, 46, 124, -34, -68, 146, -89, -10, -68, -15, 15, 61, 97, 119, 56, 15, 120, 51, 129, -42, -23, 7, -74, -162, 94, 183, -70, 12, -115, 77, -92, 23, -12, 109, -46, -45, -31, -84, 15, -55, 4, 20, -159, 48, -23, 7, 24, -89, -6, 66, 42, 28, 180, 29, 74, -82, -54, 97, -112, 66, 64, -57, 13, -3, 62, -135, -29, 59, 6, -59, -95, -21, 16, 59, -19, -19, -1, 4, -67, 11, 1, 18, -73, -78, 67, 243, 49, -168, 42, 35, -19, -49, 23, -158, 34, -24, 65, -36, 17, -127, 0]
2907@mK9j3j24J61k7o8j3k6K1J78j26%Q7j42O1J59q6j13l8J49p4j8N0j06J09j40
2934a14Q4J15j49L3r7J10%j04J54r0j46K00m7k7J4J39j01R4j01L5J22K3j86J44
2958A05k3m9L6p2R0j51J11p8R9j34J10j61jK53k96K46j86J79r1N7l2q9J00k9M5
2983C9J9j16R1q5j7N9J6K6j29K53j93J24m3l8Q2o1j44J24N6r3l7J25p4Q4j45l6
3009a13m0J18J6K4N4j06J08j58K42j99j21J62j44O4n7J26j58P8J00N5Oo7J17j8
3033H9m4L8j27J45m5k9J1J42k22r4J79p8Q8q2j24K3O6Q8j70L3P8L9N0j21J52j0
3059G5q9m0n7K52j86%L0j47N5K2N9J19k39J46L6j08R8j1j98K15KK10l17O8j2q0
3085i7J00L7p8m0R9j68J69M6p9N4p3q5J99p7ON2j45J0M2j9J02j95K17j29J9l3
$$ y = [0, -4, 25, 12, -112, 49, 22, -46, -59, -85, -64, 114, -12, -12, 75, -67, -6, 153, 67, -46, -84, 65, -9, -27, 23, -83, 26, -114, -30, 85, -64, -31, -128, -18, -18, -122, 32, -58, -204, -4, -51, -78, -64, 75, -26, 68, -33, 2, 124, 147, -39, 105, 82, 33, 69, -3, 87, -64, 47, -31, 68, -66, 44, -117, -118, 135, -161, 85, -101, 78, -13, 44, 12, -77, 23, -6, 39, 58, -58, 33, -52, -69, -10, 6, 32, -97, 156, -37, 87, 44, 6, 88, 27, -117, 7, 63, -30, -67, 58, -16, 68, -77, -113, -153, -35, -19, 5, 59, -47, 61, -97, 145, -54, -175, -13, -157, -93, -150, -24, -182, -104, -4, 51, 57, -10, 107, 89, 45, 83, -44, 101, 56, 27, 38, 180, -42, -136, 43, -35, 53, -29, -153, -130, -64, 24, -146, -113, -35, 4, 54, -67, 85, 75, -14, -54, -111, 141, -45, -45, -15, -162, -107, -85, -26, 93, -146, 0, 36, -72, 26, 15, -183, 32, 34, 244, -73, -5, -17, -97, 3, 40, -38, -78, 21, -147, 22, 68, -11, 43, -30, -115, 84, 7, 13, 65, -80, -70, -28, -47, 55, -140, 77, -52, -33, -66]
3111f6O6j8m3J56l04J53O9p2K5p0Q8m3R1p1q8M8J66k4M1j32q6Q4N7M0j05K9l0
3138c9Q4r5P9J8R0k10J28j19kK3J51k07Q1j43J63K0p9J31j41m1J56L8Jo5j77J05
3164e0k3n4J07q8K67n8k1j32Q2q2J61k53J26m1J23q4J41j70R3k8j84K61j92K60
3188A61j67j4k25J87J13o9j49K52j54P8n2PL2O1RK9j44QK47k09Jp2J34k00L1J21
3214A6j43J14P8o6q7J06m1J08j23R3j31J53J24j74M2l6j49J40J7p5nO6o8j19K88
3239A28k1j45j8j2K29j27O7l04K12m0j10J79j23j1J15O8m9k1p5M8L1J0j49K50
3263A32j25q5M0nL2K0j80J73N0n7L9J24j87K3j1o9r1J56L6k9Jo9P9l8l5j6K87
3290A95k39j2J07k55J23J35rj45K69k85K6J43k8j39N6J28j28K6kR2J64l48R8q2
$$ y = [-66, 0, -18, -61, 95, -209, -56, 13, -59, -34, -104, -16, -59, 32, -39, -127, -79, 87, 63, 104, -28, -114, -30, 27, 67, -38, -9, -39, 45, -50, 29, 47, 137, -73, 55, -64, -66, -43, 108, -99, -18, -161, 2, 22, -57, 74, -67, -108, 48, 86, 87, 22, -155, -50, -73, -127, -20, -108, 159, 101, 80, -52, 30, -52, 109, -144, -18, -59, 64, -20, 121, -49, 44, 16, -168, 93, -99, 161, -6, -20, -245, -58, 55, -14, -163, 89, -65, 13, -39, -32, 0, 61, 70, 99, -45, -37, 210, 1, 2, -70, 64, -136, -105, 16, -127, -13, 65, -1, -88, 18, -23, 85, -38, 55, -76, 77, 201, 27, 69, 33, -116, 24, 41, -34, -39, 27, -41, -160, 128, 107, -38, -56, -68, 161, 34, 101, -203, 9, -31, -141, 38, -85, -96, 19, 87, 38, 17, -58, -10, 21, 31, -118, 132, 7, -78, -38, -43, -11, 9, -171, 2, 52, -5, 34, 158, -29, -6, -17, -86, -177, -21, 15, -14, -13, -82, -3, -41, -76, -92, 195, -44, -56, 51, -204, -81, 54, 45, -100, 169, -116, -90, 53, 25, -114, -58, 70, -58, -32, -34, 58, 222, -126, -28, -110]
3314a10J25j1J04k28J86J6m8M4Oj18K53k11J3j25N5R9k56J21J45j1J4J1K4m5l06
3339b53L53Pl1r9P0n2M1N2q2P3o3N0L3k04j5J03Q0m9j15K08k21P2o2Q8PJ03j08
3366a4J06j60l6J45p0NK8K2J18j14N4p5R5j46k4J13q7J55K2j21J58o5j47K2J1
3391eM9l2j14J37n3O0K9k76K25j0o4m8r3K78j02J1j8J15j38J14J8k05K23l7j14
3416e0J41m6n4o7K00j3lj78O7J9j8K0r0J55l6J40j90j58K11Ok63K63j20P0k4j38
3442a56J19j3R2N8j18r2N7O6MK6J28j82M2o1J43k84J40j9L5j21O2J84m1j04l7
3467g2J61n3m2M9L9k7j5P5k03O3J33j18p5J9J0m0J00Q8j26j4L2J52q9p5nj29J67
3494EP0q7K5p7R6q9Q2K1Pk10J12J54j99J0M8m9K13j33K8qO4M0j15rM7j7r1J88
$$ y = [-110, 15, 4, 108, -120, 66, 82, 34, 78, 84, -34, 219, 8, 21, -104, -49, 50, -206, -85, 60, 49, 63, 74, 98, 53, -253, 100, 107, 76, -23, 47, -5, 36, 88, 6, 79, 16, 66, 99, -105, -120, -17, 63, 14, -101, 107, -114, -42, -104, -16, -9, 94, -14, 92, -68, -104, 41, -29, -24, 4, 26, 144, 30, 84, 9, 104, -42, -66, 47, -40, 115, 137, 16, 174, 109, -38, -16, -5, 44, 12, -102, 35, -18, 42, 71, -205, 20, 10, -54, -102, -195, 83, -19, -8, -26, 89, -49, 65, 83, -122, 101, 64, -50, 91, 45, -9, -76, 124, 111, 108, -70, -3, 16, -2, 18, -72, 83, 47, 187, -3, -161, 50, 56, -207, 56, -64, 6, -18, -156, -37, -50, 42, 100, -18, -110, -53, 13, 17, 43, 171, -11, 31, -30, 113, -171, -31, -50, -15, -136, -74, 110, 69, -35, -72, 89, 36, -6, 43, 82, 55, 40, 115, -88, -25, 108, -10, -85, -66, -56, -96, 4, 92, -34, -48, -16, 136, 47, -28, -33, -162, 5, 75, -12, 13, -64, 32, -57, 25, 46, 53, -157, -45, 109, -90, -80, -32, -81, 132, -1, 27, 19, 83, 123, 8, -1, 46, 29, -62, 126]
3522A26j82O9M2J21k29k4J99r6R7q2n0m2%J15j73J4K77k82k9P9J32k9j78N9P8
3547A2j92J18R9p3K17j49Q9j03kJ43j58O2k7k3j34Q2MJ1l0J26r2J31q9Q5j44Q8
3573E1J30n2j40K00k12L0J10j25J4j27J17o1K7J61p7p3m0J40k0j69K24j94J61
3596G5r0m1P2K3m2k5P0o0m9k6J91j09l0J11j20QQ3l5l3N9r7J07j07L9R1R6k00
3623c9K47k2k29mPR5p7Q9q6o7P0o1o3J65p0J14J17j75m4N2o7R8m4j52J77P0m9
3650E2Lm1K0j37O8N6L9kq6p9Q3L8mk8n9J55j27K22r8j44O9l7P8q5O5N2J7rj12
3679c1j46J74J11j53J38n3o5N5K3j51l5J83k4J3J5q9J28q5l1J53l10L02k19J31
3703C4m2N8j5o4J39j42J15j61O9j15J27j25j9R9J17j29O4R7m0qj6n9j19O5Q6O
$$ y = [126, -56, 13, 55, 176, -53, -77, 122, 26, 123, 41, -9, -51, -51, 64, -109, -95, 182, -100, -129, -50, 82, 53, -125, -66, 12, -180, -62, 37, -36, 181, 32, 121, 18, 16, 159, 1, 63, 36, 13, -121, -39, -35, -24, -54, 72, -20, 111, 22, 107, -37, 51, 181, 129, -11, 189, -23, 7, 117, -8, 6, -121, -4, -65, -38, 123, 46, -27, -67, 73, 53, -116, 108, -86, 75, -15, -56, 16, 39, -3, -28, 42, -18, -67, -93, 98, -11, -41, 70, -50, -42, 41, 6, -27, 32, -65, 42, -65, -26, 65, 161, -39, 208, 186, -43, -47, -40, 55, -22, 67, -19, -86, -16, -77, -140, 25, -45, 69, 186, 11, -33, 19, -48, 50, 6, -146, 31, 101, 52, 55, 14, 34, -103, -35, 21, 60, 58, -28, -107, -24, 14, 10, -18, -77, 78, -49, 173, 75, -69, 0, -37, 41, -44, 21, 73, 90, 81, -31, -177, -3, 108, -45, 93, 40, -25, 30, 53, -98, -133, 50, 26, 39, 54, -35, 93, 8, -23, 130, -180, 122, -97, 34, -8, 50, 35, -29, 110, -32, 83, -78, -9, -124, 3, -122, -141, -42, 75, -54, 10, 107, 67, 59, 43, -16, -135, -70, 16, 22]
3729B2P1qr6O0j81L0J15k70K40k5R6j72R8k2J4o8j1K46m8k15J72j29Q2j52P0O9
3755a2j25J54P8j67J7J13p9J89k03K46j01l2k4k5j73K29j45L9N6L4o5j83J58o7
3779h8N6M9p1J12l2l8L3j97K47m4j2J7q6J81k13J37p4o3l8M3N3O3P4j39MJ33n1
3806E6l1K8r8R1N0r2j34J55Q6j63P4J37k61J91j79K13j25j10Q4j2mj6Q3o6J05
3831F2j00jO2p8j35K08Q2n2l2r8J06j72K20n8Q7j78m0N9n6m1J14N9R6k34J31j8
3857gqP5j29O9Mj1M9j16R3j2m2O2ll5j41K46K6n5j04j2M6J00k57Q9nO0M3j17l1
3886a23Q8J5jk3R0m8P4r2k1O5k45R7J54J68k34K0Q4o3j55K8J80j99L9J21R8J0
3912A27j94K1k0kk7K57j32k6O3n5L1k0L1m3J9q0R1p9K2O5r5J3J52Oj38j17J86
$$ y = [22, 93, 85, -11, 49, -132, -102, 13, -257, -17, -42, 54, -118, -20, -42, -28, -96, -107, 139, 91, -124, 48, -81, 1, -151, -81, -12, -137, 17, 95, -72, -55, 58, -21, 168, -35, 211, 110, 78, 54, 29, -144, 85, -60, -21, 35, 69, 4, -179, -21, -88, -32, 17, -54, 58, 26, -12, 21, -176, 71, 27, 15, 32, -54, 127, -86, 51, -23, -86, -124, -81, -28, 35, 109, -30, -26, 107, 56, 25, 53, -45, 46, 96, 4, -130, 25, 111, -52, 22, 159, -102, 89, -90, 123, -2, -112, -28, -40, -44, -60, 23, -43, 62, -38, -39, 23, -55, -190, 18, 100, 48, 16, -82, 24, -148, 72, 14, 101, -77, -117, -58, -114, -155, -41, 18, 114, -120, 11, -7, -15, 60, -69, 0, 4, -7, 42, -74, 19, 7, -35, 27, 24, -11, -152, 94, 120, 65, -39, -51, -5, 95, -162, -73, -78, -18, 25, -92, -123, -35, -20, -21, -44, 46, -2, 72, -20, -41, 24, -221, -124, 30, 198, -36, -16, 68, 5, -150, -122, 58, -141, -102, 19, 117, 127, -67, -46, -66, -68, -95, 162, 30, 4, 67, 12, 43, 23, 54, 11, 30, -50, 41, -38, -16, 49, -46, -33, 119, 125, -13, -130, 56]
3939E6M0j9r8N7j21J00%q4J06m8P2j8j58J38j5mm7N9j21L2N7o2o8P2J93j37o7
3966h5J28J9j0p8j38K17j12p6Q4L9j46K27j58L2N8n2J9r5J28N1m8K3L8n4Q1k19
3992a27K87k08q1K90l33L19l4j18P2k11P4J18rk37J69J12j9Oj15P1k4J9m5j4J25
4017H7k09J81j11J04o9r3lK40k5r7k6R5j44k0J02K6p0M9m4L4O9j46Q5p1R7j7k58
4044b34J93l3pR3j19J43P0L7j25k5J48j44k0NJ00j07j01J50q3PR5n4j09O6J56
4069A02q4N5m9l26L43L2P2j47k3J20j46j7J94J6j47oR8l7r2M5M1k2j33K57j17
4094B9n6k4p4J87P4k60M2J38n0K4j48J67k4J22j02r5rJ45mj55N8q8K14j39K05
4119A77j02q9j1R7j18J07K4m0o7R1j09m7m4P0P6q3M7j6M7R6j18Nr3P8j4Q8k2j70
$$ y = [56, 96, 77, -21, 36, -85, 15, 15, -69, 37, -11, 61, 43, -115, 23, 8, 4, -43, 16, -105, -73, -16, -78, -146, -74, 119, -18, -85, 43, 62, 52, -26, -164, 53, -59, -135, -51, -12, -158, 69, -89, -57, 1, -51, -32, -127, 1, 52, 4, 27, 65, 11, 92, -127, 160, -48, -129, 161, -172, 147, 113, -5, 67, -144, -70, 48, 39, -198, -29, 83, 64, 70, -45, 26, 2, 21, -24, -38, 87, -122, 59, -52, 52, -17, -110, -113, 127, 102, 5, -21, 74, -70, -90, 12, 38, -32, 17, -27, 7, 76, -70, 15, -56, 41, 24, -234, -41, -74, -81, 12, -107, 36, 106, 143, 18, -7, 141, -3, -23, -18, 82, -25, -126, 24, -59, -52, 43, -11, -120, -54, 102, 18, 73, 24, -302, 41, 73, 145, -2, -25, 95, -51, -68, 126, 142, -5, -11, 87, 50, -42, 3, 44, 22, -111, 146, 29, -27, -51, -125, 62, 136, -124, -82, 56, 6, 30, -118, 49, 25, 147, 45, -50, -59, 86, 82, -73, -15, -103, 111, -28, 177, 75, -14, -25, 72, -46, 61, 85, 45, -22, 69, -40, -87, -131, -61, 15, -68, -21, -37, 10, 106, -12, -7, -100, -22, -36, 52, 30, -140]
4147a40K15j4l5m4L1O1j4m2R1j16r4KP7J32o8M2j02j3K5J9l8J01O6k92K24j3m8
4174A3l8j2p6J29r5J03o0O3p8J22j63K45k43J04k6l8P2N8L6j79j6m6L7oK60k89
4200a23K07r0N4M8j12M0k31K45p7M6k9mM2m3J1q5J04m3N2l5l2Q9k9L2q8J8N8J5
4228D0kj52K5J53q6R8M8k24N7k8J16j9M3k34J57P0p9pR0j05Q8n0p8NK4N1k8M9
4256B2o1J00J5k19J2K8L6N5o6mJ24j58J17Q9j20M0k9p3J84r7L3L3j93R2J38K8
4282A26j46J69j45jJ04K8j93q9K48k7j83J67j57QJ10m1N8K6j74J66M3j51J99N4
4306A99k28L7Q4l9m6j05l1J28P7j39P3J0P9o1n0M2J6P8j36KR5j31N6o4J91q2k7
4333B8j77O0J78k12K31k26J40q8M5R1n4kl4R4j58pk3K52j02j27N1n7J69J5p6j54
$$ y = [-140, 75, 61, 26, -18, 13, 74, 60, 18, 109, -7, -101, -99, -22, 110, 42, 84, -18, -31, -6, 13, -25, 76, 142, -150, 74, 61, 13, -25, -37, -113, 16, -79, 24, -36, 27, -51, 71, -92, 153, -90, 14, -12, -50, 22, 80, 116, -63, -79, -125, -88, -94, 166, -123, 84, -6, 48, 96, -16, 24, -207, 38, -39, 7, -22, -26, 16, -27, -16, -101, 3, -40, 12, -23, -55, 34, 5, 37, -51, -33, 25, 40, 38, -114, -89, 64, -22, 76, 124, -100, -43, -71, 45, 26, 69, -165, -8, 62, -17, -24, 66, -39, 49, -1, -79, -74, -50, 1, -27, 22, -39, 61, 76, -143, -131, -103, -67, -12, -78, -82, 42, -116, 1, 90, -30, 10, -19, -92, 92, -5, 28, 61, -132, -40, 98, 126, -20, 149, 4, 3, 107, 135, -58, -147, 101, 74, -109, 58, -99, -91, 19, -22, 36, 62, -112, 54, 97, -54, 145, 199, -29, 8, 92, 53, 7, -98, -129, -1, 76, -63, 10, 20, 99, 38, -12, 30, 46, 124, -12, -10, 85, -46, 10, -54, 137, 55, 28, -149, -89, 89, -123, 108, -118, 22, -66, -21, 70, 16, 14, -20, 74, -84, -91, -114, 138, 36, -91, -40, -97, 72, 87, 11, -143]
4359a43K6J81j36N2J27p8nn8K3Pnk7j15K33r8J9o3Q4p7K38l14J58Qo3j65J74m6
4386f3J59j11k6P3j18J91j21N6J03p2j6k9j27N9k8n6J58L2j25J7J2O0P5n0R0j27
4412A6Lj06J68l8O2j01j3J06l76L35K9J3o7p3kK0Mp2Q8J08K1j70Q0j5j25J82k4
4439E3q1l6l8Q4jN6o4j5N8L2n7R7J88l18J66j64Q4K46k76J3j55J28K3K4m1l8K5
4466gL6M3j00R0j85P1o5J92L5j03k6m2J04o2n3J16j32J37j8J54k3j14mO8j66j77
4492b31L14k0k1n1P2n5j00p3K67K2j5r2k6P2j32LQ2k8P0L4m4oL3j5m6M1o8P8J
4521F6j43o0R2J54j15K5P2mq6j01J47j71K37j23p6J53J05j71l1O0K2n9P2k6j07
4546f8J84j41ml9N3j4J48q4m0j6N8o2k7R5K3k90K57r7r2K36k95J71Q0j55R0J61
$$ y = [-143, -117, 64, -72, -20, 107, 29, 24, -34, -11, -4, -9, -36, -151, 82, -16, 3, -60, 24, -53, 185, -129, 29, 37, -26, -191, -17, -63, 96, -15, -41, 32, -86, 105, -16, 40, 143, 71, 55, 26, -101, -42, -70, -126, 32, 64, -61, -44, -32, 28, 103, 53, 143, 16, 19, -87, 81, 43, 105, 4, -9, 97, -279, 56, 85, 98, 31, -42, -44, -24, -20, -92, -4, 104, 125, -45, 35, 20, -105, 77, 53, -28, -64, -102, -18, -19, 37, -27, -42, 16, 48, -9, 88, 276, -42, 124, -40, 44, 290, 14, 27, -128, 0, 23, 47, 6, -32, -7, 29, 72, -28, 62, -123, -52, -117, 75, 110, 7, -19, -61, 43, -19, -72, 44, -88, 49, 31, 185, 162, 48, 44, 112, -54, -231, 83, 63, 42, -9, 63, 8, -92, -165, 102, 124, 109, 17, -9, 63, -69, -66, 16, -12, 58, 92, 48, 42, 75, 60, 14, 55, -13, 65, 66, -77, -137, -45, 109, -6, 19, 91, 87, 1, -100, 47, -124, 113, -10, -86, 67, 172, 1, -30, 30, 52, -7, 65, 39, -68, 116, -25, -29, -68, -15, -29, 119, 35, -5, -21, 37, -25, -52, 43, 66, -224, 33, -64, -156, 80, -215, -44, 36, -119, -29, 132]
4572A32j01o7J34j32J23k40J09P0k2k0L8K7r8KL6oj53J30P9r0O7N4R6j61q5j9
4598i7J15L4j53O9K8o8o6J31%pk1m3P5P9o2L4Lj40j9N9l7J08J8l5Mn9N6k8J25
4627A03Lm5J3j23n0J6O5J75n1j45M1JN6q1J00m8j39J69p6L3j03L9J22j38M3J68
4653A48j94l5J39j21J16o0K7j16Q7K9j02N1P1j23KK8N5m8k1K7o3J06l7L8J65j79
4679a0M9kRj18J19j04N4L1o3J08L1n9q1j8R7J28j35m6J06k3o3n2pJ33k13N1K7
4706e1j2J52l3M1j18K8p0r7N5K11q5J5r5P0r1m7N5J5J54k05l6J67Nj17N9J7R6
4733H3k3J26j23j32O4K1K0j17J21p3J30j94J21oPj20q3K63M4j03o6R7p0Rj18J22
4759@K8k5L3K3k39J19oJ17J08k00J69j04j41K82j08oj41R7j1q0J4n3M8K2m9J00
$$ y = [132, 31, -36, 98, -34, 89, -151, -42, 28, 6, -14, 24, 51, -47, -45, -9, -15, -168, -38, 41, -49, 18, 72, 168, 7, -78, -97, 18, 52, -101, -32, -4, -72, -138, -7, -7, -14, -35, -78, -3, 76, 14, 48, 51, -89, -108, -49, -86, 22, 40, 5, 9, -50, 6, -22, 103, 106, 61, 74, -49, -99, -83, -18, 157, 106, -39, 2, 3, 59, -22, 78, 30, -109, 60, -16, 17, -86, -47, 75, -63, -20, 148, -46, -81, 58, -63, 53, -7, 20, -96, -9, 20, -82, -31, 40, -83, -81, -53, 2, -46, -67, -40, -103, 3, -34, 4, 169, -10, 39, 37, 46, -72, 47, -57, -3, 28, -35, 73, 104, 45, -36, -54, 43, 171, 36, -10, 96, 73, 10, -42, -49, 84, -129, -78, -51, -63, 89, 56, 97, -21, 7, -63, -160, -105, 106, 21, 36, -59, 11, -80, -127, -72, -57, 97, -108, -144, 23, 28, -89, -30, -13, 83, 60, 186, 63, -69, -5, 16, 36, -81, 40, -33, 97, -97, 24, 18, 25, -95, -178, 85, 129, 26, -40, 57, -13, -4, -122, 0, 28, 3, 36, 59, -180, -61, -67, 50, 158, -42, 127, 23, -118, 164, 56, 50, -91, 6, -5, -85, -71, -124, -76, -54, -103, -3]
4785ck8R7j7o6n3J75k97K44l3j59J18N4LN0j55o5K60j87O7l3P9j2j23J82r9Q1
4811H0r7J41p5l7j60J55l3k9J53r0k3p5JJ13n3n8J59q0L9j6P2o7P2j55N0J05k5
4838F7j60O3j9J24l6M3j70P1M4n1j02M7K54q6j85J37k7j22J92qo6O0K5j56n8K22
4864A03j23j3J83m7j22J8j8k1l4K04k26P0m3Q9O5j57J31jo5J35k44K57o4l3j25
4889h1j9M4j18N2J19Lr3l5J15P9Jm6J1Mo1p7K18qj53J52k11J17Ojj60J75kN7j5
4918G3k1P2j20k6k7M2l0N0J3O1j87K28j41p7O0K3p5K6OQ6m1k7R8j82p4J35m3p7
4946a75J25Q8k34K42qm7M0j9j4k4L8nk4J47j81j0L3K9R4r3n5J4J40j27o2J1j1
4973h8J35k3R4j03l8L8k6o5rk0R8M1j52Q0j01K05Lnr7O2m1l2J0p0J52j46rK9J25
$$ y = [-3, -31, 66, 49, -17, -70, 105, -192, 52, 19, -140, -22, 32, 35, 85, -70, -135, 125, -62, 5, -28, 51, 39, -84, 98, -1, 80, -17, 124, 49, 12, -148, 7, -26, -55, 98, 8, -15, -90, -89, 24, -29, -87, 72, -8, 31, 15, 87, 20, 92, -63, -13, 92, 67, -93, -30, -49, 75, 39, 82, -88, -17, 27, -24, -126, -79, 175, 89, -96, 41, 14, -108, 84, 76, 10, 70, 95, -61, -119, 103, -20, -33, 150, 103, -19, -1, -19, -40, -74, 130, -96, -26, -69, 20, 85, -72, 59, 58, -7, 128, -116, 141, 77, 44, -81, -100, -56, -174, -122, -3, 0, -93, -128, -13, 66, 67, 21, 32, 36, -25, -102, 116, 108, -45, 107, -104, 13, 19, 18, -142, 33, 31, 88, 73, 52, 124, 4, -22, -49, -7, -37, 13, 26, 87, -100, 128, -13, -90, -30, -7, -82, -56, -50, 36, -5, -32, 66, -116, -190, -55, -98, -175, -50, 38, -196, 46, 38, -9, 31, 12, -2, -26, 12, 7, -17, 130, -51, -61, -28, 1, 95, 2, -53, -39, 101, -26, -88, -77, -88, 47, 24, 118, 15, -23, 15, -11, -76, -85, -105, -7, 34, -118, -38, -139, 66, 69, 64, -33, 29, -12, -44, -34, -104, 48, -98, -107, -78, 47]
5002D7k5k2m2J08l1K3P2p5k13J39q9J36j17q4K16l7P9j00m0J43N1k68J10J58k31
5027i2L6J19M9j11o9Q4j1L7r1J24j01L3p5J2J6J5N8r0J2N5J0j14J53j45J08j14
5053i2J26m6j67J70p2r1K61j43J41j29K23k43K00q4l6L2j26P9k42J23O6L5K3J
5077ILJ00k4q4J6J37n8j18L8m1J62rn8K9j36P8N0r7oJ44k08J10j15K08n6j87J57
5104D4J2k5m5K5K5L1l2n1L4J6K4R7N0j56j50J26j9o3J3j2K96j02nq6K2k03K04
5131G0L2j14N3j8j0P1n1n2q2J17j4r8K07j40q2J75p3Q6Lo7r8P6J71j30j5Q6j78
5158g5M9rM5r8K4J31k6J5K6L2j92O1KP9k24J16K59l86L09q7k90K70j70J79J1j65
5184a14L6J23j49R9OJ01J3m8j74Q1R5j23K0M0P8j47O2m8J34q8j52K24m3O8j26
$$ y = [47, 22, 0, -42, 66, 35, 58, 130, 55, -158, -19, -108, 28, -89, -173, 43, 6, 85, -15, -55, 88, 139, -129, -19, 139, -92, -56, 63, 112, 1, -68, 16, 5, 42, -49, 75, -26, 7, -68, -56, -40, -25, 33, -57, -45, 10, 20, -94, 59, -86, 22, -92, 34, -12, -179, -9, -81, -172, 89, -54, 87, -42, 181, -62, 138, 54, 18, 50, -76, 3, -239, -116, -50, -15, 8, 9, 12, 112, 88, 4, 20, 157, 99, -19, 19, -22, 140, 131, 73, 102, -34, 44, 94, -3, -9, 135, -73, 37, -78, 130, 74, -113, 44, 56, 31, -14, 11, 36, 67, 35, -16, 18, 34, 58, 155, 205, 49, -101, 25, 6, -57, -44, -56, 240, 138, 133, 47, 69, -134, 70, 102, -12, 41, 23, 13, 84, 33, -19, -101, 16, 2, -96, 111, -29, -111, 64, -9, 77, 80, 13, -85, -9, 162, 32, 17, 103, -75, -26, -35, 10, -88, -64, 67, 41, 56, 82, 114, -78, -17, -15, 64, -160, -44, 215, -171, 138, 51, -239, 31, -139, 40, 51, -114, -78, 45, -104, -5, 1, 102, 115, 67, -107, -26, 69, -54, -34, 6, 84, -63, -1, -49, 85, -3, -155, 69, 26, 94, -32]
5209c2k5n4K52j89k0J75k14J73k07K20j16o1K19j94K47p1J7Nm7Q6j49j17Q2J12
5233I2k12K16M4j66N7L5J4j10J15oj78J96k54J97q6J94j96m7J72J0j34K32m0j3
5257A32kj4r7PO0j71J36o8lJ10nr3k0j6j32L4J60q0n8K62j25M8j66J15P5J7k0
5284H6j43M5N7j74J09r1J34q1J21J22k13r7J09NJ48k32K09k72K56j95J51qj6O9
5308I9j45o9R2Q6k7r7Q0R3j13j09J27n6PJ05rj44m3J29k8R0n7K7J92k14n8K08
5334A66j44lj11J44K7j20n9J69r2R3O9k17R2Q3m5rj01r3J32O4j25O8Lj24J97o8
5360do4Q0nL4o2o5L8K11j40n9o9O2J64k00Q7K9j13J76kJ21j38M1j29J12q3J31
5386A53q6oqj09K29l58R1r4K52r0O1j44J96j61J10j44R8K2lK5m1q4J9K7j34L53
$$ y = [-32, -57, -111, 141, -48, -68, 107, -107, 66, -141, 79, -37, -98, 121, -73, 174, 103, 120, 125, 78, 164, 15, -102, -20, 92, -120, 96, 140, -26, 31, 66, 80, -30, 85, 79, -99, 97, -157, 40, -46, 148, -48, -95, 77, 87, -47, 185, 145, 132, 130, 116, 19, 26, 86, -85, 51, -17, -20, 90, 85, -8, -28, -44, -176, -142, 18, -62, -120, 142, 17, 65, -101, 14, 89, 106, 86, -57, -12, 45, -129, -20, -111, 23, -58, 63, 185, -28, -125, -16, -11, 137, -95, 114, -158, 98, -97, 54, 46, 30, 99, -46, -115, -23, 63, 36, -61, 19, 112, -1, -110, 17, -39, -32, 73, 64, -80, -123, 6, -22, 68, 11, 38, 230, 16, -42, 166, 22, 19, -92, 52, 79, -41, -100, 69, -23, 70, 139, -78, 14, 97, 52, 43, -58, -151, -19, 45, -80, -12, -9, -133, 64, -4, -68, 12, 7, 41, -21, -86, -48, 163, 23, -36, -105, -43, 121, -79, 8, 37, -76, 100, 98, 219, 81, 122, -7, 105, 22, 153, 67, 61, 53, -56, 173, -185, -94, -188, 64, -26, 35, -109, 87, -74, 36, -108, -10, 12, 9, 34, -7, -91, -72, -45, -179, 174]
$$ [...]
8191H9
##END NTUPLES=NMR FID
##END=
