##TITLE=1H_Pr AmCS2
 CDCl3
 8 sc, 
 8.04.2022
##JCAMPDX= 6.0         $$ Bruker NMR JCAMP-DX V2.0
##DATA TYPE= NMR FID
##DATA CLASS= NTUPLES
##ORIGIN= UXNMR, Bruker Analytische Messtechnik GmbH
##OWNER= root
$$ XWIN-NMR		Version 3.5
$$ Fri Apr  8 10:24:17 2022 Russian Standard Time (UT+4h)  she@DPX200
##.OBSERVE FREQUENCY= 200.13135
##.OBSERVE NUCLEUS= ^1H
##.DELAY= (6, 6)
##.ACQUISITION MODE= SIMULTANEOUS
##.ACQUISITION SCHEME= undefined
##.AVERAGES= 8
##.DIGITISER RES= 18
##SPECTROMETER/DATA SYSTEM= spect
##.PULSE SEQUENCE= zg30
##.SOLVENT NAME= CDCl3
##.SHIFT REFERENCE= (INTERNAL, CDCl3, 0, 15.7039)
##AUDIT TRAIL= $$ (NUMBER, WHEN, WHO, WHERE, WHAT)
$$ ##TITLE= Audit trail, XWIN-NMR		Version 3.5
$$ ##JCAMPDX= 5.01
$$ ##ORIGIN= Bruker BioSpin GmbH
$$ ##OWNER= she
$$ F:/spectra/data/she/nmr/H-F/1/audita.txt
$$ ##AUDIT TRAIL=  $$ (NUMBER, WHEN, WHO, WHERE, WHAT)
(   1,<2022-04-08 10:22:44.03 +0400>,<she>,<DPX200>,
      <created by zg, POWCHK disabled, PULCHK disabled
       configuration hash MD5:
       00 E9 B6 7A A2 85 ED C7 34 08 36 98 17 FE 4E 26
       data hash MD5: 16K
       A1 52 F5 97 4C EA E9 E9 88 48 2D 42 97 CA 23 7C>)
$$ ##END=
$$ 
$$ hash MD5
$$ 23 26 13 FE 22 71 C1 F4 7A C2 9D EB 47 88 91 E5
##$RELAX= 
##$RELAX= 
##$RELAX= 
##$RELAX= 
##$RELAX= 
##$RELAX= 
$$ Bruker specific parameters
$$ --------------------------
##$DU= <F:/spectra>
##$EXPNO= 1
##$NAME= <H-F>
##$PROCNO= 1
##$TYPE= <nmr>
##$USER= <she>
##$AMP= (0..31)
100 100 100 100 100 100 100 100 100 100 100 100 100 100 100 100 100 100 
100 100 100 100 100 100 100 100 100 100 100 100 100 100 
##$AQSEQ= 0
##$AQ_mod= 1
##$AUNM= <au_zg>
##$AUTOPOS= <>
##$BF1= 200.13
##$BF2= 200.13
##$BF3= 200.13
##$BF4= 200.13
##$BF5= 200.13
##$BF6= 200.13
##$BF7= 200.13
##$BF8= 200.13
##$BYTORDA= 1
##$CFDGTYP= 0
##$CFRGTYP= 5
##$CHEMSTR= <none>
##$CNST= (0..31)
1 1 145 1 1 1 1 1 1 1 1 1 1 1 1 1 1 1 1 1 1 1 1 1 1 1 1 1 1 1 1 1 
##$CPDPRG= <>
##$CPDPRG1= <>
##$CPDPRG2= <>
##$CPDPRG3= <>
##$CPDPRG4= <mlev>
##$CPDPRG5= <mlev>
##$CPDPRG6= <mlev>
##$CPDPRG7= <mlev>
##$CPDPRG8= <mlev>
##$CPDPRGB= <>
##$CPDPRGT= <>
##$D= (0..31)
0 1.2 0 0 0 0 0 0 0 0.06 0 0.03 0 0 0 0 0.0002 0 0 0 0 0 0 0 0 0 0 0 0 
0 0 0 
##$DATE= 1649398963
##$DBL= (0..7)
120 120 120 120 120 120 120 120 
##$DBP= (0..7)
150 150 150 150 150 150 150 150 
##$DBP07= 0
##$DBPNAM0= <>
##$DBPNAM1= <>
##$DBPNAM2= <>
##$DBPNAM3= <>
##$DBPNAM4= <>
##$DBPNAM5= <>
##$DBPNAM6= <>
##$DBPNAM7= <>
##$DBPOAL= (0..7)
0.5 0.5 0.5 0.5 0.5 0.5 0.5 0.5 
##$DBPOFFS= (0..7)
0 0 0 0 0 0 0 0 
##$DE= 6
##$DECBNUC= <off>
##$DECIM= 32
##$DECNUC= <off>
##$DECSTAT= 4
##$DIGMOD= 1
##$DIGTYP= 9
##$DL= (0..7)
0 120 120 120 120 120 120 120 
##$DP= (0..7)
150 150 150 150 150 150 150 150 
##$DP07= 0
##$DPNAME0= <>
##$DPNAME1= <>
##$DPNAME2= <>
##$DPNAME3= <>
##$DPNAME4= <>
##$DPNAME5= <>
##$DPNAME6= <>
##$DPNAME7= <>
##$DPOAL= (0..7)
0.5 0.5 0.5 0.5 0.5 0.5 0.5 0.5 
##$DPOFFS= (0..7)
0 0 0 0 0 0 0 0 
##$DQDMODE= 0
##$DR= 18
##$DS= 0
##$DSLIST= <SSSSSSSSSSSSSSS>
$$ [...]
##$SUBNAM2= <"">
##$SUBNAM3= <"">
##$SUBNAM4= <"">
##$SUBNAM5= <"">
##$SUBNAM6= <"">
##$SUBNAM7= <"">
##$SUBNAM8= <"">
##$SUBNAM9= <"">
##$SW= 18.05172834244
##$SWIBOX= (0..15)
0 0 2 0 0 0 0 0 0 0 0 0 0 0 0 0 
##$SW_h= 3612.71676300578
##$TD= 16384
##$TD0= 1
##$TE= 0
##$TE2= 300
##$TE3= 300
##$TEG= 300
##$TL= (0..7)
0 120 120 120 120 120 120 120 
##$TP= (0..7)
150 150 150 150 150 150 150 150 
##$TP07= 0
##$TPNAME0= <>
##$TPNAME1= <>
##$TPNAME2= <>
##$TPNAME3= <>
##$TPNAME4= <>
##$TPNAME5= <>
##$TPNAME6= <>
##$TPNAME7= <>
##$TPOAL= (0..7)
0.5 0.5 0.5 0.5 0.5 0.5 0.5 0.5 
##$TPOFFS= (0..7)
0 0 0 0 0 0 0 0 
##$TUNHIN= 0
##$TUNHOUT= 0
##$TUNXOUT= 0
##$USERA1= <user>
##$USERA2= <user>
##$USERA3= <user>
##$USERA4= <user>
##$USERA5= <user>
##$V9= 5
##$VALIST= <valist>
##$VCLIST= <CCCCCCCCCCCCCCC>
##$VD= 0
##$VDLIST= <DDDDDDDDDDDDDDD>
##$VPLIST= <PPPPPPPPPPPPPPP>
##$VTLIST= <TTTTTTTTTTTTTTT>
##$WBST= 1024
##$WBSW= 4
##$XGAIN= (0..3)
0 0 0 0 
##$XL= 0
##$YL= 0
##$YMAX_a= 759576
##$YMIN_a= -1084124
##$ZGOPTNS= <>
##$ZL1= 120
##$ZL2= 120
##$ZL3= 120
##$ZL4= 120
##$ABSF1= 10
##$ABSF2= 0
##$ABSG= 5
##$ABSL= 3
##$ALPHA= 0
##$AQORDER= 0
##$ASSFAC= 0
##$ASSFACI= 0
##$ASSFACX= 0
##$ASSWID= 0
##$AUNMP= <proc_1d>
##$AZFE= 0.1
##$AZFW= 0.1
##$BCFW= 1
##$BC_mod= 2
##$BYTORDP= 1
##$COROFFS= 0
##$CY= 11.3945322036743
##$DATMOD= 1
##$DC= 2
##$DFILT= <>
##$DTYPP= 0
##$F1P= 2.36226072786647
##$F2P= -0.459571619588291
##$FCOR= 0.5
##$FTSIZE= 0
##$FT_mod= 4
##$GAMMA= 1
##$GB= 0.15
##$INTBC= 1
##$INTSCL= 1
##$ISEN= 128
##$LB= 0.24
##$LEV0= 0
##$LPBIN= 0
##$MAXI= 10000
##$MC2= 0
##$MEAN= 0
##$ME_mod= 0
##$MI= 1.114404
##$NCOEF= 0
##$NC_proc= 0
##$NLEV= 6
##$NOISF1= 3.799351
##$NOISF2= 2.8
##$NSP= 1
##$NTH_PI= 0
##$NZP= 0
##$OFFSET= 15.70392
##$PC= 1
##$PHC0= -18388.24
##$PHC1= 12.00078
##$PH_mod= 1
##$PKNL= yes
##$PPARMOD= 0
##$PSCAL= 0
##$PSIGN= 0
##$REVERSE= no
##$SF= 200.130013532006
##$SI= 16384
##$SIGF1= 3
##$SIGF2= 2
##$SINO= 400
##$SIOLD= 16384
##$SREGLST= <1H.CDCl3>
##$SSB= 0
##$STSI= 0
##$STSR= 0
##$SW_p= 3612.71676300578
##$SYMM= 0
##$S_DEV= 0
##$TDeff= 0
##$TDoff= 0
##$TI= <>
##$TILT= no
##$TM1= 0
##$TM2= 0
##$TOPLEV= 0
##$USERP1= <user>
##$USERP2= <user>
##$USERP3= <user>
##$USERP4= <user>
##$USERP5= <user>
##$WDW= 1
##$XDIM= 8192
##$YMAX_p= 0
##$YMIN_p= 0
$$ End of Bruker specific parameters
$$ ---------------------------------
##NTUPLES= NMR FID
##VAR_NAME=  TIME,          FID/REAL,        FID/IMAG
##SYMBOL=    X,             R,               I
##VAR_TYPE=  INDEPENDENT,   DEPENDENT,       DEPENDENT
##VAR_FORM=  AFFN,          ASDF,            ASDF
##VAR_DIM=   8192,          8192,            8192
##UNITS=     SECONDS,       ARBITRARY UNITS, ARBITRARY UNITS
##FACTOR=    0.0002768,     1,               1
##FIRST=     0,             0,               0
##LAST=      2.2672688,     0,               0
##MIN=       0,             -1084124,        0
##MAX=       2.2672688,     759576,          0
$$ Real data points
##PAGE= N=1
##DATA TABLE= (X++(R..R)), XYDATA
0 0 0 0 0 0 0 0 0 8 -8 8 -16 16 -24 32 -40 49 -64 80 -96 115 -137 168 -195 233 -273 321 -370 427 -495 571
30 571 -652 740 -843 955 -1077 1215 -1364 1530 -1710 1909 -2125 2361 -2618 2900 -3209 3546
46 3546 -3912 4314 -4755 5237 -5770 6357 -7007 7729 -8536 9449 -10485 11674 -13051
59 -13051 14673 -16612 18984 -21958 25815 -31035 38525 -50235 71205 -120081 464793 -224686
71 -224686 -1053414 411475 475834 -164065 -173532 -56572 78871 413686 -271837 -560076
81 -560076 362943 474373 -309513 -118038 37278 -189167 232938 230782 -467110 39726
91 39726 522350 -366278 -423424 503581 156151 -363275 114158 111522 -219339 85358 65232
102 65232 -100484 235881 -4628 -429103 168470 366615 -264984 -102086 235674 -138117
112 -138117 -37849 177549 -261563 -20352 503380 -205893 -544156 331775 349294 -311581
122 -311581 -87639 157977 -50649 26921 -30068 -157096 219812 155845 -332424 -10368
132 -10368 264497 -188941 -44703 312046 -178017 -238614 304139 17255 -282062 206679
142 206679 163312 -269549 -18670 152253 -72549 20838 47051 -111167 79568 48900 -238838
153 -238838 90478 292455 -214586 -191907 237779 -10648 -158678 163632 13254 -163306
163 -163306 142005 40437 -229599 98265 215992 -132882 -100361 64039 -15136 60273
173 60273 40709 -151387 57532 171867 -194561 -121528 245528 21643 -168944 67962
183 67962 6234 -103106 125049 39369 -176001 76544 143668 -167263 -88283 153371 54360
194 54360 -44883 -61531 -66248 115017 105103 -181987 -48691 235548 -29285 -216332 75477
205 75477 123456 -55202 5520 -3817 -90955 64889 87723 -104215 -31705 99861 -17171
216 -17171 -63595 786 -175 54074 42368 -110116 -36771 121431 -23692 -89656 94512 37065
228 37065 -115686 18229 80518 -49086 -15278 56312 -16616 -26083 9051 -17456 24383 50503
240 50503 -44460 -43957 35239 3111 -7314 28033 -32332 -26004 61916 -16597 -86073 53046
252 53046 84084 -63775 -62601 42726 26647 -14995 -862 1012 5386 2831 -21289 4544
264 4544 31308 -7219 -9167 16400 -20995 -20011 42062 17764 -38120 -734 19992 -23348 -7305
277 -7305 31356 -2996 -25504 5252 7443 -15395 -7651 19443 19328 -21058 -34769 15272 36045
290 36045 -12696 -23743 21438 15267 -26171 -7923 25171 9151 -4851 -786 -8491 -7649 13278
303 13278 16313 -7751 -15105 6073 7409 -14470 -7656 19294 10238 -21700 -16279 12123 6900
316 6900 -8683 4632 8393 -13023 -12844 11878 12822 -7156 -3075 11027 -1922 -14091 4915
329 4915 18064 3701 -9261 -2991 2093 -2584 3969 10501 -3857 -11392 2497 3254 -9823 -524
343 -524 14530 -1870 -18236 -3945 8571 2446 -2219 -1934 1470 -457 -9260 976 15217 -25
357 -25 -9088 6611 821 -10752 11580 15545 -14183 -4838 14668 -7703 -8835 14565 1731 -7065
371 -7065 3946 -10598 -8169 18883 427 -18601 7462 2494 -16615 11129 8168 -21691 11347
384 11347 20112 -30820 -7794 35162 -6567 -14899 18167 -10027 -12509 29329 -1826 -24345 23335
397 23335 6984 -28634 17022 11935 -29891 19611 23635 -44979 -4154 38371 -21431 -8908
409 -8908 27963 -32392 -16192 52627 -16035 -48005 40044 20366 -37078 10659 1657 -20934
421 -20934 49077 7877 -76981 26529 71185 -49440 -30000 48744 -9705 -11779 27600 -39162
433 -39162 -10247 73515 -29954 -68615 61043 22647 -64674 25960 27074 -48515 23154 21511
445 21511 -61776 31172 57678 -79221 -16703 90004 -32733 -54933 53585 -133 -17957
456 -17957 44692 -51537 -44049 120289 6956 -139250 42215 104770 -58096 -39731 20337
467 20337 -12727 56964 17748 -134027 18848 157255 -71153 -118929 87478 38679 -51198
478 -51198 23747 -29261 -35020 105753 -6893 -132191 66694 95053 -91606 -14223 62479
489 62479 -49111 16050 57876 -90000 -568 118951 -77035 -82461 122729 7122 -104831
500 -104831 52382 33417 -54909 39748 -12203 -72682 103595 37089 -166810 33806 155934
511 155934 -92359 -84421 88000 1888 -16181 37226 -82141 -6207 151350 -63628 -142977
522 -142977 124639 70902 -121115 21314 50328 -65265 52490 35856 -123423 42823
532 42823 120274 -114580 -52969 121439 -33268 -60990 69557 -37255 -32554 105499 -63956
543 -63956 -106573 153013 41255 -180724 39056 132407 -72035 -40425 31271 -26921 69359
554 69359 34890 -163909 23007 202118 -93373 -157026 121568 65415 -73688 10447 -31716
565 -31716 -25066 133024 -27845 -178017 95679 139348 -127496 -54520 82669 -21475 15592
576 15592 33644 -116628 21577 160703 -100088 -125551 143039 46330 -109120 23791 20868
587 20868 -27184 75642 -33878 -117498 124436 89214 -179584 -14616 162550 -47784 -84613
598 -84613 47794 -6567 14848 49478 -107141 -29250 164452 -36317 -156354 88345 84180
609 84180 -86483 2631 21162 -49835 72249 34946 -135657 27881 137244 -81566 -76094
620 -76094 87858 1563 -31717 41030 -49558 -21758 108465 -42872 -109266 104785 52894
631 52894 -121662 16469 75934 -55120 -2096 31394 -56466 34520 60648 -102625 -15713
642 -15713 127313 -43766 -94750 73660 30211 -46459 25057 -19623 -30765 89888 -7417
653 -7417 -116124 61873 91066 -86389 -32331 61879 -18577 -352 28328 -64950 2678 93224
665 93224 -52847 -76389 77833 25875 -61407 16015 7797 -24024 47046 -7240 -71892 54775
677 54775 56403 -83181 -10899 75329 -26660 -30306 35659 -17517 -5630 43709 -38133 -31407
689 -31407 68888 -4315 -65031 34945 29802 -39923 10318 10486 -34066 30797 22315 -63176 8241
702 8241 61886 -38242 -34251 43003 -1436 -18872 22014 -16894 -14402 44990 -9098 -45638
714 -45638 34993 26132 -38792 3742 20803 -18757 11343 12853 -34633 9633 36984 -32421
726 -32421 -21325 37436 -2615 -25852 14638 639 -12747 17832 -5872 -22948 23057 10431
738 10431 -29196 7419 19647 -16521 -247 13568 -13381 2750 18360 -16293 -7567 24320
750 24320 -5817 -17942 16294 5090 -14088 5772 2595 -8601 8147 158 -14413 8900
762 8900 9187 -16489 -2143 13719 -6306 -6126 7002 -4163 -1469 10102 -5802 -7951 12025
775 12025 3389 -9824 2814 5834 -2089 1710 953 -4375 4067 4825 -6286 -1312 5336 -2869 -2217
790 -2217 3424 -3617 -2871 4935 -916 -6474 824 2653 -1721 -1555 -233 -621 1820 1645 -2667 -894
806 -894 3141 1641 -119 -966 -249 4104 2427 -3637 -2003 4549 2892 -3536 -2786 3166 2014 -2818
822 -2818 -2682 375 1515 -762 -2637 -1330 197 1039 -188 -2842 -1531 2781 1147 -3059 -1535 4243
838 4243 2081 -2663 -257 2839 1340 646 -276 -299 1616 959 -426 870 -545 -1535 2643 1119 -5509
855 -5509 -1023 5083 -2455 -4851 2745 -667 -3361 3867 -495 -5881 3107 4283 -4125 -862 2467
870 2467 -952 3287 2417 -7637 2753 10032 -6144 -4859 9274 -1697 -4504 8210 -3108 -8822
884 -8822 10198 3100 -13256 3368 7753 -9028 -240 5652 -8496 918 7831 -10048 -664 11401
898 11401 -11092 -4020 17983 -7803 -14801 17959 5667 -16471 7113 7263 -10461 10128 5614
911 5614 -20573 8207 20722 -18592 -8720 17355 -5685 -3987 10352 -15910 -3568 27986 -14018
924 -14018 -26860 26671 9553 -28129 9315 11922 -19283 11524 11578 -27671 9038 27442 -25855
937 -25855 -9488 30411 -9119 -14456 18719 -7966 -6218 25479 -19548 -23077 44939 2493 -52949
950 -52949 21572 37344 -33602 -11628 19746 -10437 8232 10949 -38459 5741 48657 -29887
962 -29887 -35278 39183 6760 -23498 17126 -10772 -17422 46675 -2712 -59365 32816 46194
974 46194 -46265 -13463 34626 -12609 137 16201 -36533 6509 51880 -40355 -38199 58524
986 58524 4461 -48807 21038 12364 -21515 23951 -8957 -40349 50359 24996 -77419 10552
998 10552 72420 -39604 -37811 41766 -635 -9249 20733 -34063 -6887 64734 -25308 -60930
1010 -60930 52596 28051 -50829 11825 14800 -32147 35006 16814 -73129 20391 74117 -55760
1022 -55760 -44111 60326 3790 -31334 15811 -15642 -1101 50373 -38302 -50699 77069
1033 77069 19464 -84854 22525 56862 -40784 -6919 22800 -30235 24797 34261 -70923
1044 -70923 -4440 87372 -35551 -66158 53174 21350 -34706 13722 -15192 -18230 63076 -13031
1056 -13031 -83292 52231 62456 -70371 -18414 49526 -16749 2041 21669 -54270 9556
1067 9556 80730 -50934 -65942 75204 27909 -60674 5724 16633 -7299 31289 -24513 -53927
1079 -53927 67819 37931 -95189 530 83440 -35672 -41109 37728 -10016 -5606 35909 -43447
1091 -43447 -25631 76380 -8873 -72989 39215 38218 -38574 5309 5497 -25334 45111 12627
1103 12627 -79925 25892 80158 -58893 -46028 62714 3160 -30850 19009 -18873 -8302
1114 -8302 54581 -27215 -60144 58504 32565 -65195 2095 36989 -20447 7127 6424 -41412
1126 -41412 31267 45641 -66361 -19469 77531 -14878 -54841 34863 15365 -22875 19172 -10490
1138 -10490 -26450 46772 6648 -60488 22582 44003 -38206 -10287 24346 -18490 10124 21197
1150 21197 -47842 206 63837 -32715 -52081 51434 21117 -43911 6745 13705 -11751 20860
1162 20860 -5897 -36548 34626 28622 -50243 -2523 43156 -18502 -13658 20299 -18373 -95
1174 -95 34792 -30714 -28704 50452 4830 -49490 15377 26620 -20046 -715 3719 -14498 20658
1187 20658 9222 -37849 8913 36693 -25962 -17195 28995 -5650 -11732 19163 -12608 -13137 32186
1200 32186 -4004 -34216 22285 21241 -27715 -2481 17284 -8562 1367 3777 -17030 10526
1212 10526 17503 -26166 -6385 28587 -10106 -18504 17930 -126 -13338 15425 -1217 -18514
1224 -18514 17241 11118 -23112 2110 18370 -8551 -4533 6443 -5213 5080 6968 -15345
1236 -15345 1023 18887 -11338 -13316 16872 917 -15176 8441 4309 -12259 6056 6255 -12212
1249 -12212 1680 9425 -7624 -2977 6652 -2646 -455 3683 -5192 1613 9362 -7715 -5631 13248
1263 13248 -695 -11353 7145 6033 -8399 1029 5572 -5115 -868 5078 -3122 -2909 2982 -509
1277 -509 -1666 688 -2797 1026 3409 -5110 -2500 7144 -1271 -6565 4686 4220 -5241 43 5201
1292 5201 -2073 -2248 3687 1229 -2411 506 1807 590 -1256 -1244 1845 1227 -3209 -512 3361 -2046
1308 -2046 -3646 2326 1591 -4081 -808 3811 -1268 -3417 1763 2459 -1997 -1879 2379 1890 -1625 -839
1324 -839 2890 897 -2136 302 2993 -806 -2257 2039 1460 -2853 -287 2446 -1210 -2071 897 1065
1340 1065 -1581 -1395 661 315 -1075 -1046 855 595 -1668 -107 2695 -1009 -2345 2931 1250 -3062
1356 -3062 1231 3217 -1821 -734 2882 -464 -1774 2081 594 -1504 52 -453 -176 865 -3153
1371 -3153 -967 4450 -2165 -5508 4393 2808 -6703 202 5097 -3543 -2073 4332 -1709 -1272 3738
1386 3738 -2242 -1147 5395 -2026 -3061 5817 -302 -4604 5193 478 -6623 5639 3440 -9960
1400 -9960 2194 8743 -8283 -3506 7634 -3614 -2682 5207 -5718 -3121 10339 -4341 -9816
1413 -9816 9903 3332 -9808 4060 3657 -6475 6802 3122 -12857 6924 13378 -14577 -4838
1426 -4838 16618 -4121 -9377 8267 -1754 -4170 9457 -6803 -9758 16654 592 -20162 9401
1439 9401 11584 -14996 459 8984 -10730 5000 10245 -18073 -349 22826 -11741 -15080 18253
1452 18253 2010 -11259 9449 -3747 -8606 20296 -1973 -26357 17134 19219 -24550 -4172
1464 -4172 18177 -7753 -1660 7040 -16818 4986 23905 -22837 -17707 32352 1117 -27612 11923
1477 11923 9702 -11900 9554 -2234 -18163 22693 11350 -34447 5842 31562 -19190 -13270
1489 -13270 19816 -6588 -2957 16462 -20343 -9452 35785 -9286 -34619 24299 17249 -25124
1501 -25124 2980 6880 -13001 17557 3996 -36663 16258 36471 -35143 -19390 36759 -1412
1513 -1412 -19128 11397 -7132 -1265 27162 -20339 -27447 41435 11927 -45105 9779 29298
1525 29298 -18991 -2154 9150 -19190 15130 21163 -39479 -5677 46188 -16322 -33236 25483
1537 25483 7098 -15817 12869 -11077 -15371 37575 -819 -48132 23755 37315 -34896 -12333
1549 -12333 25392 -6915 2069 9221 -29676 9201 42521 -33392 -32760 46791 9548 -38102 9757
1562 9757 11419 -11076 17332 -9022 -31290 34735 22123 -50794 -1128 43929 -18058 -19204
1574 -19204 17742 -8937 2252 23352 -30333 -15766 49448 -5327 -46088 24258 24739 -24140
1586 -24140 1768 4319 -14517 24809 7368 -45287 13703 45532 -33339 -26930 35236 2215
1598 2215 -17265 9419 -12404 -2876 33574 -19344 -36321 39425 19668 -43278 2177 26949
1610 26949 -13108 1347 5840 -22834 17554 27199 -39206 -11551 45398 -8335 -30853 18712
1622 18712 5669 -10104 14879 -13233 -18793 35488 4722 -44386 14701 32298 -25332 -10555
1634 -10555 16966 -8667 5447 11397 -28574 2100 38066 -20812 -29457 31722 10656 -24814
1646 -24814 6373 5424 -8514 17370 -3515 -27517 22864 21773 -33980 -5189 29368 -9795
1658 -9795 -11849 11095 -9339 996 19255 -20165 -15435 31920 542 -30114 12530 14183 -14076
1671 -14076 3725 2127 -13374 16497 9595 -28110 4623 27790 -16136 -14881 18484 -518
1683 -518 -7276 9349 -9215 -5493 21810 -6827 -22644 17927 12011 -20952 944 11393 -8438
1696 -8438 2887 4476 -14632 6642 15881 -17819 -7792 20981 -3282 -13375 10012 1406 -5993
1709 -5993 9330 -3324 -10586 14452 4897 -17377 4531 13010 -9734 -2279 7160 -6331 1853
1722 1853 7856 -11561 -2578 15010 -5941 -11892 9963 3275 -8790 3230 1005 -5512 6679
1735 6679 960 -10705 6363 8368 -9839 -1209 9294 -3929 -2306 5196 -3685 -1176 7418 -4106
1749 -4106 -5352 8409 824 -7990 4019 3364 -5272 1668 1861 -4740 2648 3202 -6247 -310 5655
1764 5655 -3386 -2873 4357 -1303 -2027 3413 -1637 -2461 4796 312 -4473 2992 3082 -3090 555 2284
1780 2284 -1331 674 1558 -2377 417 2608 -2607 -1655 3009 -907 -2432 1696 120 -1958 838
1795 838 106 -1736 1053 369 -1421 606 1358 -1296 -18 1640 -683 -363 1500 -307 -307 1413 -310
1812 -310 -635 1098 17 -643 398 475 -995 -199 307 -793 -228 258 -466 -270 3 -597 -131 275 -760
1831 -760 -63 1096 -253 -772 992 808 -746 352 1089 -27 -124 513 171 321 1 -471 1071 319
1849 319 -1345 108 1299 -911 -1239 954 44 -1454 54 279 -449 325 -302 -979 1379 230 -1894
1866 -1894 1044 1713 -1327 363 1912 -872 -195 1732 -955 -631 2516 -577 -1879 2028 -189 -2461
1882 -2461 1823 232 -2823 1290 1271 -3382 -132 2706 -2541 -874 2195 -1780 -200 2461 -3022
1897 -3022 -1282 5576 -2156 -4628 5222 1909 -4857 1480 2859 -2318 1424 1348 -3833 3025 3677 -6671
1913 -6671 -538 6780 -4085 -3524 5056 -2148 -2953 5262 -2570 -5418 6798 919 -8200 3325 4965
1928 4965 -6022 1110 3294 -5155 3356 5169 -8940 90 10976 -5553 -6679 8489 382 -5227
1942 -5227 4449 -2086 -4071 9127 -1587 -12053 8456 8092 -12471 -870 8887 -4986 -1089
1955 -1089 3905 -7228 2197 10202 -10960 -6575 15579 -1409 -12471 7986 3545 -6758 6513
1968 6513 -388 -10025 11140 6164 -16543 2838 14802 -9425 -5487 8683 -4384 -288 8343
1981 8343 -12037 -4233 19064 -6261 -18022 13573 8485 -13751 1975 4429 -6280 8236 1471
1994 1471 -16934 9328 17104 -18306 -7780 19208 -2544 -9463 7474 -4018 -1843 14360 -10309
2007 -10309 -13861 21021 5414 -22801 5674 13827 -10591 -44 4144 -11192 9041 11408 -21882
2020 -21882 -2622 24737 -9166 -16954 13868 2659 -7035 7925 -7363 -7605 21703 -1736 -25740
2033 -25740 14523 19726 -19967 -5078 14587 -4731 1005 4794 -15883 5310 21767 -19017
2045 -19017 -15722 25192 2613 -20167 6973 4577 -7356 10371 -4543 -18056 19194 12805
2057 12805 -27708 -36 24147 -9481 -9812 9625 -4811 2884 12780 -18049 -7319 28434 -4350
2070 -4350 -25800 15024 12822 -14471 1981 2034 -9152 14443 3398 -26283 8970 24666 -20444
2083 -20444 -13898 20229 -233 -8901 5915 -7803 -486 19784 -12555 -19894 24374 9307 -25143
2096 -25143 3693 14628 -8750 2048 3165 -13978 10737 15211 -23720 -6278 26713 -5911
2108 -5911 -18017 10545 2544 -5125 8458 -9174 -10280 22005 994 -26689 10463 19002 -16218
2121 -16218 -5342 10800 -5372 3431 7186 -17074 1960 22775 -13144 -16709 19764 5004
2133 5004 -14382 4567 1733 -4419 11609 -4358 -17423 15881 12210 -22750 -1660 18451 -7784
2146 -7784 -6686 7295 -6258 968 11534 -12969 -8586 20016 -910 -17849 8675 7921 -8127
2159 -8127 3514 71 -8221 11983 5445 -19276 4315 18187 -11718 -9634 12613 -302 -5186
2172 -5186 5450 -6022 -2862 13291 -5592 -14130 12468 6966 -13700 1318 6441 -5649 3199
2185 3199 2233 -10339 5652 11042 -12987 -4871 15047 -2461 -9209 6814 967 -3561 6256 -3400
2199 -3400 -6859 10341 2094 -11947 4218 7792 -7333 -642 4392 -5200 2201 5663 -9819 -1195
2213 -1195 11689 -4736 -8560 8204 2781 -6329 2294 1151 -2753 5125 -260 -7291 5536 5385
2227 5385 -8142 -105 6775 -3619 -1374 4314 -3611 -694 6244 -4057 -4959 6768 772 -6614
2241 -6614 2151 2689 -3241 1076 652 -3450 2551 1983 -5547 705 4701 -3869 -1540 4299 -1498 -1286
2257 -1286 3736 -1645 -2186 4399 42 -4646 2558 2648 -2937 9 1475 -1514 819 414 -2691 1364
2273 1364 2064 -3587 -918 3234 -1595 -2494 2372 53 -2266 1782 563 -2153 1409 1453 -1456 85
2289 85 1476 -822 -20 784 -643 591 1210 -1517 -119 1845 -1076 -1372 1521 -266 -1552 903
2305 903 442 -1585 26 1002 -891 -496 529 -566 -475 367 210 186 83 -658 500 853 -674 -336
2323 -336 1759 -81 -1213 1002 790 -1091 -272 1045 -281 -701 40 -39 -219 -250 -353 217 90 -916
2341 -916 119 488 -708 -453 855 146 -952 632 614 -572 359 696 -447 -46 1085 -144 -157 385
2359 385 -276 296 368 -409 229 659 -909 -352 1174 -665 -1230 1103 197 -1660 766 917 -1317 -310
2377 -310 1226 -646 -1003 1095 -36 188 667 -1152 187 1813 -1287 -1323 2739 -70 -2724 1571
2393 1571 1435 -1980 221 997 -1990 244 1650 -2048 -454 2097 -1210 -1280 1708 -1251 -1037 2288
2409 2288 -1729 -2180 3616 113 -3893 2070 2336 -2828 805 1900 -2256 1214 2180 -3685 -75 4522
2425 4522 -2644 -2485 3847 -194 -2577 2098 -1079 -1942 4043 -1470 -5069 4239 2669 -6221 614
2440 614 4428 -3371 -385 3062 -3403 120 4807 -4264 -2625 6444 -650 -5113 3436 940 -3026
2455 -3026 3565 -919 -5144 6025 2871 -8696 1605 7624 -5234 -3068 4312 -1921 -552 3896
2469 3896 -5220 -1851 8742 -3341 -7968 7195 3253 -6974 1712 2052 -4040 4221 1141 -8252
2483 -8252 4921 8141 -9002 -2998 9268 -2241 -4488 4240 -2711 -1418 7379 -5331 -7082 10416
2497 10416 2270 -11333 3360 5933 -5443 773 1817 -5904 5305 5863 -11610 -708 13312
2510 13312 -5368 -8705 8486 1383 -4188 4192 -3062 -3542 10794 -1429 -12904 8124 8628 -10933
2524 -10933 -1494 7392 -3848 672 3375 -9074 2293 11429 -10387 -8109 13426 666 -10489
2537 -10489 4366 2038 -3629 6311 -2710 -9130 11119 6036 -15211 1276 12767 -6181 -4473
2550 -4473 5456 -3533 1715 7129 -10431 -3737 15513 -3600 -13567 8940 6386 -8434 1429 1087
2564 1087 -4998 8255 1454 -14353 5703 13026 -11865 -6423 11580 -1028 -4301 4339 -4629
2577 -4629 -727 11547 -6921 -11178 14051 5267 -14360 2254 8233 -5100 1663 1087 -7856 7143
2591 7143 7967 -14493 -2275 15228 -4527 -10202 7214 990 -3341 5452 -5439 -5553 13362 44
2605 44 -15027 7036 10344 -9371 -2075 5669 -3638 3080 3740 -10953 2149 13726 -9083 -9653
2619 -9653 12413 2101 -8757 3155 706 -3122 7165 -2704 -10607 9943 7025 -13680 -675
2632 -675 10715 -4728 -3550 4136 -4164 1339 7366 -8986 -4473 13083 -1247 -11039 6010 4904
2646 4904 -5846 2470 126 -5313 7470 2531 -11772 3247 10832 -7859 -5427 7583 -1066
2659 -1066 -2444 3467 -4860 -1191 9305 -4587 -8983 9147 4312 -9225 1467 4744 -3473 2564
2673 2564 1214 -6324 4494 6477 -8942 -2232 9622 -2243 -5718 4574 -409 -2439 4540 -3134
2687 -3134 -4656 7478 1083 -8978 2898 5537 -5374 -628 2798 -3425 1730 3176 -6654 -315
2701 -315 7859 -3680 -5534 6130 1490 -4069 2171 49 -2197 4367 -509 -5575 4563 3781 -6332
2716 -6332 -222 5027 -2334 -1097 2688 -2501 -398 3938 -3510 -2546 5286 -559 -4533 2439 1526
2731 1526 -2829 1716 622 -2965 2469 2045 -4547 445 4298 -2902 -1465 3073 -778 -802 2252 -1952
2747 -1952 -1139 3409 -929 -3684 2365 1504 -2883 255 1317 -1368 459 836 -2210 894 1897 -3081
2763 -3081 -651 3002 -633 -1515 1968 -66 -1076 1257 12 -1295 1681 587 -1718 903 1258
2778 1258 -1354 41 1090 -1174 175 1271 -1362 -785 1777 -540 -1834 1208 178 -871 426
2793 426 -29 -860 851 272 -1074 760 951 -1151 123 1377 -516 30 809 -169 -209 892 -326
2810 -326 -317 1026 -283 -933 843 552 -883 -40 653 -532 -366 475 -304 -295 232 -403 76 524 -380 -20
2830 -20 701 -269 -404 562 58 -521 477 927 -319 69 337 -9 194 88 -351 257 236 -572 -354 532
2850 532 -593 -396 547 56 -872 301 306 -346 242 -85 -422 444 311 -671 462 408 -625 -24 649 206
2870 206 113 408 -280 -246 556 -310 -533 931 -5 -1039 637 122 -1202 277 436 -918 273 803
2888 803 -859 -22 782 -853 -217 884 -585 -296 1379 -654 -748 1818 11 -1643 1279 1156 -1225
2905 -1225 29 1002 -680 855 540 -1580 549 1569 -1997 -1151 2267 -469 -1563 1091 -397 -1465
2921 -1465 1504 -334 -1724 1702 1091 -2677 579 1835 -1711 225 1622 -1835 419 2929 -2049
2936 -2049 -1056 3430 -471 -2400 1776 365 -1306 1394 -592 -2416 2914 940 -4281 1057 3455
2951 3455 -2780 -1521 2683 -1183 -483 1719 -2423 -481 4142 -2201 -3373 3909 1215 -3474 1702
2966 1702 1067 -2314 2292 1056 -4370 2260 3835 -4335 -1409 4334 -1243 -1712 2344 -1636 -282
2981 -282 3819 -2943 -3980 5463 854 -6328 2038 3335 -3293 437 1463 -2748 2907 2760 -6020
2996 -6020 269 6586 -3311 -3967 4883 147 -2259 2720 -1920 -2112 5764 -985 -6720 4432 4068
3011 4068 -5921 -276 3201 -2772 818 2035 -5340 1212 6540 -5728 -3988 7474 151 -5306
3025 -5306 2739 1038 -2079 3542 -1388 -5120 6448 3265 -8352 1033 7049 -4108 -2439 3324
3039 3324 -1960 648 3661 -6022 -1831 8532 -2413 -7269 5440 2962 -5040 1295 448 -3291
3053 -3291 4653 503 -8161 3704 7379 -6737 -2972 6794 -1029 -2119 2639 -3031 341 6690
3067 6690 -4566 -6396 8245 2282 -8132 1832 4210 -3294 1057 651 -4932 4199 4393 -8477
3081 -8477 -1061 8876 -2949 -5469 4199 104 -1749 3693 -3271 -3204 8196 -39 -8836 4676 6278
3096 6278 -6024 -1166 3586 -2158 1780 2110 -6546 1661 8006 -5817 -5501 7677 910 -5474 2201
3111 2201 -161 -2065 4825 -1850 -6380 6250 4196 -8342 93 6510 -2759 -1881 2580 -2756 1542
3126 1542 4725 -6012 -2397 8355 -1024 -6812 4352 2699 -3762 1651 -200 -3490 4786 1491
3140 1491 -7832 2016 6780 -5203 -3288 4686 -927 -1366 2241 -3333 -390 5969 -3319 -5541 6270
3155 6270 2265 -6030 1057 3327 -2666 1536 800 -4402 3034 4300 -5983 -1570 6243 -1679 -3447
3170 -3447 2714 -316 -1267 2855 -2879 -3234 5596 343 -6245 2767 3828 -3969 -499 1849 -2118
3185 -2118 1674 2245 -4213 317 5544 -2915 -3212 4446 788 -2556 1417 -295 -1214 3165 -1059 -4134
3201 -4134 3691 2483 -4693 -388 3402 -2043 -1199 1761 -1919 143 2917 -2770 -1974 4063 -297
3216 -297 -3416 2010 1141 -1667 1353 -49 -1859 2528 1405 -3796 608 3342 -2261 -1366 2311 -553
3232 -553 -814 1233 -1422 -543 2336 -1314 -2408 2302 731 -2379 585 1160 -1343 679 422 -1952
3248 -1952 930 1953 -2202 -850 2618 -648 -1341 1387 65 -800 1206 -311 -869 1628 392 -1710
3264 -1710 738 1087 -1546 31 765 -1228 324 1058 -1356 -246 1705 -791 -1436 1373 617 -955
3280 -955 426 121 -488 681 -272 -675 880 779 -1022 283 965 -684 35 740 -487 -291 1172
3297 1172 -597 -750 868 206 -976 262 279 -617 423 -99 -523 107 138 -619 179 348 -496 -88 690
3316 690 -395 -440 764 -107 -504 619 260 -495 267 350 -222 144 124 21 -136 -10 -489 206 -94 -541
3336 -541 15 615 -489 -393 603 -140 -491 429 224 -266 -12 389 -89 58 289 102 516 452 -277 179
3356 179 202 -539 -31 685 -286 -281 501 -96 -599 569 147 -587 72 200 -248 -35 253 -461 175 230 -430
3377 -430 243 546 -631 -44 340 -356 17 766 -333 -373 989 193 -1021 437 665 -738 24 443
3395 443 -359 341 356 -922 487 626 -824 -314 796 -639 -531 759 -302 -742 909 65 -984
3412 -984 903 657 -1000 272 735 -595 196 488 -897 272 1319 -1537 -619 1958 -596 -1510 1186
3429 1186 302 -1135 589 -22 -1217 1407 174 -2155 663 1566 -1801 -454 1294 -436 -132 921
3445 921 -1362 68 2068 -1105 -1595 2191 444 -1876 1029 616 -1262 1267 379 -2331 1072 1598
3461 1598 -2512 -523 1930 -967 -758 959 -958 31 2227 -1713 -1534 3229 16 -3088 1558 1625
3477 1625 -1862 442 688 -1275 1282 1208 -2813 546 3302 -1989 -2009 2422 -343 -1407 1600 -1180
3493 -1180 -1235 3295 -658 -3783 2349 1910 -3543 82 1949 -1562 612 1209 -2576 919 3522 -2898
3509 -2898 -1843 4039 -137 -2675 1856 299 -957 2263 -933 -2817 3501 1716 -4659 898 3413
3524 3413 -2538 -1315 1809 -1441 605 2137 -3315 -665 4620 -1730 -3697 3376 1220 -2814 942
3539 942 376 -1919 2781 636 -4634 2327 4122 -3994 -1404 3861 -721 -1189 1606 -1983 -102 3892
3555 3892 -2976 -3423 4967 1350 -4984 1464 2498 -2064 1061 253 -3002 2634 2382 -4981 -328 5367
3571 5367 -2090 -3021 2755 55 -1209 2159 -1922 -1782 4979 -443 -5275 2900 3228 -3705 -558 2104
3587 2104 -1913 1181 1308 -4186 849 4728 -3798 -3339 4628 337 -3170 1309 -214 -1189 2753 -1288
3603 -1288 -3762 4157 2693 -5332 5 4404 -1819 -1039 1456 -1592 715 2954 -3643 -1581 5073
3618 5073 -964 -4503 2664 1691 -2422 1229 -175 -2282 3058 878 -4921 1312 4342 -3445 -2095
3633 -2095 3246 -968 -581 1497 -2267 -190 4351 -2215 -3538 3977 1437 -3851 840 1977 -1416
3648 -1416 1072 225 -3181 1803 2696 -4200 -1206 4026 -1048 -2361 1688 -424 -525 2052 -1801 -1964
3664 -1964 3521 476 -4004 1669 2651 -2464 -216 1182 -1166 1290 1557 -3036 -54 3824 -1847
3679 -1847 -2551 2718 616 -2113 910 -310 -1149 2392 -491 -2977 2372 1929 -3493 -331 2265 -1391
3695 -1391 -848 1274 -1428 167 2367 -1933 -1240 3067 98 -2290 1567 752 -1202 1260 -9 -1383
3711 -1383 1937 1015 -2657 323 2510 -1565 -1222 1591 -514 -416 722 -1129 -567 1995 -490 -2210
3727 -2210 1529 864 -1969 425 907 -883 547 582 -1511 492 1636 -1579 -686 1870 -410 -1067
3743 -1067 1018 -328 -583 997 -426 -1048 1390 470 -1909 573 894 -978 -35 619 -836 139 795
3760 795 -1318 -252 1524 -636 -1023 791 250 -735 156 103 -455 911 172 -882 688 650 -900 3
3778 3 941 -379 -137 645 -722 -256 810 -602 -623 741 -146 -864 106 494 -381 -85 64 -609 343
3797 343 466 -743 47 753 -74 -369 511 21 -160 438 -50 -210 366 -94 -647 450 287 -603 113
3816 113 -3 -383 66 215 -610 30 553 -405 -319 451 -127 -208 215 275 -158 303 123 -9 321 285 166
3837 166 121 242 -233 21 508 -140 -75 379 -310 -127 467 -217 -253 267 207 -386 204 -67 -265 176 -186
3858 -186 -178 108 264 -127 193 492 -329 63 255 -185 -161 562 29 10 58 106 -23 249 15 -355 217 175
3880 175 -614 -154 179 -412 -156 314 -293 35 584 -451 -386 895 -148 -422 324 187 -438 335 56
3899 56 -597 305 371 -389 -16 298 -279 -80 325 -569 -125 580 -480 -418 1063 -303 -759 412 33 -494
3919 -494 -117 188 -545 655 202 -726 477 681 -604 -61 909 -339 -183 677 -368 -206 1053 -322
3937 -322 -1007 1219 246 -1287 710 597 -519 442 162 -867 415 890 -1313 -304 1087 -522 -523
3954 -523 734 -262 -388 1062 -848 -1161 1673 276 -1350 284 911 -996 -122 636 -699 610 1081
3971 1081 -1604 -94 1986 -738 -1059 1170 -173 -752 848 -310 -701 1276 81 -1702 930 1243
3987 1243 -1821 -222 1395 -698 250 874 -1081 124 2271 -1217 -1157 1955 10 -1354 916 446
4003 446 -941 845 -319 -1763 1599 1147 -2515 30 2292 -1123 -922 959 -715 215 1301 -1554
4019 -1554 -830 2827 -214 -2408 1729 1062 -1470 621 736 -1301 1476 667 -2222 602 2381 -2047
4035 -2047 -986 1989 -436 -869 958 -1106 -538 2061 -1049 -2229 2233 945 -2692 303 1469
4050 1469 -1228 401 522 -1682 1185 2006 -2370 -617 2929 -673 -1839 1477 186 -640 1238 -781
4066 -781 -1261 2396 257 -3151 977 2197 -2013 -496 1466 -1115 141 1080 -2326 -188 2812 -1555
4082 -1555 -2519 2471 933 -1933 692 438 -937 1582 -195 -2770 2021 1901 -2925 -405 2431 -677
4098 -677 -818 1137 -1065 72 1951 -1889 -1334 3013 75 -2755 1020 1102 -1268 622 4 -1521
4114 -1521 1344 1142 -2792 314 2734 -1401 -1468 1823 69 -685 1156 -921 -1031 2463 -600 -2473
4130 -2473 2019 1529 -2515 86 1287 -807 392 564 -1992 708 1876 -2142 -1415 2492 -256 -1752
4146 -1752 993 -52 -748 1519 -568 -1581 2221 866 -2564 647 1872 -1274 -386 763 -988
4161 -988 420 1335 -2170 -106 2424 -1003 -1951 1755 692 -1601 394 109 -963 1088 162 -1837
4177 -1837 792 1286 -1866 -697 1509 -619 -394 941 -831 -140 1752 -900 -1144 2148 488 -1664
4193 -1664 954 686 -1059 492 91 -1029 932 863 -1833 -137 1633 -981 -1044 1033 -142 -397 760
4210 760 -944 -570 1478 -319 -1510 943 799 -1616 6 924 -541 270 608 -1312 309 1373
4226 1373 -1093 -620 1204 -32 -739 691 -128 -558 905 -183 -1060 803 566 -1256 246 734 -706
4243 -706 -477 838 -272 -27 737 -732 -114 1187 -107 -782 901 143 -571 445 127 -542 852
4260 852 277 -846 377 380 -780 -316 663 -95 -307 321 -314 -428 702 -222 -551 742 109 -654 212
4279 212 94 -488 132 70 -431 272 242 -543 10 922 -175 -397 264 32 -86 395 -124 32 498 -36
4299 -36 -906 -157 319 -556 -55 445 -314 67 167 -114 101 518 -342 -270 474 155 -158 227 317 -90 213
4320 213 -138 -160 300 143 -293 -46 300 -307 -78 156 61 -140 248 -512 -278 397 -15 -369 382 60 -104
4341 -104 268 203 -372 92 40 -158 62 450 -417 17 23 -277 76 118 -206 -222 190 105 -341 -110 145 -99
4363 -99 -37 -73 -58 63 107 -509 -162 326 -99 -324 390 -302 158 197 -3 -271 389 56 -190 216 112 -304
4385 -304 216 31 -321 177 2 -19 -132 106 -335 -162 396 -299 -216 542 -322 -323 126 -47 -393 -76 378
4406 378 -491 224 469 -227 353 327 -552 -227 477 -182 75 609 10 -196 99 -90 -385 468 18 -736
4426 -736 377 331 -507 271 298 -235 142 110 -584 96 678 -368 -212 670 53 -155 334 -221 -226 529 100
4447 100 -524 513 442 -860 353 682 -505 -163 143 -428 -18 318 -646 -158 932 -372 -625 688
4465 688 -2 -565 118 157 -647 759 263 -768 396 875 -758 -143 804 -326 46 353 -677 -109
4483 -109 930 -478 -812 1155 198 -935 409 253 -294 430 -48 -1142 531 748 -1037 -154 1164
4500 1164 -775 -450 497 -526 52 755 -504 -537 1395 -46 -1447 956 896 -984 163 385 -610
4517 -610 634 423 -1268 337 1303 -904 -1062 1036 12 -542 474 -94 -475 1238 -630 -1409 1396
4534 1396 834 -1632 262 996 -744 102 412 -858 528 1139 -1205 -697 1858 -246 -986 906 83
4551 83 -469 541 -307 -1088 1538 426 -2004 332 1328 -1070 -489 925 -494 -43 817 -1122 -12
4568 -12 1944 -567 -1258 1524 599 -1210 442 230 -645 692 16 -1599 1032 1242 -1672 -415 1539
4585 1539 -433 -719 524 -778 -139 1107 -1052 -1198 1688 384 -1735 591 1051 -1014 158 201
4601 201 -1065 978 883 -1582 -19 1855 -898 -1253 1279 -166 -488 796 -595 -497 1453 -248 -1752
4618 -1752 1083 1121 -1206 15 877 -715 18 444 -1145 512 1486 -1172 -925 1601 -64 -1161 712
4635 712 -63 -403 1063 -264 -1304 1256 833 -1781 161 1454 -796 -387 743 -525 243 904 -1225
4652 -1225 -120 1469 -643 -1337 1225 496 -1009 155 63 -906 525 390 -1324 722 1333 -1101 -328
4669 -328 1107 -57 -399 561 -543 -204 1205 -443 -1219 1441 535 -1270 556 458 -424 261 73 -778
4687 -778 606 704 -1577 -373 1410 -649 -851 566 106 -157 508 -340 -334 1106 -3 -1243 802 632
4705 632 -1009 121 642 -484 113 559 -842 117 898 -695 -765 871 107 -569 409 16 -196 564
4723 564 -267 -841 687 362 -1103 -73 765 -517 -353 352 -322 425 530 -544 -327 930 -132 -696
4741 -696 481 284 -339 270 32 -278 429 169 -902 154 682 -642 -334 376 -67 -391 479 -319 -151
4760 -151 502 -21 -543 584 -32 -505 144 335 -250 3 -114 -352 227 265 -323 -325 588 -131 -302 442 139
4781 139 -164 142 -33 -271 608 268 -460 121 200 -459 112 407 -215 36 287 -291 104 370 6 -114
4801 -114 488 -150 100 212 94 -112 179 52 -304 190 341 -429 280 302 -343 61 203 -367 -73 311
4821 311 53 -202 189 -37 -176 239 294 -45 14 254 -406 107 168 -141 43 232 -115 7 80 -77 -185
4842 -185 149 52 10 255 9 -283 75 -199 -191 66 311 -74 -239 259 -263 -126 205 -101 234 404 24
4863 24 -272 177 179 -152 218 40 -339 297 158 -130 255 43 -91 -51 -118 -413 -67 56 -111 3 237 15
4885 15 -157 166 40 -272 216 53 -372 236 214 -21 -4 144 -216 -70 47 -81 4 288 -266 -274 438 -60
4907 -60 -144 50 224 -300 232 -196 -285 152 114 -428 61 208 -363 -128 74 -382 53 304 -506 -83 450
4928 450 -12 -417 433 216 -285 274 -165 -356 327 55 -508 -217 366 -274 -132 101 -311 -216 114 -513
4948 -513 -249 655 -195 -582 380 184 -481 200 262 -425 421 146 -558 -31 411 -550 -167 599 -68 -122 613
4969 613 -291 -230 562 -297 -541 476 52 -405 122 450 -349 214 -10 -539 426 341 -610 -72 718 -86
4989 -86 -300 646 -45 -94 529 -396 -803 763 165 -731 346 530 -480 59 338 -443 115 328 -728
5008 -728 -23 707 -574 -415 778 218 -433 351 -197 -339 779 11 -655 616 620 -954 -71 850 -269
5027 -269 43 384 -582 157 771 -818 -538 1125 -88 -933 268 280 -516 625 -156 -756 500 374
5045 374 -1202 54 957 -397 -48 443 -72 -75 507 -521 -330 909 -293 -801 773 440 -636 152
5063 152 426 -564 448 164 -1046 359 862 -660 -624 730 -339 -641 366 -219 -322 662 -470 -655
5081 -655 971 399 -1149 335 805 -293 -124 364 -659 426 831 -1094 5 996 -381 -832 767
5098 767 92 -355 400 -402 -355 929 96 -1087 636 621 -816 -121 701 -547 94 311 -701 88 1114
5117 1114 -515 -802 822 192 -918 429 230 -275 600 -44 -845 723 469 -1315 -190 1283 -324
5134 -324 -668 435 -72 -32 692 -824 -450 869 -113 -890 517 167 -652 285 282 -542 259 455 -1075
5153 -1075 243 1032 -671 -591 611 -26 -321 221 -469 -480 1166 -420 -1111 843 627 -944 -99 416
5171 416 -106 183 104 -678 343 715 -821 -358 1251 -224 -801 367 269 -18 421 -327 -554 621 -1
5190 -1 -572 416 537 -449 -60 569 -438 117 374 -645 47 668 -359 -394 624 186 -482 279 77 -481
5210 -481 504 -145 -661 568 479 -661 24 720 -333 -291 349 -320 -133 459 -426 -324 710 -56 -608
5229 -608 424 174 -293 193 -154 -309 228 278 -669 -50 465 -509 -557 485 70 -318 431 -34 -104 380
5249 380 -180 -398 315 681 -549 91 452 -187 10 164 -283 -19 499 -342 -171 587 -19 -65 188 -146
5269 -146 85 347 27 -304 512 -54 -324 217 569 12 -57 53 -230 -215 483 -158 -101 192 -297 -326 195
5290 195 265 -158 -3 141 81 413 242 -105 26 75 -301 -234 392 -164 -272 44 -270 0 159 114 -186 42
5312 42 -38 -199 -232 316 -189 -32 126 -99 162 118 -184 -170 73 -127 -118 300 -212 -14 209 19 -147 201
5334 201 -103 -236 117 145 -170 -20 203 -219 -32 150 -352 46 253 253 -132 238 183 -201 93 -37 -18 262
5356 262 -112 -196 123 -115 -197 -39 174 -404 89 105 13 -67 56 -97 -356 276 -75 -240 186 43 115 393
5378 393 77 -25 191 205 -44 -12 2 -206 -127 199 14 -8 50 -10 -287 -111 15 -156 107 287 -356 149
5400 149 153 -94 283 110 59 -66 119 -152 -148 -64 -226 103 370 -1 -146 373 -57 -170 210 96 -237 187
5422 187 142 -125 288 246 -214 11 189 83 -258 408 -156 34 86 -44 -268 124 -11 -259 321 391 -57
5443 -57 -82 42 -160 22 4 -82 71 558 -362 -360 49 -137 -177 27 67 24 129 -174 -273 213 64 -337 -20
5466 -20 355 -242 27 220 -337 -82 400 -456 -244 709 -214 -127 160 156 -274 530 -217 -520 308 242 -662 -2
5488 -2 368 -424 -103 141 -212 57 66 -507 -200 607 -383 -244 537 309 -330 59 -129 -330 570 38 -457
5509 -457 196 556 -433 -11 523 -426 -232 299 -82 -20 464 -288 -572 451 -187 -514 81 69 -451 461
5529 461 -84 -467 419 214 -614 -127 679 -148 -438 497 -240 26 380 -284 -188 713 -18 -761 511 145
5549 145 -448 220 144 -337 252 411 -524 251 602 -326 -624 631 -83 -585 231 -200 -369 452 44 -777
5569 -777 665 270 -588 -13 244 -435 -25 240 -410 118 676 -825 -166 876 -28 -469 418 134 -222
5588 -222 278 -2 -341 464 111 -628 -174 589 -574 -232 166 -218 -65 380 -503 -211 782 -282 -423
5607 -423 502 161 -375 198 34 -416 70 -232 -734 473 577 -854 62 574 -143 -307 383 -169 -140 331
5627 331 -201 -275 731 216 -823 222 386 -462 239 299 -586 239 188 -582 225 719 -275 -491 375 180
5647 180 -443 289 -245 -219 584 -63 -700 667 540 -525 49 237 -202 62 375 -424 230 554 -370 -410
5667 -410 880 -188 -463 367 152 -230 190 -37 -526 83 135 -712 177 433 -625 -223 440 -199 -136 310
5687 310 -529 -192 686 -24 -525 445 378 -336 176 75 -355 311 53 -444 1 480 -376 -196 411 -124
5707 -124 -317 327 -105 4 403 -259 -639 353 -7 -598 323 254 -285 143 371 -181 388 271 -433 56
5727 56 586 -282 -188 296 279 -243 221 28 -321 486 -160 -506 119 437 -439 -90 219 -293 156 5 -358
5748 -358 43 292 -369 -48 454 -83 -418 191 183 -77 314 -191 -243 255 284 -174 -146 404 -138 -7 186 18
5770 18 -98 230 -192 23 306 42 -111 224 518 -216 99 140 -240 334 150 -164 -106 166 -227 -1 472
5791 472 76 27 334 -186 67 348 -143 -180 328 87 -358 74 128 -82 74 62 -298 -107 260 -148 4
5812 4 8 -221 -6 135 -49 -95 103 -214 54 195 96 -201 149 197 -131 165 369 116 190 51 -49 146 90
5835 90 142 7 207 -57 -251 -82 -8 -307 -84 22 -515 108 106 -207 88 111 -462 111 245 27 -29 186
5857 186 39 -108 126 84 -138 -61 179 -182 48 138 -245 59 2 -279 -48 37 -126 56 100 -145 -106 476
5879 476 -20 -108 45 184 -106 -22 -32 -128 -19 120 -216 145 -9 -63 204 392 -37 10 92 -8 -237 109
5901 109 95 -219 58 88 -109 186 188 -14 63 -255 -181 156 107 -77 48 231 192 -86 207 -45 51 229 39
5924 39 -161 140 -34 -174 145 -50 -239 95 75 -253 149 113 -587 26 291 -169 -278 -12 87 -213 -17
5945 -17 7 -359 137 15 -380 -61 405 -186 136 65 -149 -164 291 -253 63 133 -304 -68 362 -3 -30 -53
5967 -53 -141 -290 -39 -49 -183 421 17 -526 -48 157 10 18 261 -356 253 335 -248 -78 272 -145 24 285
5989 285 -72 -277 97 0 -454 291 -13 -354 -10 323 -352 -96 454 -57 53 162 -212 63 302 -118
6009 -118 -566 449 -4 -371 -52 63 -50 346 -87 -271 300 286 -516 6 326 -79 -273 117 215 -258
6029 -258 327 -4 -135 558 87 -569 91 415 -478 -42 219 -101 3 307 -323 -101 404 -34 -349 270
6049 270 161 0 176 56 -298 500 4 -427 232 363 -584 12 377 -206 -99 193 -197 -18 310 -367
6069 -367 -198 456 63 -522 440 210 -158 351 11 -406 158 225 -563 315 627 -303 99 278 51 126 328
6090 328 -338 -159 510 -305 -259 398 439 -522 16 194 -314 174 184 -358 225 527 -536 -257 401 -239 -264
6111 -264 231 -48 153 264 -279 -259 531 306 -531 157 130 -416 39 -55 -310 5 10 -494 59 446 -420 -373
6133 -373 368 -45 8 269 15 -336 119 -313 -407 438 361 -640 351 377 -297 33 172 -47 59 458 -339
6154 -339 -280 517 -29 -350 221 107 -434 218 -103 -359 339 55 -509 -78 480 -225 -152 -40 -243 136 185
6175 185 -408 -212 491 -216 -345 98 319 -458 172 227 -13 286 342 -460 205 713 -370 -112 450 -165
6195 -165 -296 250 -154 25 208 -350 -92 335 95 -404 264 174 -331 88 -29 -415 148 263 -340 -23
6215 -23 544 -59 -254 294 147 -256 332 -208 -217 470 -36 -545 231 287 -197 -227 484 -166 -86 26 -285 -6
6237 -6 427 -374 -53 516 -92 -102 -71 199 -107 476 -94 -156 258 223 -667 140 192 -102 -77 270 -51 -75 147
6260 147 -199 -43 419 -38 -184 268 196 -63 -105 122 42 201 372 -197 -16 296 -209 -14 208 -153 -23
6281 -23 48 97 7 339 -39 -226 166 85 -359 -219 259 29 62 229 -149 -80 155 -33 -176 84 -184 -380
6303 -380 238 167 91 244 -139 -135 300 128 -49 72 296 -16 -134 188 -213 142 259 -36 -69 166 -77 -365
6325 -365 13 114 -204 -31 37 -82 -93 -105 -19 359 233 -109 -151 100 57 120 -97 16 -136 454 -115 -140 348
6348 348 12 8 84 -19 -149 282 29 -181 -131 -47 -70 -30 312 38 -33 212 126 -48 228 54 -99 312 -69
6371 -69 -72 165 -41 -150 276 292 -207 -16 133 -22 -145 212 60 208 156 -101 -105 90 -69 -166 -54 -242 -53
6394 -53 51 -22 125 224 28 -263 34 186 69 66 44 301 -170 -52 -130 -78 181 -34 -175 -16 -26 -217 -108
6417 -108 142 -208 41 14 93 101 -88 -286 54 348 -99 -120 -45 96 -129 -148 -49 -171 196 35 -86 19 40
6440 40 -17 58 -115 -87 205 170 -155 143 432 -172 -56 265 34 -231 -20 4 63 64 -43 -96 40 -126 -250
6463 -250 46 209 -135 97 256 -259 30 104 -332 -234 512 -89 -203 74 88 -161 147 -328 -207 21 -112
6484 -112 -130 50 102 -296 -395 189 -30 -61 89 29 -52 383 -251 -186 312 271 -350 264 263 -67 232 -81 17 331
6508 331 236 -314 -51 203 79 -241 238 84 -143 156 -105 -80 202 -109 -266 -22 87 -86 -211 -24 -43
6529 -43 169 82 -328 -169 362 -291 -144 132 -31 -182 159 -42 -302 166 187 -186 283 112 -237 165 283
6550 283 -59 -120 522 -80 -84 303 -317 -370 315 124 -436 469 431 -82 -14 78 -171 12 98 -373 -116 371 -121
6573 -121 -38 299 -124 -81 42 -265 -178 113 -165 -578 257 135 -370 209 9 108 -63 -84 -405 136 185 -160
6595 -160 -15 371 -130 -281 196 47 -243 119 -87 -337 383 30 -257 417 54 -383 60 123 -174 -11
6615 -11 270 -256 -216 369 -175 -349 344 18 -156 284 8 -6 331 117 -244 301 11 -273 169 581 -118
6636 -118 -162 -123 -174 117 406 -129 -222 661 1 -561 269 196 -247 220 -131 -306 327 261 -410 -109 320 -221
6658 -221 -272 50 16 48 171 -217 46 297 221 -227 99 228 -41 49 147 -135 167 76 -211 75 260 -163
6680 -163 -20 380 90 -444 143 -29 88 187 -64 -101 418 261 -162 -48 316 -184 17 -88 -31 80 279
6701 279 -63 195 276 -144 -194 -72 -112 -113 175 -171 -118 421 -185 -338 -48 81 -293 28 14 -141 279 131
6723 131 -8 -155 456 -95 -171 207 -46 -29 90 169 -235 164 -146 -389 146 124 -359 111 257 -123 63
6744 63 207 -62 -17 183 -69 -186 197 1 -278 54 170 -322 -96 -1 242 210 169 -335 215 373 11 -11
6766 -11 38 -28 18 122 -367 130 303 -42 -237 93 279 -346 246 165 166 89 16 -223 112 367 73 -263 -36
6789 -36 -76 -45 223 209 -146 116 -134 1 81 27 -134 148 199 -43 95 -37 -104 6 -66 -113 -146 482 -61 -156
6813 -156 222 -53 -35 -6 106 220 -65 99 -142 -5 75 -167 -100 386 14 -246 42 5 -126 236 -122 74
6835 74 -209 -5 -225 100 -110 -120 120 65 -117 197 81 -72 -218 170 -68 -82 34 40 26 -58 7 -82 17 178
6859 178 145 190 18 -95 147 316 82 195 -11 -165 -299 30 14 36 129 -166 -89 142 -50 -107 174 -85
6881 -85 -229 2 -7 46 53 11 -144 56 257 -48 -244 261 96 -29 24 76 -234 -33 -225 -330 81 -124 -224
6904 -224 241 172 -182 2 95 -134 46 356 -279 136 363 -54 -96 198 5 -149 -19 49 22 -91 205 -316
6926 -316 -24 -10 -278 -100 253 256 84 -69 -79 -63 309 -198 99 215 194 -204 313 -89 -170 112 -28 249
6948 249 127 77 -47 52 42 11 -7 106 -70 -222 235 -115 -239 180 -141 -20 178 50 -140 107 -123 -79
6970 -79 140 -61 -248 121 148 -80 14 18 -96 -68 -52 -51 -158 224 145 -22 246 187 -88 30 55 82 120 47 -223
6995 -223 9 111 -170 -71 342 -102 -246 194 82 -105 150 64 116 358 -98 -210 235 116 -214 -31 184
7016 184 -20 179 85 -291 -54 291 -239 -116 143 42 -262 98 -107 -81 250 -165 -228 -88 294 -408 -16
7037 -16 109 -187 -69 -26 -141 -22 203 227 -65 198 149 -362 431 260 -261 -36 -71 -87 67 27 -224 -26
7059 -26 115 -177 -202 245 -102 96 214 -123 -25 83 -26 -231 251 -96 -214 -49 110 79 -196 -11 -378
7080 -378 94 98 47 -4 217 -78 -3 261 -108 11 110 -124 -111 428 -221 -313 123 42 -202 -48 157 -39 -151
7103 -151 134 -156 37 247 -42 48 299 109 -61 148 -210 -464 179 -71 58 223 156 3 -159 271 -9
7124 -9 202 69 -132 -64 194 -137 -345 243 -162 -274 -144 19 -131 -30 -208 -217 95 -55 -191 134 182 -257
7146 -257 60 250 -105 103 -88 -21 -168 251 -124 -82 228 83 24 9 128 -81 43 3 -218 164 73 -196
7168 -196 -103 348 23 -305 227 -192 123 379 8 -244 230 -42 -48 -89 253 -125 45 232 -88 113 112 -264
7190 -264 -51 78 -5 -128 -49 -74 -160 504 -22 -56 -54 -25 -199 287 -102 -251 251 8 -116 -142 -108 -240 115
7213 115 285 11 -204 259 -43 59 68 108 -138 129 84 -56 56 398 -208 -125 -1 -122 94 138 -31 29
7235 29 389 0 153 277 -15 -112 321 14 -100 -33 197 -74 59 43 -147 188 258 -179 123 233 72 6
7257 6 207 -120 51 41 -257 -375 114 76 -104 407 127 2 21 63 -168 247 234 -140 76 388 -150 17
7279 17 6 -45 -346 92 137 128 192 -132 -31 89 139 -111 -144 27 -79 55 153 -12 142 272 -80 -246 89
7302 89 77 -455 -243 76 -372 186 32 -251 259 107 -180 -104 183 -48 -197 94 -112 6 -138 -96 -326
7323 -326 155 -118 -59 28 233 11 -113 -103 55 -70 -155 -249 -36 109 31 154 -44 56 -219 79 -123 74
7345 74 -60 -24 -260 85 -26 -141 -1 -30 -38 256 111 -79 21 151 -228 126 349 -170 -54 148 -112 -195
7367 -195 128 242 -396 114 -127 -13 271 122 -171 -212 72 -75 112 52 243 -187 384 -210 147 -20 -218
7388 -218 -46 244 179 -107 84 496 -33 161 114 -42 240 50 58 -168 252 13 73 484 89 -171 51 -40
7410 -40 -99 49 -187 -97 -11 128 -81 149 192 -54 117 32 -21 -124 -10 -202 89 30 -344 44 98 -150 -142 55
7434 55 75 -42 35 89 32 -65 147 -49 191 118 -234 -74 246 -45 -308 -4 122 -63 44 304 -174 98
7456 98 -33 -217 5 97 -26 100 331 38 -7 137 -75 16 171 55 -409 355 -3 -161 262 139 -74
7477 -74 -50 79 -206 96 40 188 121 293 -198 -74 324 38 -135 90 -160 -46 -60 299 -399 171 59 -120
7499 -120 28 28 -69 61 58 100 106 225 133 -268 54 -128 -39 347 -122 -275 231 26 -219 -99 -23 -240 120 36
7523 36 -258 21 189 27 -122 -101 -30 144 125 -96 -30 115 33 -259 219 205 140 -115 90 -299 84 106 -53
7546 -53 -10 215 -267 -68 238 57 64 162 -261 -232 377 -305 -60 425 80 -282 -98 53 69 -116 150 -295
7568 -295 34 196 -411 108 192 34 -291 194 -71 128 244 49 7 225 136 -237 79 100 102 91 -13 -93 -22
7591 -22 158 -84 81 81 -114 -28 167 -109 -6 288 -12 -194 90 -42 -253 137 -15 -578 65 184 -96
7612 -96 -62 -132 -82 127 206 -130 -212 40 80 -256 171 -49 -41 178 6 116 312 110 -154 112 43 22 -224 178
7636 178 89 140 -3 -91 -10 226 -153 -294 233 22 -348 11 -268 -121 -91 -94 -315 -21 50 -243 16 194 109
7659 109 47 108 -339 278 295 -168 15 360 3 -141 104 -18 60 45 76 -195 -11 60 -228 -160 210 -174 -334
7682 -334 182 79 -103 224 339 18 78 149 -467 509 271 -6 124 236 15 -29 196 40 40 27 -161 -248
7704 -248 242 2 -317 81 36 -51 184 98 -50 114 35 -175 17 307 -70 -23 156 -11 83 93 81 -110 241
7727 241 89 -145 116 133 -199 119 -76 -304 230 -16 -200 68 260 -90 -204 90 10 49 39 -194 -44
7748 -44 224 -11 -136 320 201 -256 -81 280 -254 102 133 -176 110 -192 153 -90 164 107 -16 19 31 -133
7770 -133 44 8 -146 158 -127 -240 -23 184 72 216 39 -40 192 18 -87 -165 -69 -1 -207 36 -63 7
7792 7 100 117 0 212 -234 -179 -12 28 -66 -76 338 79 -84 129 -69 260 206 -250 -81 352 -1 26 -108
7815 -108 11 -176 -73 239 108 251 10 -142 -40 212 -105 -6 155 27 79 94 -173 -31 117 60 120 97
7837 97 -130 -167 -12 243 -87 -21 121 -69 199 135 -398 191 394 -84 -257 66 99 96 123 170 -43 214 -62
7860 -62 -172 -103 -10 -151 -144 -332 -171 -224 -249 81 -101 188 -54 86 182 70 142 37 16 -93 -98 -143 -100 17 48
7885 48 12 275 252 -146 190 135 258 -65 107 -77 -160 54 51 107 99 57 -228 50 -40 -106 84 25 -17 -220 164
7910 164 -186 -111 -244 208 -4 338 -151 -223 48 137 -172 71 -116 -315 -77 -96 88 89 149 220 -79 126 -99
7933 -99 -168 47 -65 120 85 -93 -383 -120 98 107 51 192 -87 7 164 60 -214 210 -142 -229 108 212 -230
7956 -230 191 -26 5 47 -36 -70 172 149 -47 -1 -66 -16 261 53 -210 181 96 -116 38 44 -104 -90 356 -72
7980 -72 -305 141 -74 -78 183 -1 -268 -13 118 -139 94 -75 -281 49 30 -93 177 150 -210 88 94 8 -246
8003 -246 115 20 137 94 134 -126 69 -7 -141 -92 104 -341 -2 72 -90 111 161 -24 -36 -44 -164 -365 149
8026 149 114 -134 83 64 -89 184 123 -356 297 283 -189 98 248 -128 132 132 -111 188 197 16 50 264 -3
8049 -3 -174 37 176 -76 -99 112 -16 -39 90 -380 -101 139 18 -127 245 150 128 263 44 -7 175 -208
8071 -208 -394 206 125 -335 15 337 -92 35 202 -270 -102 87 32 -39 151 -74 -96 -29 11 -184 -1 -150
8093 -150 -88 139 259 -105 -133 152 -66 -83 -26 129 -271 93 -320 104 258 -182 -133 24 210 52 48 -59
8115 -59 -100 149 -1 -105 32 223 -210 16 299 67 91 210 93 -6 133 -288 -131 150 43 76 -233 -10
8137 -10 24 -46 -99 -297 126 -117 -335 0 254 -63 -162 -98 -154 139 69 -295 -192 -68 29 -324 204 125 -211
8160 -211 -204 -25 182 -105 -74 -165 -31 261 24 -200 161 -151 130 86 -198 -293 196 0 -86 22 61 -39 -74
8183 -74 25 -126 45 126 -226 -198 21 -80
8191h0
$$ Imaginary data points
##PAGE= N=2
##DATA TABLE= (X++(I..I)), XYDATA
0 0 0 0 0 0 0 0 8 0 0 0 8 -8 8 -8 16 -16 19 -24 32 -32 40 -48 56 -68 79 -90 102 -118 138 -155 175 -199 224
33 224 -254 285 -318 354 -394 440 -488 543 -600 661 -731 805 -888 978 -1074 1182 -1303
50 -1303 1435 -1582 1745 -1929 2144 -2386 2662 -2989 3381 -3854 4441 -5191 6181 -7544 9532
65 9532 -12660 18160 -29647 62759 -349765 -1084124 376866 759576 -291869 -298130 76121
76 76121 84597 248738 -164378 -508496 337082 562127 -362701 -307598 187711 -54728 100194
87 100194 254872 -367322 -122042 513205 -215338 -499335 467446 298337 -464297 -15080
97 -15080 236935 -201496 3113 169830 -115204 80768 60168 -359452 88723 433512
107 433512 -226904 -244487 273421 -32275 -152702 190190 -104159 -114802 402749 -94057
117 -94057 -554203 287192 469233 -341540 -214960 244294 -9648 -66330 31797 -107718
127 -107718 120162 172883 -298335 -100232 320352 -91525 -166320 269171 -73933 -299917
137 -299917 259816 140700 -307833 108586 233598 -260722 -86213 230699 -36265 -60708
147 -60708 76890 -82399 7279 96832 -164036 16507 283056 -162526 -263047 238350
157 238350 91904 -212465 99721 88047 -186566 66230 109903 -198668 35153 236645
167 236645 -130919 -165126 110501 37819 -753 46136 -111037 -1211 173726 -126810 -152370
178 -152370 238441 76288 -221352 28075 91330 -96186 67498 81938 -163686 14453
188 14453 164808 -133926 -118144 172857 64533 -108657 -54469 -17930 82661 97005 -148879
199 -148879 -85227 214845 9159 -234866 61719 180086 -70512 -56265 30538 -55739 38083
210 38083 102003 -87146 -61549 108010 2071 -85906 16685 31850 22861 24606 -87446
221 -87446 -49267 119950 9364 -111919 59771 62551 -114691 -9288 103582 -37476 -47575
232 -47575 57234 -5434 -43623 19299 6347 9060 39845 -35254 -50612 45414 27523 -21493
244 -21493 17092 -11705 -32222 48429 6985 -76759 36133 86724 -64388 -77526 53780
255 53780 43023 -30057 -12635 4406 -1706 1010 -13977 168 29239 -5712 -22980 12519
267 12519 -4460 -17367 36175 22380 -41106 -9032 31476 -9749 -11269 31102 2346 -29761
279 -29761 3986 15776 -10559 -6083 16878 10751 -22741 -29909 16530 35700 -14625 -32609 14808
292 14808 17632 -25633 -11396 27254 8902 -15264 -4865 -1625 -1720 14147 14545 -8919 -15346 7569
306 7569 12619 -8105 -5505 18620 9208 -21279 -14368 16582 12392 -10479 -2728 6238 -11825 -12568
320 -12568 11620 12354 -10832 -10104 7242 -1037 -13260 4359 17143 -306 -13922 -3311 6828
333 6828 2269 3166 8835 -2354 -10656 4631 9075 -4517 -638 12747 -830 -17747 -1615 13516
347 13516 2608 -5838 -3865 -1151 -1108 -6380 -687 11489 -1401 -14347 1911 4710 -9174 6183
361 6183 14644 -13147 -10421 16149 -103 -10837 14416 7015 -10730 3237 -363 -5658 17137
374 17137 6142 -20261 3015 10944 -13663 3594 13097 -18763 -964 20980 -23972 -16604 34622
387 34622 -449 -28006 12520 1849 -17608 21882 6911 -28782 14040 18325 -27545 6770
399 6770 24545 -24111 4612 30734 -33672 -14269 46416 -8658 -25655 27137 -12805 -25387
411 -25387 44874 70 -54824 28769 34381 -44226 -5256 21562 -19913 22958 17058 -68194
423 -68194 8504 79292 -40532 -52480 54702 9607 -32871 24104 -12286 -21096 61815 -7331
435 -7331 -75609 49273 49713 -67218 3941 49798 -42860 -2577 39511 -47430 2137 63950
447 63950 -59793 -42016 88743 -10801 -78380 47859 27269 -42798 26151 -14541 -50062
458 -50062 90031 29696 -136036 20352 129436 -54983 -72290 47438 10635 16605 22921
469 22921 -98311 -3078 154193 -46264 -145624 85356 79724 -76928 -3590 12722 -38200
480 -38200 69633 17697 -128095 36717 120185 -86182 -57149 84118 -22823 -26135 62689
491 62689 -55729 -34464 113965 -38032 -107015 108358 47605 -120915 29149 74313 -62025
502 -62025 6848 28670 -64083 58502 61969 -143168 -4253 169990 -69465 -126204 98183
513 98183 39205 -60132 24692 -34131 -30281 123764 -26930 -157364 99907 113390 -131669
524 -131669 -21677 93864 -51065 1886 60932 -94053 1767 133002 -83119 -91692 128140
535 128140 8160 -98751 60205 11877 -61277 77282 -12852 -116955 112056 78452 -178098
546 -178098 22 164027 -65348 -88520 60630 427 15266 39805 -120816 -10749 193905
557 193905 -59146 -187408 117105 114754 -105922 -20749 25978 -25834 87672 5471 -165163
568 -165163 63719 167901 -120053 -100084 113620 10202 -38840 35984 -71475 -13885 147111
579 147111 -62914 -153193 128767 87574 -136173 -5951 69528 -34739 31561 4069 -104714
590 -104714 80433 112823 -158533 -52963 182005 -20645 -127674 57768 36726 -22424
600 -22424 36552 -61610 -47363 142620 -1982 -170282 66252 124465 -97206 -40309 58892
611 58892 -34449 24312 49494 -111140 -6524 144882 -58850 -111811 92743 37676 -65227
622 -65227 27387 -7850 -37658 85894 -6464 -115951 78229 87112 -120154 -16573 105365
633 105365 -42402 -40054 50553 -32662 -2230 65103 -72600 -43581 121349 -16340 -118567
644 -118567 63864 63264 -67566 1446 16167 -34750 57719 16517 -109181 36451 110576
655 110576 -78801 -62380 81518 4439 -33264 30172 -33879 -16628 85554 -27849 -90510
666 -90510 69947 52414 -75612 -2751 36516 -26064 20487 11646 -65726 30064 68087 -73757
678 -73757 -35567 84054 -10912 -55727 36402 5302 -24203 36000 -15424 -40979 57847 15898
690 15898 -70564 23392 50785 -41071 -8239 29078 -25525 10182 32085 -50388 -9104 65831
702 65831 -26148 -51302 43510 14467 -34680 14009 325 -22107 32792 3217 -48869 23515
714 23515 38512 -39745 -10168 32947 -13066 -4555 19504 -24190 -1446 39621 -21140 -30027
726 -30027 37831 9468 -33737 10637 13750 -15661 9576 3749 -23312 14442 17226 -29221 -2235
739 -2235 25312 -14637 -11064 16173 -8322 -6232 17550 -9984 -13753 22139 1305 -21639 13016
752 13016 12638 -15683 2072 10113 -7488 4162 5898 -11975 4779 13174 -13528 -6013 15675
765 15675 -3089 -11057 6610 -182 -5831 6920 -3029 -10715 8993 5301 -12122 -92 8178
778 8178 -2912 -1499 2146 -2914 2487 5807 -4804 -2547 7300 -146 -3203 4331 -467 -2919 5022
793 5022 1143 -6098 1017 4236 -1897 -2628 189 -559 264 514 -3235 -2190 2366 535 -2419 -1321
809 -1321 -339 2316 1707 -3408 -1747 4335 3312 -3337 -2024 4480 3268 -2286 -1464 2187 2565 -190
825 -190 -1928 -321 1420 785 -495 -2438 -1241 2373 614 -3828 -2164 2989 1230 -4139 -1943 2664
841 2664 604 -953 -401 -353 1351 1248 -659 740 796 -274 2322 2398 -3314 -650 5919 -184 -5408
858 -5408 2927 2267 -3816 1823 1108 -5945 1129 4969 -4981 -3379 2989 -1059 -309 1568 -5776 -132
874 -132 9248 -4139 -7562 8534 2350 -7016 6500 1969 -8464 7949 7100 -11829 494 12032
888 12032 -6575 -4158 8298 -4881 -3174 8921 -6558 -5827 11341 -6039 -9301 14438 -2649
901 -2649 -18170 13296 10688 -19003 617 13045 -9698 1830 9777 -15971 1462 22895 -13522
914 -13522 -14878 20572 1842 -11141 9965 -5741 -8113 23491 -4421 -29413 21098 19068 -30136
927 -30136 -273 20899 -17060 -971 16748 -21907 -2705 29195 -19087 -20472 30482 -387
939 -387 -24433 16237 3830 -14476 19248 -4828 -26485 34311 15443 -51298 10641 48410
951 48410 -29794 -24933 29967 -1044 -7326 13303 -24814 -5013 46018 -18767 -45509 36406
963 36406 21291 -35342 6557 7306 -20878 29769 9367 -56191 18170 56064 -42304 -30142
975 -30142 44767 -948 -18325 18900 -18984 -6594 48375 -23223 -47956 53248 22172 -57569
987 -57569 10699 32372 -25500 6528 8565 -36546 29105 35661 -67716 -8965 78587 -28381
999 -28381 -58111 44643 17408 -28700 14309 -12400 -17281 53152 -7741 -66652 42184 47786
1011 47786 -55286 -6475 36822 -25163 10434 29148 -57509 196 78519 -40322 -62393
1022 -62393 62273 22586 -50089 9567 7590 -13246 35428 -17470 -55767 59493 37964 -86269
1034 -86269 2224 75001 -35833 -32317 36843 -14512 -375 37619 -49073 -21625 84613 -15559
1046 -15559 -80530 49217 45133 -48943 -828 11914 -20665 41256 5067 -78607 33101 76737
1058 76737 -66479 -42169 64067 -2600 -26580 23388 -30650 -9891 72060 -30587 -77554
1069 -77554 67321 48591 -72728 -7989 41616 -10401 9847 -4442 -46647 47223 50766 -84959
1081 -84959 -19912 94617 -20764 -64987 41254 13902 -25695 26792 -19433 -35838 62932
1092 62932 9158 -80272 26282 58295 -44217 -15806 25470 -19493 19944 23512 -66074 5632
1104 5632 85615 -44630 -65336 66134 24400 -49871 12355 6767 -17417 39948 -7513 -61882
1116 -61882 44811 49084 -66580 -15086 54198 -15525 -16112 16725 -27571 10291 47198 -51645
1128 -51645 -35873 75931 1739 -69825 28118 36076 -32537 4474 8524 -26201 30761 19935
1140 19935 -56830 9050 56317 -33342 -27668 35450 -5980 -8969 23472 -30390 -13658 58948
1152 58948 -17028 -61692 44124 36805 -51979 -5697 30100 -13065 4249 5208 -32321 20471
1164 20471 35384 -44763 -15960 50187 -9427 -29476 22954 -2635 -12136 30009 -14801 -34007
1176 -34007 43446 17865 -52672 6883 39486 -20570 -13387 13741 -9356 7778 13912 -31618
1188 -31618 -1467 39240 -19261 -29031 29505 5194 -22415 14264 -353 -18617 24264 5763
1200 5763 -35126 14614 29818 -26500 -11344 24913 -4157 -7869 8640 -10288 2701 19387
1212 19387 -19023 -13274 29145 -2553 -25372 15106 8810 -17862 8046 6416 -19071 9226
1224 9226 15627 -21832 -4518 21723 -6521 -11574 9100 -881 -896 7766 -10329 -3306 18776 -5563
1238 -5563 -16664 15506 7864 -16705 4794 10500 -11322 751 9773 -10441 -2806 11255 -5633
1251 -5633 -7283 7561 -768 -4528 3513 -2788 -2005 7699 -4642 -7985 11069 3015 -12748 4544
1265 4544 9872 -8138 -1958 8062 -3114 -2826 6168 -1252 -3816 3805 976 -2529 1006 -603
1279 -603 -174 3268 -3565 -3980 5890 220 -7769 2465 4921 -5576 -2061 5183 -1231 -3911 2989
1294 2989 1998 -2784 -260 2414 431 -914 -468 1816 1934 -2378 -410 3806 -415 -3600 2302 2514
1310 2514 -3516 -1589 3799 -580 -4173 868 2187 -2516 -2650 1437 1388 -2335 -1894 2160 690 -2662
1326 -2662 -144 2628 -241 -1995 1578 2477 -2016 -420 3373 0 -1967 1672 1760 -1400 -1207 1539
1342 1539 738 -1244 -1153 713 409 -1838 -1015 1686 -698 -2937 1614 1354 -3356 -299 2860 -1643
1358 -1643 -1822 2675 562 -2039 1422 1478 -1258 479 1106 93 1060 -1260 -1163 3894 -420 -5436 3340
1375 3340 3979 -5860 -1650 5943 -2651 -4595 3686 -401 -3267 2574 -867 -3178 3920 -431 -4796
1390 -4796 4546 1875 -5525 3582 3287 -5895 3224 5762 -7778 -198 10218 -5335 -6054 8967
1404 8967 -297 -5767 5174 -1694 -5104 8325 -1024 -11492 7139 6603 -11159 -48 7007 -6504
1418 -6504 1128 5808 -10467 1566 14206 -11206 -9406 17086 803 -13438 7662 4510 -6963
1431 -6963 6773 -700 -10671 12603 6389 -19507 4420 17044 -13471 -6109 12868 -6843 -2813
1444 -2813 11390 -12461 -6661 21378 -6301 -20695 15871 8851 -16465 4640 4627 -10765 12778
1457 12778 4640 -24629 10318 24269 -21748 -11638 23326 -2549 -10005 9337 -8096 -2082
1469 -2082 22011 -14053 -22735 28974 9372 -32155 6147 19196 -14311 148 5693 -15958
1481 -15958 12093 16283 -30347 -3699 35051 -13768 -23677 21872 2991 -12702 14111 -8154
1493 -8154 -14584 30137 1188 -37360 18444 27392 -27112 -6508 17984 -10101 4996 10168 -28920
1506 -28920 5408 38790 -27510 -30003 37954 8047 -30455 8467 6041 -8776 18807 -8620
1518 -8620 -29745 32481 21514 -45806 -302 39762 -16495 -15371 17251 -10038 2610 23030
1530 23030 -28088 -15189 45719 -5737 -41909 22827 20422 -22983 4166 3137 -17250 25051
1542 25051 8803 -45842 12308 44748 -32068 -25484 32731 852 -13138 10720 -16941 -1351
1554 -1351 39137 -21095 -39753 42845 22297 -44886 2094 26610 -12780 4036 3105 -26682
1566 -26682 22131 29210 -45216 -12532 49830 -10594 -33328 20212 3780 -10397 18281 -16676
1578 -16676 -22247 41815 5860 -50905 16279 37003 -26793 -10641 16501 -10373 10378 13859
1590 13859 -36654 2599 48639 -24685 -37640 37248 14299 -28447 6024 2644 -8829 24566
1602 24566 -7549 -38010 30135 29472 -44361 -8762 36854 -10112 -13252 11892 -13806 4848
1614 4848 27351 -29415 -21148 45130 1750 -39947 15956 19058 -16364 6468 -132 -18919 25236
1627 25236 13656 -42089 5152 40404 -22062 -22028 22987 -820 -6946 12008 -18087 -6547 34946
1640 34946 -11843 -36192 27681 20219 -30574 -1126 16075 -9620 6958 4294 -24229 14108
1652 14108 27098 -29872 -13749 34259 -2971 -21359 12482 943 -6598 16172 -10536 -19356
1664 -19356 27353 8448 -33268 6933 23095 -15541 -5135 9065 -10683 6810 12820 -23726
1676 -23726 -3168 29831 -11106 -22287 18872 7014 -13797 6832 -844 -9009 17151 269
1688 269 -23412 13776 18624 -20710 -5172 17736 -5923 -4437 7517 -9958 450 16222 -13098
1701 -13098 -12900 20343 1579 -18693 7445 7233 -9375 4389 1726 -11192 9458 8441 -16639
1714 -16639 220 16399 -7822 -7298 9635 -2214 -2759 8389 -6991 -5774 14629 -1471 -14065
1727 -14065 8570 7723 -10656 507 5010 -5397 2871 3417 -10041 2408 9907 -9045 -5352
1740 -5352 10032 -1624 -6271 5509 -839 -3613 6459 -1277 -6645 7202 3482 -8297 2380
1753 2380 6435 -4980 -565 3906 -3552 471 4847 -4796 -2081 5971 -2105 -4504 3539 202 -3682
1768 -3682 2177 -12 -3992 3121 1597 -5112 1305 3928 -3309 -1050 3307 -845 -420 1907 -1189
1783 -1189 -270 3122 -1255 -1957 3162 625 -2494 1507 1444 -2201 454 813 -1756 280 854 -1852
1799 -1852 -321 1300 -1481 -984 1547 -985 -1340 1178 -169 -1059 999 355 -849 830 564 -465
1815 -465 547 1149 -468 232 1198 -492 -524 848 -22 -294 71 -249 -269 192 -741 -743 565 -306 -1240 408
1835 408 858 -1211 -398 925 -363 -748 295 379 189 130 -253 699 843 -621 188 1823 99 -1165
1853 -1165 1070 1066 -1334 63 932 -660 -84 -189 -999 474 347 -1960 166 1512 -1686 -1185 1347
1870 1347 -654 -1328 1414 -347 -1266 1998 351 -1826 1916 1412 -2233 1206 1494 -2281 839 2573
1886 2573 -2416 -631 2897 -1417 -2193 2493 -895 -1706 2216 -1639 -2611 4173 -591 -5689 3640 3609
1902 3609 -5418 -357 4102 -2245 -615 2264 -2944 1026 4496 -4893 -2260 7290 -1451 -5195 5373
1917 5373 1067 -4156 4221 291 -6044 4919 3225 -8355 1168 6742 -5453 -2325 4789 -3858
1931 -3858 -510 5792 -6700 -3030 10331 -3101 -9176 7850 3785 -7305 2745 2159 -4888 6125
1945 6125 2192 -11106 5334 10938 -11106 -4489 11549 -2464 -5546 5212 -3701 -1550 9654
1958 9654 -6972 -9450 13804 2227 -15272 5150 7993 -8635 1818 3894 -9302 5989 8915
1971 8915 -14892 -1871 17119 -6458 -10482 10089 500 -4708 7568 -6048 -6957 16655 -859
1984 -859 -19862 10738 13755 -15351 -3238 9970 -5378 1829 4882 -13906 3294 18042 -14701
1997 -14701 -13288 19815 2271 -15537 6242 3190 -5804 10164 -3337 -15231 16617 10750 -23100
2010 -23100 821 19686 -9099 -6580 8566 -6453 1624 12496 -16227 -7943 24634 -4026
2022 -4026 -22207 12452 9627 -11784 3103 62 -9206 15244 3862 -25471 8453 24205 -18726
2035 -18726 -12578 18978 -542 -7193 6845 -8759 -540 20504 -12080 -19984 23535 9641 -24116
2048 -24116 3081 13155 -8627 3438 2301 -16073 11970 16579 -24916 -7087 27400 -5559
2060 -5559 -18049 10793 1475 -4433 10161 -10431 -11406 24516 1871 -28674 10836 20605 -16490
2073 -16490 -4586 9956 -6692 6514 7826 -21246 2387 27303 -15395 -20681 21554 6407
2085 6407 -15941 4386 571 -5095 14826 -5778 -21464 19306 15462 -26576 -2361 21039 -7624
2098 -7624 -6431 7601 -8966 3446 16365 -17822 -11653 26657 400 -23202 9816 10415 -9054
2111 -9054 3938 -1501 -10817 16337 6430 -26101 4789 23971 -14968 -12738 14618 -999 -4347
2124 -4347 7401 -11010 -3563 21328 -7914 -21137 17552 11359 -18248 700 8699 -5637 5789
2137 5789 1204 -15814 10467 16263 -20415 -7252 22027 -3750 -13050 8643 -73 -4030 9877
2150 9877 -7722 -11589 17365 3878 -20511 5310 13237 -9712 -2065 4734 -6931 6191 7803
2163 7803 -16679 -378 20231 -8375 -14454 13360 4777 -9187 4159 -367 -5035 10537 -941
2176 -941 -14522 9677 10912 -14327 -2507 10509 -4507 -2085 4594 -7926 1032 11628 -10026
2189 -10026 -8963 14775 1039 -12928 5381 5350 -5976 3276 685 -7299 7474 5026 -11581
2202 -11581 1439 10918 -6169 -4016 6651 -2717 -1192 6034 -6175 -3882 11218 -2114 -11049
2215 -11049 6915 5719 -8100 100 3564 -3207 2312 1429 -6668 2858 6726 -7019 -2925 7804
2229 7804 -2028 -4107 4979 -1205 -2837 5661 -1489 -5817 5785 3123 -7052 1052 4937 -3402
2243 -3402 -838 2006 -2737 1089 3172 -4492 -964 5324 -2905 -3698 4331 -255 -3162 2858 -113
2258 -113 -3346 3381 1532 -4694 1625 3819 -2782 -1048 3075 -560 -245 1302 -1395 607 2543
2273 2543 -2234 -1535 3468 -373 -3336 1838 1071 -2678 741 1493 -2616 254 1725 -1768 -527 1496
2289 1496 -660 -745 1123 -363 -154 1039 -837 -418 1911 -318 -1322 1563 1004 -1810 628 1463
2305 1463 -1165 -460 1094 -750 -703 802 -256 -802 285 -96 -534 -29 -580 135 684 -839 -750 1149
2323 1149 86 -1218 494 1330 -753 -579 1158 147 -545 554 403 -103 190 -167 -14 127 -717
2340 -717 -262 800 -393 -566 749 62 -1278 127 682 -775 -285 845 -410 -624 784 -48 -187
2357 -187 449 155 85 370 -92 -1 755 -107 -337 1150 414 -1581 810 1011 -1607 -43 1426 -1453
2375 -1453 -604 1486 -732 -1316 547 102 -592 252 -690 -126 1355 -824 -1524 2395 851 -2615 968
2392 968 2098 -1860 -241 1884 -1044 -230 2239 -1027 -776 2392 -676 -1897 1489 -229 -1622 1946
2408 1946 -520 -2801 2570 1187 -4072 807 2991 -2915 -1169 2606 -1529 -450 2754 -2695 -1216
2423 -1216 4780 -1196 -3937 3846 1570 -3172 1548 1104 -2220 2742 372 -4885 2804 3950 -5705
2438 -5705 -1225 5696 -2372 -3034 3285 -2151 -1595 4260 -2645 -4609 5741 913 -6131 2630 3188
2453 3188 -3560 1593 1614 -4604 3299 4499 -7568 -649 8866 -3723 -5249 5533 216 -3096 3159
2468 3159 -2309 -3236 7322 -904 -9054 5643 5767 -7846 -515 4967 -3566 1015 3118 -7050
2482 -7050 1493 8821 -7266 -5657 9903 451 -7112 4220 915 -3314 5584 -1450 -7974 8086
2496 8086 5087 -11635 701 9255 -4976 -2933 4132 -3964 1386 6324 -9060 -3975 13084 -2622
2510 -2622 -11772 7430 4821 -6959 1818 750 -4653 7242 1705 -12269 5069 11463 -10001
2523 -10001 -5170 9906 -1728 -3326 4624 -5260 -974 10884 -6313 -10679 12449 4481 -12998
2536 -12998 2225 6167 -4843 2323 872 -8826 6854 8143 -13907 -2890 14960 -4416 -8976
2549 -8976 6757 300 -2232 6104 -6128 -5858 14120 149 -15684 7088 10683 -9454 -2095
2562 -2095 5247 -4095 3742 3804 -12064 1752 14593 -9606 -10618 12581 2158 -8580 3300
2575 3300 -279 -3447 8828 -2961 -12174 10882 8874 -14847 -1064 11958 -4495 -2943 4020
2588 4020 -5513 3079 9022 -10956 -5806 15943 -1464 -13400 6936 5473 -6011 2877 -838
2601 -838 -6474 9658 2930 -15154 3824 13258 -9205 -6245 8492 -1487 -1769 4712 -7406 -1237
2615 -1237 13240 -5678 -12169 11510 5927 -11223 1215 5063 -3621 3915 784 -9443 6441
2628 6441 9387 -12646 -4057 13159 -2694 -7649 4932 -488 -1919 6246 -5406 -6862 11413
2641 11413 1637 -13285 4209 8602 -6639 -1018 3430 -4287 3916 4870 -10238 231 12508
2654 12508 -5798 -8235 8215 1839 -5262 2914 -1405 -2678 7702 -1710 -10121 7065 6832 -10223
2668 -10223 -1296 7236 -2995 -1465 2501 -4826 1451 6866 -7134 -4594 9958 91 -7877 4128
2682 4128 3055 -3623 2979 27 -4945 5663 3222 -8814 1180 7502 -4687 -3119 4372 -2018
2696 -2018 -841 3468 -4574 -2096 7432 -2230 -7217 5427 3445 -5615 870 2118 -2392 2431 1093
2711 1093 -5286 2699 5109 -5527 -2044 6170 -1341 -3165 3363 -966 -1620 3713 -1792 -3826 4925
2726 4925 1409 -5301 1729 2686 -3378 -1 1921 -2558 1104 2561 -3979 -885 4350 -1787 -3004
2741 -3004 3166 211 -1987 1987 -284 -1704 3309 423 -3554 1961 2793 -2923 -381 2461 -939
2756 -939 -475 1288 -1860 145 2370 -2157 -1677 3142 -383 -2768 1642 691 -1869 890 670 -1768
2772 -1768 908 1241 -1887 29 1794 -1255 -365 1471 -745 10 1634 -717 -804 1827 84 -1678
2788 -1678 951 980 -1155 259 358 -595 305 237 -991 197 820 -1306 -669 848 -163 -754 435 42
2806 42 -341 599 75 -604 837 401 -662 771 598 -487 64 680 -273 -370 491 -94 -476 399 -540
2825 -540 -391 408 -198 -322 410 -347 -767 608 226 -667 -38 438 -345 -251 576 14 -171 321 -37 308
2845 308 281 -279 -73 841 -246 -594 740 282 -711 129 377 -402 100 -112 -544 153 303 -647 -68 501
2865 501 -778 -495 728 -102 -631 401 -74 -380 671 34 -311 743 255 -800 660 955 -974
2882 -974 172 855 -623 -161 608 -643 -404 697 -656 -726 587 -512 -893 803 -348 -1443 1180
2899 1180 424 -1776 599 1440 -1388 -402 1112 -488 82 661 -933 -23 2072 -1166 -1432 2443 432
2916 432 -1947 1146 756 -1354 1000 429 -2206 1099 1659 -2245 -406 2153 -1504 -1041 1834 -1352
2932 -1352 -782 2560 -1075 -1959 2991 707 -2924 1410 1626 -1786 670 554 -1998 1792 1932 -3920
2948 -3920 1 4322 -2060 -2652 2710 -186 -1790 1664 -1295 -1735 3211 -1104 -4019 2995 2433 -4002
2964 -4002 180 2601 -2396 796 1917 -3403 718 4427 -3272 -2357 5218 -65 -3128 2055 81
2979 81 -1445 3108 -1144 -4256 4563 2616 -5988 498 4952 -2936 -1507 2337 -2218 588 3034
2994 3034 -4722 -1509 6611 -1993 -5738 4202 2040 -3800 1751 500 -2848 4223 851 -6442 2878
3009 2878 5889 -5548 -2163 5164 -1541 -1568 2654 -2874 -732 5921 -3879 -5637 6683 1925 -6965
3024 -6965 1289 3293 -2956 1495 384 -4918 3800 4468 -7751 -1183 8501 -2677 -4858 4363 123
3039 123 -1438 3577 -3323 -3066 8044 -204 -8343 4355 5514 -5581 -864 2992 -2655 2108 2298
3054 2298 -7104 1445 8233 -5702 -5565 7056 973 -4678 2350 -504 -1739 5535 -2006 -6876 7011
3069 7011 4709 -8856 14 6688 -2889 -1263 2272 -3674 1941 5139 -6958 -3067 9367 -1318
3083 -1318 -7799 4035 2957 -3638 1843 -629 -3995 5989 1855 -9127 2535 7952 -5909 -3675
3097 -3675 5384 -871 -1318 2499 -4159 -152 7977 -3630 -6899 7280 3316 -6758 1089 2763
3111 2763 -2637 2547 358 -6436 4226 5630 -8040 -2434 8098 -1840 -4523 3176 -694 -796
3125 -796 4171 -3800 -4053 7768 571 -7772 3063 4908 -4515 -30 2172 -2782 2703 2766 -6508
3140 -6508 494 7927 -4201 -5368 5609 1267 -3468 1847 -1161 -1896 4938 -1845 -6718 4907
3154 4907 4163 -6569 -547 5086 -2289 -867 2041 -3298 1028 4845 -4718 -3023 6636 -96 -5262
3169 -5262 2329 1910 -2188 2035 -622 -3208 4305 1869 -6321 1171 5214 -3434 -2209 3028 -1224
3184 -1224 -531 2633 -3193 -1290 5084 -1586 -4654 3565 2151 -3544 682 1314 -1706 2043 614
3199 614 -3897 2326 3831 -4239 -1338 4652 -832 -2094 2244 -707 -1140 2822 -1617 -2657 3538
3214 3538 713 -3860 1173 2211 -2075 500 1059 -2338 1426 1778 -3392 -218 3877 -1572 -2777
3229 -2777 2534 508 -1407 1063 -362 -1352 2036 -58 -2593 1648 1787 -2672 165 2014 -1396
3244 -1396 -83 908 -1435 51 1951 -1934 -1437 2368 -269 -1975 1127 786 -1109 880 293 -1147
3260 -1147 1007 802 -1866 262 1492 -1024 -621 1272 -741 -138 1454 -1074 -746 1253 -372 -1870
3276 -1870 1129 688 -1418 63 652 -763 172 231 -1090 467 865 -1243 -488 1061 -350 -425 1062
3293 1062 -92 -360 1032 240 -966 670 663 -856 157 448 -433 -34 130 -686 115 119 -651 -183 608
3312 608 -694 -494 759 -140 -481 573 120 -669 321 371 -452 49 748 -268 90 365 77 -76 203
3331 203 -225 -4 448 -227 -117 775 -383 -727 595 169 -730 399 203 -330 -25 96 -227 -134 175
3350 175 -44 -43 142 -414 62 273 -476 -301 720 -42 -335 664 247 -536 216 266 -459 177 336 -245 -81
3371 -81 203 -477 -196 189 -535 -213 189 -336 -467 500 -156 -343 416 -138 -930 498 449 -922 201 943
3391 943 -400 -55 742 -133 -133 302 -252 124 666 -766 -495 951 -496 -1059 866 274 -1342 395
3409 395 414 -1090 170 1070 -1070 -148 924 -590 -258 773 -984 104 1197 -828 -685 2024 -147
3426 -147 -1623 1247 1009 -1116 78 476 -974 637 703 -1781 13 1882 -1374 -1074 1465 -51
3442 -51 -1150 865 -528 -769 1608 -442 -1933 1783 1082 -2167 454 1141 -1338 116 1240 -1927
3458 -1927 356 2379 -1872 -1255 2518 -255 -1422 925 -153 -632 1656 -941 -2275 2415 896
3473 896 -3351 641 2460 -1965 -620 1185 -1001 533 1378 -2200 -159 3276 -1161 -2577 2507
3488 2507 807 -1857 1341 35 -1549 2100 191 -3627 1837 3054 -3194 -953 2982 -998 -1085
3503 -1085 1436 -1742 -478 3176 -2047 -3020 3555 1082 -3698 1232 1567 -1594 1128 38 -2730
3518 -2730 2391 2298 -4458 -499 4697 -1644 -2545 2609 -1 -880 1932 -1932 -1805 4215 -554 -4605
3534 -4605 2613 2590 -3353 -5 1389 -1569 1109 1357 -3856 699 4602 -3236 -2697 4147 448 -2641
3550 -2641 1514 -557 -1154 3228 -1212 -4175 3929 2408 -4960 164 4144 -1882 -759 1519 -2208
3565 -2208 964 2972 -3892 -1789 5163 -929 -4595 2516 1590 -2278 1300 -200 -2427 3405 772
3580 772 -5354 1902 4412 -3438 -1669 3088 -1029 -288 1843 -2601 -552 4660 -2451 -4263 4245
3595 4245 1776 -4088 764 1540 -1756 1803 234 -3864 2768 3322 -5118 -1445 5068 -1202 -2555
3610 -2555 2211 -293 -522 2713 -2180 -2326 4903 599 -4976 1880 3224 -2892 140 1314 -1966
3625 -1966 1673 1588 -4142 -4 4709 -2453 -3174 3503 419 -2360 1342 -886 -1260 3231 -834 -4026
3641 -4026 3412 2826 -4080 -168 2954 -1269 -444 1021 -2213 835 3213 -3066 -1914 4414 -333
3656 -333 -3429 1685 1094 -1671 1372 -583 -2446 2452 1130 -4313 350 3283 -2445 -1627 1826 -910
3672 -910 -379 1873 -2250 -821 3813 -985 -3268 2551 1801 -2306 429 1047 -1181 1253 476 -2912
3688 -2912 1287 2726 -2899 -1125 3034 -587 -1524 1265 -475 -821 1970 -1349 -1885 2495 648 -2811
3704 -2811 882 1684 -1464 235 738 -1524 999 1646 -2210 -24 2843 -1217 -1677 1730 429 -1079
3720 -1079 755 -110 -499 1897 10 -2108 1298 1500 -2042 -204 1389 -1019 -276 867 -1289 -260
3736 -260 1587 -1134 -1293 1890 94 -1417 929 456 -791 915 44 -1032 1068 795 -1653 -99
3752 -99 1477 -845 -608 1002 -462 -238 871 -674 -901 1331 95 -1381 767 623 -951 33 389
3769 389 -571 162 425 -966 459 926 -1094 -193 1155 -103 -452 604 -154 -473 681 -22 -597 641
3787 641 593 -940 566 739 -543 -250 217 -277 46 469 -610 -170 784 -342 -668 565 129 -536
3805 -536 416 313 -244 368 140 -357 375 465 -440 -27 285 -108 -110 99 -266 -88 301 -216 -572 462 -98
3826 -98 -691 307 -21 -563 95 347 -553 175 30 -392 27 226 -101 -31 341 -66 -119 606 -131 -330 525
3847 525 75 -517 310 101 -181 -76 124 -172 -133 262 -418 -182 185 -430 -218 250 -339 -266 351 -56 -265
3868 -265 275 94 -335 209 185 -52 -61 283 -88 282 389 -387 1 512 -157 -7 195 -428 -199 344 -276
3889 -276 -312 371 -252 -628 82 234 -360 197 236 -236 -140 540 -98 -28 637 -151 -23 350 -264 -167 752 -193
3911 -193 -592 770 157 -938 368 620 -603 51 399 -310 269 599 -922 -46 759 -811 -698 787
3929 787 128 -522 402 -107 -702 996 -212 -961 765 671 -1098 333 1113 -598 65 697 -624 105
3947 105 1040 -907 -985 1199 86 -1012 835 -94 -659 616 -127 -1263 958 758 -1644 -64 1544
3964 1544 -715 -321 927 -697 -18 1074 -837 -472 1771 -384 -1390 1344 746 -1055 736 333
3980 333 -984 995 576 -1741 764 1780 -1589 -946 1368 -404 -522 675 -913 -451 1391 -847
3996 -847 -1740 1879 833 -1566 538 1109 -939 473 534 -1454 1006 1683 -2148 -626 2506 -508
4012 -508 -1653 1045 21 -820 1117 -810 -1281 2095 82 -2820 1129 1669 -1732 -435 1406 -1009
4028 -1009 395 1038 -2093 171 2638 -1234 -1923 2193 500 -1449 997 133 -829 1749 -208 -2702
4044 -2702 1704 1911 -2736 -197 2087 -844 -704 1062 -1059 265 1783 -1911 -1333 2942 224 -2697
4060 -2697 1105 1057 -1336 550 10 -1489 1525 1115 -2873 502 2660 -1800 -1393 1860 -220 -587
4076 -587 1043 -1411 -819 2835 -617 -2863 2072 1354 -2454 228 1110 -1255 856 608 -2242 1023
4092 1023 2441 -2360 -1497 3017 -343 -1712 1111 -181 -342 1771 -981 -1777 2644 687 -3087 830
4108 830 2180 -1356 -260 871 -1385 670 1483 -2292 -333 3023 -1137 -2411 1744 433 -1328
4123 -1328 782 -227 -1115 1930 -154 -2812 1572 2166 -2531 -624 1964 -605 -440 992 -1166 127
4139 127 2049 -1412 -1662 2480 251 -2187 592 813 -1071 734 38 -1757 1639 1129 -2584 -219
4155 -219 2419 -782 -1220 1217 -272 -269 1456 -1038 -1027 2408 -452 -2570 1525 1239 -1670 -7 785
4172 785 -731 533 481 -1645 430 1909 -1572 -1073 2009 -175 -1319 952 -227 -518 1262 -666
4188 -666 -1520 1883 655 -1997 254 1412 -840 19 615 -1063 461 1238 -1653 -768 1983 -415
4204 -415 -1449 1055 534 -867 439 -347 -768 1042 218 -1580 690 1445 -1385 -530 1058 -635 -378
4221 -378 638 -609 -258 1319 -633 -831 1045 356 -890 406 413 -483 397 62 -1041 581 1173 -1165
4239 -1165 -283 1191 -499 -727 516 -343 -179 656 -444 -689 966 -27 -1010 446 591 -762 122
4256 122 336 -576 285 422 -739 244 1082 -521 -371 954 24 -504 193 -98 -394 407 50 -630 450
4275 450 175 -640 182 439 -414 58 200 -203 189 606 -601 -117 639 239 -310 319 179 -473 87 -19
4295 -19 -217 324 15 -530 251 318 -407 -96 353 -173 -91 170 -294 -350 300 -396 -467 399 -84 -612 1 318
4317 318 -140 188 256 -324 173 450 -248 -14 104 -156 -92 328 -148 -228 327 60 -91 209 -4 -514 248
4338 248 238 -95 33 223 -465 106 232 -235 -9 108 -122 -131 -2 -66 -140 38 -44 -76 215 331 -256 51
4360 51 280 91 72 169 -166 -80 289 -351 -27 163 -88 -225 125 -216 -355 265 111 -415 125 211 -301 197
4382 197 371 -163 166 347 -207 57 303 -177 -335 451 -72 -253 485 106 -117 225 96 -372 391 23
4402 23 -514 187 261 -344 -283 74 -183 -44 260 -273 415 432 -158 -119 369 230 -216 345 66 -193 330 46
4424 46 -758 453 576 -558 -72 322 -160 -166 239 -243 -110 329 -375 -458 466 122 -619 360 126 -305 469
4445 469 -57 -608 193 402 -930 -44 793 -239 -469 507 -234 61 481 -599 -279 990 180 -875
4463 -875 663 331 -550 247 384 -440 340 306 -975 49 896 -632 -658 609 -280 -209 507 -572 -369
4482 -369 858 -290 -1031 927 547 -1012 161 620 -569 49 453 -825 257 774 -953 -554 1429
4499 1429 -424 -825 730 111 -465 410 -224 -931 907 431 -1358 555 1262 -843 -649 789 -625
4516 -625 233 588 -1057 -83 1453 -637 -1291 1138 471 -655 362 156 -631 889 61 -1442 724
4533 724 1214 -1583 -480 1465 -695 -557 691 -811 116 1078 -908 -984 1470 262 -1590 560 832
4550 832 -804 304 68 -924 852 710 -1817 278 1836 -726 -963 946 -123 -622 847 -785
4566 -785 -613 1328 -277 -1984 1146 978 -1266 17 986 -695 404 640 -1367 470 1788 -1057
4582 -1057 -808 1632 10 -1143 784 3 -817 989 -324 -1427 1209 602 -1783 332 1146 -658
4598 -658 -351 453 -649 511 950 -1380 -427 1767 -610 -1552 1315 664 -747 695 -234 -669 1253
4615 1253 272 -1593 715 1358 -1631 -366 1312 -331 -409 688 -932 -45 1360 -1086 -1166 1449 387
4632 387 -1706 332 537 -643 485 339 -1117 1047 973 -1421 -270 1649 -377 -758 794 38 -137
4649 -137 877 -786 -532 1729 98 -1586 613 1020 -1293 118 562 -586 241 65 -1382 -60
4665 -60 1243 -1025 -903 1293 -140 -918 710 -324 -515 1258 -240 -1027 1025 711 -1438 173 965
4682 965 -514 -40 423 -599 240 920 -824 -536 1183 -243 -1151 626 276 -841 412 -27 -721
4699 -721 779 108 -1226 432 857 -823 -318 711 -273 -302 341 -475 -359 1179 -323 -1081 902 349
4717 349 -1125 100 668 -158 106 -51 -775 144 744 -922 -132 946 -162 -509 397 -98 -68 341 -456
4736 -456 -490 804 29 -813 532 506 -336 146 367 -224 398 390 -331 -81 792 -438 -477 788 -156 -368
4756 -368 95 -29 -306 310 -22 -595 358 291 -743 105 507 -273 -147 168 -332 147 589 -368 -184 645
4776 645 50 -450 350 140 -536 197 139 -413 40 271 -618 -148 468 -360 -168 327 -193 -80 98 -331
4796 -331 74 416 66 -511 464 104 -251 245 330 -191 25 365 14 -33 281 -153 -296 243 44 -241 50
4817 50 167 -19 246 -129 -382 -21 -36 -268 158 232 -136 -19 -12 -117 -91 89 -96 -136 245 -158 -206 146 67
4840 67 -283 199 260 -269 179 -25 -164 13 146 -304 -250 290 -65 -59 95 -90 -12 244 23 -222 11 -123
4862 -123 -137 94 -11 -362 150 367 -21 -56 17 -231 -56 184 -97 -63 145 -32 -27 68 -202 -291 239 152 -257
4885 -257 -104 -212 -430 -22 -45 -350 -110 -24 -353 59 502 146 -130 116 -495 -54 380 -98 -85 281 228
4906 228 -44 132 -22 -375 238 217 -204 264 441 -43 -145 271 44 98 298 -251 -99 377 -70 -235 477
4927 477 288 -387 250 226 -133 124 19 -264 200 545 -307 51 644 -72 -68 188 28 -413 234 75 -387
4948 -387 321 150 -770 192 219 -688 60 142 -394 171 345 -340 -39 599 -352 -264 602 112 -79 491 37
4969 37 11 601 97 -651 240 472 -674 -67 350 -183 -187 245 -246 78 806 -700 -431 616 61 -360
4989 -360 370 113 -166 325 82 -391 538 238 -1045 229 823 -348 -44 479 -395 -137 418 -406 -280
5008 -280 703 -373 -710 246 -20 -722 -17 108 -294 199 222 -1077 374 709 -698 -262 758 -259
5026 -259 -221 299 -301 -282 792 -262 -498 419 402 -716 348 688 -398 189 125 -749 16 609 -970
5045 -970 -188 1229 -498 -734 675 -170 -346 470 -246 -581 911 -38 -1008 499 831 -926 -14 709
5063 709 -424 54 480 -777 -4 1026 -613 -929 773 -56 -663 403 -22 -500 454 -176 -1082 679
5081 679 439 -1228 -198 1001 -318 -261 277 -413 259 898 -774 -391 1095 -130 -999 679 305 -557
5099 -557 89 203 -451 587 361 -1184 159 1229 -821 -597 906 -345 -306 333 -382 -237 1168 -227
5117 -227 -1316 678 471 -747 49 692 -271 192 419 -829 577 857 -1004 -480 1262 29 -494
5134 -494 538 67 -549 380 -288 -874 1036 201 -1248 321 787 -726 33 468 -370 210 181 -933
5152 -933 -71 966 -403 -932 562 306 -559 219 -217 -461 850 -61 -1109 628 663 -603 -42 847
5170 847 -361 -42 303 -462 38 269 -682 -580 942 48 -1061 523 367 -423 239 247 -495 499 417 -644
5190 -644 280 898 -467 -362 610 99 -150 377 -183 -80 613 -149 -536 540 439 -689 360 208 -188
5209 -188 103 -41 -564 -160 666 -513 -275 663 57 -578 370 51 -352 528 -267 -470 467 319 -727
5228 -727 127 534 -351 58 133 -68 -34 236 -654 -234 578 -109 -409 370 166 -109 176 48 -108 142 -118
5249 -118 -530 146 640 -367 -14 455 -190 -282 418 -403 -48 312 -128 -322 660 99 -572 62 189 -118
5269 -118 -203 52 -667 312 205 -425 -16 481 -140 -263 217 -260 -147 63 -69 -202 329 148 -322 338
5289 338 290 -207 112 54 -423 154 208 -231 38 162 -160 -114 96 -101 -196 156 20 -288 177 -228 -62 24
5311 24 29 -302 162 455 -194 -154 60 -221 -137 137 -107 -177 261 -133 -521 307 46 4 11 125 -230 196 -97
5334 -97 -52 204 108 -304 -26 -46 -181 25 224 3 -118 424 20 62 242 180 -69 62 -95 -192 48 31 -91
5357 -91 17 330 -86 231 278 -159 -221 133 -16 -130 54 138 -81 234 -86 -46 -91 16 -326 -37 105 -293
5379 -293 -157 174 119 -2 72 -73 122 424 -14 -163 181 6 -178 94 7 -337 -50 -67 69 -81 -11 -109
5401 -109 53 404 -164 -221 358 180 -350 219 -62 -176 351 -86 -242 110 86 -438 161 214 -178 -23 101
5422 101 -80 -71 -9 -231 -252 160 -179 -153 349 -10 -339 106 65 -414 175 -31 -443 111 249 -247 -315 283
5444 283 -391 119 210 -237 -320 403 -60 -197 405 250 -119 184 119 176 118 156 -304 380 390 -190 234 102
5466 102 -225 -249 185 -84 -168 153 -268 -219 377 41 -457 246 277 -254 359 -54 -276 142 354 -331 26
5487 26 365 -195 -249 186 33 196 259 -125 -130 504 -239 -446 246 324 -248 -4 -4 -208 61 272 -758 211
5509 211 304 -483 -88 552 -216 -337 345 -184 -221 443 -205 -564 705 308 -716 -283 404 -271 110 257
5529 257 -440 -138 469 -390 -328 712 -246 -564 457 180 -158 236 -111 -382 458 178 -672 260 574 -454
5549 -454 19 498 -195 116 210 -478 -177 721 -519 -457 548 -105 -467 26 16 -55 404 -136 -705 295
5569 295 252 -815 -206 621 -301 -112 465 17 -69 703 -226 -509 854 17 -713 394 421 -524 14 129
5589 129 -511 241 -71 -990 51 835 -340 -256 429 -51 -447 333 -390 -507 679 -117 -675 360 254
5608 254 -532 -216 258 -250 119 414 -512 269 831 -314 -397 612 41 -489 305 97 -536 275 -103 -458
5628 -458 351 299 -869 114 414 -563 -286 480 -428 0 683 -664 -44 895 -235 -738 360 253 -623
5647 -623 276 -93 -269 391 231 -1043 246 452 -611 -166 613 -255 0 92 -254 76 652 -525 -342
5666 -342 586 123 -569 187 179 -415 129 -62 -251 301 381 -581 338 729 -355 -332 569 -113 -416 144 -239
5687 -239 -380 666 -29 -724 369 209 -562 186 226 -131 229 114 -444 108 276 -472 -450 432 -166 -381
5707 -381 231 -5 -298 549 -84 -628 254 294 -631 -87 291 -129 88 251 -288 19 254 -316 -292 453 -167
5728 -167 -352 276 124 -479 359 165 -311 91 1 -411 219 490 -396 -11 472 40 -112 408 -480 -12
5748 -12 352 -375 -460 363 133 -249 -88 156 -282 32 222 -303 -15 13 -268 -56 484 -47 -105 40 -97
5769 -97 59 187 -184 -46 304 202 -348 226 159 -93 -1 -22 -224 -56 88 -378 62 236 -90 -85 423 62
5791 62 -302 222 28 -71 273 144 -202 398 136 -614 -41 379 13 -75 104 -170 130 11 -211 -253 104
5812 104 93 75 121 242 62 39 -169 -346 254 96 -112 -169 74 -258 -142 137 21 -7 -4 23 16 357 -39 -77
5836 -77 276 -99 -188 -133 -205 102 72 150 91 22 156 -76 -305 127 -156 -267 44 -174 -171 2 -96 -332 27 -2
5860 -2 10 -49 50 -60 -95 227 -320 -35 49 -202 9 59 108 7 87 -65 83 -13 157 -36 -135 224 -18 -100
5884 -100 19 4 -159 183 -94 -110 -55 -133 63 230 54 -17 22 -18 -35 188 196 -155 129 108 -125 152 201 70
5908 70 128 -26 -250 30 267 -365 -7 304 -53 -223 378 -148 -126 -9 192 -230 -116 -69 -15 -119 206 -74
5930 -74 -6 254 -122 196 124 14 -68 512 -161 -89 234 128 -455 185 -78 -11 74 24 -424 152 235 -91 -138
5953 -138 113 -127 -45 206 -175 -31 406 -92 -251 198 -75 -142 285 79 -220 56 125 -371 -27 385 -293
5974 -293 20 7 -87 -215 20 -39 -86 253 -160 -408 418 19 -443 401 127 -137 12 -214 -213 104 97 -98 -12
5997 -12 137 -92 -91 336 67 -53 236 78 -144 245 9 -288 115 110 -518 -53 510 -137 -274 87 -492 221
6019 221 416 -424 -284 350 193 -389 330 319 -311 -27 -47 -1 142 182 -395 69 373 -244 -270 220 -221 -121
6041 -121 365 -250 -272 566 112 -196 385 248 -316 34 86 -260 111 156 -304 99 368 -467 -188 223 -215
6062 -215 -276 354 65 124 411 -79 -83 361 -91 -634 236 242 -476 -170 143 -587 224 362 -349 -21 403 -172
6084 -172 -441 401 -68 -232 370 -61 -173 446 -172 -496 392 632 -314 -255 335 -348 0 364 -490 23
6104 23 280 -287 -391 413 57 -409 215 -110 -206 536 79 -466 213 87 -515 -55 429 -382 -168 385 -359
6125 -359 -38 299 -378 -188 706 97 -228 551 146 -335 193 -142 -166 309 32 -377 230 412 -331 -268 460
6146 460 -180 143 123 -20 -191 364 -143 -311 469 304 -595 148 285 -223 87 292 -85 168 212 -879
6166 -879 -169 504 -453 -549 109 -30 -225 317 -131 38 241 -17 -409 344 384 -490 36 20 -234 117 213
6187 213 -414 106 319 -203 -214 425 34 -348 461 4 -53 62 -3 -351 285 206 -498 9 24 -270 136 217
6209 217 23 260 252 -114 -109 306 9 -416 123 52 -164 199 -144 -357 212 22 -570 136 170 -318 -258 212
6231 212 -4 103 52 -184 42 526 -88 -427 434 64 -448 -38 396 -69 130 -60 -59 208 165 -309 -150
6252 -150 395 -79 -228 74 17 -20 13 -119 -114 163 278 -499 -10 296 -149 -229 -27 89 373 72 -217 243
6274 243 215 -277 -201 69 -108 -207 132 -153 -80 129 -80 -356 233 200 -451 -82 69 -142 24 276 61 21
6296 21 62 -106 -307 433 -113 -149 81 -24 125 74 -220 -262 207 283 -324 197 348 -264 -260 343 -81 -207 -63
6319 -63 -208 9 259 12 -281 259 34 -82 44 -56 -3 -157 -176 -293 8 307 -263 -151 52 -229 -43
6340 -43 6 -224 97 -2 40 96 165 86 77 141 381 -192 -128 106 35 292 62 -177 -1 53 -180 -62 344 21
6364 21 -189 43 183 -53 -9 48 11 -128 13 -92 36 -31 -142 150 198 136 13 30 -263 -23 35 -299 198
6387 198 99 198 -102 243 -20 15 44 85 -150 44 161 -395 -157 180 -38 -84 223 61 -134 158 32 -56
6409 -56 161 155 75 151 229 -79 55 155 -259 -105 16 -197 180 36 -53 -144 350 185 -36 118 -16 -234 42
6432 42 -92 4 240 191 -344 161 -176 100 37 130 -107 -14 399 -61 -197 173 -135 -139 167 -137 -247 220 189
6455 189 17 -74 -160 -234 -92 255 -27 -130 343 -165 79 191 -350 -61 394 -114 101 191 49 -150 -11
6476 -11 93 -129 78 13 -148 153 -57 -211 66 417 -152 35 120 11 -203 0 96 -21 129 119 -286 168
6498 168 78 -234 86 162 -112 69 239 -91 -178 333 -129 -82 379 120 59 121 118 -62 153 33 -46 141 217
6521 217 -236 -112 115 51 -47 -58 -32 -19 140 -241 -118 316 -181 -523 330 -85 -295 210 21 -122 141 200
6543 200 -51 283 230 -145 -33 318 -147 -48 245 27 9 222 -172 -117 279 103 -310 35 394 -194 -14
6564 -14 -121 -79 46 209 -271 -108 528 -273 -242 164 -70 -168 351 -151 81 217 14 -395 342 170 -631
6585 -631 -151 379 -212 -267 107 -360 35 273 -461 -323 685 54 -387 221 -27 -218 214 -221 -341 237
6605 237 169 -407 241 395 -167 -146 410 -229 27 134 -201 -94 270 -58 -397 243 207 -184 98 139 -221
6626 -221 310 183 -330 -133 234 -136 -37 456 -105 -165 110 -63 12 176 28 -213 402 99 -406 60 211
6647 211 -274 -339 144 -171 178 429 -299 -113 253 -247 -119 214 2 -108 418 -124 -263 345 -2 -472
6667 -472 143 315 -284 -56 550 -93 93 169 -224 233 582 -197 -510 401 62 -260 357 16 -143 -1
6687 -1 -150 -284 103 216 -511 -23 442 -153 -51 139 -166 70 279 -209 -98 431 48 -50 350 218 -456
6708 -456 134 26 -137 55 -87 40 127 59 -111 -140 126 164 -73 -1 -49 -149 271 -225 -268 189 112 -487 -184
6731 -184 27 34 -46 -11 -93 104 217 -370 -213 203 -165 -78 133 -73 34 163 -148 -210 189 54 -224 -5
6753 -5 -16 -178 194 128 -130 176 114 -83 92 418 -58 -256 262 96 -491 -76 139 -81 176 -28 -242 309
6775 309 173 -139 -72 335 123 -133 -75 -91 285 346 -70 -53 229 -36 -421 -126 369 -141 154 37 133 29
6797 29 -49 -110 206 254 -74 -103 138 258 -58 214 -183 -49 83 -282 -195 -10 -38 -43 15 -207 107 146 154 -298
6821 -298 -51 355 -128 -137 316 -143 -9 63 -115 104 328 41 -65 119 104 -3 91 -48 -61 -79 227 -4
6843 -4 82 174 -59 -101 215 30 -93 259 -75 13 173 -99 -73 59 -146 -124 -35 54 -212 11 135 -67 -143 71
6867 71 18 -21 128 92 -84 -138 110 -19 87 133 -161 -47 223 18 -194 168 -169 -109 257 -233 -132 206
6889 206 14 47 59 89 -5 30 95 73 65 171 70 -70 3 -134 148 139 -86 -84 47 6 49 -16 -177 -23 -116 81
6915 81 -126 61 -186 24 123 -53 26 -8 -171 5 227 123 -46 -104 -87 -34 -21 -21 -74 -3 120 -101 -231 200
6939 200 18 -50 68 -50 -39 130 361 -13 -20 239 -71 -26 258 -159 -162 178 -48 -6 120 -212 -36 117 7
6962 7 -330 61 -32 -39 134 43 -64 -29 224 -51 -32 2 33 -46 271 -162 -333 -127 12 76 188 -13 -228 12
6986 12 99 -34 -66 40 -86 -96 188 -338 221 166 -96 -179 147 -146 -296 -43 80 -16 -105 -92 26 203 -41
7009 -41 -180 -181 221 -144 -221 399 -57 -352 -283 -137 -24 420 10 18 35 -16 -193 -128 274 -195 24 101 -90 -76
7033 -76 104 -202 -100 162 -116 -233 33 -329 -116 357 74 -176 252 37 -356 244 -16 -71 353 6 50
7054 50 121 47 -302 -68 221 -170 -208 195 106 -18 104 -106 98 181 -48 -329 75 33 -133 31 217 -101
7076 -101 187 156 -178 159 541 -236 -191 172 1 -329 283 351 -43 60 -9 -111 367 238 -440 90 355
7097 355 -265 -357 266 -185 -34 232 -245 -218 359 -146 -295 73 22 -100 -163 25 -74 312 -79 -440 -65 173
7119 173 -310 -35 272 -104 90 155 -104 19 -110 -75 -106 67 11 -288 214 58 -236 61 -123 -152 130 111
7141 111 -218 -81 300 14 -104 233 -5 -215 351 -72 -157 219 -108 -185 256 369 -151 42 85 -146 -152 -161
7163 -161 -124 -142 298 -253 -235 225 -182 -213 -164 90 -165 288 -31 -58 126 26 -116 19 163 -109 -151 198
7185 198 -161 163 211 -164 -23 181 -53 -26 153 38 -290 146 -42 -154 68 162 -330 -122 325 -274 19
7206 19 218 135 -13 -88 -130 -95 234 -67 -302 266 88 150 91 62 -84 69 137 -95 81 55 -27 -169 24 -435
7230 -435 -120 141 -43 -58 139 -46 -128 245 58 -359 -120 250 -196 90 86 -118 6 78 -172 -65 462 67
7252 67 -129 345 -59 -27 142 91 80 131 96 -164 188 -146 -513 106 207 -149 -30 4 -127 -75 329 13 -53
7275 -53 117 70 -511 273 150 132 317 118 -263 278 426 -89 156 157 -101 -72 163 -36 -141 85 70 -152
7297 -152 344 -257 -168 278 242 -170 18 258 -14 19 71 -95 197 283 -169 -197 84 48 -219 4 236 98
7319 98 -36 -55 -275 226 -77 -229 -97 160 -8 -168 136 -396 -3 22 -174 62 165 127 -174 -133 40 -84
7341 -84 51 -81 -161 137 53 -323 110 -20 94 -119 -85 -47 62 181 -74 -16 -146 -145 -115 22 -61 -176 51
7364 51 -97 187 -205 144 -431 -115 -61 -195 188 -73 61 -110 -112 0 121 401 -195 33 13 -66 -73 14 -106
7387 -106 -30 50 -76 -18 -94 103 -171 -204 4 -5 156 22 -90 -221 54 -163 -181 312 -28 -65 171 157 -111
7410 -111 -275 -88 -236 -221 -78 -236 123 22 123 28 230 -44 -108 248 -2 -57 55 -114 103 252 214 -137
7432 -137 269 62 51 154 324 -35 -306 103 118 -115 -43 -172 -108 -27 57 -98 131 -196 -67 -117 180 122 4
7455 4 97 -39 211 156 -200 40 -91 150 -106 157 -22 -170 38 107 40 -275 127 -278 201 -96 127 -278
7477 -278 131 -87 -105 212 -102 37 253 -179 93 50 -60 -124 48 -82 -265 -31 4 142 141 29 -378 -139
7499 -139 280 -189 -44 112 -87 -403 340 71 -152 250 209 -66 537 135 1 25 -189 -113 124 56 -200
7520 -200 161 71 -84 -44 102 27 135 -93 192 80 -50 -94 -59 173 -48 -251 6 179 -159 31 199 -32
7542 -32 108 -25 -227 100 -26 14 -89 187 -217 -184 141 64 -145 142 47 -62 -16 197 -194 110 106 43 267
7565 267 51 -214 183 135 -97 50 446 46 -110 179 177 -74 26 91 -244 10 121 -154 8 450 -246
7586 -246 -29 -140 -49 50 24 -13 -63 271 -36 -272 -42 3 -277 20 160 -158 151 172 -212 94 332 -307
7608 -307 -239 187 -177 -158 -76 0 68 307 -194 -45 160 9 -190 -38 548 -54 -133 -169 4 261 -42 -215
7630 -215 89 338 -58 -281 236 209 -269 282 -26 100 198 209 -177 1 -55 18 317 127 -13 1 104 -153
7652 -153 -142 121 -85 -268 432 -225 -73 1 -133 96 48 -108 -436 25 -40 39 -52 301 -103 -67 -70 -51 -136 -95
7676 -95 -214 -102 19 13 -180 -147 67 -77 45 -19 -29 257 -11 -305 -81 295 -471 78 214 -146 -141 -107 -196
7699 -196 105 270 -188 -198 277 262 -50 42 119 -127 -289 167 -248 -25 128 -268 -188 389 -249 -209 -56 -324
7721 -324 -128 288 1 -152 207 52 -197 99 91 -16 79 82 131 -164 115 -299 -141 154 207 -64 53 65 -50
7744 -50 111 -88 -74 62 146 -265 175 -67 -338 53 271 -31 101 13 -155 108 102 -36 -86 -173 131 -114 131
7767 131 254 120 102 108 -110 71 4 -342 -87 246 -30 -22 162 131 -152 225 -145 -228 361 -25 -77 79 50
7790 50 -57 38 -102 -11 -60 17 -145 -181 63 -109 38 76 18 29 41 -160 22 -104 -310 -50 -45 -56 -51 -34 200
7815 200 -82 -242 -7 38 -97 -47 -140 124 215 207 9 200 -142 -218 158 -206 -54 144 3 -154 -33 18 46
7838 46 -117 131 -44 -80 -6 -57 -8 148 -74 -78 -31 21 60 -151 192 -191 -35 -69 -313 -149 147 -85 -21 -138
7862 -138 -184 -184 -8 -111 32 -206 -226 111 20 115 -109 44 -51 -9 50 -125 13 88 117 -255 -94 -14 -190 -104
7886 -104 -141 120 -115 165 40 -68 -5 45 -33 118 34 -102 38 203 14 -1 -68 -24 -277 -16 -255 75 -39
7909 -39 -343 15 15 -21 34 -45 -24 -245 5 188 -50 -130 48 0 94 53 -22 -10 -149 182 91 130 -74 -199 167
7934 167 -100 2 156 116 -208 163 43 9 -43 -106 117 73 -158 75 130 102 46 8 174 97 126 -130 -181 -92
7958 -92 -8 -63 34 68 64 57 -228 344 -64 -188 60 -72 -55 29 -68 -34 -32 -206 -226 45 -21 -221 -173 -77 -186 147
7984 147 -5 -187 65 79 26 -223 -90 153 -163 -7 78 -45 127 57 13 -29 93 68 274 141 -160 -151 400
8007 400 -60 111 60 -113 -66 100 -108 -165 185 -26 -44 270 48 -85 90 96 28 324 137 78 -50 76 -28
8030 -28 49 -45 -356 97 104 46 19 79 92 -82 241 59 51 -34 -106 -246 73 174 -505 36 41 15 -11 30 -11 29 229
8057 229 -203 104 432 -139 -226 186 -49 -109 191 -48 -184 -34 55 -40 56 121 -40 -75 40 46 -133 295 66
8080 66 16 38 -17 -250 217 49 -192 282 -79 -75 303 -129 -221 223 223 -375 -99 20 -307 -137 15 37 48 131
8104 131 -145 -80 163 108 -161 13 99 -27 54 49 -45 235 -190 -301 52 86 -278 -11 91 37 -92 167 5
8127 5 -122 196 -207 -283 156 172 -333 38 50 76 -50 44 -36 -70 -3 240 -360 10 -35 -106 274 -92 22 -11
8151 -11 -110 40 402 177 -155 49 -35 52 -224 64 0 -33 28 -188 166 247 -86 -76 211 -43 -292 -34 3
8174 3 -198 15 -17 -109 246 93 -220 -100 103 -88 -138 443 -75 150 54 166 -96
8191i6
##END NTUPLES=NMR FID
##END=
