##TITLE=1H_Pr AmC7
 CDCl3,8 sc, 
 27.10.2021
##JCAMPDX= 6.0         $$ Bruker NMR JCAMP-DX V2.0
##DATA TYPE= NMR FID
##DATA CLASS= NTUPLES
##ORIGIN= UXNMR, Bruker Analytische Messtechnik GmbH
##OWNER= root
$$ XWIN-NMR		Version 3.5
$$ Wed Oct 27 11:39:26 2021 Russian Standard Time (UT+4h)  she@DPX200
##.OBSERVE FREQUENCY= 200.1313468511
##.OBSERVE NUCLEUS= ^1H
##.DELAY= (6, 6)
##.ACQUISITION MODE= SIMULTANEOUS
##.ACQUISITION SCHEME= undefined
##.AVERAGES= 8
##.DIGITISER RES= 18
##SPECTROMETER/DATA SYSTEM= spect
##.PULSE SEQUENCE= zg30
##.SOLVENT NAME= D2O
##.SHIFT REFERENCE= (INTERNAL, D2O, 0, 15.7039)
##AUDIT TRAIL= $$ (NUMBER, WHEN, WHO, WHERE, WHAT)
$$ ##TITLE= Audit trail, XWIN-NMR		Version 3.5
$$ ##JCAMPDX= 5.01
$$ ##ORIGIN= Bruker BioSpin GmbH
$$ ##OWNER= she
$$ F:/spectra/data/she/nmr/H-F/1/audita.txt
$$ ##AUDIT TRAIL=  $$ (NUMBER, WHEN, WHO, WHERE, WHAT)
(   1,<2021-10-27 11:38:25.25 +0400>,<she>,<DPX200>,
      <created by zg, POWCHK disabled, PULCHK disabled
       configuration hash MD5:
       00 E9 B6 7A A2 85 ED C7 34 08 36 98 17 FE 4E 26
       data hash MD5: 16K
       28 B7 7C C6 CD B3 74 D9 75 11 E6 F6 F6 01 20 7B>)
$$ ##END=
$$ 
$$ hash MD5
$$ 71 0B 0B 60 05 BB CC 37 EB 02 32 9E C1 41 05 0B
##$RELAX= 
##$RELAX= 
##$RELAX= 
##$RELAX= 
##$RELAX= 
##$RELAX= 
$$ Bruker specific parameters
$$ --------------------------
##$DU= <F:/spectra>
##$EXPNO= 1
##$NAME= <H-F>
##$PROCNO= 1
##$TYPE= <nmr>
##$USER= <she>
##$AMP= (0..31)
100 100 100 100 100 100 100 100 100 100 100 100 100 100 100 100 100 100 
100 100 100 100 100 100 100 100 100 100 100 100 100 100 
##$AQSEQ= 0
##$AQ_mod= 1
##$AUNM= <au_zg>
##$AUTOPOS= <>
##$BF1= 200.13
##$BF2= 200.13
##$BF3= 200.13
##$BF4= 200.13
##$BF5= 200.13
##$BF6= 200.13
##$BF7= 200.13
##$BF8= 200.13
##$BYTORDA= 1
##$CFDGTYP= 0
##$CFRGTYP= 5
##$CHEMSTR= <none>
##$CNST= (0..31)
1 1 145 1 1 1 1 1 1 1 1 1 1 1 1 1 1 1 1 1 1 1 1 1 1 1 1 1 1 1 1 1 
##$CPDPRG= <>
##$CPDPRG1= <>
##$CPDPRG2= <>
##$CPDPRG3= <>
##$CPDPRG4= <mlev>
##$CPDPRG5= <mlev>
##$CPDPRG6= <mlev>
##$CPDPRG7= <mlev>
##$CPDPRG8= <mlev>
##$CPDPRGB= <>
##$CPDPRGT= <>
##$D= (0..31)
0 1.2 0 0 0 0 0 0 0 0.06 0 0.03 0 0 0 0 0.0002 0 0 0 0 0 0 0 0 0 0 0 0 
0 0 0 
##$DATE= 1635320304
##$DBL= (0..7)
120 120 120 120 120 120 120 120 
##$DBP= (0..7)
150 150 150 150 150 150 150 150 
##$DBP07= 0
##$DBPNAM0= <>
##$DBPNAM1= <>
##$DBPNAM2= <>
##$DBPNAM3= <>
##$DBPNAM4= <>
##$DBPNAM5= <>
##$DBPNAM6= <>
##$DBPNAM7= <>
##$DBPOAL= (0..7)
0.5 0.5 0.5 0.5 0.5 0.5 0.5 0.5 
##$DBPOFFS= (0..7)
0 0 0 0 0 0 0 0 
##$DE= 6
##$DECBNUC= <off>
##$DECIM= 32
##$DECNUC= <off>
##$DECSTAT= 4
##$DIGMOD= 1
##$DIGTYP= 9
##$DL= (0..7)
0 120 120 120 120 120 120 120 
##$DP= (0..7)
150 150 150 150 150 150 150 150 
##$DP07= 0
##$DPNAME0= <>
##$DPNAME1= <>
##$DPNAME2= <>
##$DPNAME3= <>
##$DPNAME4= <>
##$DPNAME5= <>
##$DPNAME6= <>
##$DPNAME7= <>
##$DPOAL= (0..7)
0.5 0.5 0.5 0.5 0.5 0.5 0.5 0.5 
##$DPOFFS= (0..7)
0 0 0 0 0 0 0 0 
##$DQDMODE= 0
##$DR= 18
##$DS= 0
##$DSLIST= <SSSSSSSSSSSSSSS>
$$ [...]
##$SUBNAM2= <"">
##$SUBNAM3= <"">
##$SUBNAM4= <"">
##$SUBNAM5= <"">
##$SUBNAM6= <"">
##$SUBNAM7= <"">
##$SUBNAM8= <"">
##$SUBNAM9= <"">
##$SW= 18.0517286264689
##$SWIBOX= (0..15)
0 0 2 0 0 0 0 0 0 0 0 0 0 0 0 0 
##$SW_h= 3612.71676300578
##$TD= 16384
##$TD0= 1
##$TE= 0
##$TE2= 300
##$TE3= 300
##$TEG= 300
##$TL= (0..7)
0 120 120 120 120 120 120 120 
##$TP= (0..7)
150 150 150 150 150 150 150 150 
##$TP07= 0
##$TPNAME0= <>
##$TPNAME1= <>
##$TPNAME2= <>
##$TPNAME3= <>
##$TPNAME4= <>
##$TPNAME5= <>
##$TPNAME6= <>
##$TPNAME7= <>
##$TPOAL= (0..7)
0.5 0.5 0.5 0.5 0.5 0.5 0.5 0.5 
##$TPOFFS= (0..7)
0 0 0 0 0 0 0 0 
##$TUNHIN= 0
##$TUNHOUT= 0
##$TUNXOUT= 0
##$USERA1= <user>
##$USERA2= <user>
##$USERA3= <user>
##$USERA4= <user>
##$USERA5= <user>
##$V9= 5
##$VALIST= <valist>
##$VCLIST= <CCCCCCCCCCCCCCC>
##$VD= 0
##$VDLIST= <DDDDDDDDDDDDDDD>
##$VPLIST= <PPPPPPPPPPPPPPP>
##$VTLIST= <TTTTTTTTTTTTTTT>
##$WBST= 1024
##$WBSW= 4
##$XGAIN= (0..3)
0 0 0 0 
##$XL= 0
##$YL= 0
##$YMAX_a= 63117
##$YMIN_a= -95168
##$ZGOPTNS= <>
##$ZL1= 120
##$ZL2= 120
##$ZL3= 120
##$ZL4= 120
##$ABSF1= 10
##$ABSF2= 0
##$ABSG= 5
##$ABSL= 3
##$ALPHA= 0
##$AQORDER= 0
##$ASSFAC= 0
##$ASSFACI= 0
##$ASSFACX= 0
##$ASSWID= 0
##$AUNMP= <proc_1d>
##$AZFE= 0.1
##$AZFW= 0.1
##$BCFW= 1
##$BC_mod= 2
##$BYTORDP= 1
##$COROFFS= 0
##$CY= 11.3945322036743
##$DATMOD= 1
##$DC= 2
##$DFILT= <>
##$DTYPP= 0
##$F1P= 2.36226072786647
##$F2P= -0.459571619588291
##$FCOR= 0.5
##$FTSIZE= 0
##$FT_mod= 4
##$GAMMA= 1
##$GB= 0.15
##$INTBC= 1
##$INTSCL= 1
##$ISEN= 128
##$LB= 0.24
##$LEV0= 0
##$LPBIN= 0
##$MAXI= 10000
##$MC2= 0
##$MEAN= 0
##$ME_mod= 0
##$MI= 1.114404
##$NCOEF= 0
##$NC_proc= 0
##$NLEV= 6
##$NOISF1= 3.799351
##$NOISF2= 2.8
##$NSP= 1
##$NTH_PI= 0
##$NZP= 0
##$OFFSET= 15.70392
##$PC= 1
##$PHC0= -15149.86
##$PHC1= 8.000819
##$PH_mod= 1
##$PKNL= yes
##$PPARMOD= 0
##$PSCAL= 0
##$PSIGN= 0
##$REVERSE= no
##$SF= 200.130013532006
##$SI= 16384
##$SIGF1= 3
##$SIGF2= 2
##$SINO= 400
##$SIOLD= 16384
##$SREGLST= <1H.CDCl3>
##$SSB= 0
##$STSI= 0
##$STSR= 0
##$SW_p= 3612.71676300578
##$SYMM= 0
##$S_DEV= 0
##$TDeff= 0
##$TDoff= 0
##$TI= <>
##$TILT= no
##$TM1= 0
##$TM2= 0
##$TOPLEV= 0
##$USERP1= <user>
##$USERP2= <user>
##$USERP3= <user>
##$USERP4= <user>
##$USERP5= <user>
##$WDW= 1
##$XDIM= 8192
##$YMAX_p= 0
##$YMIN_p= 0
$$ End of Bruker specific parameters
$$ ---------------------------------
##NTUPLES= NMR FID
##VAR_NAME=  TIME,          FID/REAL,        FID/IMAG
##SYMBOL=    X,             R,               I
##VAR_TYPE=  INDEPENDENT,   DEPENDENT,       DEPENDENT
##VAR_FORM=  AFFN,          ASDF,            ASDF
##VAR_DIM=   8192,          8192,            8192
##UNITS=     SECONDS,       ARBITRARY UNITS, ARBITRARY UNITS
##FACTOR=    0.0002768,     1,               1
##FIRST=     0,             0,               0
##LAST=      2.2672688,     0,               0
##MIN=       0,             -95168,          0
##MAX=       2.2672688,     63117,           0
$$ Real data points
##PAGE= N=1
##DATA TABLE= (X++(R..R)), XYDATA
$$ [...]
1819b24j39l8J13k25q7K35O6kNQ0L5M8Q7L75k33J93q6Mj87L30j2O5j46o3J61M2
1845C97l56l5L8q7l8m03N28l06n3j99K44j45N0l8J91K5M3J91j14J68j26K97K4
1868B96j5k36K34j15K87k56J06j9j88P4j87l15K33J0K2j28k12J75k98K1K73p2
1890c10P9n7K1L78l4n8M14k30j43K91m41K72J12j19P3j52p4P7Q7P2k56j26k80
1913d04k8K28R6l59j58M24l4N3j85J43K88n4j68K43k2L71k35L5P8P7k06K70j79
1936B74m2J29l6j38l9oj36k04M2N5l6j0J10l07O1J53K3p3K2J50j15p1K53J2P3
1961A44n8K00J11K9k77l4K21k33j43L28k79K39m39rJ29J30j82k99K32n1q9J67
1983a63j13L4OL00k19J89J48k5K1r1J01J15K20k09J25k53L49m10J72j80j96L10
$$ y = [-224, -363, -401, -288, -513, -600, -365, -299, -301, -296, -216, -181, -133, -46, 329, 96, 289, 203, 207, 20, 350, 338, 403, 257, 194, 355, 397, 41, 6, 44, -43, -81, -484, 44, -262, -315, -514, -270, -415, -365, -403, -212, -187, -144, 47, -67, 101, -25, 272, 296, 281, 45, 279, 164, 451, 195, 301, 282, 94, 168, -19, -334, -101, -91, -69, -197, -409, -234, -532, -511, -238, -310, -231, -288, -267, 111, 77, 19, 433, 203, 60, 351, -90, 182, 294, 175, 248, 96, 22, 99, 186, 258, 2, -124, -404, -432, -204, -108, -467, -625, -201, -235, -182, -367, -224, 64, 10, -158, 85, 63, 434, 199, 234, 312, 389, 183, 453, 274, 232, 361, 325, 187, 148, 142, 6, -198, -156, -101, -137, -147, -37, -344, -283, -130, -107, -180, -158, -8, -123, -194, 59, 71, 144, 86, 286, 397, 426, 149, 115, 336, 103, -40, 288, 9, 248, -191, -200, -71, 59, -123, -422, -190, -241, -330, -163, -276, -242, -236, 64, -155, 34, 182, 157, 178, 87, 188, 303, 523, 314, 439, 186, 535, 125, 297, 117, -79, 231]
2005B31k59O4l59K9k30K64M0j79K75m3Q1k0OJ56k26J75pK13K9j64K92j68J80j51
2029B29j12m9R0J8j28J18m88mK58L0j64r0J30J70j99j23j4O4o4J49k25K91j63
2052b76M0L44K55r0j4K44p5j39N9N3k89K7j31j49J54K1p6J7j43m4k6o2j27K43
2076a84k21K54m0m8p7M09N9o2l3P9j13K20j06N2J48k88M6K05J83q7J3n42J52m
2100A5o4k8j08O5k5o5K49j9k8m17K06J84j6j95K55J91j96N3J46J03pR4k65N2q
2125A72J20J2j60J51j71j32q8J94k65p9o9J37K75k40l2j43JR5J20j10K74m39L61
2148a6K43j64J26k8r4J28k5J53j84r6K43M1r7k98J24j54q7LJ49l8j48j19L3j81
2172d86K95j55Q6J73r9K52j23o4J88L6%J16N2o6l0j07K76k87K67r4j35O2j65n5
$$ y = [231, -28, 36, -323, -294, -524, -260, -220, -399, -124, -167, -86, -106, -100, 56, -170, 5, -2, 211, 240, 76, 368, 200, 380, 229, 117, 68, 158, 176, 48, 166, -322, -326, -68, -38, -202, -292, -162, 8, -191, -314, -328, -264, -328, -179, -404, -113, -276, -236, 108, 363, 273, 259, 503, 428, 289, 348, 401, 112, 139, 8, -141, 13, 34, -42, -25, -168, -212, -238, -300, -427, -184, -405, -151, -191, -239, -316, 93, 152, 90, 57, 136, 23, 243, 137, 189, 337, 49, 95, 300, 483, 396, 409, -133, 19, 15, -49, -77, -185, -120, -145, -210, 39, 20, -8, -425, -219, -35, -51, -246, 9, 200, 4, 57, 203, 306, 299, 393, 128, 180, 172, 292, 304, 144, 295, 124, -8, -96, 98, -167, -246, -315, -178, 97, -143, -175, -318, -317, -222, -102, -212, 62, -377, -16, 227, 63, 189, 161, 67, 195, 170, 323, 139, 43, 286, 327, 230, -68, 56, -98, -185, -182, -33, -71, -219, -338, -305, -486, -191, -346, -260, -87, -186, 66, -57, -121, 67, 103, 103, 219, 271, 205, 175, 68, 344, 57, 324, 230, 95, 157, -8, -63]
2196f3J94j67m5k01R4O6l4J19k46O5Q8J54n7Kn9J42O3k14P8M05j59O9j82J98j7
2221B93k14K45j18k48R3P6l09J18o9K28j50o3K02k04j33K18j28j84p5L41n1J99
2243F7J74m01L23J1J95M1q0k10P5k2K27N6m15R7j99Nn1j03J24j31L91k67Pr5j95
2268c76L60j13j32L18k18J97m62M67J53JO7j86O0N2j88K6J68j62j04R4k25L10
2290A07p5j80Q1k06J98J02j70k32J72J14j43J09j26K80k8j14J66J55j82q6Q2q4
2312f0K65j12K27j47J39k70J45J06k14k32J52rl10Q0k78J73R9N8K3r2L11l83K95
2335c4J6K35j88n6m2J87j98J35j6J98k05K24j24P7j3r7Mj76N3q1p9J81l09J65
2359a43N7r7k9j22K09j97J9K82P4j37L56m1j33J39j15J41k09N9O9n3J95j37N8
$$ y = [-63, 131, -36, -81, -282, -188, -122, -156, -37, -283, -218, -130, 24, -33, -31, -90, 52, 115, -99, -21, 384, 225, 294, 112, 310, 293, 79, 324, 206, -42, 51, 127, -182, -64, -133, 95, -55, -118, 84, -120, -253, -35, -163, -347, -422, -81, -132, 67, 241, -160, 163, 174, 369, 410, 330, 120, 195, 173, 400, 456, 41, 138, -61, -56, -107, -210, -86, -217, 174, -93, -86, -181, -376, -16, -129, -261, 57, -161, 36, -426, 41, 194, 195, 262, 76, 136, 188, 0, 26, 194, 32, -72, 22, -203, 107, 32, -148, -67, -273, -75, 27, -143, -375, -203, -89, -232, -123, -249, 31, 3, -111, 55, 210, 28, -58, 24, -60, 205, 93, 320, 173, 312, 42, 187, 293, 79, -153, -1, -10, -320, -240, -518, -345, -246, -188, -165, -257, 54, -329, -34, -18, 217, 29, -27, -69, 118, -80, 55, 39, 237, 32, 256, 132, 209, 196, 99, 103, -73, -20, -101, -180, 1, -308, -143, -86, -183, -212, -334, -125, -322, -303, -21, 53, -84, 272, 231, 98, 237, 122, 263, 54, 113, 182, 129, 324, 187, 245]
2382B45k78k2J8J56j02k02j71J30jK0j8k28K45j10J75q8L85l72L94Pj15J62Rl43
2406a04N56j89k15J35j28M2K22l43J21j03j75O6N6j86l5K31k78J21k39L35k67
2427c77K80L5O6J16k2m4L17k94O6K19j24k57K17l6j94K53j05J0q8j54M42j60k5
2450A41j38k45j25L59k60J75j12J76j59J53K2k44K60J07M7J48k37M3J49q9P0r1
2472A50rq6J39j35K29k11k5qKj87J07j14O0j43L0k34J62K73m9j97N1J75O9r4R0
2497D5O1R0r4J57J51p2k54K11k73J29R2r1k04J63j08l45K46j74N5J57J89l81K43
2520gk11J72K63j38j93j85M17j07O6J10k40Q2l2J26p0p5M06k93R2k89mJ42j4M3
2544F1j56j99k6J52o3K41l69J83k46L02J3r2K68j06n8J49K8N8p2j27m2L30k01
$$ y = [245, -33, -55, -37, 119, 17, -185, -356, -226, -227, -207, -225, -453, -208, -318, -143, -231, 154, -218, 176, 183, 68, 230, 239, -104, 452, 263, 48, 183, 55, 97, 319, -24, 97, -6, -181, -115, -59, -245, -280, -49, -327, -206, -445, -110, -377, -97, -62, 4, 120, 98, 54, 371, 77, 143, 362, 238, -19, 198, 162, -32, 221, 116, 126, 38, -116, 326, 166, 141, 3, -242, -367, -8, -268, -93, -205, -29, -188, -35, -13, -257, 3, 110, 157, 305, 68, 111, 260, 171, 241, 150, 141, 55, 194, 59, 288, 77, 52, 44, 46, -141, -34, -148, -88, -231, -201, -435, -273, 0, -49, -246, -195, -20, 49, -45, 45, 106, 196, 102, 259, 410, 338, 84, 295, 22, 151, 243, 152, -52, 111, 3, -342, -96, -270, -215, -58, 131, -250, -7, -218, -46, 217, 79, -114, -299, 118, 11, 77, 187, -53, 29, -3, 123, 53, -22, 384, 91, 183, -106, -110, 32, 18, 61, -95, -294, -320, -168, -231, 10, -359, -176, -422, -120, -107, -199, 69, -37, -95, 54, 82, 140, 68, -59, -101, 229, 28]
2567B8K43k10r9K30k53o0J09j02j70J44k47J71J53l38M93q7k32J01j15J89k32
2588b84M7K54L3J30O1N4J51k31J01j10j63r7K22k4j57J21L5j12M5n09N04L2j72
2611f9o9j41J60J61k46L28j96k25L38l0n8K09r7j16J01l0J54n6R5j60Q1j17J97
2634B14l27K35k12P1m3j13j9J90j75J9j19r8J65K90j01k32J45K88j10J83k55j69
2656a73L93K32l44j4M35m10rJ25P5j64k03K57m6o6M3j60n7k50Q4P9p9J9K0j02
2680c15RN12k08j01K58m6K01j70k48K09k03K08j1K9n8J53l06K97k35J09j03J65
2702A46j62j15J0O2L9j67J49j23J39o4n6K9NJ91N2j93J01N1m9K17L8l24L82k39
2726A19j58J99j26j98K79l55J41K19l76J96J5P9j13Q9k82M01l70N0Kj59L13N2
$$ y = [28, 271, 61, -38, 192, -61, -121, -12, -114, -284, -140, -387, -216, -63, -401, 92, 5, -227, -126, -241, -52, -284, -237, 17, 50, 180, 241, 295, 446, 215, 316, 206, 43, -54, 168, 144, -13, 108, 143, 31, 76, -433, 71, 103, -69, -138, -279, -119, 42, -204, 124, -72, -297, 41, 11, -47, 162, 65, -51, 50, 20, 174, 118, 213, 53, 134, 17, 214, -113, 122, -90, -19, -62, -175, -194, -4, -179, -160, -279, -377, -212, 78, -23, -255, -110, 178, 68, 251, -4, -173, 220, 452, 108, 94, 529, 119, 110, 235, 310, 146, -57, 200, 154, 88, 131, -29, -86, -336, -252, -173, -252, -233, -213, -315, -306, 206, -2, -103, 155, 109, 310, 140, -108, 101, -102, 106, 95, 124, 66, 219, -87, 210, -25, 84, -19, 146, -16, -131, -121, -59, -20, -187, -38, -161, -22, -86, -142, -113, -108, 83, 135, -58, 43, 94, 45, 262, 300, -24, 358, 119, -39, 160, 34, -164, 115, -240, -99, 120, -256, -60, -45, 34, -79, 10, -272, 129, -241, -191, -189, -348, -35, 17]
2748A7J59n8q5J72K2Ok79M05k63K18k41J11j47j63M80l72q3pJ01j39K4o8J46J15
2772G1l11K47k16P8K32j76K9N2p4J28m7J78j4k11L51k27j58L01N2M1m44L38p9
2795A41k14P0p2q7L00m32J62j95J97K23j85K32k72k09L48L1R0j3kor7K03q4m0
2819H9R0j49J00J14j8J7k17K73l33j31L62k21k47J4j8J47j02J02N1J22o6l2j06
2842a59J50R2j84K43K27j69Mj69K25k3k90L10K0k26L34k86K1j76l6K47j96J02
2864F1j93kR0j91J1k63L41L31j47j3j5nJ63r2L6p2J72j34N1J06j58K1j05K6M8
2889F7j65r5L8K12k81r0J30m2K75Lk50J16K2J69r2k23J85O3L20k06Q9k04O2j17
2913a4J98k5Jp3J8j1k65J01Q0j71J15q7n2J01j46J63k70J82K09k57q3J71J24J79
$$ y = [17, 176, 118, 33, 205, 227, 233, -46, 359, 96, 314, 73, 184, 37, -126, 354, -18, -101, -108, -7, -146, -122, -190, -44, 71, -240, 7, -209, -131, 101, -75, -46, 6, -68, 60, 13, 191, 177, -34, 317, 90, -68, 233, 285, 326, -118, 220, 141, -73, -3, -75, -162, 138, -294, -132, -327, -130, 93, -92, 140, -132, -341, 7, 38, 128, 115, 113, 107, 10, 213, 129, 89, 179, 30, 130, 244, 226, 243, 26, 299, -34, -165, 197, -24, -271, -257, -275, -128, -230, -128, -77, 45, -21, -53, -159, -9, 83, -101, 142, 369, 200, 204, 35, 260, 237, -53, 257, 277, 51, 385, 99, 120, -56, -92, 155, -41, 61, -132, -134, -44, -235, -224, -487, -146, 185, 38, 25, 10, 5, 168, 76, 112, 40, 212, 78, 129, 235, 77, 98, -7, 19, 67, -98, -193, -155, 57, -224, -314, -184, -226, 49, 52, -198, -82, -60, 109, 17, -206, -21, 42, 362, 156, 245, 41, 103, -14, 184, 159, 160, 87, 105, 94, -171, -70, 10, -161, -46, -133, -185, -84, -230, -67, -337, -155, 54, -203, -286, -115, 9, 188]
2937A88j30j28K01j28L8L55k48l28n8K45o6L35m04K3M0o8J92j84m3J31k2K3l9
2960g5j60L73l79K23j75J96j97J48Q2J3Nj48L3J48K4Rj17j16L12r5r6N1j70J6
2984i5j49J73P6j47p8K58j19oJ0K48l14k2L2K75k98MK66k12K16k8J94k75rq0L00
3009B20k6o9N1J21k45R9j14N9O2l98J81j27P7r6m7J57Q2j01P9j08O0Q6K19J2j48
3034H6Nj54K26N1j12J05j59K03j41nJ77o7k96L5K3%j52L5j70R5K7q5K2K06m9J1
3060h3R4J92l76J59M8j49K63p6l1J39k30L05j17o3j7J15n8n9L7p7j4k1p0k31L44
3085B4k30O2K83l59J62n0J31j12K39k36j6L81j12l20L78j89K9o0j28N8J44J9j42
3108d4K68k16j07PJ68L2k70LK68p4k49J86j32k6nL11k15O3j57K52MJ45Qj81N7
$$ y = [188, 58, -70, 131, 3, 41, 396, 148, -180, -238, 7, -59, 276, -128, -105, -65, -133, 59, -125, -168, -37, -59, -36, -75, -235, 138, -241, -18, -193, 3, -194, -46, 36, 49, 54, -94, -61, 87, 111, 120, 3, -113, 199, 104, 8, 59, -111, -95, -244, -71, 5, -142, -220, 38, -81, -87, -77, 171, -143, -165, -133, 142, -156, -152, 114, -98, 118, 90, 284, 9, 0, -80, 220, 194, 125, 176, 297, 52, 151, 37, 96, 158, -240, -59, -186, -109, -205, -252, -95, -13, -114, -35, -143, -83, 3, 222, 234, 86, 91, -63, 163, 214, 102, 207, 48, 251, 110, 105, 282, 215, -81, -46, -23, -23, -175, -140, -310, -215, -188, -273, -251, -45, -94, -83, 11, 203, -173, -14, 34, -115, 148, 72, 41, 180, -50, 255, 138, 75, 58, 173, 115, 56, 93, 16, 2, -19, -89, -320, 24, -206, -144, 139, -220, -58, -108, 23, -89, 150, -86, -102, 279, 167, -153, 225, 36, 65, 5, -123, -65, 79, 98, -44, 224, 8, -99, -92, 76, 108, -162, -159, 109, 35, -214, -28, -160, -186, -191, 120, -95, -32, -189, 63, 67, 212, 220, 39, 96]
3133I6J65j35O2j37q6J46j71R8O7k18J67j1j89N2J63j33l83M65L4k30K43J7m8
3156C4j12p0J58j29K45j72J40J82j70l0k38J90l2K88r6m3r3k61L36m5j00p5J05
3179A2p7J11j76m3j12Q4R2k4J44jj26K27j20nP4K08r9k52J48P0J05l2j11j06J06
3204I7j94L07k97K24j84l06M07j53J42o3O1j38K40k30J43j31o3K46p3L3n0l9J
3227b0N6J11r7J73j55J91Nk93K59n7j37O6j67P0o5j12K42m16J27K85k41j08K85
3250Br2J14P2O3k19K96l66K07n4O9J56k11R7P0j79J81k03J17k56M5M8j24J69m
3274bk93J86k1J24n1LM8O3k61J87m9J67J65n7q0j18J69k96K00K1J47r5j36R5k07
3299i1J50j11J46O1k33M6l27M08j16K18k68P8p7M9P8K33j63j13J26M9l1K16k09
$$ y = [96, 261, 126, 188, 51, -35, 111, -60, 38, 105, -113, 54, 43, -146, -94, 69, -64, -447, 18, 52, -178, 65, 82, 34, -78, -148, 10, -119, 126, -46, 94, 276, 106, 76, -162, 28, -4, 284, 188, 145, 52, -209, 127, 82, -18, -93, 12, -65, 46, -130, -173, -285, -201, -109, -133, 11, 10, -116, 111, -9, -14, 60, 268, 169, -83, 65, 135, 240, 208, 97, -9, 97, -97, 210, -87, 137, -47, -353, 54, -99, 43, -20, 41, -97, 143, -87, 56, -75, -138, 108, 35, 68, 18, -21, -20, 36, 147, 50, 223, 68, 259, 264, -29, 230, 173, 36, 102, -65, 5, -60, -172, 70, -346, -219, 66, -175, -283, 2, -90, 24, 96, 159, -60, 236, -130, 77, 23, 92, 248, 37, 134, 204, 25, 206, 3, 120, -136, -91, -43, -167, 2, -2, -295, -109, -130, -6, -57, -54, -6, 57, -204, -17, -66, 101, 266, 209, 129, 11, 180, -116, 84, 105, 252, 157, 21, 116, -91, 59, -52, 94, 155, -78, -32, -359, 49, -67, 151, -117, -39, -116, -67, 11, 244, 81, -32, 94, 143, 112, 328, 119]
3322A19j4q3K56j85j46j6L54m04PJ82J7l51J07J54R5j37K0j53K98l20K50j43K24
3345A31j41m4J64j63L32j94q0K38Q3j57o8o9j3q6Q4K31j49o7k50K85M5k1k44j77
3369c30N7K0J62J29k6n4L7q1J34j4j4l9L6K36j46p6K7p1J07j69l3O4J22k24j5
3394a61J82K14j48N7j42j02Q3j93O2L08j95J40j31j43K02n6P5k2j62N6K47k9J02
3417B44j95r5P6j60J32j07J55k0qp1Ro3j03K52p4J19k14l60J98k71O54omk44J23
3442c3l0j91P0nK90k7J75r1J83j16k20K88o0k07k2M7nr6J24o6j47J66J05l81J97
3467e2j40k2K27J13j02K24j21N9j27M4l04K41l5Q9J15o4j21N4Q0k26K45j13j26
3490f2p1J50J29j84k4J9k47K74n8J20l31J23L63k62J04j79K06r0j87M02n4J22
$$ y = [119, 105, 22, 278, 93, -53, -69, 285, -119, -112, 70, 87, -264, -157, -3, 92, -45, -25, -178, 120, -200, 50, -93, 131, -10, -54, 110, -53, 279, 85, 5, 243, 326, 169, 101, 32, 19, -67, 17, 248, 99, 32, -218, 67, 112, 91, -153, -330, -273, -253, -91, 38, 12, -42, -5, -86, 48, 34, 20, -19, 17, 253, 107, 31, 58, -13, 94, -75, -108, -44, 78, -146, -161, 21, 235, 87, 144, 2, -100, -17, -210, -148, 160, -35, 105, -26, -169, 33, -23, 52, 30, -132, -76, 171, 142, 244, 49, -46, 30, -130, 2, -105, 50, 30, 22, -49, -40, -103, -206, 46, -28, 91, -123, -483, -285, -556, 98, 92, 88, -156, -33, -63, -254, -184, -189, 101, 74, 249, 158, 341, 225, 5, 293, 233, 26, 4, 51, 46, -50, 74, 8, -139, 27, 132, -249, -52, -192, -214, 13, 126, 24, 248, 127, 186, 59, 103, -201, 40, 5, 94, 209, 145, 24, 78, 158, -68, 177, 64, -62, -133, 17, 146, -38, -62, -43, -290, -16, -74, 46, -285, -162, 201, -61, 43, -136, 70, -20, -207, 195, 141, 263]
3512B63r6k02l1j38L78k93K6N5J19l84L81j80j70L45O9j06j85L0O3P6j16l7K73
3535A40k62J1J29K20p7k45L64l06p5N2J58J14J5j62J06k43J55k71K87l06L44K8
3557A76k82KJ59m6l26K80o8K0J30l18M67m78M17n4j67JL69j76k1M3M8l0Q6m1q4
3582A07q2J58r8R1j63j70j0K16j80K2J76j7r7K34l80K8P6P2J57O7l20K26r6K54
3606B71j99k48K04J55k16K93k16l6J6J61k3j69JM2k96N31m11n6J99k8o1Q9Q8l5
3630E6l6k48L77m8R4q0K9m1l02Q6J96k68J74pm3J30j42K43j03j17J9j8k28L37
3654F0P6o7j13J89K00k95L1j41K51m10L24k19J79P7p1J02j06J46j17j22n7K75
3676A92k38Q8j31k8J92j42J90j39j32Q7lrJ00j34r5K02n1M3J8q7j2K36q9l07M52
$$ y = [263, 167, -35, -66, -204, 174, -119, -93, -38, 81, -303, 78, -102, -272, 73, 142, 36, -149, -119, -56, 20, -96, -133, 140, -122, -111, 18, 238, 161, -84, 280, -26, -101, -49, 109, 223, 238, 76, 182, -61, 94, -177, 110, -196, 148, 176, -106, -104, 55, 9, -317, -37, -105, -85, 45, -273, 194, -284, 133, 79, -88, -87, 282, 106, 85, 128, 176, 146, 232, 191, 107, 25, 183, 85, 176, 13, -157, -167, 49, -131, -109, 67, 50, -47, 187, -193, -165, -89, -17, 140, 207, -113, 113, 17, 271, 72, -176, 28, 183, -33, 260, 44, 8, 24, 185, 162, -7, -6, 36, -260, 271, -140, -196, 3, -25, -86, 3, 91, 56, 20, -228, 149, 101, 195, 115, 144, 103, -199, -113, 83, -185, -11, -18, -61, 69, -73, 170, 67, -50, -31, -49, -277, 60, 136, 69, -44, 145, 345, 50, 81, -60, 191, -219, 105, -114, 65, 142, 71, 173, 67, 213, 96, -26, -83, 192, -46, 42, -89, -117, 75, -67, 123, -16, -148, -61, -64, -73, 27, -107, -202, 0, -51, -8, 10, -77, -89, 147, 58, -249, 203]
3701B03j95r7J55K3J57m72L17k7k5l2K57j24l29K81j28Kj49j00L67o8K6K1j48
3724h5k3j05K37Lj60L4K17J28J08k58l42L80k07M33n37K49K56j82j92J58n55K37
3746b06J85j81K6J18Q0n2m1J13K8Op5j9J64N7J88l70Q2J13j39k0j31L88j58J65
3770C21k89R1j67j01l7L81l67J59J63k53J11j20R5J2L3k12K4J20oK37j72j4k9
3793b0L3L2l5K74q7j72JJ13j95J4J97m5r7J55j66M5o6oj26J32K13k30K21j34r3
3818d2l8K7K1m0j19J12P3n9M27k89j35L61l13J61k82J36J11Q9n08O05j98l28K12
3841a6J08k20j0J77R4q3j06mN0R0l44K59L2K60j19j49K2j17K0Lj36J23J95j09
3865B0R9k75K60k45j2J65L7J43j50k28J8J72Q1k67J63R3o2N1jJ51N6j54j35J06
$$ y = [203, 8, -89, 66, 89, 246, -226, 91, 64, 39, 7, 264, 140, -189, 92, -36, -34, -183, -283, 84, 16, 42, 63, -85, -108, -213, 24, 27, -133, -99, 118, 246, 354, 96, -246, 134, -73, 360, -177, 72, 328, 146, -46, 112, -443, -206, -21, -202, -176, -58, 22, -30, -71, 42, 70, 76, 1, -18, 146, 203, 391, 21, 103, 216, 77, 57, -74, 314, 156, 321, 32, 123, -44, -145, -182, 199, -168, -9, 154, -99, 12, -108, -13, -1, 32, -180, -156, -36, -42, 195, 23, 9, -20, 13, 45, 10, 284, 197, 25, 26, 139, -56, -42, 155, 110, 13, 168, 2, 47, -19, -25, -151, -19, 194, -36, 185, 51, -42, -80, -53, -32, -72, -191, -79, -6, -65, 362, 73, -62, 299, -14, 147, -135, 1, 112, 201, -307, 298, 100, -228, -16, 92, -128, -138, 39, 133, 50, -56, -60, -10, 80, -264, -5, 27, 287, 168, 19, 41, -76, -56, -53, -189, -66, 129, 20, 119, -156, 104, -141, -153, 12, 49, 192, 42, -186, -168, 4, 85, -182, -19, 74, 12, 63, 62, 213, 269, 115, -20, 86]
3889H6o9r8J99M0k51R4K51K6m11J83j32m8O8n0K14p7O0k43R5l38L90J67m02L58
3913A12o5j15K29j59O4l6l14K90K14l17K47o6j38o8J46mQ7j77K13P9j72N7n1j96
3937a40NK74k19K3L9J65k11p9J57K0j28N25q42P43k45M5Q1k79J74k5j77R6q1K25
3961A46P9m57L34J3l7Q9k80J77J1J48j99j6R7j05j10k8Q7J67j5j25K77j23j87
3984e7J89oo4j28q2K44j7K4k03N7lJ9o0J99o9J58M3l2k86J54J8K6j55j25J29J06
4010G9J7j53J97k92K88J36l79jK59k48K56l17J49J32r3k19M04o9o7m8j36K0m1
4033a26K14j19j61J13J53K8j68R4J62j15j24R4L4r9M8k49K57n8KJ41p1J25n9j09
4057Gj36r7J37M9j18J04L8J20J2k33M0j20K12j18P5q8NK45k70K12j3m2j84K12
$$ y = [86, 17, -81, 118, 158, -93, 1, 252, 278, -133, 50, -82, -130, -62, -112, 102, 25, 85, -158, -63, -401, -11, 156, -246, 112, 47, -68, 161, 2, 66, 30, -284, 6, 220, -97, 150, 84, -54, -122, 24, 20, 107, -70, 143, 222, 50, 107, 56, -140, -135, 139, -80, -57, -18, 147, -64, -143, 14, 34, -94, 431, -411, 332, 87, 132, 213, -66, 108, 83, -94, 2, -79, 146, 225, -232, 102, 115, 78, 167, -113, 64, 75, 223, 24, 8, 105, 0, -110, -138, -51, 116, 101, -24, 253, 130, -57, 132, 126, 62, -66, -148, 96, 79, 103, -100, -43, -46, -27, -87, 112, 43, 201, 244, 212, -74, 80, 98, 124, -31, -156, -27, 79, 96, -57, 140, -152, 136, 272, -107, -108, 151, -97, 159, -158, -9, 123, 30, -189, 215, 146, 79, 31, -105, -85, -126, 88, -31, -192, -79, 74, 102, -66, 28, 190, 75, -49, 45, 79, -20, 28, -221, 36, -22, -20, 121, 50, 175, 116, 7, -129, -226, -89, -40, -158, -54, -16, 104, 116, -117, -77, -197, 15, -103, -28, -116, -111, 134, -136, 76, 63, 21, -163, 49]
4081D9J45m09l0L86j80J56j02J00rk74J52J95j16k8K5R5m8j53l3O9j73L0K2J20
4105a1j80N5O3j42J85J45k25L49k43J04k45L4K92k29lN7J30k14K26j51m2J62j52
4128c5J0J24pJ2j00L1Q1j76J41Rp4l8KM13l90O3j66K46r9p1p3K74k52Q7j04j9
4154a11K7P5l6J9n4rJ83k01k11J68J48q2j19m8M90k70L1qj42J71Q7M9k78K65k58
4179a14J93j11j17J26j31r8K89R8l06L20n1j4j58J76P6l93Q3K29j43K3k8j01L82
4202B30k56J44m8J65j68J10p3O4N6l4m0j26J66j82J4J04j86K15l74J49o9K71m51
4225c19L06J8m0J44k99P4k6J46j01o3R4J95r9m2K6J52k78L26l00K05l5K43l28
4248aJ17J00j86J40p8Kk92K36Q4k08L64m50N5O9L4L42J07o46M34l63qK88j68p1
$$ y = [49, 194, -215, -245, 141, -39, 117, 15, 115, 106, -168, -16, 179, 63, 35, 60, 155, 107, -46, -79, -10, -183, -153, -131, -11, -191, -136, -73, -215, -30, 115, -110, 239, -4, 100, -145, -111, 181, -48, -51, 6, 136, -78, 148, -3, -45, 117, -35, -25, 99, 92, 104, 4, 35, 116, -60, 81, 90, 16, -22, -20, 393, 3, 66, -100, 146, 47, -24, -97, 177, -75, 12, -92, -111, -84, -9, -45, -26, -80, -89, 94, -107, -318, -150, -2, -84, -203, -251, 239, -31, 0, -8, -150, 21, 108, 157, -121, 144, -114, 79, -32, -149, -23, -154, -252, 37, 135, -171, 149, 98, 84, -74, 102, 178, -215, -132, 97, -46, -23, -51, -152, 230, -26, 118, 70, 235, 67, 177, 104, 168, 224, 190, 150, 24, 190, 8, 22, 126, -60, 155, -219, -70, -139, 132, -319, -13, 5, -35, 109, -190, -116, -142, 4, -97, -160, -66, 129, 30, -12, 14, 166, -112, 214, -86, 119, 84, 327, -1, 116, 216, 30, 170, 92, 94, -198, 38, 122, -86, 278, -172, -117, -48, -14, 328, 435, -211, 223, -140, -148, 140, -28, -99]
4272i9K66P6l57L99l11r4J24J36k77K69o1J7j92k43M51J2j35j39J38K17k19m7
4294f9L16k8l69K12m7K49j13K4l49J38K6J01j25l1L3q6J08N9K00k26r4L14k21
4317B2J69j73j04m0N4J47j69J62J91m53O5K97j82O3J72q4j97J32k29K79oj38j4
4340c6M9j7J47m1j07M7k16J23L55k55K1k16j55K19P2mR2j10j0j67P0K32p2N0j22
4365e1k1K33o9j98K07ln7J19P0n27K34M06l08L27p61R4O36k95K25k71K01j58J84
4388B17m30K16k6k10K35J37k09J4L94k56j7j97L04j21p4l17j6L04OJ15Kj43j23
4411a95K75J77l52j5oj7J72l3K9l66K79K38m17K51r2J89Km8j00J3J36j17K84j63
4435A24m52K48N1J76o3j36o3K29K23m35M0k8P9k03L25l71Q7L9J73r9j32K84J9
$$ y = [-99, 167, 243, -114, 285, -26, -120, 4, 140, -137, 132, 71, 88, -104, -347, 104, 116, -19, -158, -20, 197, -22, -69, 247, 219, -150, 62, 15, 264, 151, 175, -174, -36, -10, 91, -34, -65, -32, -118, -10, 49, 249, 23, -71, 243, 22, 191, 18, -86, -126, -72, 75, -94, 68, 259, -194, -129, 168, -14, 49, 221, 137, -60, 72, -157, 122, 116, -22, -36, 13, -4, 143, 102, -5, 42, -174, -51, 304, 49, 70, -146, -301, -82, -10, -14, 78, -32, -42, -209, -139, 93, 21, 71, -51, -72, 161, 92, -106, 101, 98, 41, 160, 230, -297, -63, 343, 35, 362, -399, -305, 331, 36, 261, -10, 191, 33, 217, -213, 3, -23, -233, 2, 139, -70, -56, 338, 82, 65, -132, 172, 51, -23, -340, -356, -52, -46, 69, 71, -72, -195, 80, 257, -95, -110, -116, -133, 39, 6, 35, -331, -52, 186, -231, 20, -72, 117, 119, 71, -29, -16, 120, 3, 287, 124, -328, -80, -29, 147, 84, -52, -115, 114, 337, -98, -58, -86, -7, -210, 115, -256, -169, -130, 43, -56, -188, 96, 115]
4458A15j86nJ75l51K53k35R7J41K1j35K01k4p2J14J8k27q2J54J19j83L7N0j11
4481a16L76r4j78j0j45M63k89K10j83p3J96k03k4N9p5L4j11L50m31L51j90N0Q2
4504D9nP2j34j57K34j60m5J06o9J55L0J6M6j36J34Rp0J6j13P1k45J43j67K07Q9
4529G6j01k6k0j8p7J07m7NR7J52J84m03J10R8j89M4j52J20R3kQ2j86j46K6J52
4554b1J26k72L93j29k34k3M74l90K98n4l74N5J28J7J84%l22m4K24n0J23p7k2m0
4578c0r3L9k11L16M5r9L7k5Mp2M3j30K13k00L1Q7L6m5M5q7J25pl6k33J83J58o8
4605B6J07K9k87J16Q8n9j36N1j84L76j01Rj05o8m0J74Q8k91K93N5k41k0j01L89
4629A68L1j82L9k09k0L00Q8k45Mo0j05N4J05p4J26k07K96j03j6O9p0R6j05N1R
$$ y = [115, -71, -76, 99, -252, 1, -234, -137, 4, 25, -110, 91, 67, -5, 109, 127, -100, -182, -28, 91, -92, -55, -5, -116, 260, 166, -12, -22, -167, 296, 7, 217, 34, -39, 157, -46, -70, -11, -86, -52, -163, 187, -244, 107, -83, -33, 49, 44, 116, -18, -175, 59, -101, -146, -40, -109, 46, 76, 92, 138, 2, 136, 145, 75, 91, -22, 49, -196, -53, -220, -13, 76, -25, -51, -71, -89, -166, -59, -106, -101, -4, 148, 332, -71, 39, 137, -52, -8, -160, -40, 53, 51, 133, -53, -199, -173, -21, 105, -167, 226, 97, -137, -160, 314, -76, 222, 168, -206, -151, -23, -6, 178, 178, -144, -188, 36, -14, 109, 32, 10, -30, -123, -84, -295, 21, 66, -33, 4, -21, -17, -89, -46, -176, 37, -163, -132, -45, -9, -54, -9, -96, 29, 22, -14, -247, -64, 94, 26, 133, 162, -125, -9, 79, 20, -116, -65, -249, 127, 26, 35, -70, -138, -178, -4, 84, -207, 86, 141, -100, -120, -221, 168, 199, 17, 56, -153, -173, 127, 215, -30, -26, -86, -191, -137, -32, -106, 20, -187, 109, 6, -10, 59, -11, 85, -20, 31, 40]
4654D0K65l13J51j24j08R8q9K64k75J12l0j10K38k92J55K27j13k32J16q5L25k58
4676c8J08k9j29q4Q5L4J20Nk60K34l20K04j38K22l6j84K4L43o2Q1j26j87P3N4
4700fK3K63k91K2J53n7k40J93k8K9k13Q2q0L24j91N4P1j23p6Q5pn9j55M32l42
4725a37J24J3O8r3K48k74O1n7l9K57k31J37L78m52N2n0l4r3K6J61j00k8J46k14
4749a31k7J28J51k48J61l1P9j18J0J98R3l81lM8J0K7j55L09k28o7J52J31K87m51
4773e6K59l41K44j79J89P6k95M0K35j54j09K36j00J85l18P2l37P29n70M2m5K68
4795G1j54J61j02K5J33m01J52J77j16%J25j73K11O2l59L43j59r9P5N0O6l0k5k0
4819A3L02k61J20r5j74N2rK16l39K62l77K72O0j94M38l65K36q8R4k21L6L3J97
$$ y = [40, 305, -8, 143, 19, -89, 9, -80, 184, -91, 21, -9, -119, 119, -173, -18, 209, 96, -136, -20, -105, 220, -38, 70, 41, -88, -172, -87, -53, 67, 72, -188, 46, -274, -70, -208, 14, -22, -206, -182, 161, 99, 180, 54, -133, -60, -6, 17, 280, -11, 11, 164, 107, -133, 60, 32, 61, -152, -70, -150, 174, -17, 37, 108, -15, -91, -6, -13, -72, -227, 205, -137, -13, 0, 68, -25, 223, -51, 10, -47, -86, 171, -60, 77, 455, 3, 55, 5, -29, -122, -96, 65, -35, -63, 83, -131, -158, -30, 121, -127, 34, 3, 82, -36, -26, 172, 265, -116, -119, -71, -61, -34, -189, 120, -108, -175, -23, 108, 395, -56, 203, -138, 106, -73, 116, 192, -103, -63, 172, 18, -91, 145, 45, 230, -88, -16, -353, 376, -194, -152, -197, 71, -83, 78, -24, 1, 134, -267, -115, 62, -54, -54, 71, -102, 109, 171, -188, 155, -4, -103, -28, 22, 88, 58, 33, 13, 315, 54, 174, 79, -95, -43, -52, 164, -175, 87, -290, -18, 42, -152, 286, -79, 157, 69, 163, -58, -22, 11, 208]
4842B08k41j7m6J24m1p5q4K88k33J53j58o7Q3L55n81L75k11L39k55Q8k9j54P9
4865a00o0L62l95K57j8J02k68L91m06K31K04k71qm9r0J69r0P8m3J13j98J01J52
4888A64j54O6p1j92J68J07L1J09k52J81j59j34K21q7K25k68J02j30J63R0l18K1
4910a17J9J41J90l56J87j58J27l2n2J60j39j2j4N5K0K0J63l21J88J32k22j0m4
4933g5J39j51L24k70J00q4j12N8P7p9J67R6k68J23q1pK41M4p9l67J28O6k7k6M4
4958a9o9RJ15O4q7j02K60j23J19j56m1J6L28j13n26L94K47l40q6R8O4k34J07k5
4982a00J53k63P3rL21n47M24M2l58J55JJ49N1J36o14L52K25o8k29J43J24j96K00
5005A65j36J19k60J0K31k33N4L8R4p9K9m6M9l9l26L69q0J01l01K51J26l82K27
$$ y = [208, -33, -50, -96, 28, -13, -88, -172, 116, -117, 36, -122, -189, -106, 249, -332, 43, -168, 171, -84, 4, -25, -179, -100, -160, 202, -193, 64, 46, 148, -120, 271, -135, 96, 300, 29, 21, -28, -118, 51, -39, 39, -4, 109, -89, 12, 164, 10, 76, 5, -187, -19, 88, 119, 228, -24, 157, -2, -136, 85, -2, 223, -45, 57, -73, 90, 180, -138, -117, -98, 43, 233, -123, 64, -94, 33, 1, -51, 109, -30, -42, -56, -1, 19, 39, 202, -119, 69, 201, -21, -31, -75, 64, -87, 237, -33, 67, -17, -129, -71, 6, -73, 94, 190, -78, 45, -36, -43, 198, 242, 163, -204, -76, -10, -37, -63, -19, -88, -79, 36, 100, 13, -89, 171, 48, 167, 11, -30, -14, 314, 201, -325, 69, 316, -24, -110, -12, 52, -182, -75, -100, 53, -210, -137, -146, 175, -372, 52, 94, -264, -109, -108, 41, 92, 228, -386, -34, 191, 123, -106, 37, 161, -35, 165, 29, 148, -112, -102, 129, -104, -50, -12, 82, 3, 32, -14, 35, -4, -330, 39, -41, 60, -241, 10, 136, -246, -19]
5028a9L2L5j36k9n1L08j01k01K5l4J41p4K59k38J69l4k13J93q8n6J21q0J19r3
5052d5J28O3m9l7l33J56J46J4P7O1r8lK3k40L06k64J10J66l35N6K0L6K5n6Q8k44
5078b29k3R6J63lJ10j72r0K77q8J95l16O6r0J81j21J80p1j16K02N1j49j53Q6J51
5102A37J06l64N0k24L85J41k26l2L6Q0P2j98j48m5J41K68l37QJ26J74mOk71R5
5126b4j64L87k13l4J21J59l0L3k46j39J18Q5J92l07R8m7J8P0J25k26Jj28J07K10
5150A66Q3l10O4P8j02J5K30m41K50j58Q2J95j4q7j85K75k81M2K90j06j53J76M1
5173A50k83P0J18J26Q1l25K6L7k08J71K41l96J00J78r7K66k81L30m04J08R4l43
5195b41K31J24J04j48k5j59K29pk71J05j38J98o1j10J22j18J58K85k54O8r4Q4
$$ y = [-19, 13, 48, -88, -117, -168, 140, 39, -162, -137, -171, -30, -104, 155, -83, 86, 52, -161, 32, -56, -112, 9, -71, 48, -45, 83, 146, 97, 60, -273, -117, 29, 43, 120, 181, 83, 80, 103, -137, 169, -95, 15, 181, -154, -98, -78, -42, -17, -73, 15, -229, -252, -156, 7, 4, 114, -58, -148, 129, 41, 236, -80, -14, -104, 77, -44, 136, 65, -51, 151, 202, 53, -100, -14, 137, 243, -121, -71, -295, 90, 231, 5, -27, 9, 89, 161, -37, -185, -230, -89, 179, -158, -150, -24, 150, 146, 152, -119, -24, -188, 199, -14, -48, 73, 232, 202, 235, -11, -150, -32, 53, 245, -62, 36, -11, 7, 77, 202, -24, -23, -151, -44, 166, 249, -61, 3, 81, -21, -6, 224, -217, 33, -125, -43, 152, 138, 51, -134, 141, -140, -98, 192, 86, -67, 109, 150, -133, -63, 55, 181, 262, -63, -37, 0, -208, -37, 204, -192, -92, 86, -11, 255, -26, 304, -100, 8, 102, -241, -10, 114, 218, 70, 45, -114, 115, 108, -163, -58, -196, 2, -59, -169, -47, -165, -7, 278, 24, 92, -2, 82]
5217H2j47q9n5K03J98j06r9k4M7P4J48k70N4K08k54j11K11rnl3k02J40J74j02
5241C3m8k71M57j70J55m1j29L0j02O8j3N4JL7M3M2k44p6K57l41L89j99K15n2r1
5266DQ9o8p2K25l50J36J65j05k3L23l63R0J38j73p6R5j40P5k29Q7K64n1J20l8
5290A23J66k19k4l0r8J70r5J1l9j4j07K04n9Q3P5l25k1N1K71l2o5j56K60k15K03
5315A18j20J54j41l13R5K18K35j65k15j03K91j47J42k54K54k00J34RQ9j21J52
5336A12n3k1m3K67J1n82J62K15j0p9n2K54l34J84N5k28L14j24K23l42k4N6MK14
5360A79j03j17j25P7K96j19Rk86L52r5r5N9j81L0J86j60J17N1J19k49J0p8N0j14
5384a87J45o6K1J56k79J72l6J46K51l40K14j5k62K12p5k6p6J42L7m8j16Mp5K30
$$ y = [82, -65, -154, -209, -6, 192, 86, -13, -37, 10, 84, 232, -38, 16, 224, -30, -141, 70, 61, 56, 23, -179, -39, 135, 33, -15, -286, 171, 1, 156, 115, -14, 16, -86, -18, -31, 23, 24, 61, 104, 146, -98, -174, 83, -258, 131, -68, 147, 95, 4, 93, 25, -47, 178, -172, -36, 129, 24, 1, 324, -39, 51, 189, 16, -60, 35, -105, -30, -259, -172, 92, 41, 161, 123, 289, 70, 46, 16, -82, 88, -7, 4, -35, -49, -156, 48, -11, 72, 147, -178, -199, -148, 123, 91, 26, -130, 130, -85, 118, -2, 152, 11, -302, -207, 11, 246, 81, -134, -237, 54, -93, 49, -205, 49, -151, -17, -8, 81, -40, 112, 59, 38, -5, 262, 273, -309, -147, 68, 58, -21, -73, 181, -153, 31, 86, -142, 172, 48, 271, -71, -95, -39, -35, 179, 76, -41, -166, -89, 207, 88, 97, -189, 163, 68, -27, 32, -149, -119, 67, -93, 24, 75, 194, -55, -45, -123, -73, -187, -42, -108, -87, 69, -210, -38, -74, 72, 323, -17, 197, 182, -80, 132, 57, 31, -45, 97, 134, 86, -30, -26, -101, 129]
5408A29n1K6k89J32q3K31j06M3O3k84J82J52j42nL9R0j24K40o8n7j24P7Q3j28
5432B6M9J68l43R4k1q9k22K95J45j32p7J7O0o7K91j19j18J63j80q3J18J67j7j81
5456e6J45l68M48k38N2O4Q1j1j52N8J29k82J59J24k32M1J57J57k22P5o5n1q9o1
5480a37J50k0J03l3j51O4j89J15PL6P3k7M3j35K70l91K13J16r2j73J30N3q0l2
5504h7J23j3o9k58L99j3k45J60N3j4Q5j73J94m12R9j9J39M4K17k92K63l33N6K24
5528A28j45J08K8n5j9L7p2Nr6j32K76k74R1J93QJ6l9K66l27O9k5q7Pr8M5k3J32
5555A7j54N2k8p1J92p2L0K77l48q5J97j5K32k61P4R2j87k5K88k05rK32q8J8k03
5580e0L2L10k80j1j8K32k50j16J60j52J61m3P3J43k51Lj43O8K98j69R7L1k72n9
$$ y = [129, 78, 104, -185, -53, -136, 95, -11, 32, 95, -189, -7, 145, 3, -2, 37, 127, 3, 243, 175, 118, -6, 71, 154, 26, 75, 243, -100, -6, -27, -116, -338, -43, 102, -30, -107, -90, -30, -97, 194, 75, -43, 120, -60, -143, -25, 142, 125, -56, 89, -279, 169, -69, -17, 47, 128, 117, -35, 23, 152, -130, 29, 153, -79, -38, 119, 276, 54, 129, 64, 13, -76, -137, 13, -7, 96, 63, -88, -24, -213, -98, -91, -55, 18, -9, 34, -101, 169, -222, -9, 107, 15, -158, -28, 25, -55, -87, 36, 23, -46, -304, 95, 82, -163, -3, 50, 36, 121, -52, 142, -270, -171, -190, -51, -7, 210, -82, 181, -152, -96, 128, -17, 91, 119, 64, 45, 82, 10, 15, -81, -213, 63, -211, -120, 73, 81, 97, 58, 324, -3, 66, 41, -46, -39, -137, -92, -115, 17, -137, -85, -113, -184, 8, -64, -34, 243, -105, -190, 7, -8, 224, -37, 37, 129, -58, -83, 205, 0, -9, 223, 135, 153, -50, -18, 292, 12, 1, -17, 215, -35, -151, 9, -143, 18, -25, 48, 191, -60, -57, -200, -132, 166, -3, 94, 125, -147, -206]
5604b06L58p4j32jl4l85M01K08m0j69J25j42n7J14O2j5j83N5k5K55K8j58l6K73
5628B22K0k67J29j32O8J39k40oN0J27q8l2Jq5l3J87l5K8j04J26Q5l38M17j23o5
5653E1lk59L06k36j86L09J47q2K82k71m9J14j10M6J36k7k04n4j0L41m49J33m4
5676a19O0n5P0K10K0j36J66l03R9j43L53k34j94J30J8J76j6l5j4j9J2Q7j35J7
5700A5J26k6o4J38k07m5r2J11Ql8k6M6J90q0J65k60K44l11P3N4j22R7N1p2J1j13
5726a27M02m06K03J9l03K98k2opj94L1M6j78R7J84j42L80l36J59l1j7KP5k61N1
5751h3J56j31Q7N5j50j8K23r4k33L23p7k5j77K24j50J71l02Q6J31q5J42j98R7
5774b8L9O6O8j84j41R8L5L49m05K42r4p9J8r0L6L0j26K5K48j55j3J29k32M00k01
$$ y = [-206, 152, 78, -54, -55, -89, -474, -73, 135, 95, -74, 51, -91, -148, -34, 28, 13, -170, -115, -140, 115, 143, -15, -51, 222, 242, -25, 104, -28, 40, 179, -61, -67, -17, 110, 22, -10, -9, -94, -127, 60, 25, 53, -51, 75, 160, -178, 239, 116, 51, 48, -211, 95, -141, -327, -18, 129, 47, 329, 58, 9, 123, 13, 59, 195, 168, -36, -90, -100, 241, -208, -75, -119, -59, -114, -44, 166, 186, 50, 216, -87, 12, -131, 222, -12, -206, -76, -58, 118, 102, 67, 53, 34, 46, 133, -2, 15, 141, 115, 51, 189, -18, -63, -155, -44, -36, -74, -100, -54, 136, 56, 221, -39, 205, -106, -33, 21, -101, -4, 47, -25, -14, -127, 275, -131, 72, 91, -212, 86, 64, 58, 51, -143, -112, -66, -244, -147, 37, -105, 275, -61, 98, 67, 50, 52, 127, -134, -83, 73, -58, 29, 84, -66, -84, 139, 45, -188, 135, 58, 33, -144, 80, -70, 101, -201, -115, 16, -69, 73, -125, -28, 11, 77, 145, -39, -180, -82, -47, 302, -103, 139, 45, -34, -16, -106, -70, -40, -166, -141, 107, -48, -61, 68, -164, 236, 35]
5799C5N4m2J32l60K73n4P9p7q8N4o6Q5q7L3j68Q5P1J14K3R3r5K61l67P9j26R9
5825D0k71J38J28j81J85r0M58l54j6j07Q7K7kPn7L4l01K34J54l74J40R8Nk4L17
5850B75j70O1l49K55N0j36J75l64p4L89l88L14q9J86m0P2o7o2j27J50j30M51l53
5873B9J12j24n0n4M1J04k27J71j98J59m5J28k44K08j95K71qN1r4j44K3P9j26J50
5897A7J58j84j18J96k13K74k99%N25k66k44M52k84J49j57J48k99J74Jj79K20m2
5919B9k63J27L19q2kj65n7R2o2j91L31K6J56k06j25N1L7j4M6lj00N4KK34k7k45
5945c8q4N1K1P5J27j12n0K09j84Kj01j3j67K24L65n70M10p7J11j68M6jo7p6K1
5970d6j18RK96L25n01Q7k36J14J70L0j62K46k81k86N69l08J90n6j10j04J76K20
$$ y = [35, 89, 47, 179, -181, 92, 38, 117, 40, -48, 6, -60, 25, -62, -29, -197, -112, -41, 73, 96, 189, 94, 355, -12, 67, -59, 40, -231, -93, 35, -146, 39, -51, 407, 53, 37, -70, 17, 44, 42, 49, -8, 26, -275, -41, 113, -261, -121, -23, -18, -42, 275, 105, 166, -183, 72, 122, -14, 161, -203, -277, 112, -276, 38, -51, 135, 95, 167, 100, 38, -89, 61, -69, 382, 29, 141, 17, -33, -87, -46, 58, -169, 2, -196, -37, -82, 46, -198, 10, -185, 86, 78, 129, 35, -109, -86, -7, -133, 17, 175, -9, -127, 69, -144, 130, -169, -169, 356, 90, -154, 298, 14, 163, 6, 154, -145, 29, 30, -149, 71, 29, -234, -107, 212, 130, 128, -37, -94, -2, -64, -255, 76, 102, 258, 52, -73, -22, 15, 1, 47, 44, -56, -2, 0, 234, 207, -38, -122, -71, -50, 25, 152, 40, -10, 199, 15, 17, -84, -97, -264, -40, 325, -245, 165, 88, 199, 31, 77, 76, 9, -67, -46, -164, -155, 141, 466, -35, 52, -184, -70, 100, 130, -32, 214, -67, -353, 216, -92, 98, 42, -68, -172, 4, 224]
5992B24j81o4j21K76m08J58nJ27OK7J67q7k48N6K35k69L8J89k46J57r7P3L07k51
6016F3p9J69k56J27j37O8J67K6k86K27o9m8j65J68Pl3K03j34o9Q7m1k12N1K29
6040F3k50K82j80K04N1j37N1q8Q0k61M41j21j24j76N0L28k04n4J85l46K31Po7
6063c5L97l71J39j40Po2k5J61J4n2n5J29k22L34l4k28J8J89l4P6l55J55J58l10
6087a46L69j33k00o6K56j72K34m04L44k39L36n0j66k36L22K4l1O1m1k50J69j80
6109a99j74K68J70j50M8J60o0m4j73K74k54J92J9o5j06M2J4j56K12R2p8p5K58
6132B15l97L04N7R8p7k73J21r4R4j7Lk23K76Q8k22K9L9J76k07m4J29j24j71K19
6156ak31J97J04o7J00J18R7j54J1j22J38l30K42m7L9k33M6o2j15L3K35P2q2l2
$$ y = [224, 43, -21, -142, 134, -274, -116, -121, 6, 12, 39, 206, 119, -129, -73, 162, -107, -69, 120, -126, 31, -66, 7, 314, 63, -16, 153, -103, 24, -113, -45, 122, 148, -138, 89, 20, -28, -193, -25, -18, -51, 152, 18, -51, 36, -5, -217, -166, 63, -187, 95, -85, 119, 170, 33, 84, -4, 76, -185, 256, 135, 11, -165, -115, 213, 9, -45, 140, -206, 25, 32, -35, 362, -9, 130, -10, -3, -65, -90, 71, 85, 33, -22, 107, -115, 219, 185, -43, -25, 164, 130, 206, -149, 6, 164, -146, 223, 90, -110, -176, 80, -92, 142, -262, 82, -157, 179, 129, -37, -273, 49, 73, 42, 103, 62, -188, -19, -199, -373, -105, 65, -85, -37, 123, 63, 19, -154, 120, -134, 58, 77, 12, -94, -52, -38, -194, 18, 110, 32, -43, 215, -182, 122, 179, 277, 200, -73, 48, -46, 48, 31, 34, -189, 87, 175, -47, -18, 21, 197, -10, -54, 75, -49, -220, -1, -232, -35, 69, 2, 102, 220, 317, 163, 174, 52, 190, -140, 102, 55, 94, -139, -93, -155, -270, -237, -2, 70, -12, -44]
6180d4k6J61N0J12l14K3j14L19k14N8j60K02R6J9j81j09j8K71k47P5J27P0j09
6203D7L1j47J1L63m50m5J11Q6l8q8L38k33L11l01K81j59r6p7O5j16K77q9M1k20
6227i7J36j19k88M43k94K69j13J45P5j70J24k35kn5R2J11p8j41K55P4j41k69K97
6250A9Q5O0j92k11L83J39l09m1k2n7J86O9j00K5j40L5O3qP0p3J11j65O0j29L6
6275a06J82N5K0l16J40J46N6n2r4N0j66J55j07q7n8J84Qj41K23r8r1J7J24r5P4
6300B3J27n08K46R0M5l59J10K99j03L08l42J35k49M0PJ40M2P2j74J16j07J80j27
6323A1j09M1KJ04M1K27k95Lj2j63J11R5O6m0R6k94K08k73J77Q9r5J93q2k23l3
6348a55M70k97K0J42l6J41j64j24Q3M3r1m7Q2O9O8k45J87l38J59Q1PK7j65K39
$$ y = [-44, -70, 91, 141, 253, -61, -38, -152, 167, -47, 11, -149, 53, 149, 168, -13, -122, -140, 131, -116, -41, 86, 156, 47, 78, -69, -58, 305, -145, -190, -79, 7, -31, -119, 219, -14, 297, -4, 277, 118, 22, -55, 10, -106, 171, 82, 123, -97, 39, -80, -368, 75, -219, 50, -63, 82, 157, -13, 111, -124, -126, -181, -89, 22, -56, -197, 58, 132, -9, -278, 19, 104, 164, -28, -239, 144, 283, -26, -67, -89, -146, 40, 109, 9, 34, -106, -71, -8, -16, 54, -19, 92, -73, -13, -142, -106, 76, 131, 151, -165, -25, 121, 177, 125, 31, 81, -85, 70, -37, -124, -182, 2, 10, -131, 92, -6, -97, -80, 44, -51, 23, 150, -358, -112, -22, 23, -336, -226, 73, -30, 278, -64, 71, -178, -138, -131, 9, 51, 123, -51, 65, -42, 138, 11, -98, -57, -55, 49, 90, 317, 22, 25, 13, -150, -39, 56, 122, 82, 178, -116, 92, -181, -4, 85, -10, 183, 101, -122, -155, 315, 18, 38, 180, 144, 285, 121, -3, 80, 123, 32, -15, 67, 136, 204, -41, 146, -192, -33, 48, 55, 82, -83, 156]
6372A56k54J73Q6j86n9J28K6j01n8K60k76K59Ol69J95k23O6O5J71J7j44J91J46
6395B75l40J19rk2J81l59K78k67r5J76L3j27J37L4J44j74J60k8M7k79K69j82p7
6418a06J11j6L36l65K0K7J26J10k11l1J5j05j8Q6j72%L33k35N3j72N6L21j7j59
6442a3q3J4J03J37j81M4J2J71l66k2K29N8r3p7L30l68K56o4L6j89J86L1l78M86
6466B59n17L29j13m7K19l5O9Q7km04J14K40k59K81k41R7J73p1j60o2J04O7l41
6489b13L11j46l7J15n6j32J54J27j09j39J51j04J31j2l38K84J61K7l63M1L20k05
6511c2Q7R3m39M09m4n9J37k17J91q3J70k07Nk0k4j21J80J8m6j46L02k31Q4J45
6535A52m49L31N6j28j9j5n3M30l93k4J89n5j36L04J03m37J52j18J94r9j48J78
$$ y = [156, -98, 75, 161, -25, -84, 44, 70, -31, -89, 171, -105, 154, 160, -209, -14, -237, -171, -106, 65, 82, -62, 129, 275, -65, 54, 45, 23, 204, -155, 123, -144, -239, -63, -30, -157, -20, 14, 158, -16, 144, 116, 163, -116, 153, -29, -106, 5, -11, 325, -40, -20, 7, 133, 243, 32, 1, 16, -89, -107, -21, -193, -193, 140, -95, -42, -214, -158, 163, 146, -13, -96, -82, 21, 158, -23, 21, 33, 204, -162, -184, 45, 103, 10, -67, 263, -105, 151, 87, 123, -66, 120, 151, -227, 259, -258, 71, -42, -89, 130, 95, 164, 251, 249, -155, -41, 199, -60, 221, -20, 77, 250, 179, 19, -43, 61, 128, -213, 98, -48, -85, 30, -26, -158, -4, 123, 14, -125, 26, -78, 53, 41, -297, -13, 148, 175, -188, -147, 173, -32, 55, 148, -291, 118, 74, 15, 152, -65, 126, 43, 213, 6, 11, -9, -33, -154, 26, 44, -2, -148, 154, -77, 7, 152, -297, 34, 90, -38, -57, -72, -125, 305, -88, -112, 77, 22, -114, 190, 293, -144, 8, -110, 84, -15, -163, 15]
6557A5l0m0J10QK36k96m5j52K9L10r1K25j58k4J2O8o6q9j27j5O7J53j41q6P1J65
6583A09j14pJ13N4l8j35rJ52j66m2P9j04m1J73J82l17P1n5K17p4qj16K38l62K90
6608I0j53K54r7r6l48K87O6O8j67M2J14j35Q8r5K07J58l20K34k24J53k55K7J78
6631G6R2k8n8r8K06k31K53k07k4l9J26J30j31J57l27J48p1J62l40J43M24m43j7
6654i7J31Mk77K20r9J15j39J90n2J38p4J20j05j42K08j02pK5O1k60R2j02K56q2
6678B2J78k23Q2l5n1k07L39j89J80k89M01l69K02m1Q2j28k8P9J75k42K52j10j03
6701b3j5j36L15m6r4J24r7o8J55P6m00J75J31j84KO9o0k08N33q8j13k51K28r0
6725f5P9M6l23L0J34J88j3J75m23L20J08j23l58J70K22j76o2l7Q0p2L2J31j18
$$ y = [15, -15, -55, 55, 63, 299, 3, -42, -194, -165, 145, 54, 279, 121, 97, 109, 177, 111, 22, -105, -120, -53, 100, -41, -127, -56, 109, -5, -12, 101, 155, 117, -18, -27, 125, -41, -83, -4, -108, -149, 24, 206, -111, -40, -95, 122, 48, 40, -76, 162, -200, 90, -63, 191, 94, -2, -350, -63, 3, 71, -96, -54, 60, -75, 13, -82, 125, 283, -37, 197, -27, 126, -129, -102, 76, 168, 140, 82, -16, 190, -41, 212, 5, -19, -58, 68, 198, 67, 224, -103, 45, -26, 136, -204, -61, 363, -80, -97, 34, 38, -239, -19, -118, -3, -142, 48, -4, 134, 60, 180, 75, -67, 141, 39, 32, 57, 118, -142, -50, -152, 104, 22, 200, -23, 59, 24, -27, -234, 105, -84, 96, -193, 208, -161, 41, 0, 82, -46, -74, 5, 180, -62, 190, 80, -23, -38, -174, 141, 95, 1, 125, 28, -40, 115, 191, -209, -34, 97, -87, -85, -16, -76, -284, 249, 161, 48, -203, 25, -65, 14, 60, -263, -233, -99, 89, 76, 251, -172, 148, 256, 133, -225, -55, 167, -9, -71, -108, -28, -100, -68, 63, -55]
6748e5n9J25j06Q7L06l41p8J00r6O2L4O4j04J22j12jJ62j9om7k74nP5J4J7K05
6774G0p9p3Q4j09oO4K63r0J49m25K32r7N2q4lK61m71L43Rq0n8K48k15L98l67l90
6800c74M80q5r2j40J81K58j53O2j75jj40K93k57L93k85P7M6JM6l3K5l7o9J6r0
6825e3O7j9p2L2k7n1N1J9q2l3K63j54J47j58J75m6r4N1k02L66k66M1J97jn9J04
6851A96%k67O5K33j29j06j35J82L70k90P5k84J53o5J95j95LJ54k50j71P2L21j33
6874fK7m1O5M8q9pK19j93k24K01R0k41M41j44j13l54J63k0J19k15J8J33J67l3
6898A1M1L44l11k97%K34k05K72k14N4K38k25P7M4j9q0R6L43k96k28n7J01Q7p4
6922f4j29L55l41nJ96j71J50J4j32k15M74k54J52j42J07J6q8J39J08l34k5K45
$$ y = [-55, -114, 11, -95, -8, 298, -43, -121, -21, -117, -55, -21, 43, -61, 61, -51, -52, 110, 91, 85, 38, -236, -241, -166, -152, -135, 70, -9, -82, 2, -107, -113, -49, 214, 124, 273, -152, 80, -17, 35, -49, -52, 209, -262, 81, 90, 10, -48, 200, -15, 383, 16, -374, 106, 21, -71, -211, -30, 228, 75, 137, -38, -39, -179, 114, -143, 250, -35, 42, 88, 89, 135, 102, 127, 90, 21, 37, -53, 14, -5, -77, -45, -72, -123, -72, -53, -135, -168, 95, -59, 88, -70, 105, 59, -35, 16, -186, 180, -86, -45, 152, 151, 92, 196, 196, -71, -6, 227, 98, -8, -143, 39, 409, 119, 194, -90, 63, -2, 193, -2, 1, 155, -95, -266, -194, 127, -6, 21, -20, 45, 93, 4, -3, 216, 23, -201, 0, 90, -151, 290, 146, 33, -321, -158, -178, -59, -274, -256, -123, 44, 11, 52, 396, 85, -212, -212, 22, -183, 89, -125, -71, 167, -58, 19, 63, 44, -36, 60, 403, 107, -121, -178, -77, 10, -64, -193, 162, -179, -184, 12, -159, -9, 5, -127, -342, 132, -122, 30, -112, -5, 11, -77, 62, 170, -164, -189, 56]
6944E6L1L1Lk80K24l2K2J2J08k07L2K55l13j93K65j97O7J0K38jq1p5j22R6p3J10
6970a4q9J49o2Q9k51K12K37k63J74J00j75L5q2k33K42k08K78k17J28j25r0pK12
6993D0k88K42J47m7q0k62N13l42O4n5oK60l25J52O9J25r9j82K94l01j31J18K66
7016A72l94J85j54L29j10m1o6j26K91o8j13j57K60M3j95R0l5J66k62M00q1l09
7038a75J98mO5o4N8L3o7Q2N5j99j70K49J12k47P6j67J65p5o3O3J67K2l22L97j29
7063F0p0j70n9J95k79J53K60j49jR6K97j30k73j5O2m8j00N20o83L04O7K49j78
7086A08k30K02j31J52q5Q8j38J07j36K67k64L36j66M9N0l20L6K32l02k39N40N7
7108B13k97O8j14M8L9J3q7L19j58R3q3J39j12J19j52R3j37K2Q0j79J63o6j44K39
$$ y = [56, 87, 118, 121, -159, 65, 33, 55, 67, 175, -32, 0, 255, -58, -251, 14, -183, -116, -106, 132, 131, 50, -25, -147, -51, -124, -14, -103, 46, -16, 73, -178, 34, 271, 8, 182, 282, 107, 142, 60, -173, 69, -139, 139, -78, 50, -75, -165, -172, 40, -248, -6, 141, 94, 14, -248, 265, -77, -13, -68, -74, 186, -139, 13, 82, 207, 108, -74, 220, -81, -212, -94, 172, -222, -37, -191, 138, 28, -13, -79, -205, 86, 18, -95, -252, 8, 51, -144, -54, -89, 77, -185, 215, 134, -175, 23, 19, 84, 20, 78, 111, 44, 126, 181, -18, -188, 61, 173, -74, 2, -165, 0, -75, -138, -75, 92, 114, -208, 189, 60, -10, -180, -239, -44, -323, -170, 90, -59, -60, 36, 333, 203, -70, -85, -23, -71, -171, 349, -334, -30, 37, 286, 108, -122, 80, -51, 101, 16, 104, -34, 73, -63, 204, -60, 276, 110, 159, 209, -111, -75, 157, -145, -384, 156, 213, -84, -16, -130, -82, -43, -30, -117, 202, 44, 137, 54, 193, 81, 200, 48, 141, 4, 26, 106, -73, 90, 24, -120, 119]
7132A19j77P1J16j79J93m18M09k79L04N6q3l46J24K31j94Q5m5j44L7O1R5L1J17
7155A84j67k51oL85P8k06k03J22K27k7q1k37K72j90Q0j72K33k92L05m4j6l3J40
7178A01L4pl7m1J41j35j19L3Kpj4p1K42j66K3j11J48r8mR7j20r6L38r2L73j03
7204C11m37J21J58j19O8j36J55j79J70J40l04j6K69k07k71J20J01j9L45k94M0
7225A6j51l23L33j15K06R1j96J04J36k98k5K95j72L44k81K1o7l6J20K04r5J07
7247B18k40n3m7K13J63l29k0K13j81K72k8J01l57l5R0qk6J1K87o2k77J9M6J24
7271I4j9j52L69j65j6M8j48j59P6J17m0o9J53j47J97j39j03K27j59K43r8r8m2
7294c0P9j24L1K3n2J27P6P2l11J71K5N6m83J47K07K1j17P1J1K03k25m5J51j44
$$ y = [119, -58, 13, 129, -50, 143, -275, 134, -145, 159, 215, 132, -214, -90, 141, -53, 32, -13, -157, -120, -59, 36, 67, 184, 17, -234, -240, 145, 223, 17, -186, -64, 163, 136, 55, -182, 90, -100, -20, -192, 41, -251, 54, 10, -6, -39, 101, 135, 128, 91, 50, 191, 56, -63, -30, -28, -35, -49, -120, 122, -44, -21, -132, 16, -82, -86, 11, -109, -205, 133, 41, 414, 311, -126, -5, 153, 34, 102, -34, 121, -58, 112, 252, -52, -68, 201, -6, -277, -157, -56, -75, 270, -24, 16, -135, -458, -125, -240, -34, 57, -139, -35, 101, -197, -222, 73, -99, 245, -36, -15, -82, -118, 2, 206, 111, 218, -22, -75, -122, 91, 254, -75, -95, 118, -63, 209, 181, 282, -75, -110, -20, -28, -54, -43, 244, 182, -95, -76, -30, 94, 75, -77, 292, 127, 111, 159, 11, -148, -72, 45, 5, -64, 89, -58, 139, 0, -103, 124, -35, 208, 110, 12, -30, 49, -75, -44, -21, -73, 54, 130, 202, -109, 62, 87, 143, -340, -193, 14, 35, -82, -11, 0, 203, -22, -67, 84, -60]
7318f0J55Kj17K00k69p4Q8J1N8q8K26Oq5%R2m37M23j64kJ15j40J17l9j6K2j19
7344i5j9J33j48n2K89k00K7J98j57J62j73M8J07l02K57m6m7m6pk73M48k23J90
7367G1k8j50K93r3R0l00Q4O5q5Q7k3K00j59j25J48K20m44J8J62J0r9N4j09J64
7391E1j27J11k01K12j58J50O4rj55PR7j46J0L07l61J03j30K92l01N1J55J99j93
7414B8j55Q4l9j13M22j92Q9j13N8j95J23K53m97L35k71J00o8J40M9qm9Q2j6J54
7438B01k38k27J86QM0K5k0J41M1j11M8Q2k98K12j98j18J98J30m6j31k1J04n2K72
7462B28k26M2N8j75q4K32O6j11j5q3M7K8Q3m8j31K41j92K14q7J37j7r8j78K01
7486A32m07M09K8k23q7KL87l73K61j09OK24l18K81N8k66K03j38L5L0j92K16j03
$$ y = [-60, 95, 97, -20, 180, -89, -163, -75, -64, -6, -94, 132, 138, 53, 53, 145, -292, 131, -33, -35, 80, -60, 57, 18, 2, 24, -95, -114, 19, -129, -181, 108, -92, -65, 133, -24, 138, -35, 13, 120, -182, 75, 29, -18, -64, -71, -344, 104, -119, 71, 43, -107, 186, 93, 183, -117, -33, 32, -53, 34, 11, 211, 52, -73, 75, 295, -149, -131, 31, 41, -58, -4, -113, 51, -76, 35, -166, 46, -112, 38, 102, 93, -62, -55, 42, -104, -94, 213, -148, -45, -175, 117, -184, -133, 22, 221, 28, -127, -43, -82, -195, 227, 35, 124, 11, 69, -126, -3, 250, -247, 88, -183, -83, -151, -11, 38, 30, -19, 63, 47, 201, -37, -264, -78, -70, -30, -5, -25, 116, 157, 46, 94, 176, -122, 90, -108, -226, -28, 102, 56, -75, -96, 8, -44, 228, 2, 44, 102, -73, -157, 75, 141, 30, 15, -68, -21, 7, 90, 42, -89, 152, -40, 174, 87, 224, 207, 109, -69, 132, -275, 134, 162, -61, -148, -146, 241, -132, 129, 20, 26, 250, -68, 213, 271, 5, 208, 70, 105, 135, -57, 159, 56]
7509E6j47O4k16Q1j58L34j74J12q1q8J07j26M29k02n4J59j13K26k40M1P2m0k18
7532a76Jn0L88P2k02p6l3J86k41K4N2r8J50R3j56j0K1Q8K62m96L08Q5k00J94l45
7557a59L26j50j56L50j83p9K29k27P6k34K21j46K62q0M4j31K7L8k52L20m4J4M1
7580A07j44J86m6o8j86K06k33J57N8M1P9j93K10k40Q4J38k62j05J50L7J57j13
7602B0J03j09l7Pk47L72k69J98o4Q2n4lm2L3Q2j79L05k00K10j10J9k31Q0J68l67
7627b33J92M8J60l83Q0J88j04m7l7J36J53N8n01K22K43k3j45J14Q1K8j3k59q8
7650a30L32j7k31L9j7J85j53j15Lj2J36J05j24q2N8P3j36j08O6L44m15J73j70
7673a96K47N8j73K29rk58M07m01k3N3J68p1P4j14j41N0J80k0q1km1K52l41J66
$$ y = [56, -91, -27, -243, -162, -320, 14, -160, -48, -129, -217, -110, -236, 193, -9, -63, 96, -17, 209, -31, 10, 82, 42, -176, -175, -225, 163, 235, 33, -43, -76, 110, -131, -107, -55, -153, -3, 90, -66, -76, -55, 33, 295, -201, 107, 192, -8, 186, -159, 167, 17, -139, 211, 28, -51, 178, -49, 27, -207, 14, -132, 130, 50, 94, -37, -10, 28, -224, 96, 52, 66, 107, -37, 149, 103, 35, -151, 55, -178, -21, 37, 78, 157, -36, 174, -66, 18, 156, -106, -211, -61, -24, 133, 20, 123, 14, -23, -16, -263, 109, -160, 38, -26, 56, 2, -1, -43, -10, 72, -107, 198, -2, 208, 98, 117, -114, -34, 134, -233, -41, 7, 167, -216, -136, 52, -52, -99, -136, 0, 153, 211, -290, -68, 175, 152, 7, 121, 202, 230, 217, -42, -130, 202, 185, -46, -7, -24, 161, 8, -107, -104, -116, 20, 125, 1, -81, -23, 50, -86, -194, -128, 216, -199, -26, -196, 51, 109, -64, 165, 156, -102, 305, -96, -119, -66, 102, 31, 105, -9, -150, -100, 80, 60, -21, -23, -64, 188, -153, 13]
7697A3R9j12q5J01k31L79k70L9J15n1r3j5K17j2j85J9l04L32M2j11L08j35R4M
7721A58k41L0K9O0j96J52j10K02O9j8q4q2N7M8qj51L28l98L35q5n5L57m14J45
7745A28K04k35qO9j7j65N3qr6J26L8j65K68k88M2K94l57J79J26m9j49p4O8r2L14
7770B06r7j70J60K5j25j50M12l26j49L05n6l3M7K31k55m0N5Q5j63j62K18M4mp6
7794a8ko3M9K57j75j64K29n14L82J30O3j22J00j71l11M20l42J63L5J33j55o3K31
7817I2j88o0J97j2m2J00k55K95j66N9J60j55o2n0L27L6j00j44p7O2q1J02l7j2
7841a1J67k80L11J2k29L29l04j5M91o46N5J51r0j4J03l02J79J64o9K1K27k42M9
7864E7M6k17J6J7k6K12j42p5J08q8J96j95L85l94M3J05j06Q8L7n0Q3q2J74l38
$$ y = [13, 112, 0, -85, 16, -215, 164, -106, -67, 48, -3, -96, -111, 106, 94, -91, -72, -376, -44, -2, -113, 195, 60, 154, 158, -83, -53, -24, 36, -160, -8, -118, 84, 153, 135, 51, -31, 26, 74, 66, -85, 243, -155, 180, 95, 40, 397, -17, 128, 332, 97, 89, 158, 141, -24, 29, 21, -75, 51, 89, -76, 192, -96, -54, 240, -117, 62, 188, 139, -10, -84, -16, -108, 206, 109, -61, 99, 124, -1, -151, 261, -65, -214, 91, 35, 2, 49, 280, 25, -15, 40, 125, -38, -200, 18, 62, 58, -18, -20, -83, -34, 223, 48, -116, 113, -401, -19, 111, 174, 52, 152, -19, -330, 90, -252, -89, -54, 79, -76, -139, 92, -96, -156, 41, 29, -13, 87, -168, 127, -39, 20, 180, 25, -37, -87, 240, 276, 176, 32, -45, 17, -64, 38, 1, -11, 156, -124, 187, 199, -30, 299, -5, -20, 471, -175, -120, 31, -59, -73, 30, -272, -93, 71, 2, 23, 250, 8, 57, 103, -114, -98, -81, -107, 105, -37, -112, -4, -92, 104, -91, 294, -100, -57, 48, -58, 30, 67, 17, 100, 18, 192, -146]
7888a46K60k82K50j37j12J58K14k97L17k50Rj12p9K29j16L86l37P0j12N86n28
7909b9J37L1k18J17k53K95K68k01k82K01N7q7j62K29j47r9K32m9l75L48n6J04
7931F1j3j73K60l05J03o0J05J05J19k61L1J28j07n7K67kk43r7J25K05R1l22l7
7954g7O3K73j52j63J31k8j03K55j10K5j44k1Np8r6J68J59k01J96k3k04O1j92J87
7978f9J61l70K77K14k80m1J03q8L87l87k15L29N0p6J36l1j18P1K6j51K4K40J16
8001C08k96J76j6m43L03L5o8K7j95J87J59k69L14l78M42k56j40K43j14j12J89
8022I6n47L67j2N2J51k87J07K1K14k44M19n97J58J94k15J19pj05%L2L8O3n8j02
8046a43k7j4M78r6o4k31P7K24k49L11j96j92N2j48j10K99J66j3k94K29Nk73L84
$$ y = [-146, 114, -168, 82, -55, -167, -9, 205, -92, 225, -25, -16, -128, -207, 22, -94, 292, -45, 25, -87, 499, -29, 108, 139, -79, 38, -215, 80, 348, 147, -135, 66, 123, 36, -126, 103, -44, -143, 89, 40, -335, 13, -43, 61, 48, -125, 135, -170, -67, -127, -22, 83, 202, -59, -28, 100, -7, -64, 203, 201, -42, -139, -14, 191, 282, -40, -77, -14, 259, 107, -56, 75, 47, -56, 199, 89, 114, -30, -51, -46, -124, -220, -52, 107, -94, 102, 79, -125, -64, -256, -69, 92, -278, -1, 213, -67, -108, -5, -93, 294, -93, -308, 21, 71, -5, 131, 100, -18, 53, 79, -72, -48, 192, 308, 12, 188, 172, -271, 32, 67, -1, 26, -169, 18, 177, -92, 222, -156, 286, 30, -110, 133, 19, -93, 96, -451, -84, -96, -44, 107, -180, -73, -52, 162, -82, 337, -260, -102, 92, -123, -4, -11, -116, -116, -84, -46, 17, -41, -143, -170, -184, 294, 198, 134, -97, -20, 204, -45, 266, 70, -122, -70, -218, -328, -29, 137, 124, -170, 59, 64, -209, 175]
8069A75l45L98k02j62L40J40k33j75J02J42k60K03n2L6l66K28j30oJ82n7K09k40
8091g3O4L50m09J23r7j4J66n6r3m7M4n9K06j81K22j68J9J10j30k2J54j54K54r3
8115A16K1l59J47j55J62K27m85K23J45j81M0Q8J38n3Oj28O0K7jR4j16L4J95k51
8139fK54l35K98k65j02K82k68J75k21J36n5M0K0O7J86k50J14n9l0J12p7ll2p0
8163h9J79j32k02K68M2Q2j2J74l51M2j2R9j45l0kJ43P7m36L76r2j77K77J62l09
8187f8J56o1J5j48
$$ y = [175, -170, 228, 26, -136, 204, 344, 111, -64, 38, 180, -80, 123, 71, 107, -259, -31, -161, -167, 15, -42, 167, -73, -9, 341, -68, 55, -42, -56, 110, 54, -39, -86, -42, -101, 105, -76, 146, -22, -3, 107, -23, -45, 109, -45, 209, 116, 137, -222, -75, -230, -68, 159, -326, -103, 42, -139, -99, -11, 127, 74, 80, -48, 12, 39, 38, 132, 16, 50, 245, -6, 248, -87, 211, -54, -156, 126, -142, 33, -188, -52, -107, -67, -47, 20, 206, -44, 70, 11, -19, 93, 16, 13, -19, -89, 90, -42, -244, 24, 66, 148, 136, 310, -41, 1, -11, 88, -57, -87, -89, 54, 131, -305, 71, -21, -198, 79, 241, -68, 88, 27, 42, -106]
8191a06
$$ Imaginary data points
##PAGE= N=2
##DATA TABLE= (X++(I..I)), XYDATA
0@%%%%%%%%%%%%%%%%%%Lj1J6j6J6j6J6k4L2l2L5m3M8n5O3p1Q1r0J01j12J26j42
40g5J58j74J90k10K33k58K85l13L45l81M21m63N09n64O24o92P70q56R61j084J229
61F55j411J644j947K364k980L971n828J0434m2133n9937J17275M1010p5529j9885
75c2297M7797k998j0273K2541p446l2007K4487K6104l1137k6871K1370K1858j2680
88H448l1856n995L0407J7995k6031k3818J8490J9034p725J655K3j9216Q647L0578
102B0636r448k7074J0617J7414j1530n15J7745j1647j5353K1052Q382k3821k354
115e896K0645k210k3822n551K0074R294j7429j6550R739J6383p195o193J3589
128D878p273j7835K2975K1592k9082j7785L3198J0486l5332K188L5597j3834k9222
$$ y = [0, 0, 0, 0, 0, 0, 0, 0, 0, 0, 0, 0, 0, 0, 0, 0, 0, 0, 0, 3, -8, 8, -8, 8, -8, 8, -16, 16, -16, 19, -24, 24, -31, 32, -39, 42, -48, 53, -59, 67, -75, 83, -91, 99, -111, 122, -136, 149, -164, 181, -200, 221, -242, 267, -297, 327, -365, 405, -451, 510, -574, 655, -756, 888, -1059, 1305, -1675, 2296, -3532, 6902, -35231, -95168, 22107, 63117, -12412, -32297, 15500, 12502, 2229, 24770, 17324, -14683, 9804, 35908, 4771, -22100, -730, 21128, 8448, -23408, -29403, 1004, 18999, -7032, -30850, -12360, 6674, -1051, 604, 627, -18589, -9942, 20636, 11188, -15886, -5269, 12145, 615, 100, 17845, 6198, -9155, 11897, 20279, -3542, -5896, 14749, 12539, -11283, -16834, 3240, 12534, -4895, -21445, -11706, 4677, -2518, -8711, 4878, -2395, -20230, 2745, 24337, -4745, -22530, 10668, 21154, -14178, -11990, 23607, 9773, -19449]
141a9449K0190J9806j7826r143J2910o86r044O253K661j0546J357M841p363j86
155f225O665r46n422j704K873Q123L572r685q956J1328J1774j0093o999P435J00
170A840k656M730m23n282M589N574q712n098J4316K979j6228k834J1623P62p621
185b441k763L574j09k831O20K334q6k472q40M973J454m553K990K963o017J007
201b197Q980j727r592L102J0484m147o813O211J528o380K188L610m198k623K139
216E65l85m394R51L252l666j641J953o15N13K507q28q30N48J393J984J645o48
233B304l735K509P023l785n441M407K831k900j390P11j560l69K716k910o659L733
249b515N344n604n115L210L776j154l049L6K568K304J112k375j33L949P81r08
$$ y = [-19449, 741, 20547, 2721, -6422, 6488, 5802, -3242, 3011, 5672, -4874, -3517, 1324, -6039, -6225, 440, -506, -5928, -7632, -4759, 3364, 6936, -2749, -11705, -377, 11397, 1304, -5695, 1740, 1840, -816, 3914, 3491, -1791, 2798, 8372, -340, -5438, 8878, 11857, -4371, -7205, 4418, 5180, -2441, -5204, -1630, -1739, -4570, -3950, -1616, -1702, -4174, -5014, -41, 1413, -3140, -150, 2813, -3204, -2197, 6783, 5056, -4536, -1434, 9050, 4903, -1910, 4301, 5829, -551, 1637, 5247, 1049, -1574, 565, 180, -4214, -3263, -11, -3677, -5318, -3365, -3980, -3467, -960, -1788, -2618, -2070, -677, 1307, 2952, 2304, -1431, 1078, 8101, 4316, -1125, 3282, 6113, 3213, 1823, 2534, 974, 605, 3321, 411, -6248, -2515, 2829, -2775, -7890, -4680, -904, -2058, -5107, -5071, -2503, -199, 913, -1462, -1595, 2354, 3135, 2227]
265B227M16n92R34K204j837j982J183K374k532l925K757R66m537O12J766l188
281c154j708J918P78k390K08K428p59q96L003J79j050K382J011k17P3N66J045
298C417K55n15n83l8J262j258k623J576J68k855J55O57j691p50J185j84k765Q21
316c766L120k274j048L318r4j117J226J783rk56J093O73p65P71Q30j646Q77j00
334B616j416M89l56q33n21l37q42q96R98O4k455N21K271k091p15J985K78m62M47
353a255J358m02p8J841M61j543J619R01j051M45l4k09m0j98m68j158K14O09j690
372f78n4j3j655N44J309j931m04J275K50o28q2J417j69l54J860m01o53K178N19
391B330j339K81J108N26j306K45M17j057K96R6k034M77K25j464m10J55j60n24
$$ y = [2227, 2643, 2051, 2985, 5189, 3352, 1370, 2553, 4927, 2395, -1530, 1227, 2193, -2344, -1732, 34, -3154, -4862, -2944, -2166, -4556, -4348, -1920, -2679, -3575, -572, -393, -1443, 939, 1950, 1733, 1806, 2372, 3417, 3672, 3157, 2574, 2536, 3798, 2540, -83, 1493, 1661, -1194, -1039, -382, -2073, -2823, -1638, -1822, -4587, -3766, -646, -2920, -3968, -650, -744, -1861, -635, 1148, 1139, 883, 1976, 2649, 1884, 2655, 3485, 1839, 2716, 2616, 1200, 1689, 1333, 500, -21, -358, -1200, -2096, -1098, -1034, -3489, -2968, -697, -2788, -3503, -1518, -1240, -1702, -1255, 103, -299, -377, 1464, 1925, 382, 2001, 2902, 1851, 2296, 2262, 2053, 2013, 1815, 1347, 189, 403, 1012, -678, -732, -745, -2400, -1856, -547, -2478, -2882, -1607, -1357, -1985, -2067, -650, -819, -1173, 687, 286, -367, 1811, 2330, 991, 1272, 2380, 2906, 1600, 1845, 2262, 1205, 1501, 1597, -437, 40, 265, -1199, -1609, -1454, -1614, -2138]
409b138n9O77m84n72J439q84o7K204k12o95R82Q93N44k55K01L48O1J189n04k623
429D5J358J591j460j661o73Q21N39r64j716m64O54J022j611q05R38N66O84K44
447h92j695Q61L153M97j975j012L232J791j989n80J15Q23J177j186j805q6N92
464A021K36n75k112m15K87J416r52l216J048K894n94k505m7K619J558j277o53
481a267R03R10J296K79j026J15L36J650J27k495k60J442P57j881k096R55J527
498A272k250j163M98L11L89j432l34R30M62o16M10Q90Q2r07J596J748j029j047
516a90J421J405j12m22l76L82j412P90J659k248j985K20K316k23l646n87K950
533e8J05k940q00K379K093k357j856J863J895j55j33k15N6O14K191K51l162j54
$$ y = [-2138, -2197, -1520, -2004, -2576, -1137, -2021, -2088, 116, -96, -791, 191, 1084, 1628, 1373, 1574, 1922, 1983, 3172, 2668, 45, 1403, 2994, 1534, -127, -800, 21, 560, -404, -2120, -2584, -1930, -908, -2519, -3324, -2386, -1820, -1136, -892, -2587, -1726, 1427, 1924, -51, -1063, 2169, 3960, 1971, 1391, 1506, 2329, 3506, 2320, 515, 429, 1021, 1257, 682, -1430, -1845, -1558, -142, -1094, -4310, -3262, -368, -962, -3467, -3514, -895, 663, -614, -1267, -364, 546, 1842, 2121, 1095, 1210, 1546, 3196, 3323, 828, 568, 2010, 2767, 886, -1210, -255, 1272, -978, -2141, -1643, -1332, -943, -2375, -2709, -1779, -1317, -1933, -1523, -633, -551, -1458, 138, 1886, 857, -190, 1231, 2636, 2524, 2102, 1726, 2108, 696, 1486, 3145, 897, -1088, -868, 1448, 1225, -2421, -3008, -58, 47, -2893, -3693, -1314, 779, -1578, -3434, -1571, 324, 169, 36, -179, -123, 491, 2682, 2933, -229, -383]
551c83L336Q83k606j582J540J083j389j263L95L57k54j247j384J478N54j471k89
568b242M38N44nN41Q00j347k54K356Q49r31p12K37J879mj337R21L22j076o57R83
588A305Q85j856j439J374j33j153k91Q06o73j213M03J747q54j593J050J391n7
605c01j160L77K606m8k673J384K048L38j649m38J037L21L06j98k054k95K086l89
623A298j971q23M24J079p40j164m52R29J175j184j647J246K331l25j345j12K053
640G72J230j140l11K5O09Q98j29n21m99k37Q85K07j861m31P46L23j039j600J195
659h78L91j183k35J26J01O02L50l10j49j3J643N33q32k27R26J374k42j423L89
678I43P01K15l87q80k6N71n18o68n04l78R06q89q96J52L47J52k97k67M92K34O4
$$ y = [-383, 2953, 3836, 1230, -352, 1188, 2271, 882, -381, 14, 371, 117, -1130, -2514, -1036, -482, -1953, -2242, -1804, -1260, -1265, -724, 76, -1271, -1525, 831, 1680, 749, 37, 274, 2153, 2149, 812, 1733, 2055, 979, 322, 1305, 2190, 334, -1105, 269, 136, -1017, -1308, -502, -1175, -2388, -1985, -238, -1092, -2685, -1635, -244, -301, -1461, -1084, 1522, 1474, -1199, 185, 2233, 2571, 922, 484, 1521, 1842, 2148, 1950, -104, -399, 1687, 1298, -673, -1496, -1072, 7, -733, -1897, -2349, -1420, -245, -1429, -3076, -1830, 501, 176, -1169, -1281, 772, 2002, 862, 551, 576, 1185, 2083, 1954, 1433, 934, 697, 1582, 1789, -72, -503, 243, 566, -473, -2073, -878, -487, -1670, -1905, -1779, -1678, -1076, -726, -1036, -1185, -1198, 445, 978, 146, -81, 845, 2219, 1977, 554, 943, 1644, 1859, 1472, 592, 566, 1137, 619, -49, -553, -931, -25, -914, -1810, -1658, -1311, -1159, -1456, -1723, -1231, -997, -933]
699i33R75l29k65R62Q0K25N34M6M0k73M85M26j090PN07m69k74j045j58O30n08
720d27p48k16M79J38m10n93M07L12r2P26q50O79J063k33N5j84J068N30o37M7K1
741A135L83J60l86q04M66j62m76l41l99K54n03Lk93n50L95L03q14M63J39K42L9
762g46m3M59O20k65Q58j07j86Q09p5j21Q8j34k84K14k64qn73k00O5l26k97k62
784g78k00R4k93l25K32K82P9J0k49O65L88j58J61J14L91O39k93K63r6J87K38n97
806G54L41J83o48l66J80m07M0l68l34k38p8j29n6l47M12j05l6K92J42L56L44L28
828B60k57M70K65K2L00k0K45l78L69Q2o20K21k71k28j74l41k34j6k48k1o59k7
850a260M30m39J80L72j36rN9L92M19j74M91M64l32N07P4m3K37j94l0J21r0k47
$$ y = [-933, 42, -287, -552, 410, 490, 715, 1249, 1295, 1335, 1062, 1547, 1973, 883, 890, 1397, 928, 654, -391, -549, 81, -427, -1175, -1391, -912, -774, -1184, -1777, -1370, -1058, -1150, -424, -1274, -595, 468, 235, 290, 106, 1174, 1704, 1067, 1114, 1135, 1518, 1678, 1292, 488, 954, 792, 316, -25, -424, -170, -673, -670, -963, -1513, -1118, -815, -1629, -1166, -1027, -785, -746, -789, -330, 290, 25, 883, 776, 590, 1399, 1324, 1203, 1291, 1157, 873, 1087, 823, 815, 242, 42, 107, -219, -516, -778, -978, -884, -1177, -1502, -1270, -988, -909, -899, -1148, -483, -95, -253, -92, 22, 413, 1052, 759, 1022, 926, 1113, 1351, 754, 1095, 1278, 630, 264, 444, 37, 77, -291, -625, -863, -941, -1070, -1126, -1473, -1061, -1166, -1202, -910, -768, -412, -68, 260, 3, 473, 738, 760, 1060, 1040, 1285, 907, 1276, 1358, 738, 959, 688, 460, 286, -55, -289, -305, -553, -574, -1233, -1260, -830, -1269, -1089, -717, -853, -862, -803, -411, 8, -166, 325, 789, 457, 964, 1038, 995, 1232, 1038, 1008, 1129, 1039, 792]
872G92l61l37J47k40m37J0m26j56J10k55j97N03m42L32Q0K97J85k03P98L31m82
893D9Q08r6K8N88n27J38K57k64M2l41k01K91n92k89q1m52J56j75j98k8k72O36
915e23k39m63M55R9l9O77j95j06J052m53L73P8M4M32N3k10k16k68L51K11r85k34
937a06M9K68o11k95k28M15k1m02l91J74N38k52J60J25j05M64L89j68M13k15O34
958H35K47j65m53M53Q5K85o34j01J27r3p89J1j47K47k44k70K37q39L46R7J01k61
980i25K6M99J47n90N20P13q4j74L57L01J82m75N6Q02m13m37K51j24j16n44o2M70
1002C80r59k3R3m10L77l76k2J83j49j72N58J22o0q4L72O50k66k02M53J25M72l72
1024F90m2M83k69k96K53l30o7k81o8K01p34l30N92q6m71k54P6N07n34j72M37O31
$$ y = [792, 431, 94, 241, 1, -436, -426, -852, -1008, -898, -1153, -1350, -847, -1289, -957, -877, -580, -395, -598, 200, 531, 49, 857, 761, 789, 1377, 850, 988, 1245, 981, 1023, 682, 481, 772, 180, -109, -190, -642, -486, -661, -859, -887, -1159, -523, -762, -1225, -770, -671, -710, -33, -228, -334, 718, 265, 638, 716, 760, 1192, 1245, 1035, 819, 551, 902, 1113, 128, -106, -57, 211, -400, -695, -923, -508, -529, -931, -1322, -1148, -610, -862, -702, -577, -682, -218, 171, 3, 416, 201, 835, 1082, 917, 464, 917, 1002, 1287, 653, 552, 679, 586, -203, -192, -339, -92, -336, -606, -369, -1208, -862, -765, -664, -925, -899, -400, -253, -843, -323, 390, 306, 132, 489, 790, 972, 497, 553, 1355, 942, 505, 756, 632, 516, -28, -90, 380, -579, -602, -509, -919, -542, -918, -940, -757, -906, -1078, -520, -398, -458, -542, -170, 480, 214, 12, 465, 590, 1062, 690, 648, 1131, 862, 566, 819, 489, 422, 141, 73, 274, -460, -790, -198, -284, -755, -1009, -933, -426, -960, -1132, -695, -64]
1046f4k26J17m1P38p3j34O27j03o15Q01m6j23k85m5L32j4p40j50P0j54Kn64M39
1069b51k95n80N67k2k07k51J19K46J77O1N79k17J15M08o7M33j87J8M8L11q1k20
1091G04j67K96n33k83L00l40j69m63M8J67k50m66N06n9j6J02R0K84k4k57P19j20
1113F9j3L86L58mn2j30K97m9k54j32M65p16j5j79Mq6l00J3k54l97J44J59p6n2
1137h14j26N85L1o0J05oL65L98k87K85J16k69N69j93q7R5k74O1J1m01J09j74j79
1160a40Qk99j5pk98L2K63j33Qj87K53K32k54M55j01K48K41P3qJ21K24K8k58K6
1184E12M69k87k73k51OJ18j96j0l35j6k62j11J24q1N9l69N36l43J18J46J80l6
1206c02L74k38K71N56j29J69k04K91pq5j29Kk17J89l19j19k4j15l95J53k37K17
$$ y = [-64, -290, -173, -214, 524, 451, 317, 944, 841, 226, 1027, 981, 858, 573, 528, 860, 846, 106, -44, 26, -128, -126, -690, -251, -546, -1126, -559, -581, -788, -1039, -920, -674, -497, -436, 143, -74, 41, 449, 382, 815, 628, 646, 694, 1005, 924, 704, 537, 833, 300, 17, 317, -23, -192, -655, -607, -440, -690, -1156, -650, -709, -725, -623, -533, -249, -273, -530, 189, 69, 56, 442, 800, 796, 744, 614, 911, 862, 608, 476, 941, 225, 210, 31, 35, -51, -351, -338, -592, -989, -845, -686, -762, -814, -940, -355, -324, -384, -279, -285, 80, 478, 191, 476, 592, 323, 892, 699, 612, 707, 433, 494, 505, 104, 213, 39, -140, -132, -431, -446, -453, -751, -719, -456, -589, -581, -768, -515, -283, -537, -82, -183, 65, 306, 379, 371, 492, 716, 744, 486, 512, 981, 694, 421, 170, 176, 294, 98, 88, -247, -263, -525, -636, -512, -593, -534, -903, -367, -710, -592, -446, -266, -302, 72, -166, 105, 661, 532, 701, 497, 788, 781, 696, 567, 569, 352, 541, 222, 103, 79, -36, -431, -278, -515, -298]
1228b98l22om1n2mL13j67L91J30JK43j5K34j8MK72o0l29N69p9l15J71k68k74J91
1253B71l50J17k92R5l77M6Q1k86L5p7p4L24K01l3J67oJ7J83J17j24L77Q0N0K60
1277H02j63j14J19k99K80j44l46J79l69L5j76l01J7j37J37K4Jm3L6k42J00K14
1299c90L4L74P2j0K67j35K00K97r7K20m53J53J29j45l85q1Q2N1m50l9J79j45n1
1322c23k70n1J05l0k8L23Q4j41J15J88QK5J61K03m12L77K65j33J73j35M6J12j83
1345D79k78K06K0m78K79n55O2l22O1J10q6k40nL70j07J91n9J32J60K68r2k21P28
1368F23J12k73J28j08m1Q8l78M21k02K22k31j48l09K80l12j50M4j46q7N8l20J82
1390e47K11l38M35k80L42M9P3K55K82l29J42K04K34k11j86J52J06j94J47l29q7
$$ y = [-298, -620, -626, -667, -719, -723, -410, -577, -186, -56, -55, 188, 173, 407, 389, 393, 665, 605, 276, 845, 766, 451, 622, 354, 80, 271, -79, 38, -254, -159, -536, -490, -409, -695, -660, -737, -811, -487, -286, -319, -152, -158, -141, 42, 159, 35, 412, 492, 542, 802, 639, 525, 644, 345, 625, 481, 135, 314, -55, -20, -196, -497, -480, -617, -480, -456, -455, -498, -462, -704, -604, -390, -356, 18, 90, 80, 347, 212, 412, 709, 612, 832, 379, 532, 661, 516, 131, 50, 132, 183, -267, -306, -127, -272, -323, -593, -644, -539, -569, -597, -274, -190, -331, -216, -28, -20, 5, 166, 369, -43, 334, 599, 466, 639, 504, 550, 662, 479, 201, 407, 427, -51, 228, -327, -265, -587, -526, -416, -502, -742, -747, -377, -484, -293, -352, -220, -60, 208, 116, -105, 623, 735, 462, 590, 482, 441, 529, 151, 572, 370, 592, 361, 213, -96, 184, -128, -278, -234, -380, -467, -409, -729, -547, -336, -674, -239, -519, -177, -128, -55, 200, 482, 153, 295, 499, 733, 522, 336, 488, 594, 400, 547, 218, 131]
1411A31j1o6k26m82K03j46L1L5o6j83K22J78J13O8k0l3L29L0P0R8m4J24kQ5m8
1436C90M4k4J24j60m2O5k85Kk33J7M7m29K19n9k05J92k03N6N6r6L44R4nl0K06
1461H5J27J81k27J89J73J97J5l43j9j00m6K12j84j31j49k47j3J91j28m19k6K41
1483d21k14J00Q6P1L23m60O62k75NL25J43j36J93j04J0Q3R1J8n0K4r4k01o2Rl07
1508a81J31n5j41r1k71J37J78m51K62J27k31J59K97L77n29K58M58l31j14L60J39
1529D88KQ0k38K30J35l76j08mJ22n58J95P1l22m9j36J20J76l73q5L50Kp7O8l9
1553c26L91j58K63O9n9n2N73k09k16L09j45J47k79j49J84l00j40o0j85j3m6j17
1575e18L02j47r0K42l04L52l49K89j43m5K34L8K90K15j41J29m4J57k93M24m14
$$ y = [131, 120, 54, -172, -654, -451, -597, -566, -531, -597, -780, -558, -380, -267, -199, -219, -252, 77, 107, 177, 275, 231, 355, 353, 438, 390, 434, 410, 534, 374, 332, 397, 112, 114, -119, -102, -55, -484, -265, -324, -529, -337, -540, -484, -428, -524, -180, -86, -91, -121, 85, 212, 393, 166, 355, 528, 725, 740, 397, 378, 278, 232, 444, 260, 129, -20, -267, -280, -89, -217, -636, -662, -421, -635, -535, -449, -378, -55, -515, 147, -128, -123, 202, 345, 209, 402, 298, 308, 391, 482, 500, 450, 474, 380, 179, 117, 126, -181, -50, -105, -246, -337, -608, -471, -293, -744, -482, -355, -586, -427, -130, 247, -282, -24, 434, 103, -11, 349, 488, 490, 570, 332, 562, 697, 321, 213, 209, 331, -227, -32, 39, -283, -332, -468, -348, -172, -545, -630, -280, -278, -355, -287, -326, 65, -93, 170, 239, 180, 128, 701, 492, 276, 585, 440, 587, 308, 159, 343, 43, -97, -157, -342, -355, -401, -518, -216, -363, -453, -211, -515, -163, -512, -223, -366, -411, -177, -139, 151, 366, 225, 354, 310, 467, 174, 598, 184]
1596A84Q2p6r4R8j16J00j20j20j43P6j24N4j95P7l0j75J51J48Mj43J67J32K38
1619A75l19M06N7p8L84n0j13J16j7k88rOk55K03k0k06j51j94J81l74J92k16J25
1642d45N9j01L0K40J23l1K62l21J19M82l23J87J00R8J40j72o1Q5k43P4j88M8M4
1665B06l59mk00L7J53k48j09L1J67j73L99m18L86k0J79o6J77J42N5r6j06K07K28
1688E68k29K08j97J14l32J29R3m65J07n5J25k40O7j97j18L0K4J26p4r0J36J5K77
1711B2j29J82n9J71O0K09j13l6j1J30k28J29k42R4k18L00j33%p0k92j97j44K70
1734c05k39K80q6K19k59J09P1P5K5J27r6K79J54k95L33q5J71j35J31j48j11K2
1756B37J42l72K95m34L38j64k02J11j85j74k2k6J43n6R0P3kJ93J44L9k91L20j33
$$ y = [184, 266, 190, 96, 194, 78, 178, 58, -62, -205, -129, -253, -199, -394, -317, -347, -522, -371, -223, -219, -362, -195, -63, 175, -144, 262, 319, 241, 625, 575, 462, 578, 561, 273, 264, 270, 15, 218, 198, -8, -159, -353, -172, -546, -354, -570, -445, -386, -487, -457, -217, -94, -125, 137, -184, -65, 417, 94, 281, 381, 479, 619, 447, 386, 471, 228, 302, 114, 162, 206, -153, -157, -357, -320, -167, -415, -524, -493, -326, -499, -100, -518, -132, -152, 27, -39, 138, 280, 335, 239, 133, 340, 568, 339, 547, 350, 464, 132, 261, 354, -111, -4, -59, 66, -174, -107, -304, -422, -392, -368, -242, -316, -406, -270, -255, 22, -107, 75, 16, 187, 247, 456, 343, 307, 296, 426, 198, 327, 85, 179, -39, 261, 128, 128, 58, -234, -431, -575, -305, -544, -264, -350, -131, -390, -281, -210, -135, -110, 17, -79, 200, 354, 59, 392, 307, 478, 343, 474, 326, 215, 237, 379, 7, 302, -132, 206, 42, -160, -49, -234, -408, -430, -456, -313, -369, -279, -206, -208, -15, 129, 168, -123, 197, 64]
1779F4J59J31j82M2M74l68J32r4j37J94k33J15l52o9K23k0m18J13j57J43O0j77
1801c57J73m6m5L8K29j99L42J0j36M98k77J56k52J25K58j47j02J54l27O7k28N1
1823a5O5j52j85q9j3L9j22J51J53l8j28P3K77k73K4L96j4n2L2K2P9J96q1j67L00
1848D78k11R4ln9j44Q1j85j86j7O2M9m19J71J17j77J32k08J03J54r2K29J44j65
1871e2k26L48P0R4l21L41P7k13L17r2r1l7j20K1m3p2j21R3J02l32M2o3j06J69
1895b15j17n9Q3P1K09L1R7m0Q4J19J17j83J38P5k38k5J08O6K2k00K55m09J34q
1919A15l25Q1j93J06o0J67l04J50M3r8L17j69J11rj72K76PP6J31J6R5k5O6k34
1943A68K41k95J33j19J93k63l7k98j00J72k48m7L45j95K12j24l5M9J17Q2J09p
$$ y = [64, 223, 354, 172, 214, 688, 320, 452, 358, 221, 415, 182, 297, -55, -124, 99, 79, -339, -226, -383, -240, -180, -357, -184, -230, -275, -237, -8, -207, 135, 145, 9, 507, 230, 386, 134, 259, 517, 370, 268, 422, 95, 162, -66, -15, 50, -102, -287, -376, -389, -350, -472, -321, -168, -206, -334, -261, 16, -257, -233, 163, 149, 97, 129, 151, 230, 426, 345, 178, 478, 267, 361, 358, 299, 155, 236, 51, -135, -152, -90, -41, -460, -289, -172, -349, -217, -425, -322, -168, -260, -31, 113, -52, -278, 70, 140, 234, -87, 254, 331, 118, 435, 343, 252, 215, 95, 116, 73, 1, -120, -27, 75, -257, -215, -278, -384, -215, -332, -391, -308, -237, -28, 3, 100, 60, 144, 263, 380, 197, 335, 410, 172, 147, 255, 321, 343, 143, 398, -11, 123, 115, -210, -129, -322, -216, -276, -109, -413, -263, -220, -318, -1, -170, -59, -68, -240, 36, 43, 119, 250, 266, 361, 336, 402, 168, 409, 114, 247, 128, 321, 58, 21, -277, -377, -205, -453, -500, -155, -350, -138, -262, -297, -248, -131, -49, 60, 53]
1965E3k10K37L02l06J72l13K93L07l96K39j65j49J84k85J60O3j13j60j04R8J56
1986F3k06k79J36k76K88j39J67L37l64L29j66K04j06L44j40J67M7L2k41JJ95l33
2008F0J95L2j81op5j24Q3O5k38k77M76k32J36k78J74J42o6q1L6J13j79K45r1q9
2032a60L38K2k19M61k0k18JK00k72J64k97J39L2j37k63L3M1j4k10M6K15j08J50
2055g6l0k92J04K39J9J41n8m5K06l19M06M6k51M15k98%J00q8k5K8k44K7m6r2m7
2080a80p3m8LQJ83k35K9J22R3j95J19PK61j89J0M25O2k33O0P3j83J97k82M14j26
2105C22l51OJ39Oj58k95l0J58J4j16J83k24L57m3k14l9K96K45l22N3J89k26l9
2128h9O06k98J58j40PJ48k38L2j24P9l47M3J04k5j30j73M84l53J52o5J63k47Q2
$$ y = [53, -157, 80, 382, 76, 248, -65, 228, 535, 139, 378, 213, 64, 248, -37, 123, 186, 73, -87, -191, -93, 63, -143, -422, -286, -562, -274, -413, -246, 91, -273, 56, -110, 94, -12, 332, 192, 359, 406, 438, 197, 198, 393, 60, 255, 287, 106, 100, 25, -99, -16, 49, -189, -466, 10, -222, -86, -364, -190, -48, -114, -195, -159, -46, -225, 20, -71, -160, 178, 200, -19, 442, 422, 204, 205, 405, 133, 297, 0, 139, 171, 34, -229, -196, -155, -169, -379, -333, -118, -226, -76, -106, -398, -294, -55, -36, 105, 47, 2, 208, -111, 295, 341, 90, 505, 207, 207, 307, 219, 194, 222, -22, 5, -41, -133, -180, -253, -301, -298, -290, -107, -342, -313, -191, -98, -293, -174, -167, 94, -95, -85, 340, 402, 169, 229, 302, 119, 316, 34, 448, 322, -29, -23, 116, 122, -36, -331, -361, -203, -189, -305, -122, -346, 11, -32, -246, -285, 11, 256, -66, -13, 176, -50, -89, 517, 219, 377, 237, 244, 392, 154, 186, 62, 141, -206, -163, -59, -84, -214, -387, 97, -256, -104, -169, -6, -253, -171]
2151a71J29j16J3K04J70j30PK1J25o9j96J79O0n1R0P9k5k29j5O1r0l20r2K6L06
2176c4l02J01j72J7J48L01k84n4K76q9q4L55k6j42K39j0j12L20k00q5j9QKJ44
2200B98j10k49k49M88m66J67K63k94j55O3J77M4l59J16L4K6Q9J33k0J19j3J64
2222B66j58o4L30j36O5k41J05j76R4k68L19o0k6o3Q3k61Q3po0J12q2N8j95l7J75
2247a44k73L12mJ94P8M2j48k7J29J7n9J61j9K33l74j30o4K94j08k44J93k96k3
2270b60O4Q6k40J46j58M17l68R3J21n5PN9J78K16j21j79K3L04p2ko9k87L35k48
2294a0M31m00K51j16p9l91L35l88K42o8m7jJ6k59L15O0m8jj86N24j92P8L33k82
2318A17N6J98m97K24lN5j93K65k06R0j54L13j90k08OR6k16R7k47J93L7L1K84l12
$$ y = [-171, -42, -158, -145, 59, 229, 99, 106, 127, 252, 183, -13, 166, 226, 175, 265, 344, 319, 90, 75, 136, 46, -274, -366, -340, -34, -336, -235, -407, -390, -242, 59, -225, -279, -3, -92, -176, 179, 153, 11, 250, 240, 128, 448, 248, 163, 144, 152, 154, 298, 188, -61, -310, 178, -288, -121, 142, -152, -307, -244, -67, -23, -382, -266, -232, -206, -117, 16, -4, 115, 102, 266, 108, 44, 374, 238, 303, 62, 167, -9, 85, -183, 136, 76, 50, -13, 70, -191, -108, -115, -175, -63, -145, -87, -282, -319, -144, -417, -105, -109, 85, 163, 205, 57, 30, 159, 176, 117, 278, 259, 492, 118, -12, -76, 218, 110, -134, 59, -237, -260, -196, -110, -350, -204, -362, 55, -313, -220, -99, -154, -147, -88, 90, 306, 185, 6, 29, 333, 261, 259, 190, -97, 238, -10, 421, 21, 272, 156, 77, -314, 21, -367, -125, -193, -240, -241, -225, -484, -169, -109, -157, -158, -344, 180, -12, 66, 399, 117, 173, 371, -126, 98, 95, 150, -43, 222, 16, 106, -48, 265, 75, -133, -127, -31, -247, -150, -397, -204, -167, -136, 148, -164]
2342a64k9J18K26k18j20L83L2j62J26L3K4j37j7J25O4J3k34l6j31L9J22r8l64
2365d05L59j22m6J70m11O33l17R9m7j64L01J43k41l1M03n4l71L85q6p0K41l82
2387a3L97j59r2j96j28L72k43J99Q5l47L7R7l16L0m9J00K55m9l2n4P6J53P3O4
2411B60l27O6J22K68k31j57K35p3oO4r1O5j22p2k0j32Q9j15j4m9O2j44J17J41
2435f4O8o2p2q3R0J17j2K87qj93L25k91P2O3r5j32O3J60l35l0O4J44j73Mj5J36
2461B8k76Q0k3j64K36pk01Q9J34r0K82j9o6j5J44l9J90k6J05l6p6p3P0k45J18
2486A20J89m16J73m51K90j2j18K73k43J98j72p8P0M85m73K14j04pLj37K76J57
2508B37p4J18j10k2k09L40m05P4K64k68k9J26j52L75o06L48K7j59O8n1j38R6p4
$$ y = [-164, -193, -75, 151, -67, -187, 196, 228, 66, 192, 225, 249, 112, 95, 220, 284, 297, 63, 27, -104, -65, 57, -41, -405, -46, -168, -214, -44, -455, 178, -139, -40, -87, -251, 50, 193, -48, -79, 324, 270, -101, 284, 198, 128, 369, -13, 384, 225, 133, -63, -191, 181, -62, 137, 222, -125, -88, 9, -307, -277, -326, -226, 29, -20, -52, -106, -30, 123, 196, 260, -67, -1, 121, 389, 158, 1, 236, 163, 157, 221, 130, 195, 73, 1, -19, -151, -62, -177, -191, -240, -178, -322, -205, -64, 4, -58, -130, -213, -123, -6, -18, 269, 261, 68, 393, 102, 174, 237, 142, 10, 73, 233, -102, -132, -68, 76, -97, -93, -108, 28, -248, -168, -191, -355, -119, -126, -327, -238, -104, -194, 88, 69, 3, -12, 132, 93, 283, 257, 362, 326, 250, 177, 247, 2, 120, 309, -107, 66, -385, -95, -107, -225, 48, -195, 3, -169, -247, -177, 308, -165, 49, -55, -62, -59, -196, 80, 237, 163, 281, 171, 149, -60, 280, -125, -51, 213, -55, -84, 42, -110, 265, -341, 7, 34, -125, -57, -108, -246, -150, -224]
2531b24P1j01J34J42j19K17N8k1j20O8k62K24J25j25J72j01k86K25M5k44l9J34
2553b7J1l54J33M7Kpj08J18N0J58j10J93L6j77J83q6J82R0l90J92mJ6J39k71J53
2578A69o0o9l9K70k72N9k3j93J63l00J45p5k31L04n1N9KJ60l4K82j78M5P7m1J32
2603C01j07J16m47L35M2j61PP7l2k4L1k95q1J48J53k68L3qP0n4P5n0R0j68n8K06
2629f9M3j12K59J22q6K11k25lJL00l78J80l10J99J1J13k05j60J09q2j73O3J32
2652f0l55L87J24l32K63J52l79L70k08J88J96k45R1q6n8J54K8Q9j46q1J7J56j10
2675A55oj19k6k86R7J9J00N4m0k9Mq8n4M01m45L69o9r5M05k79K7lJ04j19n0R3
2701A20r9N7j97L67k25O1N5j56j88j72L88k38J27j69J53m2L0J85l87J59n4K54
$$ y = [-224, -153, -254, -120, 22, -97, 120, 178, 157, 37, 105, -157, 67, 192, 67, 239, 138, -148, 77, 122, -122, -161, -27, -16, -370, -237, -190, -188, -195, -303, -185, -135, 23, -87, 106, 142, -35, 148, 62, 244, 334, -56, 136, 132, 148, 287, 16, 169, 109, 40, 1, 271, -1, 58, 35, -158, 5, -295, -150, -225, -456, -152, -203, -144, -142, 18, -16, 266, 88, 133, 210, 169, 301, 194, 310, -137, 198, 240, 79, 86, 163, 131, 107, 138, -157, -238, -90, 63, -205, -172, -180, -110, -164, -89, -139, -49, -217, -275, -69, -26, -138, 121, 243, 157, 368, 143, 140, 141, 441, 63, 243, -67, 132, 143, 256, 51, -109, 0, -82, -255, -192, -60, -415, -28, 96, -236, 27, 179, -200, 170, -38, 150, 346, 101, 192, 106, 48, 202, 230, 319, 173, 92, 109, 265, 155, 149, 30, 4, -282, -185, -166, -66, -12, -52, -81, -77, -165, -219, 182, -263, 106, 37, -58, 347, 68, 95, 92, 196, 77, 27, 120, 21, 78, -119, 248, 23, 84, 139, -17, -205, -377, 11, -227, -100, -269, -116, -158, -128, 57, -330, -171, -225, 29]
2723B9m4J14j68L09j47J22j92J63J5Lk96J52O1p3O2j73K98p6k08J18q1j69n6K84
2747D7M4l9j95j6L7J06k04J37L80j4k90R7J7l9lK41k7q2ml97M87p4p6l81J95j71
2773b24K47O4l14O9k6Q0L1J95j76M1j67J60k0K47j82r8K52o5m1J53j25J63l72
2796a08K48M6k07K28l8n3j23m2J7q8oN4L6j31Qr7J09J87k18K45km8j68L92k31
2821A0J77k17K84l45L09j29r6O2j06N8J63j47j37J63j41j02J29r5K76m81M05l76
2843c36K93q8J45L4j05K23j12N1k11Q3J52k5J92j12q7j14K21N6j34Q4j55j31J16
2866D0J38l00m7l9J94q0K7J74j90k28J8J95RK8K09k28r8J63K42j27j36K83R6l4
2890C09j69O4k22L7J55k84L00O1k49n9L4k13J28k01n6L42j97j06j43L95n9m5K24
$$ y = [29, -15, 99, -69, 240, 93, 215, 23, 186, 201, 204, -92, 60, 121, 48, 110, -63, 235, 159, -49, 69, -12, -181, -237, 47, 91, 52, -143, -159, -122, -16, -220, -83, 297, 283, -7, 90, 107, 68, 65, 306, 279, 197, 193, -204, 283, 209, 133, -248, -53, -224, 23, 87, -227, -158, -184, -104, -73, 122, -54, -13, -180, -20, -40, 207, 25, -73, 179, 114, 73, 226, 101, 264, -108, 140, 186, -21, 207, 169, 116, -7, -49, -32, -120, -126, -72, -36, -167, -159, -256, -147, 40, -178, 67, 65, 17, -151, 241, 10, 187, -30, 254, -91, 218, 89, -7, 55, -51, 7, 170, 23, -114, 49, -92, -194, -65, -160, 116, -365, 40, -336, -43, -131, 14, 48, -57, 166, 54, 105, -106, -23, 129, 104, 296, 184, 97, -17, 204, 260, 126, 210, 55, -76, 40, 178, -122, -169, -208, -14, -94, -67, 107, -83, -311, -293, -98, -89, -61, 148, -80, -178, -15, 227, 100, -36, 247, 343, 309, 140, 204, -18, 19, 174, -110, 190, 251, 2, -57, -23, -236, -108, -309, -365, -23, -220, -326, -469, -74, -133, -178, 46]
2913D6j2j27K26J35j14j3o7K89l46k02N55l12j28J58j38L16k21k24J1K41m6l08
2935b81J61L3j10K3K66Ok09J37r6K10j01Oj46R0L04j08L10l76k06L62k54P2j46
2958e3K94k06N7Q2j04j59n6R2%Q1j02k1J26l06J49K06k24K54j34J14k16L56j47
2981H3J73r3J07n5M5K20n62K2Q3K51m0j67k15j8J73j11j36K68j05KJ00J8j43K02
3005A02j57k37K01k29M01j36N3J84o4M7n0L1J06j70J51mJ4l79J47j0j2o7j27L
3029b02p6N7K57j63j80K32r5R1O4J77j27K3l7J9n0J65j09K47j99J74n00P2J88
3052B8M02n48pk1l2K79l92L77j28jKL70l40k23L72j47j16K42k05L1Q2J81J72m34
3076e6K46l4p7j13K78m63M44k09l7k60R7K46L5j36j19J35k06q3L21l15L73r6p9
$$ y = [46, 34, -93, 133, 268, 154, 141, 74, 363, 17, -185, 370, 58, -70, 88, -50, 266, 45, -179, -168, 73, 27, -281, -120, -87, -197, -174, 92, 98, -111, 26, -70, 140, 39, 45, -101, -11, 293, 185, 495, 119, -87, 275, 21, 93, -53, 241, 35, 92, 174, 70, -89, -145, -53, -53, 28, -74, -95, 31, -275, -126, 80, -144, 110, -24, 90, -126, 230, 83, 256, 163, 270, 215, 260, 480, -82, -60, 23, 274, 234, 67, -148, -166, 7, -104, -240, 28, -77, -75, 25, 43, -100, 102, -55, -292, -91, -320, 81, -55, -2, 182, 118, 165, 115, 146, 252, 82, 233, 229, 243, -136, 11, 1, -11, -78, -205, -202, -278, -221, 36, -127, -307, -75, -170, -79, -15, 162, 35, 58, 21, 40, -10, 155, 46, 293, 94, 268, -232, -160, 28, 430, -118, -125, -146, -178, 101, -291, 86, -42, -43, -41, 329, -11, -234, 138, -9, -125, 117, -88, -57, 25, 206, 378, -56, 190, 156, 79, -34, 244, -219, 225, 16, -21, -281, -184, 62, 97, -39, -158, -23, -229, -312, 9, -306, 67, -29, -108]
3099a08R5j06P0O7%k92M49J39k41K29J31k44k74J11k0o2K95M1k11O3r9K0k03J10
3123d0K48l01P7o0j30K37K7r0J1o6K4m2R3Q5J65m53J90N6Q2m5N9o5K06j14j11
3148D3J87j16O2j67o1J65k79J8J76k07K20n2m1K9q8M9K06kLr6J1j38J55R1j34
3173C4O4p8J0M1M8j15j97L52k72j8M95l14j75O3j22L59j24o5J14k60M69n60L31
3196H0j16J06qL1J45j49j21K29l86K90K70m12M1N6p0l0L56m44P0k9m3J29J1k65
3220b59J91J59k30L4q4J07L1k2M1N3q4P0K33j98J60k46K75k43L27k17j76N5J50
3243A27o4k01K0Q6R2qJ31l08J00r1o6K8j37M3L07p3R0N4j39oO3N3N6K47n27J6
3269a07K58q2j30M69k23k29p6Q7p7K69l03n9k6J64q2J28k67K8J23j36M66j83k5
$$ y = [-108, -13, -119, -49, 18, 18, -274, 175, 314, 73, 302, 433, 189, -85, 26, 6, -56, 239, 280, 69, 132, 33, 53, -150, -40, 208, -93, -16, -76, -206, 31, 58, -32, -21, -87, -63, -105, -12, 73, 238, -215, -25, 31, 113, 68, 127, 62, 268, 154, 43, 230, 114, 176, 9, -52, 113, -166, -148, 28, -179, 41, -11, -52, -23, -111, -62, 144, 142, 145, 49, 60, -78, 77, 168, 34, 98, 20, 30, 71, 119, 4, -193, 159, -113, -131, 364, 50, -125, -62, -184, 175, 51, -14, 100, -160, 309, -251, 80, -36, 70, 62, 93, 238, 89, -32, 197, -189, 101, 371, -41, 0, 56, -14, -44, 312, -132, -62, -91, -134, -5, 6, -259, -68, 91, -139, -105, -189, -82, -51, -73, -32, 21, -63, 7, 240, 42, 202, -44, 231, -12, 315, 98, -78, -23, 127, 63, -138, -118, -32, 60, 52, 183, -125, -25, -116, -182, -154, -291, -248, 59, -14, 76, 130, -9, -15, 48, 101, 157, 404, -123, -107, 151, 69, -61, 408, 185, -44, -120, -33, -110, 159, -144, -203, -229, -65, -147, -19, -286, -258, -135, -271, 195, 12, -13]
3292a3L8k8J57j12L3lp5J30J38l58K87j80J12l75O45m11K07j83q6K13m9Q8k63
3315h8n5j13M22k65J38j08j99L59j10p6K05r7J00j7o8Q9j57K45k51mR5r7J85k16
3339h3R6q9J73k57L1ml3pp6J17p0J52r7J06r9J47P7P6j17O6k3K20l20j07L99q5
3365A93R0k77L08l30L51j61k07J82j61K6O4k00K93k60P5o9Q8L53n33K59p5K5r8
3388f4k5r8J67jO9k9P2n6n4q0J13J71m3j60K4Qm0n7Q1j74K9N8O1K63m17J08J64
3415I0M4k89M2K05M6J1j27J18J01j58JmJ35l72p4M23j57P0j51K44j54j78P4J49
3439H9j56q2r4Q2J16k63J95J24o0J49j36R9j49J03K43k64J11k89K6L42l7j7P2
3462B04j71k14K54q7K67oj41k8n8P8r0J06k19p7P0j34Q7K21j98K05j88K38l9R2
$$ y = [-13, 25, -3, 154, 42, 75, 72, -3, 127, 265, -93, 194, 14, 126, -249, 396, -15, 192, 9, -77, 136, 87, 175, -88, -143, -256, 166, -99, 39, -69, -268, 91, -19, -95, 110, 13, 113, 96, 28, 117, -40, 205, -46, -50, 45, -52, 133, -83, 13, -76, 97, -160, -129, -133, -166, -173, -249, -132, -202, -50, -147, -41, -140, 7, 84, 160, 43, 109, 86, 306, -14, -121, 278, 193, 283, 6, 314, -16, 335, 174, -33, 149, -12, 14, 78, -122, 171, -89, -14, -83, 5, 358, -175, 84, 9, 34, -64, -89, -187, -20, -21, 48, 19, 91, 35, -19, -99, 14, 185, 142, -18, 6, 14, -26, -83, -2, -176, -147, -89, -28, 235, -182, -74, 90, 134, -155, -113, 92, 138, 149, 22, 140, 241, 83, 84, 80, 215, -157, -231, 192, 35, 105, -46, 198, 44, -134, -60, 89, -67, -149, -243, -161, -45, -308, -113, 11, -49, 100, -36, 63, -86, 17, 260, -4, 107, -182, -156, 186, 149, 132, 204, 33, -181, 73, -14, 253, 247, 106, 78, 20, 98, 8, 114, -105, -182, -112, -246, -159, 62, -136, 69, -119, 119, 80, 172]
3486A72j11L40m28J37k65L74r1o3mk09L1L64l79J25K6j39k22J69J21K04j77M4
3508A9PJ7n3L2q1J1j28K13K91j22k33J56j3l7O7k64J40M1j67N3J53l86M48k61
3532i7l2J17J54j71k05q1P4K40n2K47k92k8K35L7L9k36p0K84j18K48j89k41P8
3555e9j6J82l69J82N53m11j90K03j47J29N5j58J02q0n5k40L37O8k92J39L5k63
3577b95K02K30k19K32k64K78j80J00j34j2L1O1J70q2n8K0k3l0J29Ok37r6L31r6
3601F4J1k76M23l11M6j13j0M4M8K2P6M5K6k7j52j02Q2J09J5P8J18j57j16J33l76
3626c00K11L66l59k8k1M03l62K87j65j32L2l9K97r5j62L02m41J90J14M8k79O9
3648f4J03M8R0j28J33j91J19k84L87j91L25o20J40K02k40k2J75l39K38K93l53
$$ y = [172, 61, 401, -27, 110, -155, 219, 128, 65, 61, -148, -117, 247, -132, -7, 19, -120, -342, -173, -52, 152, -25, 19, 26, 43, -10, 22, -59, -48, -176, 37, 328, 206, -27, 129, 116, 79, 146, -118, 22, 63, -104, -51, 102, -284, 164, -97, -129, -12, 142, -29, -234, -315, -241, -1, -53, 194, -98, -126, 109, 146, 185, -51, -121, 163, 45, 293, 104, -137, -59, -75, 107, -262, -80, 473, 62, -128, 75, -72, 57, 112, -46, 56, -24, -79, -319, 18, 86, -206, -67, -32, -295, -93, 137, -82, 150, -114, 164, -16, 84, -50, -62, -31, 30, 200, 118, 60, 80, 57, 27, 156, 162, -75, -171, 160, 64, 75, -201, 222, -89, -43, -156, -166, -122, -74, -52, 24, 69, 95, 68, -84, -186, -104, 5, 20, 98, 216, 59, -57, 76, -300, -89, 277, -82, -110, -131, 272, -90, 197, 32, -100, -68, -107, 190, 95, -67, 235, -206, -16, 98, 146, -133, -64, 39, 87, 177, 49, 182, -9, 110, -174, 213, 22, 347, -273, -133, 69, -171, -193, -18, -357, -119, 174, -179]
3669a79L47k23K07j76n4N8J46l1m0j25J30L1q5n0J50j34pJ23j13N3k43K50J41
3692A76k32k9j35K21k64K67l3l1R1k77L39n9k01O4oJ44n3J65j1LL5j92n4K31k31
3717g2j54K48L5q3K8p6p5J7K1J2n4Q4J6p9K66j99J12Mo8K66l43J4R9K49l3j35
3743A00K24j87k1j57J4k7O8p7k08L86N9j00k19J14J03j48n4J63k25J34j11L00
3765A31j77OL5P9P7l12K18l0R0Rj20J11qj78J48Q2n8l4J6k82l3K26j5l27J4L52
3791B0k06j65M22k81K10Q1j59Q3K15k67K08l22l6O1PM37l47Q9L4o3K75l22J62
3814A36o3J0R6l64J81l6O9j4QJ6q7J12J80k71J04m7l6K1N0k08J11O1k3m0L2L24
3840C22l16l43M06j20K57Q6m61L48q7k02j6K62j16m31K41J16N1j46M00k34M0l31
$$ y = [-179, 168, -55, 152, -24, -78, -20, 126, 95, 55, -70, 60, 91, 6, -44, 106, -28, -35, 88, -25, 28, -215, 35, 176, -56, -85, -220, 1, -263, 4, -29, -60, 31, -246, 93, 34, -167, -103, -109, 35, -18, 147, 136, 139, 174, -18, -72, 159, -72, -226, 22, 57, -26, 2, -74, -149, -132, -111, -99, -153, -69, -53, -132, 134, -65, 47, 51, -17, 249, -94, -80, 19, 268, 235, 100, 324, 137, 116, -41, -27, -54, 14, -63, -271, 115, 174, 74, -145, -31, 72, -76, -130, 33, -192, -58, -169, 131, -46, -40, -5, 74, 151, -161, 57, 27, 117, 126, 6, 117, 109, -69, 79, 161, 103, 69, 85, -197, -230, -4, -19, -346, -332, 20, -186, -351, 71, -210, 0, 81, -78, 5, 220, -47, 161, -161, -197, -136, -129, 308, -39, 50, 84, 21, 296, -26, 136, 73, 83, 179, -185, -4, -40, 29, 15, 23, 39, -48, 64, 244, -27, 77, 30, -6, 15, 65, -143, -32, 29, 6, -34, -2, 322, 6, -337, 69, -51, 206, 292, -169, 179, 92, -110, -126, 136, 20, -411, -170, -54, -3, -149, 251, 17, 57, -274]
3862b74L81q4j46K33j30q0O8R9J62j72j21n3o5L93n63M15j06K28m07J52k8J7Q8
3885GQl58L41j49J21R2l70J0J41K88P7l10L4j72O2J36L2J56k19J76j47n6J50j18
3909f8j55J74R9j61r8J23J9O7P2k5J40l66K11r3J64k48J79O6q4K2R1j05q0L5K27
3934B06M8j00p6J58m23O9M63l47M4N8k80J83J77qk57K24j02k00K62N4j89q8J2
3957a12P8J3j33Q0O8K01k08q1K18k46K12k15J74Qj96K38j70r4J59K3J13k38J15
3980Gr4J06Q2l4mk77L37J02j49l6J19l63J71J46k28K7L02m11K51j42L27q8L7l41
4004a53K63q3J54o8k17jR4l5N6m6k81Q3J11L61j56J23j20j61J22%j48K04orJ59
4029B46k35N4L3k4K5p7j44N0j05M21l22j40J11m4J07J89j84P2q1j41JL69j88m5
$$ y = [-274, 107, 23, -123, 110, -20, -100, -32, 67, 229, 57, -64, -117, -182, 211, -352, 63, -43, 185, -222, -70, -98, -81, 7, 15, -343, -2, -151, -30, 62, -308, -298, -157, 131, 208, -102, -68, -240, -178, -42, -10, 146, -73, 103, -44, -100, 50, -68, -223, -49, 50, -111, -209, -86, -67, 0, 72, 47, 187, -179, 32, -61, 103, -145, 34, 100, 16, 38, 129, 24, -56, -21, 206, 254, 154, 78, 236, -187, -118, 345, -2, 42, 100, -180, 3, 180, 172, -85, 139, 37, -163, 99, 153, -36, -124, -112, -34, -21, -154, -74, -6, 195, -13, -94, 124, -122, 90, -125, 49, 57, -139, 99, -71, -165, -6, 17, 130, -108, 7, -87, 19, 101, 67, 63, -214, 123, 225, 76, 40, 159, -204, -33, 113, -115, -88, 214, -197, 54, -88, 239, 151, 188, -153, 110, 27, 181, 113, -104, -105, -11, -46, 10, -36, -317, -234, -123, 238, 82, 205, 85, -76, 46, 46, -102, 102, 96, 87, 246, 11, 65, 98, 74, 99, 22, -122, -72, -177, 244, -78, -218, -107, -151, -44, 145, -39, 33, -48, -189, -188, 181, -7, -52]
4053e2J22l36L3K31q0L86j45j53Q2n6j60J54p8n5J62l9k60J47J70j09J4%l6Q4
4077B6m8O7k7N4l5J2J23j11k03J78K6J13l9j47J01M4qj2r5K57l76qm8k41M35j56
4103a18J22O9p3j24L93l75J88l08L23L0mn2J2m6J26p4q7J8N4Mj28J42n3j56R1
4128b6J42m3K9l5j54J02k29L67k32N5n7J24j22J15n6K82q4l53K13j09J13j09K58
4151A91P7m20J45q6J93n0m8M4J14j21pj86P0K89n05K3L24J38l10J51l09N0K40
4174Gj01Q4p8r6K03O3j58R3j12j8K76L3J0j84r8R8J08j62J46kk33n1M3j2L90l26
4200g7J59j82K20j23O1q5J67m06L52k41J05L06l66J94Q7K01j00j90J27j17r7K5
4222B0j71M1j63J54k6Mp5K90j87N0l6K66K4j94k34J68M6j3Qj3NJ37k60K50j60
$$ y = [-52, 70, -266, -233, -2, -82, 304, 159, 6, 88, 32, -128, 26, -52, -107, 55, 16, -244, -97, 73, -36, -22, -22, -58, 26, -22, 45, 18, 72, 37, 49, 172, 61, -142, 36, 62, 175, 136, -11, 90, 134, 126, 114, 19, 276, -100, -108, -156, -397, 38, -118, 4, 73, 0, -124, 269, -106, 82, -226, 97, 127, 123, 71, 83, 37, 163, 89, 2, 20, 74, 78, -50, 92, 39, -117, -26, 116, 73, 102, 67, -87, 15, -214, 153, -79, -24, -81, 43, -79, 36, -20, 262, 178, -175, 38, -71, 42, -67, 191, 268, -152, -7, -93, 100, 50, 2, 46, 160, 39, 32, -154, -84, 205, -300, -277, 47, 185, -125, 26, -283, -233, 7, -94, -10, -88, -184, 19, 82, -76, 17, -95, -113, 163, 196, 206, 22, -76, 22, 130, -32, 114, 112, -121, -172, -129, -141, 249, -77, 82, -100, 120, -3, 58, -27, 140, -266, 86, -155, -50, 256, -110, 84, 171, 372, 272, 82, 209, 92, -5, 20, -151, -110, -273, -119, -145, -141, -216, 74, -113, -63, -99, 167, 191, -3, -237, -69, -23, -36, -28, -41, -36, 101, -159, 91, -69]
4247f9L8%O6J09k80R1P8J28N0j56o6j98J96j02Q9k34O9K97k7M7l60L29o4j43K01
4272H9N2j86J73k93O8k22K93K10j62p9K3P0n1J5l4L16j87l7l43J86J05j62K73
4295A17l11j6K44j00k0n0J37n6L08j87n6j45J94QK4Q7k9q4J0p5m8K73j41n0j02
4320f8J67j66J94P0j30R4p0j47J23j88M1m0J37l14K02J67l6L3M0j24j11K77QJ3
4344A72j05j16J4j38J49l1q0J92k57J42J64R9j27k76K52J39j73j77j12N0J39P3
4366gJ38j38l2P3rJ92k57K57k07j28rK23m00J60K38j59mK22k73K05j23O6Jmj17
4391i2m1K83l22M19k52J05j16j26K22J54k07J40n6k66N7Q9j66L10j6k00K15j96
4413f2Qj27L74j10M3l01K36j71L73l38P5K50m24J99J4k03L66l45J42L3Q5M3l12
$$ y = [-69, -31, -31, 35, 144, -136, -45, 33, 161, 211, 55, -11, -209, -13, -115, -26, -260, -191, 106, 79, 126, -234, 95, 31, -112, 89, 141, -45, 128, -165, -97, -319, -26, 184, 22, -57, -34, 36, -15, 0, -34, 282, 95, 58, -285, -99, 6, -156, 117, -194, -210, 34, -66, -86, -136, 1, -55, 253, 66, 10, -135, 59, 67, 91, 178, 149, 65, 75, 0, -48, 225, 84, 34, -68, 99, -67, 127, 197, 67, 161, 91, -56, 67, -121, -80, -120, 17, -297, -95, 72, 36, 69, 109, -15, -126, 151, 159, 172, 67, -49, -35, -173, -24, -55, -135, 57, -200, -58, 106, 205, 78, -198, 54, 193, 20, -157, -269, -219, -80, -7, 131, -7, -39, 34, 25, 217, -40, 217, 10, -118, -127, 96, -304, -144, 94, -65, -69, 153, -120, 85, -38, 28, 29, 25, -92, -133, 150, -172, 247, -5, 100, -16, -142, 80, 234, 27, 167, 111, -155, -98, -9, -175, 135, 119, -81, 134, -62, -54, -181, 193, 83, 126, -175, 61, -110, 263, -75, 0, 250, -174, 25, 39, -164, 202, -143, -1, 32, 117, 160, -152]
4436a52N4LK31n7j20m1l1J9K18j92J07j74J33j29N22m89L1N2K05j73Q2k12J48
4459C5K1J17Q0k61R8N8m9m4n0N5j29n5L61k84J39Jm6J00j28MM9rm6k35J08K27
4485A17J23k79l5n0K61j84K84r1l31KJ59N3j16K6L1k54K35J87j87k6p6J90q6J3
4509c4L67p38L27j59M00j02P0j6k53Q1P7j29k9L2O8J46N6l62J40J78k00K01m03
4532b82J48R6K35l71K41J36O7j46o8j68K60j82J7J00k77K44Q6q4M5J30j96k23
4554a92Q8J81k47L2o0J47J76o2K3kp0K0j53K02J6k72J59Q6j59RR4n4K70m01L0
4579a39L7J39J6j98K94k46R6K80j49J98m61J89l24J13Q1K5J42k93J16J79r4j44
4601a43K42r0j20L22p9j26k02k4J72j18J5J85J84l69N8J17OK47j92j06K79k38
$$ y = [-152, -98, -95, 136, 79, -41, -82, -113, -94, 124, -68, 39, -135, -2, -131, 391, -98, -67, -15, 190, 17, 99, -113, 35, 56, 173, 253, -8, 90, 148, 99, 55, 5, 60, -69, -124, 237, -47, 92, 93, 47, 147, 19, 23, 72, 63, 17, -218, -110, 117, 240, -39, -74, -124, 137, -47, 237, 146, -185, -183, -24, 29, -87, -61, -30, -284, -49, 138, -49, -75, -151, 39, -47, -34, 333, -405, -78, -237, 163, 61, 131, 115, -138, -57, 20, -109, -138, -106, -38, 108, 164, -198, -58, 120, -80, 121, -282, -134, -38, 197, -174, 67, 203, 270, 124, 56, -112, 148, -34, -17, 83, -194, 50, 136, 52, 97, 227, 31, -192, -104, 77, -170, -138, -198, -51, 125, 63, 86, 84, 14, 34, -119, 83, 99, -173, -14, 72, -87, -78, 16, -38, 232, -169, -139, -102, 37, 53, -145, 149, -97, -1, 279, 130, 328, -133, 56, -268, -155, -74, -49, 93, -200, -84, 95, 1, -143, 99, 9, -111, 211, 132, 6, -196, -220, -48, -166, -151, 34, 218, -151, -93, 24, 30, 277, 85, -21, 258, 20]
4623B0J74k30k06K55j19J77j20J30N4k09O5j37J31k40M32j24p0n1J60j62K01j99
4645f8J90j85J71P5j27k28J93N5r9K50j47M9k54k9m5J38L3O5j34K08m5k37O4k2
4669a29J44O4RN9j55j22l6K80j24R1n2J60nk13NJ9o4L73l15j60K87j43j10P4L4
4694b9J36j82m6J71L0j02K37j01j89j5J2n4L08k05r0j39K73o8k16L15J33n6m2
4717H1P7Q5k18N3k3o1J02j51L8k53K84j53J76L5J14k10J15j89K12Jr2J42k79L09
4741A95j82n7j18J51j23L74Q1k98N7l6j33j90K86K8k55J38K07k32J72j10L72l51
4763b4J01q6K4k38M16k7m8j21m7l6J72O7k60Qp2K62j61M3J19KPJ33n9N5k01p6
4789d7o1P3Q6j47K36k70M32m25J50k02L55k23k13J83r9J99p8j42K68j55K44l30
$$ y = [20, 194, -36, -242, 13, -106, 71, -49, 81, 135, -74, -9, -146, -15, -255, 177, 53, -17, -68, 92, -70, 131, -68, 122, -63, 108, 183, 56, -172, 21, 76, -23, 227, 80, 129, -125, -154, -199, -61, -28, 37, -97, 111, 66, -171, -107, -129, 15, 79, 88, 147, -8, -130, -166, 114, -10, 81, 29, 189, 184, -29, -24, -5, -69, 304, -11, -171, 116, -27, -137, -63, -29, 107, -75, -121, 50, 80, -22, 215, 114, -75, -90, -78, -132, 176, -29, -119, -258, 15, -53, -269, 46, 179, 123, 81, 158, 243, 25, 78, 55, -6, 96, -55, -17, -270, 14, -139, 37, 72, 186, -24, 91, -98, 114, 115, 23, 165, -114, 195, 13, -44, -162, -11, -134, 240, 321, 23, 80, 44, -89, -279, 7, 35, -220, -82, 125, -107, 65, -45, 327, -24, 77, -9, 15, -223, 193, 166, 118, -3, -50, -86, 86, 153, -107, -99, -171, 91, -70, -27, 92, 94, 101, 234, 175, 230, 29, -47, -108, -35, 51, -96, 140, -130, 302, -123, 27, -175, 180, -43, -256, -73, -172, 27, -51, -193, 75, -80, 164, -166]
4811a66K98J66r9k88J08j9j10K47l43k1O6J40KK75j15j89j0Q5JJ05q8r8j40K8
4835a65O6L01j35k4k4k4m9J51J76l99L17k06R5j56J29K68l47L0J02j35J79r7J5
4858F8j64k8K05J3k18R4J26k6j99q8J78r3L27l98M57k39J45l67K71j20J65k85
4880a76j8M79l30O3NJ63l01O7J56j33K13j44J82j95j82K15j01k7K28K7o3o4j07
4903d3R3L8j92Q8J61O8k34j70J13J02J18l32J62j39K01l47K52p2P8j43K21j30
4925a07J10J95k17K6j1j00K87k10q7j7n2M32m59L01p3m0J52l29M5K23J09m2k43
4948a07J2K04oj07k6K08k86J35q0njo4J68m3j69J63K09k3j12j12M1J34k8j98r5
4973a88L53j36JR1o3j07M4j28J33k4J99k56qR6j03J19k33J45o2J20p3O5K57k85
$$ y = [-166, 132, 298, 199, -89, 19, 0, -110, 137, -206, -227, -161, -21, -19, 256, 141, -48, -58, 27, 28, 133, 45, -53, -193, -165, -99, 202, 67, 43, 19, -5, -54, 97, 273, -126, 191, -15, 80, -76, 53, 321, -26, 4, 106, -29, 150, 53, 68, -96, -124, 81, 94, -124, -30, 96, 70, -129, -217, -39, -132, 195, -203, 254, 15, 160, -207, 64, -56, 109, -176, -194, 285, -45, 18, 23, 186, -115, -48, 108, -25, 188, 44, 226, 31, -151, 64, -37, -64, 164, 191, 128, 64, -43, 50, 88, -104, -16, 145, 213, -21, -191, -78, 24, 142, -190, -28, -167, 34, -313, -61, -133, -55, -198, 23, -107, 3, 198, -19, 7, -4, -104, 183, -27, -114, -131, -183, 249, -210, 91, 18, -22, 130, -199, -154, 69, 178, 136, -107, -95, 109, 103, -4, -30, 178, -108, 27, -53, -58, -59, -123, 45, 2, -167, -4, 205, 182, 70, -42, -1, 133, 105, -93, -188, 165, 29, 30, 121, 58, -49, -5, -133, 0, -24, 175, -81, -89, 7, -96, 23, -210, -65, -127, -7, -80, -15, 242, -43]
4997d3J97j36oO7o8j18K92j02k26K61l52M25l71J20r5J61j15O3j03K05M2j89n
5020i6p8L63k96K25j83J53p0K3O7k28r2R4L14j70n1K21k53R9N5J02l0j00r0K5
5044DR8q5J0j56J23K5k4M9j02k0P3J47j31R4Q4k63qj90K70J64j14N4Kj7j76J07
5070A8Lj31J57j79J24k31K81q5L6K5l08M05L38m56p3k4o4K48k82J02R4mK15j55
5094E4j34L6J05k2k2j7K09j71L8j55k4K69q5Nn0m4lk1j6J68j9k90J83K6l3k9k3
5121f5J61Q5n46L36r6M15l27j64N6N9m9K49k38J67J33M2l9l16o0J44O3N9j62J57
5145F4L29k27j83J5J13j16J50k0q0j39J67k29J17j83P2L2J63KJ36p6l12L17j38
5168b6K30l99J26J78k69L12k36K53l33L0K76l04K69q8Mj54J98r4q2mN2J38n3L7
$$ y = [-43, 154, 18, 12, 79, 11, -107, 185, 83, -143, 118, -234, 191, -180, -60, -155, 6, -109, -46, -149, 56, 98, -91, -96, -174, 189, -107, 118, -65, 88, 18, 41, 108, -120, -212, -118, 196, 26, -25, 196, -57, 42, 97, 199, 169, 69, -21, 4, 102, 17, 27, -129, -6, 19, -5, 44, -58, -78, -5, 142, 11, 105, 189, -74, -82, -272, -2, 162, 48, 102, 104, 87, -89, 18, 21, -110, 47, -132, -8, -239, 42, -43, -7, 18, -290, 115, 453, -3, -76, -100, -164, 84, -198, -96, -2, -6, 209, 54, -80, -44, 61, 39, 17, 0, 209, 38, 76, -79, -103, 166, 81, 86, 36, -8, -11, -32, -48, 120, 101, -189, -6, 20, -13, -42, -65, 96, 181, -365, -29, -125, 290, -37, -201, -145, -86, -135, 114, -124, 43, 176, 218, 179, -137, -197, -53, 10, 69, -93, 64, 393, 166, -17, -2, 111, -5, 145, 125, 45, -94, 73, -156, -39, -222, -150, -118, 45, 47, 183, 107, -205, 112, -26, 204, -195, -69, 109, -160, 152, -84, 169, -164, -134, 142, -162, 107, 19, 23, -131, 67, -27, -109, -113, -61, 77, 24, 61]
5192F1J9j46P9p1J2K21k79J75k23J47l0M1J67l61J70J25j68J63P6j88k52K13n9
5215a08K38k07J31OK7Ml3J47r5l58K43R6j48j1K03n6l35M80Nl7j20j73m6K68k5
5240I6j01JK08l79J34J5o1%rj08M70j53j1j6l6l1j88K48l24L65q3j0M9m1N5m8
5266D2JN3O8j18%o2o9J90j03R7J6k89K20K6M7o8j6q3K49l46J74J89k73K32l96
5291b19K81K6k83K86n2j02J32m34N32q4j64P8J10j24J34n5j54oK86k86K44n0j77
5314h1L17j69j52pK42k60Q8j4n8O7jn8P4j70J92j58K15p9N2O0j43o4J26p4N0k6
5340c1m5M6q3K73l70L22r1Qm53M82j95J35R0J19l19K09k44J99n2j31Lj8L04P9
5364B37l03l1J69m1R4k51M53j78R9j17l77J41P3m4M2j3j33J80K31l64K98j99N9
$$ y = [61, 80, -66, 13, -58, -46, 175, -104, 71, -152, -5, -35, 6, 173, -188, -18, 107, -61, 102, 178, -10, -262, -49, -108, 130, -77, 54, 60, 87, 91, 58, 205, 110, -248, -5, 91, -57, -68, 135, 79, -256, 224, 229, 192, 72, -101, -147, 121, 96, -5, -4, 204, -175, -41, -26, -87, -87, -96, -204, 266, 113, 102, 86, 50, 19, -169, 79, -245, 120, 37, 27, 76, 35, 90, 42, 43, 96, 164, 46, 46, -16, -85, 105, 2, 99, 115, -174, 46, 72, 119, 51, 35, -48, 201, -145, 29, 218, -55, 177, -219, 62, 88, -195, 91, 39, -63, 69, -365, 167, 83, -81, -3, 107, -17, 117, 62, -92, -98, 188, -98, 146, 96, -81, 236, 67, -85, -92, 150, -110, -22, -36, -94, -27, -28, -86, -12, -182, 10, -148, 67, -12, 40, 100, -43, -107, 19, -55, -5, -31, -76, -30, -113, 160, -210, 112, 21, 29, -424, 58, -137, -2, 88, 207, -112, 97, -147, 52, 0, -131, -128, -146, 158, 237, -66, -97, 72, 31, 125, -126, 327, 149, 248, 131, -246, -105, -32, -76, -34, -47, -180, 0, 231, -133, 165, -34, 25]
5387B5J31j10k92L82k34J80q4j01K51q8Mj06J98j36p4J31n0r9q3P3j7KJ33j0m4
5412a8N1J20k74K78j18j48N10m07L23k45k71K15oO0k49K6J34L03r4j68L05k63
5434F4L0Kn1k18K62k8k7o3RK83m08L04j15j59K2R7j59K93n6m9J6Km7Q1k10J27
5460Bp3L4q3j3K81k71r1J31q5K09J26k70J74k10O9J2m6K13j02o5K41l33J8Q6J97
5485A51k31q4L19k22J36m3o3n1Q8Q7n0r8n4P0r3K02k16K70Oj10N9l6J53k69J3
5510f6O7j06KJ24R2J3n0n1L5k44J69j1j64K18j52J72J68l03Q2q8l0K85j39J14
5534A37nj47K07l31N3mK22l6M1l95M30k04rJ49j09J8r0K72k11q7O3j8k2L8K20
5559A82rN1j85k70L00j79R4N1n1K35r4l0l72L65J88n68N19l99K79r4n8P5k44K73
$$ y = [25, 156, 46, -246, 136, -98, 82, -2, -103, 148, 60, 64, -42, 156, 20, -54, 77, 27, -72, -155, -82, -99, -97, 36, 26, -18, 33, 153, -121, 157, 39, -109, 401, -6, 317, 72, -199, 16, 10, 70, -179, -153, -19, 284, 190, 22, 327, 64, 94, 96, 45, -173, 89, 61, 34, -29, -20, 263, -145, 159, 44, -115, -93, 4, -155, 138, 82, 33, 49, 51, 4, 85, -125, 2, -71, -37, -120, -133, 148, -123, -214, -83, -168, 41, 167, -103, 71, -139, -70, -58, -104, 109, 7, -58, 183, -150, -132, -46, 151, -80, -164, 155, -67, 69, 26, -37, -88, 0, 87, 37, -61, -115, -45, -138, 64, -152, 118, 124, 14, 73, 37, 190, -79, -66, 1, -105, -103, 21, 113, 126, 76, 25, 60, -184, -15, -26, -190, 28, -124, 48, 216, -87, -5, -93, -123, 162, 23, 137, 132, -15, 192, -139, -86, -90, 132, 96, 137, -258, 172, -32, -41, 108, -1, 17, -73, 199, -12, -99, -36, -54, -76, -38, 182, 173, 224, 39, -231, 69, -110, -16, 35, -16, 219, 125, 95, -277, 88, 276, -292, 227, -172, 107, 13, -45, 30, -214, 59]
5583E9%p0Q4k44L71j67l0k07k4Q0L9M1O7n2r7M35l25J94l3p1pP5P8j81%j87K03
5610C1j80K39j07J03L0k34M24m80K01j71J96Ql04R2J18p4M1J63k8k32J32j2j29
5633a73L18l27K54j06o7K94l49R2J25K36l93L7J04j40J7K63p5j77M4j53J22J52
5655I8MJ03l27L75k52o5J0RK33l32J26r3K77k60L1K9K03J28l33M5N8K41j37l34
5679a63K55O9r6J95l94P3K34n20L08J29j83N4L1j51K11j10J4o2J26k9J05j51J11
5702E6J51j65n5K8L7k36L25l85K74j30pJ98j29j60L20nm4k66J41J95j03k11J05
5725f6K27j71M3m4K59k05m0J38r7k04K36m3J41J09k67K09k42n5J31N1k12n6N78
5748D20l92k14J54j77M6J86j62J04q0J86p9L2L52k20j04l4M0j46j7J52k6j90J73
$$ y = [59, 59, -11, 73, -171, 200, 33, 3, -204, -228, -148, -109, -68, -1, -53, -150, 285, -40, 154, 121, 50, 43, 118, 196, 15, 15, -172, 31, -149, 90, -17, 86, 116, -118, 306, -174, 27, -144, 52, 60, -244, -152, -34, -108, -67, 96, 68, -164, -32, -44, -173, 145, -182, 72, -34, -101, 193, -156, -64, 61, 297, -96, -59, 45, -95, -78, 185, 110, -67, -23, -176, -54, 98, 102, 205, -122, 253, 1, -64, -54, -45, 188, -144, -18, -111, 166, -94, -63, -34, 169, 297, -36, 9, 67, 308, 171, -163, 92, 161, 65, 260, -134, -61, 173, -347, -39, 90, -93, -39, -8, -159, 52, -58, -44, -106, 20, -9, 96, -55, 56, 207, 42, -13, 15, 52, -184, 141, -244, 30, -100, -107, 91, -38, -198, 122, 117, 73, -193, -52, 143, 40, -171, -66, 161, -10, 33, -11, 248, 43, 3, 141, 44, -160, 76, 33, 174, 283, 16, 225, -17, -72, 59, 110, -102, -158, 420, 28, -186, -32, -209, -163, 23, -139, -35, -115, 71, -8, 24, 376, 156, 52, 18, 58, -88, -105, 47, 21, -169, 4]
5771DJ08j43Oj00J96m3QK30j65j78J4N8r7R7j25O0K10j00N8k23J92Nj47K0P5j40
5797a20N0K28J32m18m3q8J45K76k09J52k25oR0J64J15l32O1J99J5k55J47l88O19
5820C09k93l0n7R5M4J36j78J18j96k71J79K30j36N7j36j11L90j83O2j9O1J32r4
5843A09p7r9L9j96m1J82L9L1R5j24J59j29j37L44j06q5N7j11Q8l7J16l59K36q1
5867h7nJ19m0J55ok64R0r8K44j35J94j57l73L17o7K35L8j17j28l1J21K8r4rp5
5892a45J86j0p8m6j34P1L8J48L3k77j6K40k5K0r4P3m2J74K3q6J51j55qk0O0j29
5918d8K7J2o5O6j9j95K91k92K99j27j2M4J4J8j11J12M9N0l6j85J59J33k98K42
5942A28n1r3J48j45M4m1k23K73p4l3J61o3o7L13k89j85J41j8o8J99K3Nk00K76
$$ y = [4, 112, -31, -25, -125, 71, 28, 36, 266, 101, -77, -63, -5, -102, -5, -130, -70, 140, 40, 98, -125, 67, 72, -75, -55, 20, -120, -70, 158, 290, -128, -171, -259, -114, 162, -47, 105, -120, -126, -36, 128, 243, -89, -28, 171, 186, -69, 78, -310, 309, 16, -14, -71, 24, 68, 204, 26, 144, -52, -323, -144, 86, -50, 7, -129, -240, 150, -33, 29, 10, 71, 203, 109, 32, -67, -28, -224, -265, -83, -44, -13, 82, -42, 117, -12, -149, 195, 89, 4, 61, -50, 38, 1, 117, -242, -6, -87, -92, 27, -13, 142, 136, -128, -38, -136, 108, -27, 167, 10, -363, -46, -113, 122, 160, 43, -85, -116, 5, 33, -61, -70, -145, 41, 31, -47, -93, -227, -156, -118, 30, 63, -214, -230, 10, -15, 5, -89, -16, -58, 116, 139, 53, 204, 49, 41, 21, 81, -48, -21, -9, -74, -8, -27, -222, 69, -223, 76, -51, -63, -19, -5, 13, -98, 14, 63, 113, 77, -108, 51, 184, -114, 128, 77, -16, 132, -13, 31, -10, -233, 40, -34, -67, 94, 31, -36, 277, -12, -197, -56, -74, -142, 57, 80, 85, -115, 161]
5966A61p2j33j74J71M81k36l10J23K16k74J76n9j02j36K04p6K32j48j7k33p7M19
5988A36j37lk12J35l5K09o3k06K44o0J44o2j19J12j67Q8J36l27L11J16j13j90
6010f3o2M14l68K33k49j49M14j57q4J56k20M42n04L84j3q5K9N7l6j70J61O9k25
6033b6j14p3K75j64L6L69l76J80q0k47K68k40J24N5J13J62l76J25R1n9j00O5J9
6056B7o3J60Jm9o9KK07j7k37k07K57k97K50K18k52J80J70j88p6l1J89Q7k36j10
6080h4jQ2J63kj12J54l74r3L02k57K82P9j33k09L39k57K49l38M37L1q8LK4k07
6104a0k9O7J74j24j10J36k3j45J76k62K12J1k29K10j51R9O4r8L9K33m23J63p2
6127i2Q6J43J0j85J27k16K34k20L12j5k23J8J47l9K8P7l03J87j49J57l54J30L00
$$ y = [161, 89, -44, -218, -47, 434, 198, -112, 11, 227, -47, 129, 70, -32, -168, 36, -40, 192, 44, 27, -206, -283, 136, -1, -4, -216, -81, -116, 93, 30, -176, 68, 8, 152, 90, -29, 83, -84, 4, 140, -187, 124, 240, 127, -63, -125, 289, -79, 154, -95, -244, 170, 13, -71, 85, -135, 307, -197, 187, 174, 89, 118, 175, 139, -31, 130, 199, -26, -140, -213, 62, -102, -66, 303, -73, 107, 27, -220, 48, -192, -68, -13, 100, 262, -114, 11, 102, 43, -57, 8, 27, -36, 124, 125, 76, 7, 9, 216, 199, -38, -245, 12, -285, -35, 183, -69, 111, 281, 93, 17, -14, 175, 262, 26, -84, -85, -3, 160, 158, 46, 200, -174, -267, 35, -222, 60, 139, 6, -203, 136, -121, 128, -210, 227, 258, 170, 173, 197, -10, -39, 28, 202, 78, -32, 104, 81, -64, 112, -150, 62, 73, -156, 54, -97, 2, 66, -32, 7, 240, -183, -20, -92, -6, 137, 147, -38, 89, -127, 107, -113, 199, 184, -39, -21, 126, 87, 115, 192, -111, 76, -73, 84, -270, -140, 160]
6150A60j78N8l3l3j6j36J61J30qj70J41q1L3L2k13M5K59j31p0K25k72K05l8j48
6174g8K30j6m5l7qON7k30J29j47J1L87k53l7K59k7l05P6j6jj7R1K0Q9o6j11j00
6201a39qK2K69J70m18K09j74Ol4J88L07k50r9k86P1L92j42j08m3K84k34k2J37
6224I8q3J44l66K17j59L26l00k0K54K7j5Q0M2o2l0J5k34J72P3k65Q7j4J9j20K76
6249A62q3j28J08l7j4Pn0P1m5J42K1k00J90j57K59m41K81pj19N8j28K70p4k0M9
6274A15k43K47n9j18P5n0J79n7r1l34M17j05K7r3N7j18K50l36L41j93J14P0J09
6297B04j96nK8j93K37L5l07M5K57l8p7n0j0r3K91o0k01L9j4m4P3K77j03k23K14
6322H6r7K31qo9m2k29J1p3J66j20R9j07K57J3J75k32j96K15j56K61m8M1l36K62
$$ y = [160, -18, 40, 7, -26, -42, -178, -17, 113, 105, -65, 76, -5, 28, 60, -153, -108, 151, 20, -50, 175, -97, 108, 70, -78, 152, 136, 91, 54, 46, 52, 109, -121, 8, -139, -128, 259, 6, -31, 228, 201, -104, -28, -44, -45, -62, 29, 49, 138, 72, -39, -139, -147, -125, 144, 314, -104, 105, -69, -63, -97, 91, 398, 148, 49, -237, -166, 226, 84, -24, -67, 217, -17, -39, 98, 15, 159, -207, 10, -149, 177, -123, -143, 111, 138, 123, 203, 245, 183, 153, 168, -66, 106, 179, -86, 1, -13, 6, -114, 162, 79, -49, 59, 22, 8, 15, -35, 36, -9, 133, 154, -46, 144, -13, 246, -195, 86, 79, -40, 18, -110, 160, 86, 66, 115, -128, 119, 60, -58, 17, -33, 146, 89, -2, -336, 81, -24, 3, -90, -33, -151, 99, -237, 104, -89, 25, 95, 204, 8, 3, 31, -162, 75, 110, -197, -152, 105, 67, -10, -60, -70, -163, 128, 68, -133, -94, -108, -152, -79, 198, 95, -128, 86, -11, 220, 212, 143, 101, -128, -117, -190, -24, -144, -45, -152, 105, 118, 293, 61, -135, 80, -76, 185, 137, 178, -158, 104]
6346A04k0L74l81j56J12qL1J48R8k20O3Q0ml20J98k00K8m5j10P7J61K0O7l46J99
6371e0j02R1L7L07j47J9j58r8J00l9O5nj57oL19L1j25JO1Ko9M3m5k9p9M3o2p3
$$ y = [104, 84, 458, 77, -79, 33, 25, 56, 204, 302, 82, 145, 225, 221, -99, 99, -101, -73, -118, -228, -151, 10, 30, 97, -249, -50, -152, -61, -24, 283, 136, 155, -3, -101, -1, -40, 25, 20, -137, -143, 176, 207, 82, 83, 144, 146, 77, 120, 75, 46, -33, 10, -52, -125]
$$ [...]
8191a63
##END NTUPLES=NMR FID
##END=
