##TITLE=1H_Pr AmC6nB
 200.13Hz, D2O.
 8 sc
 12.8.2026
##JCAMPDX= 6.0         $$ Bruker NMR JCAMP-DX V2.0
##DATA TYPE= NMR FID
##DATA CLASS= NTUPLES
##ORIGIN= UXNMR, Bruker Analytische Messtechnik GmbH
##OWNER= pz
$$ XWIN-NMR		Version 3.5
$$ Tue Aug 11 13:52:54 2026 Russian Standard Time (UT+4h)  she@DPX200
##.OBSERVE FREQUENCY= 200.1313
##.OBSERVE NUCLEUS= ^1H
##.DELAY= (6, 6)
##.ACQUISITION MODE= SIMULTANEOUS
##.ACQUISITION SCHEME= undefined
##.AVERAGES= 8
##.DIGITISER RES= 18
##SPECTROMETER/DATA SYSTEM= spect
##.PULSE SEQUENCE= zg30
##.SOLVENT NAME= D2O
##.SHIFT REFERENCE= (INTERNAL, D2O, 0, 14.3821)
##AUDIT TRAIL= $$ (NUMBER, WHEN, WHO, WHERE, WHAT)
$$ ##TITLE= Audit trail, XWIN-NMR		Version 3.5
$$ ##JCAMPDX= 5.01
$$ ##ORIGIN= Bruker BioSpin GmbH
$$ ##OWNER= she
$$ F:/spectra/data/she/nmr/H-C/1/audita.txt
$$ ##AUDIT TRAIL=  $$ (NUMBER, WHEN, WHO, WHERE, WHAT)
(   1,<2026-08-11 13:51:11.15 +0400>,<she>,<DPX200>,
      <created by zg, POWCHK disabled, PULCHK disabled
       configuration hash MD5:
       00 E9 B6 7A A2 85 ED C7 34 08 36 98 17 FE 4E 26
       data hash MD5: 16K
       DF EF B8 9B D4 40 BC E8 4E A6 C8 3B F9 D0 FE E4>)
$$ ##END=
$$ 
$$ hash MD5
$$ E1 50 DB 56 AF 6F 61 DB 08 3F 6F 61 C8 78 C7 62
##$RELAX= 
##$RELAX= 
##$RELAX= 
##$RELAX= 
##$RELAX= 
##$RELAX= 
$$ Bruker specific parameters
$$ --------------------------
##$DU= <F:/spectra>
##$EXPNO= 1
##$NAME= <H-C>
##$PROCNO= 1
##$TYPE= <nmr>
##$USER= <she>
##$AMP= (0..31)
100 100 100 100 100 100 100 100 100 100 100 100 100 100 100 100 100 100 
100 100 100 100 100 100 100 100 100 100 100 100 100 100 
##$AQSEQ= 0
##$AQ_mod= 1
##$AUNM= <au_zg>
##$AUTOPOS= <>
##$BF1= 200.13
##$BF2= 200.13
##$BF3= 200.13
##$BF4= 200.13
##$BF5= 200.13
##$BF6= 200.13
##$BF7= 200.13
##$BF8= 200.13
##$BYTORDA= 1
##$CFDGTYP= 0
##$CFRGTYP= 5
##$CHEMSTR= <none>
##$CNST= (0..31)
1 1 145 1 1 1 1 1 1 1 1 1 1 1 1 1 1 1 1 1 1 1 1 1 1 1 1 1 1 1 1 1 
##$CPDPRG= <>
##$CPDPRG1= <>
##$CPDPRG2= <>
##$CPDPRG3= <>
##$CPDPRG4= <mlev>
##$CPDPRG5= <mlev>
##$CPDPRG6= <mlev>
##$CPDPRG7= <mlev>
##$CPDPRG8= <mlev>
##$CPDPRGB= <>
##$CPDPRGT= <>
##$D= (0..31)
0 0.7 0 0 0 0 0 0 0 0 0 0.03 0 0 0 0 0 0 0 0 0 0 0 0 0 0 0 0 0 0 0 0 
##$DATE= 1786441870
##$DBL= (0..7)
120 120 120 120 120 120 120 120 
##$DBP= (0..7)
150 150 150 150 150 150 150 150 
##$DBP07= 0
##$DBPNAM0= <>
##$DBPNAM1= <>
##$DBPNAM2= <>
##$DBPNAM3= <>
##$DBPNAM4= <>
##$DBPNAM5= <>
##$DBPNAM6= <>
##$DBPNAM7= <>
##$DBPOAL= (0..7)
0.5 0.5 0.5 0.5 0.5 0.5 0.5 0.5 
##$DBPOFFS= (0..7)
0 0 0 0 0 0 0 0 
##$DE= 6
##$DECBNUC= <off>
##$DECIM= 32
##$DECNUC= <off>
##$DECSTAT= 4
##$DIGMOD= 1
##$DIGTYP= 9
##$DL= (0..7)
0 120 120 120 120 120 120 120 
##$DP= (0..7)
150 150 150 150 150 150 150 150 
##$DP07= 0
##$DPNAME0= <>
##$DPNAME1= <>
##$DPNAME2= <>
##$DPNAME3= <>
##$DPNAME4= <>
##$DPNAME5= <>
##$DPNAME6= <>
##$DPNAME7= <>
##$DPOAL= (0..7)
0.5 0.5 0.5 0.5 0.5 0.5 0.5 0.5 
##$DPOFFS= (0..7)
0 0 0 0 0 0 0 0 
##$DQDMODE= 0
##$DR= 18
##$DS= 0
##$DSLIST= <SSSSSSSSSSSSSSS>
##$DSPFIRM= 0
$$ [...]
##$SUBNAM0= <"">
##$SUBNAM1= <"">
##$SUBNAM2= <"">
##$SUBNAM3= <"">
##$SUBNAM4= <"">
##$SUBNAM5= <"">
##$SUBNAM6= <"">
##$SUBNAM7= <"">
##$SUBNAM8= <"">
##$SUBNAM9= <"">
##$SW= 18.0517328524113
##$SWIBOX= (0..15)
0 0 2 0 0 0 0 0 0 0 0 0 0 0 0 0 
##$SW_h= 3612.71676300578
##$TD= 16384
##$TD0= 1
##$TE= 0
##$TE2= 300
##$TE3= 300
##$TEG= 300
##$TL= (0..7)
0 120 120 120 120 120 120 120 
##$TP= (0..7)
150 150 150 150 150 150 150 150 
##$TP07= 0
##$TPNAME0= <>
##$TPNAME1= <>
##$TPNAME2= <>
##$TPNAME3= <>
##$TPNAME4= <>
##$TPNAME5= <>
##$TPNAME6= <>
##$TPNAME7= <>
##$TPOAL= (0..7)
0.5 0.5 0.5 0.5 0.5 0.5 0.5 0.5 
##$TPOFFS= (0..7)
0 0 0 0 0 0 0 0 
##$TUNHIN= 0
##$TUNHOUT= 0
##$TUNXOUT= 0
##$USERA1= <user>
##$USERA2= <user>
##$USERA3= <user>
##$USERA4= <user>
##$USERA5= <user>
##$V9= 5
##$VALIST= <valist>
##$VCLIST= <CCCCCCCCCCCCCCC>
##$VD= 0
##$VDLIST= <DDDDDDDDDDDDDDD>
##$VPLIST= <PPPPPPPPPPPPPPP>
##$VTLIST= <TTTTTTTTTTTTTTT>
##$WBST= 1024
##$WBSW= 4
##$XGAIN= (0..3)
0 0 0 0 
##$XL= 0
##$YL= 0
##$YMAX_a= 510945
##$YMIN_a= -462610
##$ZGOPTNS= <>
##$ZL1= 120
##$ZL2= 120
##$ZL3= 120
##$ZL4= 120
##$ABSF1= 10
##$ABSF2= 0
##$ABSG= 5
##$ABSL= 3
##$ALPHA= 0
##$AQORDER= 0
##$ASSFAC= 0
##$ASSFACI= 0
##$ASSFACX= 0
##$ASSWID= 0
##$AUNMP= <proc_1d>
##$AZFE= 0.1
##$AZFW= 0.1
##$BCFW= 1
##$BC_mod= 2
##$BYTORDP= 1
##$COROFFS= 0
##$CY= -3
##$DATMOD= 1
##$DC= 2
##$DFILT= <>
##$DTYPP= 0
##$F1P= 0
##$F2P= 0
##$FCOR= 0.5
##$FTSIZE= 0
##$FT_mod= 4
##$GAMMA= 1
##$GB= 0.15
##$INTBC= 1
##$INTSCL= 1
##$ISEN= 128
##$LB= 0.25
##$LEV0= 0
##$LPBIN= 0
##$MAXI= 10000
##$MC2= 0
##$MEAN= 0
##$ME_mod= 0
##$MI= 1.114404
##$NCOEF= 0
##$NC_proc= 0
##$NLEV= 6
##$NOISF1= 3.799351
##$NOISF2= 2.8
##$NSP= 1
##$NTH_PI= 0
##$NZP= 0
##$OFFSET= 14.38212
##$PC= 1
##$PHC0= -4219.494
##$PHC1= 4.192301
##$PH_mod= 1
##$PKNL= yes
##$PPARMOD= 0
##$PSCAL= 0
##$PSIGN= 0
##$REVERSE= no
##$SF= 200.129724274929
##$SI= 16384
##$SIGF1= 3
##$SIGF2= 2
##$SINO= 400
##$SIOLD= 16384
##$SREGLST= <1H.CDCl3>
##$SSB= 0
##$STSI= 0
##$STSR= 0
##$SW_p= 3205.1282051282
##$SYMM= 0
##$S_DEV= 0
##$TDeff= 0
##$TDoff= 0
##$TI= <>
##$TILT= no
##$TM1= 0
##$TM2= 0
##$TOPLEV= 0
##$USERP1= <user>
##$USERP2= <user>
##$USERP3= <user>
##$USERP4= <user>
##$USERP5= <user>
##$WDW= 1
##$XDIM= 8192
##$YMAX_p= 0
##$YMIN_p= 0
$$ End of Bruker specific parameters
$$ ---------------------------------
##NTUPLES= NMR FID
##VAR_NAME=  TIME,          FID/REAL,        FID/IMAG
##SYMBOL=    X,             R,               I
##VAR_TYPE=  INDEPENDENT,   DEPENDENT,       DEPENDENT
##VAR_FORM=  AFFN,          ASDF,            ASDF
##VAR_DIM=   8192,          8192,            8192
##UNITS=     SECONDS,       ARBITRARY UNITS, ARBITRARY UNITS
##FACTOR=    0.0002768,     1,               1
##FIRST=     0,             0,               0
##LAST=      2.2672688,     0,               0
##MIN=       0,             -462610,         0
##MAX=       2.2672688,     510945,          0
$$ Real data points
##PAGE= N=1
##DATA TABLE= (X++(R..R)), XYDATA
0 0 0 0 0 0 0 0 0 0 0 0 0 0 0 0 8 -7 8 -8 8 -14 16 -17 22 -24 30 -33 40 -47 53 -63 71 -81 92 -103 120 -132
36 -132 151 -170 188 -213 235 -262 292 -322 359 -394 438 -485 531 -587 645 -711 784 -863 954
55 954 -1051 1166 -1293 1440 -1612 1815 -2057 2354 -2726 3215 -3869 4806 -6233 8543 -16841
70 -16841 304504 410734 239708 283003 218968 -103600 -360492 -373064 -354296 -203379 155906
81 155906 403915 338171 245488 199289 -15405 -328498 -429447 -329909 -164749 75362 325340
92 325340 385434 280148 158599 -39 -247467 -423253 -375347 -157278 82639 257186
102 257186 341733 333153 203394 -31787 -246166 -340813 -346494 -245613 23042 302256 355557
113 355557 257531 192578 70237 -196518 -391859 -357174 -203699 -4381 232208 350740
123 350740 277571 183620 99476 -134576 -398693 -394460 -175339 7709 149706 299478 332594
134 332594 221047 73946 -117797 -343321 -394518 -206412 -1377 120932 255169 346685
144 346685 263468 70891 -119132 -294720 -368429 -243518 -36168 108775 233685 339258
154 339258 287828 84981 -112257 -255216 -340155 -278170 -79208 104940 226318 316229 294694
165 294694 114017 -92259 -228492 -317790 -305232 -121591 106330 227051 272856 282196 174700
176 174700 -48651 -246248 -323139 -277103 -131639 51725 196831 284074 296246 181943 -30964
187 -30964 -219700 -305362 -282049 -155980 23475 177440 275854 302196 199581 -11883 -199330
198 -199330 -284033 -282020 -185838 -4688 166617 263876 295763 222193 16137 -190379 -267668
209 -267668 -260747 -212648 -58894 160944 284576 273548 201799 65446 -135101 -279779 -284906
220 -284906 -201994 -66600 117567 264432 286763 210498 80142 -100691 -262851 -298168 -209214
231 -209214 -72187 84143 233344 297238 234706 87248 -86614 -231853 -287928 -232307 -97114
242 -97114 71125 218179 284059 243295 114758 -62885 -221378 -282247 -232364 -117159 37049
253 37049 200570 290512 249749 119378 -37472 -188269 -278022 -251748 -131982 22178 177057
264 177057 279001 259775 134502 -18786 -160152 -265149 -269784 -151827 15462 158412
274 158412 252254 264981 167075 910 -154150 -250228 -261871 -172786 -14081 144345 245986
285 245986 261028 179304 27424 -133306 -243134 -262968 -183418 -35372 121842 234458 263168
296 263168 191289 46007 -112195 -228850 -263632 -196406 -53764 101796 218425 262486 206414
307 206414 64332 -96744 -211826 -255371 -211525 -79169 87615 210271 252120 210353 90327
318 90327 -71642 -204296 -254584 -213600 -96181 61322 195392 251596 216758 105684 -48139
329 -48139 -187586 -252460 -220174 -109664 38821 175841 248283 226403 119291 -30088 -167867
340 -167867 -243942 -228892 -126893 21402 158469 237643 231614 138100 -10681 -153490 -234310
351 -234310 -229071 -143629 -3556 141845 232692 233758 148818 10015 -132461 -224428 -232804 -157129
363 -157129 -23221 123039 223210 236100 159637 28624 -110680 -212122 -236264 -170681 -39636
374 -39636 104755 209374 235565 173017 46785 -94052 -199121 -233101 -182175 -59741 87790
385 87790 198751 232031 181133 65622 -74032 -187089 -231027 -190090 -77281 67387 186692
396 186692 230645 187194 79989 -53693 -171130 -228111 -198613 -92749 49137 172254 226772
407 226772 193525 93107 -34551 -152644 -222199 -208668 -109172 34191 159051 217589 195922
418 195922 109044 -12914 -136349 -217815 -215645 -121679 18868 142075 206432 199283 125665
429 125665 6085 -122614 -210965 -216758 -133444 448 125085 197862 201806 137798 23660
440 23660 -105860 -201932 -218921 -143773 -15091 107869 185832 203015 151147 39265 -92091
451 -92091 -190221 -216060 -155850 -34378 92406 178038 200967 157865 56079 -72323 -177890
462 -177890 -216800 -167177 -48255 80041 164173 192721 167433 78642 -56252 -172648 -213162
473 -213162 -168748 -64091 58525 152590 191470 172466 92957 -36656 -161313 -212045 -172321
484 -172321 -74599 39312 135800 188270 180949 106191 -22024 -149319 -206095 -172927 -86221
495 -86221 16989 119256 189404 188347 111031 -10037 -127861 -195353 -182374 -101883 5820
506 5820 107148 178281 189872 125082 6438 -114646 -186742 -183442 -114299 -11390 93788
517 93788 171085 189216 134056 23918 -97418 -179221 -186653 -123133 -24052 77822 158888 188834
529 188834 145762 40276 -83745 -171792 -184875 -127820 -39159 56449 147913 194606 154486
540 154486 46299 -69076 -152231 -182059 -143627 -52497 48354 134534 186960 165259 62675
551 62675 -59546 -140814 -170988 -150678 -73968 35134 130714 180338 164315 77394 -40606
562 -40606 -129671 -167735 -155993 -87842 22419 122815 171558 161724 93580 -18365 -122510
573 -122510 -169617 -153938 -92252 2704 105035 170781 168147 98670 -6335 -105070 -162071 -160277
585 -160277 -102305 -6939 92125 159617 169391 112247 7084 -96293 -153862 -156693 -111575 -24837
597 -24837 79345 155570 169964 117540 19980 -80947 -144431 -156945 -121667 -39387 68473
608 68473 149874 165453 120431 36914 -61676 -139692 -161133 -124219 -47550 50636 137265 167155
620 167155 128114 45699 -47559 -126614 -160509 -132519 -56489 39100 123783 162944 135793 58368
632 58368 -35500 -116809 -156871 -136954 -66745 25213 110821 158947 142762 69280 -25103 -105650
644 -105650 -149694 -141031 -79068 12943 101345 153246 144751 78662 -12259 -93467 -143216 -144522
656 -144522 -89625 1452 91337 145791 145117 89281 1805 -82753 -137491 -145322 -98113 -10482
668 -10482 80393 138173 144471 98080 15577 -71472 -132275 -145010 -104303 -22689 67397 131001
680 131001 144553 104862 27544 -59822 -124863 -144725 -109981 -33352 55199 121540 143453 112423
692 112423 38662 -49199 -116983 -141410 -114882 -45378 42331 113900 141564 116670 49478 -36288
704 -36288 -107881 -139105 -119533 -55750 29910 104330 138121 120217 59371 -23159 -98666 -136490
716 -136490 -122762 -64049 17445 93209 134664 124500 67848 -12502 -87984 -131405 -125763 -72922
728 -72922 6822 83323 128703 126477 77049 -1136 -78445 -126424 -126296 -79998 -4933 71861 123291
741 123291 128366 84542 9354 -68423 -119720 -126690 -86919 -16187 60815 117289 129038 90874
753 90874 19088 -57716 -112342 -126610 -93767 -25942 51278 109654 128065 97208 28974 -47761
765 -47761 -104792 -124041 -99147 -36619 40956 103388 125911 100861 38151 -36942 -97791 -122495
777 -122495 -103024 -45378 30362 95488 123818 104050 46967 -25954 -89366 -120397 -106508 -52572
789 -52572 20323 86043 120260 108505 54851 -16640 -80262 -115961 -109621 -61177 10609 77283
801 77283 115620 110444 63167 -6924 -71710 -110706 -111147 -69170 403 68932 110196 111209 70678
814 70678 3604 -63148 -105719 -111281 -75737 -9716 60056 105177 111124 76504 13728 -53595
826 -53595 -100600 -111388 -81223 -18852 50812 98969 109932 82122 23230 -44864 -95306 -109865
838 -109865 -85250 -27966 41237 92900 108606 86431 32208 -35436 -89127 -108283 -88425 -36567
850 -36567 30889 86495 107290 89376 40192 -25422 -82570 -106332 -90867 -43930 20883 79287
862 79287 105362 91412 46905 -15975 -74719 -104056 -93027 -49899 11428 70894 102689 93963
874 93963 52734 -6801 -66311 -101212 -95385 -55265 2731 61728 99246 96422 58117 1167
886 1167 -57669 -96830 -97238 -60396 -4967 52601 94089 98632 63403 7888 -48898 -90709 -98084
899 -98084 -66331 -12416 44495 87997 99145 69154 14803 -41060 -84061 -97747 -72365 -19793
911 -19793 37045 81668 97200 74072 22589 -33485 -77633 -96250 -76808 -26620 29983 74556
923 74556 95276 79107 29859 -26813 -71245 -92849 -80555 -34357 23097 68612 91656 82244
935 82244 37874 -20445 -65728 -88919 -82619 -42499 15628 63527 88084 83672 45258 -12485
947 -12485 -60853 -84561 -82496 -49859 6408 58874 85603 82187 50527 -2692 -54259 -82801
959 -82801 -82815 -54317 -2126 51585 82364 82875 54968 5193 -47317 -79161 -82461 -58486 -9962
972 -9962 44619 78830 82451 58739 13363 -39899 -76073 -81942 -60916 -17603 36169 74905 82314
985 82314 61707 20421 -32134 -71887 -81285 -62939 -24886 26903 71180 83008 62674 24947
997 24947 -22259 -65700 -82443 -66036 -28786 19107 63974 82515 66133 29301 -15204 -58319
1009 -58319 -80933 -69729 -33635 12917 57311 80142 68961 33931 -8666 -51265 -78768 -72456
1021 -72456 -37424 7245 49678 76407 72186 39116 -3888 -45069 -74544 -74408 -42509 1758
1033 1758 43243 72628 74103 44032 1177 -38776 -69196 -75549 -48608 -3057 38273 66655
1045 66655 73657 50103 6823 -34340 -63992 -74153 -53945 -10053 34213 62869 71284 53789
1057 53789 14402 -28704 -60402 -72726 -56959 -16010 28226 58436 69306 57097 20628 -23503
1069 -23503 -56554 -70482 -59269 -22366 22339 54317 67265 59193 26792 -17682 -52839 -67781
1081 -67781 -60176 -28818 15829 50438 64909 59696 32897 -10856 -49345 -65609 -59604 -33862
1093 -33862 7681 46545 64427 59393 35856 -2923 -43286 -64587 -60870 -36518 1422 40195
1105 40195 62567 60616 38895 2617 -37044 -61861 -61682 -39901 -4342 34181 59408 61139 41915
1118 41915 8012 -31539 -58675 -61567 -42377 -9664 28091 56097 61214 44163 12971 -25004
1130 -25004 -55006 -61697 -44473 -14500 21499 51959 61838 46386 16143 -19140 -49774 -61463
1142 -61463 -47767 -17882 16446 46847 60599 49686 19991 -14519 -44560 -59366 -50664 -22557
1154 -22557 12620 42432 57922 51405 24776 -9651 -40571 -57052 -51867 -26836 7070 38221
1166 38221 55931 52236 28410 -4604 -35812 -54673 -52883 -30357 2467 33485 53190 53162 32049
1179 32049 -185 -31181 -51547 -53392 -33543 -1727 29173 49756 52983 35808 4251 -27297
1191 -27297 -48429 -52639 -37235 -6915 25119 47039 51867 37998 9643 -22426 -45896 -51809
1203 -51809 -38903 -11176 20225 43944 51233 39903 13514 -17654 -42280 -51366 -41013 -15328
1215 -15328 15755 40374 49969 41863 17593 -13186 -38481 -49480 -42412 -19122 11645 36682
1227 36682 48239 42707 21491 -8644 -35074 -48000 -43161 -22621 6552 32860 46862 43357
1239 43357 24295 -3856 -30918 -46149 -44102 -25251 2306 28442 44451 44226 27167 -32
1251 -32 -26630 -43487 -44288 -28168 -1941 24598 41855 43960 30063 4225 -23186 -41206 -43707
1264 -43707 -30633 -6416 21192 39648 43313 31550 8569 -18790 -38752 -43256 -32270 -9850
1276 -9850 16176 36904 42790 33183 11584 -14363 -35433 -42762 -33661 -12749 12399 33160 41997
1289 41997 34987 14716 -10733 -32232 -41392 -35181 -16040 8757 30280 40532 35726 17698 -6978
1302 -6978 -29356 -39996 -35706 -18661 4807 26899 39130 36329 20119 -3144 -25256 -38330
1314 -38330 -36305 -21359 1509 23491 37194 36747 22361 92 -21928 -36267 -36649 -23368 -1764
1327 -1764 20021 34623 36800 24648 3257 -18681 -33513 -36424 -25751 -5268 16524 32304
1339 32304 36308 26284 6718 -15201 -31298 -35645 -26947 -8322 13448 29692 35585 27577 9637
1352 9637 -11675 -28300 -34861 -28481 -11035 10219 27318 34296 28818 12601 -8633 -25887 -33582
1365 -33582 -29166 -14076 7026 24650 33041 29396 15250 -5432 -23509 -32306 -29562 -16271 3292
1378 3292 21867 31799 29639 17181 -1977 -20439 -30971 -29846 -17982 433 19031 30111 29704
1391 29704 18899 1312 -17531 -29380 -29813 -19684 -2525 16005 28139 29739 20354 3931 -14207
1404 -14207 -27466 -29711 -21044 -5011 12964 26337 29152 21496 6309 -11026 -25118 -29608 -22152
1417 -22152 -7390 9831 23859 28994 22733 8293 -8226 -22482 -28808 -23171 -9242 7000 21238
1430 21238 27898 23798 10728 -6097 -20271 -27347 -24199 -11839 4814 18927 26466 24375 12698
1443 12698 -3381 -17754 -25964 -24530 -13593 2069 16259 24937 24635 14765 -822 -15497 -24549
1456 -24549 -24437 -15308 -116 13993 23413 24639 16181 1518 -13109 -22973 -24397 -16882 -2549 11846
1470 11846 21733 24040 17660 4000 -11178 -21314 -23603 -17783 -5227 9753 20034 23420 18394
1483 18394 6118 -8722 -19430 -22876 -18430 -7499 7251 18841 22799 19023 8325 -6104 -18081
1496 -18081 -22087 -18927 -9147 4395 16788 22253 19235 9699 -3476 -15857 -21460 -18802 -10692 2095
1510 2095 14569 21250 19546 11003 -1060 -13636 -20558 -19513 -11588 -367 12104 20234 19857 12157
1524 12157 913 -11303 -19170 -19651 -12528 -1846 9912 18409 19978 13246 2562 -8709 -17636
1537 -17636 -19473 -13961 -3587 7445 16876 19440 14189 4121 -6700 -15775 -19191 -14950 -5070 6001
1551 6001 15290 18998 15203 5628 -4827 -14014 -18529 -15474 -6395 4123 13184 18036 16061 7120
1565 7120 -3332 -12371 -17430 -16145 -8120 2481 11510 17172 16090 8822 -1527 -10890 -16134 -16235
1579 -16235 -9704 789 10158 15782 15935 10371 32 -9267 -14978 -15949 -10834 -1294 8675 14835 15784
1594 15784 11116 1840 -7665 -14113 -15595 -11312 -2985 6753 13818 15358 11593 3778 -6110 -13006 -15034
1609 -15034 -12107 -4552 5045 12369 14853 12187 5184 -4087 -11826 -14697 -12296 -5866 3385 11136 14550
1624 14550 12527 6281 -2376 -10347 -14239 -12682 -6963 1550 9629 13861 12835 7314 -376 -8688 -13571
1639 -13571 -12763 -7840 -65 8068 13128 12940 8139 806 -7287 -12725 -12950 -8577 -1439 6325 12213
1654 12213 12807 8931 2079 -5604 -11397 -13035 -9347 -2673 5036 10966 12922 9718 3279 -4171 -10165
1669 -10165 -12499 -10014 -3862 3380 9598 12339 10335 4426 -2790 -9000 -12188 -10762 -4960 2157 8461
1684 8461 11848 10552 5506 -1396 -7665 -11511 -10771 -6006 896 7269 10910 10759 6612 -136 -6559
1699 -6559 -10666 -10879 -6830 -476 5960 10274 10801 7403 1037 -5256 -9738 -10896 -7824 -1796 4739
1714 4739 9169 10661 7970 2315 -4061 -8822 -10670 -8348 -2865 3497 8346 10398 8306 3386 -2990
1729 -2990 -8010 -10024 -8770 -4048 2015 7421 9894 8905 4821 -1794 -6864 -9769 -9071 -4910 1112
1744 1112 6555 9409 8935 5520 -344 -6033 -9226 -9131 -5635 -302 5250 8942 9131 6218 764 -4890
1760 -4890 -8430 -9194 -6339 -1152 4400 8261 9191 6740 1913 -3756 -7775 -9100 -6850 -2399 3068
1775 3068 7445 9051 7232 2597 -2577 -7009 -8848 -7437 -3553 2179 6480 8823 7670 3828 -1284
1790 -1284 -6041 -8519 -7568 -4008 896 5622 8437 7848 4619 -429 -5251 -8160 -7813 -4749 -172 4989
1806 4989 7937 8032 5257 677 -4347 -7689 -7993 -5470 -1218 3781 7334 8144 5795 1487 -3206 -7179
1822 -7179 -7893 -6102 -2075 2871 6550 8040 6480 2608 -2128 -6260 -8079 -6598 -2872 1755 5966
1837 5966 7854 6854 3503 -1245 -5506 -7923 -6857 -3751 835 4984 7444 7217 4020 -218 -4919
1852 -4919 -7291 -7228 -4500 -53 4270 6983 7542 4803 506 -3945 -6990 -7266 -5003 -895 3491 6438
1868 6438 7229 5316 1394 -2849 -6188 -7462 -5762 -1841 2406 6024 7558 6053 2100 -2150 -5530
1883 -5530 -7258 -6264 -2706 1842 5398 7134 6486 3168 -1314 -5105 -6935 -6632 -3565 738 4644 6756
1899 6756 6711 3968 -445 -4335 -6730 -6950 -4533 27 4075 6643 6817 4557 365 -3685 -6597 -6921
1915 -6921 -4891 -1085 3348 6377 6842 4983 1063 -3021 -5889 -6937 -5343 -1952 2281 5708 6768
1930 6768 5608 2166 -1924 -5534 -6863 -5706 -2574 1767 5057 6813 6022 3169 -1045 -5065 -6794
1945 -6794 -6172 -3332 857 4612 6569 6326 3610 -530 -4539 -6657 -6381 -3842 -266 3911 6550 6445
1961 6445 4377 803 -3874 -6340 -6119 -4450 -870 3373 5874 6695 4909 1488 -3205 -6387 -6645 -4953
1977 -4953 -1953 2265 5750 6878 4889 2121 -3150 -5343 -6736 -4951 -2423 1291 4897 6241 5829
1992 5829 2763 -1201 -4874 -6861 -5736 -2931 467 4176 6601 6247 3556 -467 -4083 -6521 -6361
2007 -6361 -3610 -112 3985 6140 6513 3979 261 -3914 -6321 -6535 -4553 -515 3205 5857 6632 4772
2023 4772 962 -2981 -5811 -6697 -5035 -1421 2614 5770 6715 5162 1950 -2294 -5557 -6850 -5570
2038 -5570 -2226 2001 5255 6768 5839 2706 -1531 -4952 -6731 -5991 -3140 1229 4667 6465 6036 3178
2054 3178 -780 -4525 -6839 -6305 -3621 182 4111 6489 6382 3927 69 -3961 -6330 -6388 -4074 -310
2070 -310 3782 6290 6660 4519 960 -3472 -6341 -6751 -4761 -1108 2697 6081 6577 5019 1540 -2685
2086 -2685 -5715 -6855 -5264 -1989 2343 5596 6630 5583 2326 -1961 -5458 -6769 -5763 -2436 1712
2101 1712 5166 6929 6020 2905 -1191 -4869 -6750 -6170 -3306 736 4639 6520 6457 3455 -519 -4146
2117 -4146 -6589 -6464 -3846 243 4060 6638 6542 4275 141 -4030 -6337 -6621 -4537 -543 3479 6010
2133 6010 6763 4856 1204 -3002 -5854 -6862 -5280 -1325 2840 5954 7046 5271 1494 -2288 -5744
2148 -5744 -6948 -5437 -2040 2282 5635 6779 5459 2276 -1670 -5388 -6999 -5841 -2828 1442 5119
2163 5119 6851 6259 3151 -1126 -4715 -6792 -6273 -3285 759 4277 6675 6294 3858 -595 -3997 -6411
2179 -6411 -6336 -4031 -234 4128 6513 6546 4254 508 -3673 -6509 -6355 -4233 -1007 3141 6063 6624
2195 6624 4885 993 -2726 -6259 -7065 -5027 -1387 2713 5889 7181 5360 1948 -3033 -6120 -6816
2210 -6816 -5544 -2192 2149 5524 6480 5140 2251 -2013 -5366 -6574 -5705 -2654 1613 4746 7102
2225 7102 6302 3021 -828 -5431 -6634 -6149 -3214 795 4512 6665 6425 3693 -487 -3999 -6245 -6274
2241 -6274 -3994 -203 4171 6377 5853 3978 361 -4083 -5677 -6892 -4672 -975 3032 6435 6474 4565
2257 4565 990 -3428 -5315 -7117 -4030 -1672 2927 5760 7058 4848 1726 -2247 -5811 -6628 -4901
2272 -4901 -1850 2420 6013 6668 5418 2572 -1512 -6039 -7357 -6011 -2377 1604 5503 6479 5411
2287 5411 2504 -1167 -4758 -6719 -6192 -3496 1124 4256 6139 5886 2539 -113 -3618 -6234 -6373 -4174
2303 -4174 -73 3433 6276 6794 4490 460 -3885 -6317 -6061 -4260 -1042 3193 5854 6522 4854 521
2319 521 -2703 -6313 -7087 -5151 -688 2748 5967 6410 5309 782 -2096 -6001 -6615 -5343 -2066 2341
2335 2341 5445 6189 5674 1800 -2207 -5702 -6430 -5772 -2564 1805 4909 6331 6729 2574 -1468 -4883
2351 -4883 -6693 -5963 -3047 1056 4380 6233 6418 3775 -905 -4585 -6991 -6495 -3615 504 4013 6915
2367 6915 6602 3742 74 -3839 -6391 -6457 -4818 -1169 3613 5941 6348 4984 918 -3335 -6362 -6827
2383 -6827 -5520 -629 3174 6179 5641 5077 1595 -2776 -6138 -6673 -5053 -1361 2357 5464 5486 4707
2399 4707 1828 -1915 -5100 -6349 -5576 -2290 2202 5054 6506 5678 2904 -1520 -4347 -6495 -6343 -2740
2415 -2740 654 4438 7269 5615 2531 -501 -4017 -6592 -6256 -3262 322 4053 7184 6506 3803
2430 3803 603 -4281 -6102 -6487 -3832 -59 3265 5945 6479 4808 1340 -2853 -5617 -6368 -4618 -1416
2446 -1416 3229 5990 6564 4300 1124 -2999 -5673 -6142 -5320 -1530 2452 5344 6301 4486 1909 -2433
2462 -2433 -5540 -6793 -5366 -2268 2040 5367 6701 5637 2486 -1247 -4748 -6795 -5812 -2582 858
2477 858 4792 6288 5978 2987 -967 -4558 -6773 -5875 -3594 50 3980 5893 6128 3580 -405 -4003
2493 -4003 -6262 -6401 -3759 -217 3934 6221 6196 4264 612 -3408 -6212 -6530 -4570 -729 3184 5892
2509 5892 6364 4731 1089 -2813 -6022 -6555 -4851 -1415 2626 5769 6452 5102 1495 -2384 -5493 -6407
2525 -6407 -5216 -2010 1989 5283 6713 5253 2138 -1813 -5127 -6268 -5748 -2613 1402 4881 6517
2540 6517 5589 2895 -1160 -4523 -6428 -5682 -3196 720 4278 6519 6138 3578 -499 -4149 -6321 -6020
2556 -6020 -3622 106 3913 5974 6284 4043 95 -3690 -5965 -6365 -3964 -524 3336 5773 6159 4372
2572 4372 794 -3246 -5568 -6406 -4620 -1073 2941 5736 6537 4612 1470 -2605 -5393 -6540 -5108
2587 -5108 -1608 2221 5316 6500 5172 1906 -1727 -5040 -6403 -5541 -2276 1777 4994 6332 5530
2602 5530 2480 -1436 -4720 -6486 -5521 -2590 1071 4470 6304 5771 3132 -1066 -4271 -6028 -5838 -3538
2618 -3538 502 4184 6318 5877 3552 -129 -3741 -6056 -6142 -3832 -210 3270 5804 6243 3910 574
2634 574 -3326 -5906 -6329 -4190 -1029 2962 5571 6158 4418 1112 -2810 -5648 -6211 -4551 -1492 2411
2650 2411 5340 6416 4781 1645 -2340 -5263 -6411 -4970 -1821 1848 5162 6383 5092 2029 -1643
2665 -1643 -4566 -6161 -5455 -2542 1209 4387 6069 5485 2879 -1045 -4273 -6164 -5765 -3021 811 4083
2681 4083 5850 5533 3207 -329 -3903 -6025 -5513 -3492 239 3922 5745 5902 3649 -33 -3639 -5770
2697 -5770 -5883 -4018 -437 3452 5831 6094 3991 866 -3076 -5605 -5956 -4420 -864 2626 5353 6006
2713 6006 4521 1236 -2605 -5112 -6008 -4741 -1302 2053 5011 6199 4830 1804 -1938 -4858 -6101
2728 -6101 -4998 -2167 1583 4572 5889 5177 2191 -1543 -4557 -5813 -5265 -2437 1142 4133 5862
2743 5862 5172 2549 -876 -4379 -5849 -5379 -3084 478 3850 5729 5800 3287 -306 -3821 -5640 -5774
2759 -5774 -3602 -31 3644 5758 5499 3614 187 -3278 -5404 -5577 -3793 -748 3031 5408 5523 3932
2775 3932 676 -2732 -5400 -5645 -4002 -985 2422 4987 5876 4176 1388 -2196 -5039 -5792 -4544 -1636
2791 -1636 2056 4697 5863 4600 1839 -1594 -4633 -5902 -4953 -2222 1443 4380 5725 4937 2487
2806 2487 -1091 -4356 -5626 -4979 -2480 783 3934 5610 5152 2542 -875 -3952 -5663 -5170 -2908 360
2822 360 3460 5497 5335 3155 -151 -3377 -5466 -5362 -3477 118 2966 5328 5669 3819 298 -2798
2838 -2798 -5262 -5444 -3662 -782 2713 4946 5427 4071 639 -2450 -4742 -5885 -4111 -1133 2498
2853 2498 4812 5549 4106 1263 -1815 -4727 -5496 -4552 -1451 1614 4525 5330 4324 1720 -1580 -4366
2869 -4366 -5528 -4542 -1931 1332 4012 5285 4528 2458 -1044 -3902 -5308 -4949 -2628 582 3557 5296
2885 5296 4931 2755 -413 -3429 -5104 -4987 -3091 203 3307 5286 4954 3222 -79 -2948 -4969 -5141
2901 -5141 -3463 -240 2849 4750 5090 3586 359 -2763 -4767 -5204 -3441 -725 2376 4811 5118 3698
2917 3698 1050 -2169 -4611 -5339 -3886 -899 2023 4341 5183 4052 1521 -1751 -4263 -5177 -4095 -1819
2933 -1819 1460 4145 5324 4339 1725 -1271 -3969 -5156 -4323 -2004 1167 3848 4979 4231 1957 -830
2949 -830 -3780 -5091 -4611 -2422 804 3460 5004 4622 2491 -621 -3262 -4960 -4688 -2734 206 3113
2965 3113 4678 4738 2895 212 -3116 -4542 -4870 -3060 -278 2545 4635 4789 3376 544 -2531 -4563
2981 -4563 -4689 -3216 -485 2191 4314 4865 3377 766 -2054 -4194 -4802 -3714 -1270 2064 4173 4752
2997 4752 3880 1341 -1707 -4019 -4732 -3903 -1548 1575 3797 4815 3861 1862 -1452 -3774 -4814 -3948
3013 -3948 -1943 932 3576 4660 4379 1909 -734 -3097 -4624 -4295 -2179 567 3159 4464 4211 2280
3029 2280 -371 -2975 -4555 -4476 -2693 307 2819 4321 4267 2796 -73 -2591 -4312 -4642 -2865 -373
3045 -373 2473 4233 4422 3014 429 -2042 -4230 -4507 -3101 -729 2172 4053 4541 3385 714 -1713
3061 -1713 -3833 -4594 -3427 -969 1668 3842 4324 3631 1295 -1492 -3572 -4486 -3540 -1475 1078 3436
3077 3436 4352 3795 1558 -1014 -3261 -4424 -3519 -1756 916 3219 4373 3821 1986 -721 -3158 -4297
3093 -4297 -3971 -1918 523 2855 4311 4057 2219 -333 -2670 -4201 -3969 -2238 13 2624 4022 3731
3109 3731 2563 -139 -2115 -3969 -4063 -2559 -346 2117 3869 4112 2925 348 -2287 -3771 -4044 -2694
3125 -2694 -765 1843 3737 3942 3041 731 -1809 -3764 -4115 -3013 -1099 1676 3477 3998 3148 1090
3141 1090 -1336 -3368 -4033 -3392 -1097 1123 3176 4005 3466 1516 -1126 -3264 -3899 -3308 -1582 967
3157 967 2656 3897 3535 1788 -552 -2681 -3801 -3574 -1929 600 2458 3917 3634 2137 -480 -2450
3173 -2450 -3571 -3580 -2054 163 2444 3565 3612 2216 50 -2033 -3476 -3700 -2293 -266 2037 3492
3189 3492 3702 2485 288 -1820 -3393 -3629 -2717 -588 1605 3243 3667 2662 754 -1738 -3340 -3814
3205 -3814 -2654 -804 1392 3115 3616 2912 925 -1287 -3090 -3765 -3031 -1280 1179 2982 3617 2765
3221 2765 1190 -889 -2647 -3562 -2846 -1388 909 2736 3472 3222 1592 -626 -2353 -3411 -3171 -1723
3237 -1723 637 2444 3497 3282 1729 -341 -2381 -3327 -3188 -1979 20 2000 3119 3374 2045 176
3253 176 -2074 -3318 -3232 -2058 -196 1809 3100 3150 2517 408 -1584 -3117 -3255 -2175 -289 1553 3020
3270 3020 3223 2441 732 -1428 -2858 -3130 -2431 -787 1423 2639 3262 2617 909 -975 -2638 -3119 -2663
3287 -2663 -838 843 2503 3192 2615 1039 -1010 -2459 -3201 -2565 -1297 532 2577 2992 2886 1343
3303 1343 -629 -2288 -2982 -2748 -1471 426 2349 2988 2920 1473 -294 -2042 -3059 -2866 -1695 92
3319 92 1952 3141 3142 1625 -62 -1673 -2774 -3081 -1937 -64 1698 2720 2989 2014 186 -1503 -2817
3336 -2817 -2927 -1994 -318 1201 2668 2929 2092 429 -1224 -2744 -2903 -2309 -670 1051 2434 2952 2355
3353 2355 720 -1136 -2315 -3061 -2195 -984 936 2352 2818 2312 1009 -823 -2184 -2880 -2455 -1095
3369 -1095 653 1907 2862 2549 1154 -374 -1940 -2791 -2377 -1320 223 1977 2611 2289 1374 -214 -1820
3386 -1820 -2497 -2470 -1445 167 1700 2638 2489 1615 -15 -1855 -2555 -2742 -1627 -76 1560 2458 2694
3403 2694 1679 414 -1473 -2611 -2449 -1721 -386 1114 2344 2481 1825 281 -988 -2236 -2462 -1955
3419 -1955 -380 751 2162 2517 1974 712 -887 -2206 -2528 -1989 -753 831 2209 2703 2204 757
3435 757 -813 -2010 -2639 -2038 -1058 598 1892 2462 2318 1141 -518 -1924 -2217 -2151 -1283 355 1728
3452 1728 2399 2163 1202 -471 -1531 -2337 -2272 -1027 161 1464 2159 2236 1356 110 -1330 -2247 -2225 -1372
3470 -1372 -144 1186 2154 2373 1410 36 -1354 -2326 -2402 -1348 -113 1326 2118 2399 1724 365 -927
3487 -927 -2001 -2239 -1840 -533 901 2016 2361 1675 325 -1060 -2110 -2256 -1774 -471 689 1926 2321
3504 2321 1851 757 -429 -1975 -2310 -1594 -1097 554 1805 2288 1744 915 -345 -1739 -2067 -1821 -938
3521 -938 490 1724 2028 1964 873 -88 -1427 -1935 -1960 -1145 351 1380 2189 1856 1105 -156 -1226 -1882
3539 -1882 -2067 -1245 104 1068 2030 1780 1224 91 -1178 -1481 -1997 -1174 -132 1111 1854 1978 1420 428
3557 428 -952 -1748 -1910 -1400 -306 909 1704 1925 1356 664 -905 -1611 -2015 -1463 -284 785 1815 1877
3575 1877 1654 409 -525 -1480 -1972 -1438 -783 467 1369 1787 1717 514 -630 -1714 -1684 -1622 -626 231 1275
3594 1275 1906 1679 893 -539 -1414 -1669 -1640 -772 194 1278 1772 1752 914 -238 -1036 -1862 -1513 -1163 17
3613 17 1015 1778 1700 1176 -284 -978 -1574 -1717 -1215 -133 1049 1506 1785 1125 118 -885 -1420 -1815 -1066
3632 -1066 -108 737 1724 1865 1089 484 -676 -1520 -1726 -1291 -461 749 1409 1715 1143 248 -623 -1488 -1569
3651 -1569 -1176 -451 548 1509 1638 1297 599 -558 -1154 -1457 -1512 -670 485 1041 1522 1430 721 -378 -1082
3670 -1082 -1594 -1572 -669 319 1167 1681 1383 876 -177 -1088 -1519 -1319 -743 186 920 1510 1396 761 -15 -1072
3690 -1072 -1489 -1305 -782 45 1087 1650 1625 921 156 -888 -1512 -1478 -837 -312 670 1487 1524 1048 188 -775
3710 -775 -1408 -1364 -1103 -220 943 1292 1413 1028 246 -366 -1353 -1284 -942 -336 450 1311 1402 1215 313 -413 -984
3731 -984 -1535 -1113 -340 311 917 1397 1373 628 -461 -1027 -1285 -947 -681 314 1154 1322 1088 596 -358 -1048
3751 -1048 -1277 -1326 -521 386 1016 1249 1389 905 -292 -874 -1422 -1286 -635 420 889 1265 1084 602 -143
3770 -143 -831 -1403 -1310 -858 -138 1020 1293 1271 905 -34 -800 -1030 -1279 -883 -240 800 1126 1229 797 48
3790 48 -637 -1154 -1309 -834 -128 582 1102 1370 1104 381 -505 -1109 -1172 -1151 -314 639 1091 1209 845 458 -409
3811 -409 -1010 -1255 -952 -442 311 1020 1195 949 408 -113 -841 -1071 -789 -545 280 953 1205 1007 584 -116
3831 -116 -911 -1100 -1210 -352 -105 913 1106 1226 718 -216 -699 -1337 -1190 -663 260 617 1117 1034 664 -79
3851 -79 -541 -991 -1071 -600 13 480 1176 1185 651 227 -613 -1012 -1144 -731 -2 772 811 1164 824 27 -541 -1009
3873 -1009 -1297 -737 -115 284 925 1126 788 146 -492 -829 -896 -932 -403 418 1090 983 836 270 -248 -692
3893 -692 -1031 -777 -480 449 856 1201 945 235 -282 -807 -1208 -747 -232 135 803 925 958 379 -343 -725
3913 -725 -982 -958 -314 66 650 1046 960 488 -72 -518 -930 -1053 -639 116 653 930 893 542 38 -714 -910
3934 -910 -977 -513 97 531 905 890 701 46 -321 -761 -1109 -546 7 617 983 1018 579 -110 -454 -872 -1153
3955 -1153 -679 -141 76 981 1042 882 89 -388 -779 -665 -770 -340 389 889 1071 536 249 -271 -630 -988
3975 -988 -633 -295 110 887 1033 850 188 -222 -583 -843 -856 -204 343 452 903 656 179 -233 -844 -1031
3995 -1031 -764 -569 126 617 926 757 467 -21 -447 -992 -659 -156 186 605 722 831 636 -253 -469 -898
4015 -898 -1024 -515 86 643 765 875 309 97 -612 -846 -955 -566 -229 262 845 820 557 153 -355 -558
4035 -558 -930 -687 -177 270 800 766 443 120 -456 -856 -683 -618 -219 420 753 884 657 262 -350 -715 -616
4056 -616 -800 -144 184 834 688 754 168 -94 -750 -822 -475 -389 256 666 715 757 223 -253 -707 -895 -793 -515
4078 -515 81 598 908 628 472 -180 -743 -921 -802 -358 50 521 960 672 243 -83 -559 -788 -762 -373
4098 -373 -51 512 805 914 595 -78 -449 -658 -834 -567 73 653 624 759 500 96 -530 -682 -804 -640
4118 -640 -355 368 708 855 507 201 -265 -774 -901 -497 -93 282 729 925 755 181 -230 -646 -884 -777
4138 -777 -334 387 708 854 939 188 -266 -614 -1201 -636 -404 290 671 662 744 352 -154 -631 -807 -846 -293 311
4160 311 469 882 664 318 -37 -533 -743 -738 -417 368 342 785 672 580 -97 -483 -765 -781 -530 -86 466 731
4182 731 977 559 -67 -372 -889 -730 -555 53 640 864 985 288 39 -362 -794 -874 -545 -125 377 1031
4202 1031 885 581 91 -279 -949 -782 -645 -139 301 611 760 422 194 -290 -789 -917 -658 -240 310 658
4222 658 622 710 -7 -222 -641 -910 -650 -442 328 639 843 725 252 -171 -576 -968 -754 -416 -21 409 888
4243 888 808 587 -102 -596 -848 -635 -552 105 481 716 980 286 -212 -690 -777 -628 -479 221 719 596 773
4264 773 305 -33 -689 -796 -772 -442 111 680 804 887 455 47 -389 -735 -803 -530 43 344 842 811 517
4285 517 1 -228 -922 -1007 -437 -195 378 568 777 644 119 -371 -865 -1062 -699 -291 321 757 885 827 218
4306 218 -300 -766 -1056 -654 -413 252 566 894 642 533 42 -680 -897 -628 -230 108 732 864 788 238
4326 238 -48 -703 -937 -865 -521 267 477 879 991 537 2 -657 -711 -699 -240 -42 550 910 802 636 -77
4347 -77 -485 -692 -706 -587 137 405 667 976 502 152 -477 -662 -1072 -564 -260 468 883 725 654 268 -402
4368 -402 -773 -987 -621 -351 156 723 684 681 314 -165 -885 -752 -516 -446 272 691 881 810 109 -401 -644 -800
4390 -800 -900 -264 -35 563 777 760 273 -194 -528 -985 -709 -421 70 767 935 697 404 -265 -802 -932
4410 -932 -723 -171 27 550 1038 799 431 89 -694 -938 -846 -564 -9 445 777 653 667 11 -502 -798 -746
4431 -746 -336 -129 554 1007 884 646 88 -582 -737 -933 -869 -73 414 657 688 700 26 -364 -537 -980 -829
4452 -829 -308 270 794 846 808 410 -410 -801 -863 -635 -175 96 813 950 803 459 -156 -753 -958 -705 -148
4473 -148 141 564 995 683 515 -268 -606 -697 -731 -501 295 823 941 863 486 67 -640 -962 -1030 -488 -38
4494 -38 616 878 1144 514 -144 -521 -848 -1026 -447 110 389 856 1050 490 176 -572 -1015 -977 -508 -125 428
4515 428 848 943 595 62 -354 -968 -924 -670 -158 513 855 928 736 577 -316 -716 -1075 -849 -131 288 896
4536 896 965 784 477 -399 -765 -930 -933 -234 405 729 1102 754 575 -23 -495 -992 -752 -529 223 747 846
4557 846 872 517 58 -788 -822 -893 -672 50 589 947 739 447 -85 -767 -823 -900 -541 167 640 922 679 602
4579 602 53 -567 -1025 -805 -577 30 471 990 1124 509 35 -418 -1122 -986 -514 -237 339 1113 929 797
4599 797 235 -397 -901 -969 -778 -130 517 870 984 539 394 -306 -830 -917 -775 -383 432 867 1036 739 335
4620 335 -101 -703 -1005 -950 -267 159 774 877 691 583 -254 -880 -773 -808 -464 53 630 955 814 500 -72
4641 -72 -883 -1135 -916 -589 -142 622 898 709 484 -82 -415 -971 -765 -750 -20 635 1002 1014 604 127 -415
4662 -415 -775 -617 -1075 -79 310 795 935 383 57 -390 -764 -911 -651 -34 383 953 1037 667 357 -255
4682 -255 -817 -948 -715 -249 466 868 718 791 216 -189 -814 -1242 -884 -300 326 824 1000 909 397 -293 -603
4703 -603 -1087 -858 -529 227 681 889 924 287 -255 -499 -1026 -917 -514 13 873 779 789 585 -101 -671 -983
4724 -983 -1078 -576 26 770 1035 809 846 274 -637 -955 -1005 -673 -52 678 935 911 504 117 -569 -734 -1003
4745 -1003 -808 -173 443 706 1003 537 167 -356 -955 -868 -636 -91 298 917 823 713 264 -270 -748 -780 -921
4766 -921 -253 348 659 902 847 405 -344 -815 -1116 -935 -285 195 732 1124 821 409 -91 -575 -1065 -829
4786 -829 -380 138 808 966 1024 578 62 -668 -818 -962 -630 6 716 948 990 485 -217 -498 -911 -908 -738
4807 -738 -179 529 959 881 607 -92 -393 -1020 -968 -602 -96 477 918 847 754 135 -640 -940 -1009 -568 -218 416
4829 416 895 958 766 309 -253 -925 -913 -625 -296 419 853 1046 884 382 -248 -750 -987 -974 -361 164 606
4850 606 942 654 346 -160 -598 -687 -593 -326 238 745 1102 805 624 -58 -502 -848 -1042 -492 11 644 1064
4871 1064 849 545 152 -471 -851 -854 -749 -126 674 880 1035 319 158 -514 -884 -840 -485 -180 568 788 1170
4892 1170 746 76 -282 -973 -949 -856 -47 320 973 884 525 95 -377 -833 -917 -882 -298 501 678 1030 974 96
4914 96 -304 -982 -833 -740 -388 265 548 935 671 455 -116 -668 -877 -1028 -355 177 893 968 696 279 -299
4935 -299 -639 -997 -723 -445 39 575 999 719 506 -189 -682 -882 -812 -662 27 537 797 839 736 8 -313
4956 -313 -929 -782 -587 99 620 693 897 486 21 -626 -900 -727 -479 -99 500 879 984 711 366 -395
4976 -395 -976 -1030 -658 -113 320 517 1008 603 282 -327 -840 -961 -684 -285 150 739 1008 668 288 -465
4996 -465 -782 -852 -716 -230 329 604 833 646 381 -215 -571 -667 -637 -317 303 672 920 871 464 -187 -700
5017 -700 -853 -964 -482 -35 582 857 868 493 -145 -578 -868 -595 -666 68 744 793 1000 502 36 -587 -764
5038 -764 -981 -323 47 366 681 497 555 87 -421 -763 -662 -777 -112 434 688 684 484 401 -327 -695 -719 -511
5060 -511 -261 280 720 804 497 175 -7 -648 -857 -728 -250 355 696 607 589 341 -89 -556 -787 -693 -380
5081 -380 180 596 739 681 346 -179 -604 -825 -671 -283 130 528 969 625 612 -135 -570 -685 -789 -519 150
5102 150 502 785 675 475 244 -397 -787 -654 -457 -33 435 834 767 516 129 -420 -735 -796 -609 -114 584
5123 584 503 939 502 261 -419 -658 -780 -498 -148 13 667 694 537 402 -280 -617 -674 -713 -244 228 675
5144 675 803 568 197 -325 -590 -754 -586 -99 334 452 489 686 335 -228 -684 -925 -631 -441 172 516
5164 516 633 617 215 -15 -540 -720 -634 -138 16 487 681 765 425 9 -321 -713 -754 -366 96 529 629
5185 629 613 700 -121 -541 -723 -795 -404 1 178 739 640 669 230 -211 -711 -702 -659 -205 275 817 413 705 193
5208 193 -192 -514 -699 -521 -204 218 510 651 507 392 -330 -693 -744 -746 -283 69 624 844 681 278 -324
5229 -324 -448 -808 -528 -365 -53 464 705 607 366 169 -383 -654 -792 -443 58 394 563 644 320 44 -569
5250 -569 -745 -731 -158 -26 405 602 683 431 -2 -282 -579 -571 -302 38 340 451 574 552 -77 -391 -582 -585
5272 -585 -461 -128 340 649 544 532 25 -314 -490 -854 -617 -371 141 485 452 564 127 -54 -561 -599 -405
5293 -405 -367 213 542 402 717 379 -217 -345 -534 -473 -250 376 633 618 618 262 -124 -421 -500 -479 -274 -77
5315 -77 384 729 624 483 -132 -350 -699 -876 -484 124 425 454 490 448 -73 -391 -542 -453 -514 -126 256 657
5337 657 490 441 -46 -444 -505 -747 -307 -104 447 455 581 316 76 -269 -559 -793 -511 -286 137 355 388 535
5359 535 22 -265 -366 -588 -359 -365 348 442 610 569 226 -24 -499 -398 -393 -400 47 590 556 678 380 -136 -353
5382 -353 -450 -592 11 195 581 452 412 283 38 -190 -735 -376 -287 57 454 327 576 218 33 -486 -593
5403 -593 -505 -276 -187 204 571 402 198 189 -312 -574 -637 -356 -136 339 454 530 168 -15 -264 -335 -402 -272 -52
5426 -52 82 230 436 360 65 -47 -448 -429 -362 26 79 439 434 414 139 -193 -288 -471 -362 -58 154 506 586
5449 586 282 165 -32 -269 -466 -476 -225 213 240 401 454 321 -214 -409 -357 -263 -106 -21 373 278 286 214 -52
5472 -52 -382 -301 -350 -374 220 283 288 559 305 42 -359 -456 -419 -178 37 186 401 331 144 119 73 -327 -349 -304 7
5497 7 369 229 698 383 92 -111 -271 -445 -283 -93 265 349 481 236 35 -327 -325 -605 -295 -132 30 511
5519 511 530 49 -17 -73 -310 -429 -565 -158 -72 228 385 422 153 -105 -433 -453 -302 -243 105 273 445 264
5541 264 61 -212 -246 -460 -279 -178 -104 94 369 447 186 20 -106 -320 -506 -148 -57 167 127 130 -27 -75 -28
5564 -28 -268 -185 -39 -75 -140 397 284 241 128 178 -66 -248 -453 -45 189 260 476 220 95 -122 -295 -444
5586 -444 -453 -83 89 147 265 101 222 -290 -421 -295 -197 -150 1 323 286 146 79 -24 -156 -346 -74 -162 59
5609 59 168 389 75 64 -57 -233 -421 -30 -82 -123 126 173 237 199 111 -139 -238 -112 -137 -82 160 194 268 270 74
5634 74 -280 -373 -102 -70 110 76 141 199 151 78 107 -102 -154 -131 -107 219 60 338 406 273 2 -93 -117 -264 -188
5659 -188 43 105 142 328 108 -256 -40 -453 -256 -93 121 142 254 441 136 -83 -182 -144 -200 21 185 256
5681 256 238 285 15 78 -89 5 -106 -102 106 134 29 -17 149 -50 -137 -277 -114 -64 62 40 134 -44 82 148
5705 148 -192 11 -26 -40 7 129 141 341 326 71 -61 -289 -101 -187 -144 -109 243 101 70 -31 -176 -290 -114
5728 -114 -116 155 175 141 -10 173 121 -54 -129 -184 -79 72 -80 184 217 63 -9 -46 -28 -331 77 -254 194 323
5752 323 353 167 -27 -161 -15 -251 -112 -102 184 204 141 124 233 -150 126 -301 -107 -53 22 116 137 90 -35
5775 -35 -30 -1 -215 -207 -37 -51 1 15 129 94 -70 -160 -71 -36 -139 71 -15 -132 133 194 39 -93 22 73 -76
5800 -76 -62 -46 282 216 21 5 56 -124 -113 -32 -103 29 -123 -1 -185 -225 -54 -40 -64 -11 136 32 151 145 247
5825 247 40 -115 -8 -122 -35 56 -167 1 292 -184 248 -50 -44 -95 -13 116 52 40 241 36 170 196 -181
5848 -181 -168 216 -98 -22 169 -187 48 -200 -108 -19 69 98 -61 -59 295 13 74 -211 99 48 -28 -85 165 133
5872 133 122 -44 -102 -50 -42 17 -99 -162 168 162 8 -119 151 -100 -75 -54 -142 -137 139 -24 -50 -55 65 109 -302 -10
5898 -10 218 28 -54 149 55 51 113 178 -20 -124 47 -240 121 171 126 10 -224 249 -69 40 -232 -18 128
5921 128 -10 -47 -9 6 69 265 218 10 -29 91 123 105 94 25 -81 -96 -50 46 -87 119 -101 85 43 125 90
5946 90 53 -33 -31 -153 20 201 51 142 2 -110 94 -8 -165 -228 -192 -1 139 163 294 146 -67 71 -85
5969 -85 -76 -28 -88 49 34 11 5 -91 143 -24 -202 -2 -23 173 -37 370 16 -151 -251 -87 -106 227 -63 54
5993 54 223 41 66 -39 -266 -92 63 59 64 -27 -23 48 -29 -72 59 -292 -1 -39 191 143 141 41 -80 -49 116 -154
6019 -154 -125 110 -177 112 219 -84 64 0 28 200 -24 -94 252 -68 203 237 -119 15 109 -126 -119 42 -13
6042 -13 64 80 282 59 55 5 8 -130 -141 12 65 93 211 23 -68 -114 14 31 -88 50 279 214 179 162 -31 86
6068 86 -130 -118 -174 -30 196 273 56 53 31 -83 -168 -4 -89 -43 160 -43 -17 16 12 -40 -62 -154 -108 -10 105 253
6094 253 -16 -145 -164 7 -138 -73 69 55 -189 172 87 19 -18 -49 -131 -33 -180 -134 327 174 29 58 135 -102
6118 -102 -129 -366 -221 98 126 11 54 40 -11 74 -196 -149 6 -136 -60 145 216 157 124 -34 -70 -233 11 151
6142 151 188 18 -83 265 53 -100 148 181 -6 -143 191 255 60 11 91 75 -24 28 -41 70 21 201 310
6165 310 193 99 -26 -279 -123 -242 -115 53 21 271 233 13 -33 -76 -84 -106 -82 7 138 234 30 151 199 -70
6189 -70 -303 -88 73 -73 155 82 136 145 72 -167 -133 -134 -142 -74 67 126 252 101 121 -196 169 -47 36 -74 52
6214 52 -16 -1 8 26 -108 -196 -212 129 47 -10 150 -99 369 -1 -206 -107 140 -37 7 19 176 167 281 -99 86
6239 86 67 -301 49 -195 70 -63 79 153 63 108 -216 -77 -184 -72 208 175 235 114 386 68 -233 -116
6261 -116 -491 -47 -95 34 63 145 43 171 -34 -211 -164 -231 -59 94 154 198 149 172 -20 -39 -235 -124 51
6284 51 80 -18 177 148 -68 35 -34 -192 -66 -29 -16 74 220 443 -43 -42 27 -243 -208 -47 -128 195 54 35 221
6309 221 204 -75 -43 -242 -112 -47 -52 269 320 139 90 0 -282 -117 -26 -31 95 189 139 336 21 -250 -155 -190 -146
6334 -146 -175 -44 203 266 181 276 -38 -54 -285 -225 -193 151 156 99 101 129 -6 68 -282 -241 -16 -58 44 285 142
6359 142 234 133 -179 -144 -221 -197 -53 -90 291 321 63 28 50 -397 -207 -128 -63 24 235 298 89 51 160 48
6383 48 -267 -359 -78 49 328 320 228 61 95 10 7 -200 -154 124 229 54 143 29 -110 -6 -257 38 -61 -51
6407 -51 138 311 214 89 -102 -42 -364 -268 -18 61 198 67 94 -1 93 27 -5 -173 -119 49 199 327 334 -98
6431 -98 -121 -216 -319 -258 -195 -57 530 305 174 39 -91 -54 -85 -301 -115 70 -78 246 185 -81 -107 -115 -97 -187
6455 -187 -98 -105 87 138 222 221 235 -98 -155 -306 26 -169 9 196 325 42 311 8 -204 -228 -184 -238 5 183
6479 183 474 224 108 65 -425 -88 -198 -223 -110 -5 219 170 100 -113 -28 -313 -206 -92 -133 -8 101 321
6501 321 3 238 -307 -30 -94 -241 36 159 327 24 283 141 -138 -214 -219 -229 -10 -88 173 230 231 270 -110
6524 -110 -117 -368 -215 41 216 290 169 215 165 -211 -332 -255 -371 -225 -133 129 155 233 88 69 -293 -297 -284 -45
6548 -45 -56 210 148 189 128 -31 25 -287 -93 -238 80 -6 85 238 202 23 -13 -310 -231 -310 58 69 186 120 -27
6573 -27 -58 51 -383 -213 -69 -3 151 160 303 141 -112 -108 -163 -393 -156 -187 74 168 207 351 -58 45 -421 -350
6597 -350 -299 -57 -114 242 446 251 155 -299 -45 -150 -121 -72 -135 -4 342 167 22 21 -256 -82 26 -210 -20
6620 -20 149 166 176 120 124 -56 -274 -159 -216 -36 218 322 308 159 64 -172 28 -485 -431 49 235 296 121 254
6644 254 118 -174 -413 -281 -13 -36 38 228 278 290 -27 -324 -271 -188 -385 -122 109 112 101 194 105 -261 -96 -55
6668 -55 -270 -89 42 159 224 334 -84 -95 -98 -234 -336 -45 -143 20 122 261 284 102 -297 -218 -3 -303 -56
6691 -56 282 43 -46 247 -153 62 -309 -223 -298 -49 56 295 132 105 370 -134 -163 -129 -117 -163 46 191 240
6714 240 189 -14 53 -177 -323 -180 -163 53 318 110 160 153 -123 79 -237 2 -163 190 84 321 404 202
6736 202 -90 -169 -295 -413 -49 -140 188 128 421 134 156 -142 -87 -111 -217 70 142 223 290 331 60 -289 -221 -344
6760 -344 -314 -136 240 -14 251 297 58 -217 -492 -218 -352 -116 65 325 369 223 -8 -107 -210 -261 -89 124
6782 124 209 291 411 200 163 -156 -445 -254 -200 -213 -156 198 198 66 287 129 -492 -99 -260 -96 70 176 256
6805 256 317 83 170 -124 -284 -281 -180 141 70 227 264 155 -108 -92 -346 -294 -201 -88 -16 365 205 129 -26 -195
6829 -195 -423 -159 -191 -116 114 476 210 371 264 -302 -121 -223 -84 -115 49 274 301 480 -88 -84 -192 -209
6851 -209 -513 -311 326 180 260 441 192 -4 -135 -429 -102 118 114 315 432 104 167 76 -275 -313 -484 -98
6873 -98 18 337 260 179 173 -274 -301 -662 -327 -231 -113 350 438 521 133 16 -156 -399 -320 -194 -13 183 253 134
6897 134 186 97 -259 -413 -193 -298 19 299 154 537 222 -82 78 -246 -198 -258 74 160 89 337 251 58
6919 58 -172 -334 -179 -258 5 8 163 383 305 259 -115 -276 -329 -413 -169 -12 223 411 537 228 -90 -60 -388
6942 -388 -516 -307 -15 126 418 460 181 -41 -152 -442 -188 -336 -118 89 339 358 224 -62 -154 -217 -311 -384
6964 -384 -28 -64 327 480 106 121 -105 -259 -366 -375 -225 60 286 336 226 261 -227 -209 -446 -161 -76 94 315
6987 315 486 346 -22 -191 -234 -141 -347 -207 39 199 538 385 333 -22 -180 -186 -377 -171 44 151 245 95
7009 95 381 137 -193 -231 -449 -98 -141 18 361 193 232 111 -332 -350 -383 -315 -186 177 558 263 44 93 -151
7032 -151 -241 -465 -323 -100 -20 316 347 53 66 -264 -223 -468 -517 -289 90 81 335 280 55 -151 -432 -112 -250
7055 -250 -90 58 462 373 245 128 -164 -163 -358 -440 -306 36 278 210 344 169 24 -277 -483 -244 -156 -121
7077 -121 58 173 169 405 -62 -162 -555 -459 -257 -83 392 477 375 335 12 -176 -273 -440 -374 -21 185 136 234
7100 234 441 126 -329 -326 -302 -279 -221 267 261 289 332 193 -28 -205 -509 -364 -179 57 273 510 82 64 2 -317
7124 -317 -495 -312 -48 12 254 407 478 337 211 -265 -207 -315 -281 122 274 473 381 405 -73 -123 -482 -411 -313
7147 -313 -139 133 270 440 146 0 -199 -288 -331 -292 41 -65 386 290 498 75 -170 -376 -308 -289 -202 135
7169 135 175 394 359 185 -264 -467 -417 -308 -362 80 360 265 455 44 50 -423 -482 -456 -274 -24 374 415 531
7192 531 263 51 -205 -269 -211 -92 174 32 302 489 285 110 -316 -229 -471 -392 140 141 344 188 285 -5
7214 -5 -162 -412 -301 -211 -54 65 420 515 157 -115 -59 -216 -430 -414 9 217 81 240 457 -80 -36 -275
7236 -275 -321 -362 -143 83 359 326 167 283 -3 -492 -436 -342 -133 135 129 440 361 149 -13 -226 -345 -265 -206
7259 -206 94 54 426 434 205 -145 -381 -268 -398 -338 -26 11 395 374 266 106 -60 -376 -378 -283 -201 325 474
7282 474 442 24 -71 -299 -363 -494 -479 -283 203 260 264 447 118 -106 -521 -297 -455 -117 158 313 341 318 -4
7305 -4 -65 -133 -262 -252 -236 -2 165 457 499 -3 -217 -266 -356 -257 -175 376 293 456 335 244 -132 -518 -353 -374 -320
7330 -320 -177 242 309 316 337 -156 -226 -43 -359 -325 -285 169 285 370 234 22 -196 -337 -276 -296 -170 130 402
7353 402 431 319 208 -58 -251 -319 -203 -220 299 218 409 319 293 -108 -436 -394 -346 -5 83 462 504 438 81 -51
7377 -51 -376 -548 -458 -207 244 314 344 477 421 -134 -385 -467 -425 -214 -235 189 444 309 318 131 -61 -514 -434 -138
7401 -138 -45 184 490 594 210 -113 -347 -360 -586 -446 -231 226 445 398 263 -5 -206 -420 -429 -422 -235 140
7423 140 382 273 603 178 -286 -221 -508 -216 -205 104 306 326 234 319 -63 -411 -485 -584 -107 73 377 409 424
7446 424 351 29 -125 -493 -408 -289 182 456 336 306 132 -27 -213 -387 -403 -332 57 266 369 340 455 -121
7468 -121 -178 -482 -457 -277 24 308 320 565 252 189 -305 -430 -390 -89 -264 30 378 753 289 102 -283 -295
7490 -295 -512 -357 -276 359 198 298 237 -14 -169 -88 -416 -476 -207 179 496 467 80 93 -325 -486 -406 -704
7512 -704 -73 -32 228 244 307 273 -96 -455 -577 -372 -73 193 256 598 299 199 -300 -368 -241 -406 -222 -180
7534 -180 281 410 481 347 -76 -46 -542 -352 -422 38 332 380 359 493 -173 -77 -524 -458 -299 -95 185 367
7556 367 343 458 78 -201 -324 -571 -427 -205 108 286 534 133 175 -67 -344 -431 -340 -224 -139 298 522 430
7578 430 131 88 -258 -554 -318 -313 12 237 466 327 296 -20 -289 -509 -506 -304 80 324 401 465 115 4 -212
7601 -212 -321 -691 -248 -51 109 335 478 257 80 -111 -526 -529 -458 181 229 547 513 328 88 -208 -296 -427
7623 -427 -371 -290 -21 353 473 447 219 -125 -194 -446 -256 -374 -19 496 428 397 38 -29 -485 -420 -157 -367 103
7646 103 358 507 299 359 -124 -379 -509 -348 -159 -79 384 275 575 394 -65 -181 -410 -331 -183 -117 125
7667 125 423 405 412 -20 -240 -474 -382 -279 -209 235 417 305 329 23 -186 -435 -458 -423 -206 41 416 202 341
7690 341 75 -183 -578 -338 -324 -69 133 404 345 276 307 -270 -281 -336 -168 -63 -47 498 520 212 303 -59 -241
7713 -241 -518 -499 -231 140 284 320 437 244 -102 -256 -511 -393 -373 129 285 359 383 140 -122 -288 -409 -449
7735 -449 -135 -69 43 633 492 249 0 -516 -494 -507 -614 -50 202 463 500 308 115 -201 -385 -436 -418 -202
7757 -202 50 157 300 511 68 -303 -400 -391 -399 -127 13 328 455 358 245 -147 -609 -682 -325 -162 173 212 397
7780 397 556 193 -219 -384 -501 -498 -168 25 448 447 359 186 125 -387 -464 -321 -305 -133 142 420 330 369 22
7803 22 -359 -483 -607 -308 -109 267 521 414 165 -10 -136 -209 -648 -363 -117 219 346 371 435 79 11 -392
7825 -392 -553 -233 -289 240 337 691 255 186 -116 -525 -539 -418 -213 41 437 308 396 407 -150 -495 -281 -393
7847 -393 -223 203 504 444 411 104 52 -271 -528 -538 -164 181 286 475 482 56 -15 -471 -301 -376 -261 53 413
7870 413 667 404 329 7 -275 -804 -293 -363 -132 140 280 460 381 25 -228 -387 -408 -358 -57 249 363 476
7892 476 279 211 -81 -250 -228 -260 -335 130 269 466 272 123 -45 -357 -411 -457 -226 198 407 517 306 236
7914 236 29 -346 -654 -558 -228 9 385 599 349 163 -15 -304 -419 -307 -193 69 239 510 403 155
7934 155 -97 -422 -195 -305 -508 79 280 389 537 5 141 -557 -283 -539 -303 196 353 352 419 349 274 107
7956 107 -559 -478 -241 83 63 591 393 562 124 -142 -340 -323 -439 -72 -46 163 376 572 -61 -185 -435
7977 -435 -599 -362 -219 -59 217 678 352 180 -36 -93 -522 -472 -332 21 424 474 66 71 -274 -230 -322 -281 -403
8000 -403 20 395 224 529 165 -264 -292 -440 -396 -305 136 273 422 164 578 42 -423 -433 -395 -376 -147 242
8022 242 412 527 345 16 -202 -425 -458 -314 -99 148 423 448 321 40 -211 -358 -446 -281 -204 368 155
8043 155 490 104 241 -182 -581 -234 -286 -35 -47 135 494 199 152 46 -331 -407 -534 -161 67 371 241
8064 241 445 349 -216 -263 -413 -399 -163 32 330 540 468 107 -25 -77 -360 -455 -324 51 254 446 467 229
8086 229 -14 -157 -378 -251 -330 141 56 476 504 327 162 -126 -197 -330 -226 -135 177 330 484 353 67 -162
8108 -162 -275 -465 -257 -40 112 284 365 321 302 -128 -253 -571 -615 -478 18 237 606 191 151 -128 -259 -330
8130 -330 -530 -316 115 151 472 289 120 -103 -99 -327 -360 -169 -3 229 384 285 315 157 -341 -514 -390 -273
8152 -273 -170 85 504 363 203 51 -60 -140 -587 -297 -131 214 648 181 282 130 -140 -328 -270 -290 -5
8173 -5 37 282 511 226 7 -11 -316 -267 -492 -92 199 382 518 424 169 -139 -432 -447
8191d47
$$ Imaginary data points
##PAGE= N=2
##DATA TABLE= (X++(I..I)), XYDATA
0 0 0 0 0 0 0 0 0 0 0 8 -8 8 -8 16 -16 23 -28 32 -41 50 -58 73 -82 100 -116 133 -158 181 -208 240 -273 312
32 312 -352 401 -452 508 -573 640 -715 798 -886 987 -1092 1211 -1339 1477 -1634 1799 -1983
49 -1983 2185 -2405 2653 -2921 3227 -3567 3947 -4386 4886 -5473 6163 -6994 8018 -9311
63 -9311 11010 -13345 16776 -22328 32824 -59798 284350 510945 25960 -40119 -125417 -338321
75 -338321 -462610 -228897 -13647 183755 407788 472377 189304 -66603 -158956 -276370
85 -276370 -427700 -313634 -19268 217607 351428 409572 264319 -1288 -189611 -280404
95 -280404 -363265 -326370 -92847 203575 368608 366521 244281 69111 -131912 -314085 -380026
106 -380026 -273399 -88281 105224 315355 429054 285420 17862 -132581 -215454 -344677
116 -344677 -354692 -128679 140172 297339 367734 300392 72763 -122656 -200757 -304387 -375839
127 -375839 -187157 146958 312425 307020 270831 151160 -66456 -232277 -310382 -337170 -204893
138 -204893 91419 297945 303198 254855 181695 -10763 -231463 -328036 -312053 -197993 36594
149 36594 257515 310775 263145 191722 23391 -210906 -331976 -300298 -194316 -11812 210679
160 210679 320607 282093 189286 41338 -174211 -319080 -302044 -200222 -49635 167569
170 167569 329164 304446 172562 44769 -110960 -284701 -341695 -230629 -36670 154173
180 154173 281017 293890 211623 76678 -102371 -275598 -331263 -236244 -61915 122905 261775
191 261775 295256 227003 99153 -79290 -262007 -328210 -239415 -81375 86477 239512 303179
202 303179 239848 110176 -51949 -236627 -332593 -249575 -84011 54497 193216 311180
212 311180 281664 109940 -62930 -192206 -291506 -283985 -132236 56121 193247 280316 278189
223 278189 146639 -38631 -183400 -274368 -285208 -164286 33948 189113 263435 267058 176271
234 176271 -558 -176290 -275080 -274353 -173438 -3108 162715 263439 273386 182747 20873
245 20873 -147108 -262416 -283740 -188832 -17924 140663 241269 274764 209284 42153 -138593
256 -138593 -247554 -269617 -204994 -53562 121535 237668 270220 216069 68191 -115967 -236980
267 -236980 -262276 -213025 -85859 96090 237272 269443 210421 88730 -76858 -222915 -274273
278 -274273 -219558 -93312 68582 211739 271595 225815 101717 -58409 -200888 -267698 -232524
289 -232524 -111801 50746 194587 262962 233789 121386 -37585 -185320 -260446 -237575 -129798
300 -129798 27985 178224 256577 237301 137812 -13253 -168546 -256747 -240112 -140117 2993
311 2993 153671 253128 247482 146046 1347 -142352 -242482 -250469 -158096 -10183 136923
322 136923 236899 249772 164729 20296 -126401 -229480 -250894 -174534 -29908 121121 223946
333 223946 246728 179621 43092 -109955 -219916 -247478 -184121 -52454 99975 214214 246461
344 246461 187698 62223 -86679 -207304 -249033 -193455 -67378 78382 196080 245107 201811
355 201811 79684 -70650 -192211 -242172 -202553 -87569 58084 181556 240964 210410 97490
366 97490 -52311 -177283 -234687 -208656 -107300 36613 168578 236124 214043 112824 -30210
377 -30210 -161079 -230069 -213337 -120394 16081 149987 230176 221029 126215 -12576 -142752
388 -142752 -220799 -218292 -135028 -1921 132769 220401 225034 140801 3902 -127967 -209667
399 -209667 -218332 -149160 -21531 116669 211407 225708 153004 21882 -112123 -198742 -215913
410 -215913 -160636 -43900 98032 204535 227220 160285 37094 -92239 -184660 -215398 -173507
421 -173507 -62523 81914 195423 224308 166130 54308 -70247 -171267 -216122 -183067 -76626
432 -76626 65138 181140 220234 174202 70745 -52561 -158011 -211779 -190629 -92497 48120
443 48120 168774 215094 178629 86313 -32270 -144985 -209365 -194857 -103871 29103 151512
454 151512 210933 186308 98183 -17567 -129347 -200237 -198847 -119748 9485 138690 207420
465 207420 187927 105786 1303 -107344 -193391 -208356 -131304 -814 122626 193869 191001
476 191001 120774 16523 -93225 -182542 -210695 -145055 -15095 110259 182139 187443 133330
487 133330 35615 -78138 -175448 -210997 -153483 -27471 94889 166726 185076 148744 54242
498 54242 -69744 -168798 -202278 -157366 -49623 74810 161451 185935 151818 67241 -50356
509 -50356 -156245 -201641 -164186 -62563 57180 148145 184089 159640 79403 -35374 -141943
520 -141943 -195461 -171494 -78944 42397 138072 178433 162107 92889 -16594 -128292 -192313
531 -192313 -177962 -90008 29466 123744 167548 165598 111216 55 -122392 -186721 -172191
542 -172191 -100689 5194 110087 168285 166614 116068 18488 -104517 -184211 -175633 -104119 -10381
554 -10381 87576 162264 175845 123208 25816 -87797 -170063 -177407 -115477 -24486 72886 154783
566 154783 179043 128964 34206 -69186 -153831 -181260 -131072 -32740 65715 139536 171528 141282
578 141282 51583 -60068 -146901 -174446 -135839 -49907 50913 133647 168942 142910 64039
589 64039 -42154 -136519 -175426 -140781 -57799 36546 118509 165668 151876 75506 -31709 -125402
601 -125402 -168588 -144269 -70338 21005 106350 162989 158298 83493 -21577 -109741 -157982 -151969
613 -151969 -86199 11372 99514 153285 156696 97381 -5790 -101004 -152250 -150901 -97137 -5029
625 -5029 89276 148502 155131 104789 10773 -87280 -147134 -152492 -104775 -17626 77121 140772 153713
638 153713 113008 26240 -74470 -141940 -151973 -109497 -30306 61833 132782 154947 119509 36832
650 36832 -61683 -133069 -150221 -115425 -43252 47775 125448 154222 123529 46826 -47213 -122046
662 -122046 -148896 -121986 -53634 35735 115949 151775 127964 56490 -33881 -110646 -146511 -128026
674 -128026 -63188 24752 105185 146656 131936 67131 -21096 -100436 -142370 -131504 -72658 13176
686 13176 95328 141362 133535 76785 -7751 -89828 -138443 -134226 -80423 1602 82963 134861
698 134861 136595 85607 3563 -78881 -131866 -135408 -89007 -9859 71955 128558 137304 93402
710 93402 14838 -67306 -124026 -136208 -97201 -21338 61738 120471 135509 100604 27365 -56179
722 -56179 -117641 -134540 -102567 -32492 50144 113480 134342 105288 37462 -44312 -109448 -133596
734 -133596 -108296 -41889 39190 104676 131432 110369 48231 -33237 -101781 -131473 -111925 -50855
746 -50855 27899 95511 128305 114494 57845 -21938 -93781 -127509 -114081 -60185 16100 86499
758 86499 124738 116727 65856 -10791 -84100 -124002 -116140 -66898 5186 76273 120487 119675 72803
771 72803 -1388 -74290 -118431 -117829 -74605 -4675 66866 115134 120718 79682 7870 -64778 -111909
784 -111909 -118086 -81725 -14766 58222 109101 119364 85699 19211 -55014 -106913 -117447 -86227
796 -86227 -24922 47480 103183 118935 90435 28794 -44266 -100371 -117000 -90892 -33521 36785
808 36785 95793 118052 94488 36734 -33767 -92392 -115367 -95248 -41749 26385 87289 116200
820 116200 98761 44338 -23774 -83454 -112458 -98885 -49773 17404 79349 112705 101123 51802
832 51802 -14147 -74839 -109204 -102273 -56530 8565 70807 108140 103553 58932 -4982 -66188
844 -66188 -104786 -104218 -63032 203 61973 102632 104985 65860 3472 -58015 -99281 -105018 -69677
857 -69677 -8187 53849 96630 105323 72701 11983 -50140 -93220 -104195 -75626 -16681 45929
869 45929 90542 104025 78067 20615 -42273 -87424 -102495 -80578 -25481 38419 84991 101403
881 101403 82312 29959 -34160 -81929 -100305 -83643 -33854 29988 79109 98574 85072 38548
893 38548 -25362 -77212 -97620 -85359 -41627 20143 73172 96659 86754 45686 -15751 -70628
905 -70628 -95382 -86414 -48159 10439 66241 94445 87842 51197 -6498 -63198 -92739 -87788 -53649
918 -53649 1374 58771 91408 88308 56272 2571 -55218 -90221 -88302 -57506 -6942 50169
930 50169 88250 89414 59719 10953 -46365 -86468 -89640 -60737 -13632 40854 83113 90688 63733
943 63733 17029 -37316 -81151 -90619 -64064 -19196 31719 76353 92060 68615 21532 -30331
955 -30331 -73224 -89652 -69573 -25453 25517 69691 89771 72347 28037 -23211 -67032 -87825
967 -87825 -73017 -31239 18582 63203 87309 75909 33746 -16667 -60164 -84428 -76539 -37288
979 -37288 12626 56623 83217 78557 40735 -10329 -54302 -80816 -78488 -43337 6326 49671
991 49671 78314 81112 47769 -4924 -49511 -74919 -78215 -51117 -1370 45785 74672 79114 53288
1004 53288 3502 -44187 -71662 -76734 -55236 -9458 39924 71429 78060 56826 11026 -37758
1016 -37758 -67653 -75351 -59013 -17049 33970 68080 76035 59197 19013 -30766 -65152 -74156
1028 -74156 -60818 -23739 26700 64366 74718 61119 25653 -23516 -61366 -72877 -61292 -29794
1040 -29794 18161 60407 74472 61677 30235 -14760 -56395 -72881 -62247 -33412 10004 53855
1052 53855 74135 63832 33209 -8040 -49388 -70853 -64845 -37531 4056 47467 71520 65134
1064 65134 36910 -1488 -42261 -68763 -66645 -40688 -1519 41012 68590 66572 40192 3773
1076 3773 -35790 -65426 -67974 -43759 -6443 33907 64382 67748 44233 8388 -29437 -60628
1088 -60628 -69093 -47565 -10267 27909 58260 68331 49323 12537 -24997 -54755 -67511 -52110
1100 -52110 -16019 23662 53645 65603 52774 18506 -20045 -50721 -65262 -54560 -21628 18071
1112 18071 49620 63931 54701 23817 -14768 -46402 -63408 -56674 -26521 12847 44804 61129
1124 61129 56217 28617 -9564 -42057 -60266 -57795 -31189 7947 40585 58072 56960 34055
1136 34055 -3967 -38492 -57221 -56902 -35773 1004 36713 55924 56508 37296 2591 -33895 -55235
1149 -55235 -56360 -38290 -5098 30995 54030 56545 39377 7443 -28057 -52328 -56547 -40758
1161 -40758 -9637 25280 50351 56385 42095 11907 -23072 -48575 -55636 -43183 -14342 20553
1173 20553 47204 55262 43795 16743 -17909 -45375 -54712 -44748 -18502 15200 43678 54359
1185 54359 45044 20209 -12292 -41487 -54127 -45857 -22001 9847 39074 53419 46561 23324
1197 23324 -7816 -36376 -52029 -47478 -25560 5687 34656 50815 47836 27009 -3434 -32676
1209 -32676 -49691 -48054 -28778 1044 30635 48700 47938 30162 1397 -27855 -47025 -48289 -31470
1222 -31470 -3414 26095 45982 48197 32248 5433 -23199 -44015 -48594 -34085 -6929 21660
1234 21660 42628 47721 34809 9371 -19370 -40634 -47505 -36443 -11271 17693 39406 46430
1246 46430 36866 13621 -14790 -37958 -46666 -37585 -15064 12935 36346 45589 37776 16452 -10447
1259 -10447 -34108 -45368 -39078 -18054 8906 32271 44157 39300 19472 -6537 -30180 -43315
1271 -43315 -40195 -21292 5279 28795 41943 40072 22919 -2776 -26840 -41381 -40369 -24334
1283 -24334 1275 25548 40037 39938 25556 1203 -23399 -39431 -40417 -26547 -2738 21382 37560
1296 37560 40069 27460 4881 -19560 -36556 -39932 -28512 -5697 18045 35022 39547 29644 8238
1309 8238 -16113 -34135 -39191 -30230 -9755 14694 32298 38423 30721 11814 -12405 -31292 -38216
1322 -38216 -31352 -12793 10477 29869 37555 31626 14398 -8545 -28468 -37427 -32195 -15390 6875
1335 6875 26679 36388 32380 16900 -5143 -25356 -35475 -32693 -17991 3466 23509 34564 32901
1348 32901 19307 -1681 -21978 -33913 -32930 -20037 -65 20198 33217 33150 21060 1746 -18499
1361 -18499 -31944 -33073 -21619 -2875 16890 30985 33254 22520 4152 -15414 -29792 -33183
1373 -33183 -23476 -5597 13653 28372 32800 24308 6866 -12451 -27099 -32289 -25346 -8259 11083
1386 11083 26170 31887 25649 9677 -9528 -24783 -31260 -26025 -11008 7818 23678 30699 26353
1399 26353 11960 -6618 -22092 -30015 -27005 -13365 5346 21086 29122 27070 14487 -3708 -19721
1412 -19721 -28402 -27232 -15698 2390 18830 27692 27067 16505 -753 -17252 -26762 -26997 -17541 -738
1426 -738 16325 26216 26683 17820 2375 -14526 -25491 -26898 -18391 -3551 13363 24906 26483 19003
1440 19003 4726 -11613 -23746 -26324 -19541 -5699 10641 22992 26129 19814 6951 -8938 -21864
1453 -21864 -26172 -20480 -7694 7846 20602 25539 20651 9123 -6370 -19558 -25135 -21212 -9511
1466 -9511 5179 18439 24510 21387 10564 -3707 -17275 -24657 -21719 -11079 3003 15942 23656
1479 23656 21809 12124 -1361 -14844 -23160 -22222 -12622 543 13536 22191 22254 13487 511 -12176
1493 -12176 -21524 -22601 -13854 -1169 11088 20149 22237 15127 2232 -10404 -19338 -21975 -15631 -3225
1507 -3225 9380 18366 21521 16676 4334 -8594 -17701 -21124 -16721 -5556 7427 16755 20568 17191
1521 17191 6671 -6440 -16351 -20311 -17188 -7546 5238 15398 19776 17672 8429 -4243 -14845
1534 -14845 -19270 -17556 -9012 3101 13603 18905 17434 9779 -2248 -12909 -18562 -17574 -10460 760
1548 760 11701 17883 17687 11254 261 -10977 -17418 -17633 -11532 -1105 9974 16804 17497 12109 1992
1563 1992 -9035 -16348 -17095 -12192 -3120 7908 16014 17159 12736 3718 -6644 -15071 -17146 -12931
1577 -12931 -4467 5662 14264 17097 13193 4913 -4907 -13363 -16828 -13489 -5642 3896 12723 16545
1591 16545 13792 6359 -3282 -11542 -16079 -14051 -6980 2152 10784 15936 14391 7571 -1469 -9991 -15293
1606 -15293 -14459 -8122 681 9198 14537 14676 8490 15 -8348 -13964 -14626 -9185 -682 7787 13358
1621 13358 14651 9492 1397 -6988 -12775 -14483 -10324 -1895 6106 12292 14319 10808 2800 -5449 -11844
1636 -11844 -14049 -11163 -3648 4818 11015 13631 11341 4326 -4066 -10386 -13348 -11467 -5177 3348 9874
1651 9874 13117 11757 5610 -2637 -9237 -12692 -11802 -6317 1705 8688 12469 11760 6808 -935 -8096
1666 -8096 -11794 -11661 -7282 144 7223 11781 11629 7818 408 -6727 -11276 -11624 -8078 -1286 6110 10866
1682 10866 11618 8127 1804 -5365 -10478 -11471 -8447 -2693 4694 10037 11373 8860 3100 -3773 -9587
1697 -9587 -11376 -9022 -3770 3293 8920 11070 9101 4154 -2760 -8350 -10904 -9343 -4638 1753 7824
1712 7824 10772 9734 4954 -1173 -7195 -10543 -9844 -5543 497 6655 10000 10020 5951 102 -5694 -9932
1728 -9932 -9695 -6293 -628 5381 9384 9917 6739 1176 -4787 -9013 -10025 -7003 -1682 3964 8705
1743 8705 9780 7301 2221 -3472 -8021 -9858 -7698 -2747 3053 7637 9896 7871 3270 -2257 -7142
1758 -7142 -9356 -8105 -3714 1941 6789 9221 8267 4089 -1400 -6242 -8925 -8420 -4614 555 5643
1773 5643 8689 8551 5071 -279 -5182 -8446 -8444 -5557 -625 4725 8039 8551 5695 722 -4470 -7786
1789 -7786 -8606 -6004 -1464 3867 7610 8512 6335 1779 -3242 -7184 -8502 -6594 -2565 2835 6773
1804 6773 8364 6763 2896 -2080 -6383 -8131 -7213 -3412 1867 6249 8160 7465 3758 -1170 -5384
1819 -5384 -7857 -7158 -4158 777 5255 7704 7550 4740 -129 -4766 -7586 -7564 -4781 -429 4457 7201
1835 7201 7659 5258 820 -3917 -7148 -7725 -5542 -1435 3389 6810 7419 5792 2032 -3000 -6599 -7590
1851 -7590 -6087 -2369 2454 6184 7675 6229 2723 -1924 -5830 -7468 -6352 -3234 1556 5504 7360
1866 7360 6414 3536 -1033 -5376 -7363 -6572 -3916 477 4512 6982 6750 3989 -76 -4552 -6947 -7028
1882 -7028 -4431 -544 3973 6968 7057 4778 995 -3715 -6568 -7032 -5178 -1224 3121 6664 7141 5303
1898 5303 1620 -2634 -6056 -7313 -5518 -1842 2202 5715 7284 5760 2555 -1706 -5497 -7155 -6108
1913 -6108 -2967 1427 4996 7102 6340 3322 -913 -4771 -6794 -6428 -3655 499 4354 6840 6555 3932
1929 3932 -119 -4037 -6381 -6733 -4410 -334 3679 6414 6864 4627 679 -3570 -6240 -6650 -4895 -1049
1945 -1049 2948 5912 6793 5153 1484 -2543 -5710 -6964 -5435 -1675 2164 5630 6994 5577 2181
1960 2181 -1764 -5133 -7014 -5776 -2791 1621 4616 6463 6624 3517 -1378 -4879 -6302 -6256 -3160 877
1976 877 4020 6034 6921 4313 -3 -4387 -6792 -6603 -3246 443 3809 6194 5881 4172 364 -3490
1992 -3490 -6251 -6523 -4971 -1171 2926 6022 6634 4992 1516 -2672 -5725 -6340 -5291 -1887 2411 5645
2008 5645 6739 5480 2301 -2089 -5517 -6529 -5635 -2635 1537 5105 6539 5874 2934 -1194 -4919
2023 -4919 -6862 -6094 -3275 577 4640 6572 6123 3553 -525 -4469 -6647 -6121 -3950 -123 3878 6456
2039 6456 6490 4407 360 -3731 -6336 -6500 -4607 -1005 3286 6021 6544 4912 1221 -3067 -6053 -6718
2055 -6718 -4865 -1630 2677 5752 6675 5290 1712 -2396 -5504 -6805 -5535 -2236 1891 5174 6809
2070 6809 5688 2548 -1604 -4963 -6789 -5831 -2954 1161 4749 6937 6086 3235 -802 -4503 -6517
2085 -6517 -6438 -3563 612 4354 6587 6692 3897 -256 -3942 -6396 -6401 -4259 -278 3555 6404 6705 4353
2102 4353 699 -3447 -6200 -6874 -4853 -1131 3181 6071 6832 4992 1589 -2499 -5769 -6707 -5454 -1861
2118 -1861 2355 5642 7269 5537 2185 -1892 -5521 -6802 -5567 -2575 1291 5277 7158 5479 2905
2133 2905 -1248 -4904 -6790 -5966 -3219 587 4439 6791 6302 3260 -566 -4435 -6553 -6386 -3852 103
2149 103 4101 6494 6470 4010 137 -3875 -6570 -6445 -4204 -414 3469 6372 6724 4853 1074 -3112
2165 -3112 -6264 -6818 -4813 -1323 3040 6024 7042 5175 1458 -2682 -5956 -6963 -5854 -2002 2248
2180 2248 5094 6817 5487 2209 -1685 -5474 -6750 -5924 -2543 1923 4894 6885 6073 3106 -1329
2195 -1329 -4805 -6620 -6227 -3165 935 4826 6567 6190 3918 -430 -4305 -6751 -6545 -4307 687 3676
2211 3676 6239 6641 4224 493 -3865 -6406 -6772 -4384 -337 3540 6216 6531 4901 945 -3529 -5982
2227 -5982 -6688 -5040 -1193 2942 5679 6826 4987 1712 -2864 -5771 -6750 -5169 -2046 1943 5459
2242 5459 7132 5599 2516 -2210 -5347 -6652 -5338 -2498 1354 5790 7145 6047 3142 -1004 -4451
2257 -4451 -6358 -5890 -2911 1025 4470 6539 6294 3639 -448 -3831 -6142 -5874 -3545 -8 4084 6429
2273 6429 6165 3584 303 -4036 -6024 -6438 -3914 -673 4276 5585 6438 4213 1680 -2274 -5908 -6598
2289 -6598 -4864 -1046 2714 5267 6431 4919 1720 -2372 -5777 -6227 -5131 -1965 1615 5103 6252
2304 6252 5650 2123 -1740 -5061 -6690 -5129 -2398 1946 5425 6081 6728 2988 -927 -4363 -5972 -5655
2320 -5655 -2348 640 4735 6226 5884 3731 -236 -4386 -6426 -6222 -4038 359 4128 7011 6333 3748
2336 3748 -176 -3946 -5323 -6324 -3678 -7 3977 6230 6959 4177 748 -3460 -6367 -6498 -5236
2351 -5236 -424 3435 5423 6973 4650 1005 -2220 -6189 -6170 -4734 -1770 2424 5611 6364 5387 1522
2367 1522 -2253 -4908 -6161 -5415 -2044 2202 5011 6884 5117 2903 -1774 -4895 -7003 -5962 -2638
2382 -2638 982 4873 6437 6045 3091 -486 -4169 -6660 -5952 -3392 -41 4171 6693 6344 3431 -362
2398 -362 -4014 -5586 -6118 -3791 -631 3531 7167 7108 4385 1029 -3066 -6101 -6480 -4301 -718 3054
2414 3054 6248 6637 5119 1506 -2869 -6153 -5630 -4988 -1212 2516 5713 6729 4883 1908 -2195 -5713
2430 -5713 -6616 -5336 -2042 1625 5227 7100 5474 3211 -1562 -4601 -6540 -5602 -2507 1655 4763
2445 4763 6486 5835 3001 -906 -4605 -6890 -6011 -3412 1120 4323 6504 6270 3505 199 -4234 -6253
2461 -6253 -6196 -3711 -844 3905 6136 6667 3705 315 -3509 -6153 -6269 -4799 -761 3271 5985 6849
2477 6849 4810 1224 -2906 -5677 -6845 -4694 -1634 2462 5456 6779 5268 1392 -2276 -5329 -6684
2492 -6684 -5121 -1802 2010 5347 6951 5283 2184 -1704 -5243 -6648 -5726 -2626 1708 4812 6517
2507 6517 5775 2767 -978 -4570 -6596 -5976 -3132 586 4394 6410 6089 3349 -581 -4201 -6369 -6034
2523 -6034 -3623 150 4032 6150 6293 4022 -46 -3512 -6021 -6346 -4233 -469 3446 6120 6461 4305
2539 4305 652 -3068 -5937 -6317 -4706 -1096 2919 5846 6495 4697 1294 -2722 -5576 -6569 -5053 -1671
2555 -1671 2362 5480 6499 5151 2047 -2073 -5269 -6544 -5330 -2376 1659 5162 6341 5459 2528
2570 2528 -1490 -4555 -6378 -5725 -2921 936 4436 6494 5753 3208 -835 -4300 -6473 -5922 -3344 275
2586 275 4127 6081 6042 3608 -49 -3938 -6156 -6178 -3704 -290 3707 6009 6027 4131 573 -3170 -5657
2603 -5657 -6128 -4388 -670 2968 5591 6291 4579 1129 -2888 -5560 -6224 -4587 -1455 2408 5343 6330
2619 6330 4743 1563 -2185 -5222 -6346 -4932 -2067 2163 5149 6301 5283 2399 -1670 -4916 -6432
2634 -6432 -5645 -2501 1405 4665 6152 5518 2738 -975 -4370 -6206 -5679 -3170 1021 4143 6068 5708
2650 5708 3307 -584 -4014 -6055 -6035 -3517 -1 3752 5765 5973 3820 245 -3501 -5905 -6169 -3967
2666 -3967 -423 3275 5558 6047 4196 861 -2930 -5467 -6263 -4257 -800 2693 5483 6184 4765 1377
2682 1377 -2469 -5202 -6161 -4505 -1528 2219 5108 5971 4944 1959 -1932 -4893 -6011 -5070 -2104 1588
2698 1588 4824 6103 5245 2497 -1239 -4559 -5824 -5310 -2587 965 4361 6005 5175 2883 -845 -4121
2714 -4121 -6147 -5690 -3030 446 3754 5761 5606 3400 -59 -3556 -5807 -5534 -3363 -78 3361 5813
2730 5813 5699 3875 263 -3097 -5565 -5734 -3802 -860 3101 5444 5790 4031 1038 -2733 -5369 -6051
2746 -6051 -4345 -1272 2283 5113 5765 4585 1621 -2289 -4886 -5958 -4696 -1581 1904 4757 5728
2761 5728 4800 2005 -1810 -4654 -5720 -5011 -2135 1324 4444 5666 5158 2425 -1089 -4354 -5546 -5195
2777 -5195 -2814 804 4028 5817 5240 3012 -353 -3988 -5753 -5353 -3123 136 3676 5521 5438 3148
2793 3148 -103 -3278 -5598 -5501 -3598 -38 3391 5461 5456 3802 495 -2932 -5125 -5632 -3770 -814
2809 -814 2721 5086 5498 4185 1140 -2528 -4821 -5587 -4338 -1246 2360 4831 5607 4235 1317 -2069
2825 -2069 -4804 -5493 -4580 -1703 1703 4475 5778 4589 2000 -1353 -4522 -5770 -4813 -2247 1109 4199
2841 4199 5519 4812 2122 -958 -3961 -5463 -5117 -2499 583 3671 5473 5050 2917 -621 -3513 -5259
2857 -5259 -5101 -3034 248 3194 5167 5078 3299 124 -3097 -5326 -5184 -3466 -299 2890 5058 5028
2873 5028 3638 826 -2873 -5020 -5399 -3702 -846 2419 4839 5343 3936 911 -2303 -4686 -5236 -4191
2889 -4191 -1295 1983 4521 5290 4162 1458 -1810 -4150 -5334 -4423 -1776 1413 4113 5381 4532 1885
2905 1885 -1310 -3917 -5340 -4461 -1896 1080 3794 5194 4688 2430 -646 -3785 -5167 -4873 -2454 687
2921 687 3416 4923 4778 2651 -347 -3376 -4890 -4889 -2907 164 2908 4894 4913 3135 211 -2813 -4752
2938 -4752 -4963 -3367 -423 2782 4787 4851 3373 517 -2600 -4491 -5132 -3514 -785 2254 4595 5121
2954 5121 3646 1152 -2273 -4386 -5007 -3830 -1248 1837 4276 4953 3911 1465 -1557 -3940 -4798 -3913
2970 -3913 -1734 1344 3946 4825 4059 1798 -1080 -3909 -4852 -4394 -2273 831 3639 4936 4363 2205
2986 2205 -612 -3485 -4904 -4501 -2359 399 3285 5060 4550 2522 -387 -3095 -4671 -4463 -2727 275
3002 275 2882 4701 4504 2855 288 -2736 -4401 -4635 -3000 -473 2473 4310 4611 3012 520 -2132
3018 -2132 -4055 -4612 -3410 -869 2242 4070 4708 3283 1103 -1916 -3965 -4806 -3818 -1093 1673 3997
3034 3997 4744 3532 1398 -1558 -4016 -4628 -3797 -1442 1196 3749 4489 3776 1559 -843 -3680 -4554
3050 -4554 -3783 -1735 994 3236 4549 4016 2179 -640 -3250 -4371 -4103 -2250 366 2921 4236 4218
3066 4218 2438 -264 -2725 -4254 -4293 -2405 -39 2732 4318 4317 2697 228 -2616 -4080 -4250 -2882
3082 -2882 -382 2186 4037 4359 2982 547 -1852 -3947 -4346 -2936 -947 1876 3826 4288 3152 914
3098 914 -1914 -3555 -4287 -3268 -1000 1432 3571 4309 3457 1372 -1476 -3544 -4233 -3540 -1262 987
3114 987 3228 4046 3524 1626 -921 -3115 -4228 -3644 -1911 772 3067 4018 3845 1939 -566 -2726
3130 -2726 -3995 -3842 -1931 8 2893 4030 3780 2267 -201 -2640 -3814 -3924 -2407 31 2460 3768
3146 3768 3864 2454 8 -2271 -3801 -3663 -2703 -304 1910 3658 4071 2748 469 -2094 -3479 -3666
3162 -3666 -2627 -679 1689 3555 3805 3020 833 -1600 -3408 -3893 -2834 -922 1340 3169 3797 3069
3178 3069 1218 -1256 -3166 -3944 -2911 -1286 845 3048 3741 3156 1361 -820 -2884 -3871 -3558 -1508
3194 -1508 695 2702 3702 3287 1869 -396 -2529 -3601 -3230 -1823 310 2530 3585 3588 2077 -99
3210 -99 -2327 -3581 -3587 -1929 -130 1954 3398 3459 2212 146 -1987 -3477 -3417 -2301 -238 1628 3341
3227 3341 3508 2275 363 -1662 -3074 -3442 -2445 -496 1709 3242 3533 2556 737 -1250 -3114 -3622
3243 -3622 -2745 -936 1334 2842 3653 2763 854 -1265 -2755 -3273 -2753 -1093 1013 2600 3275 2755 1230
3260 1230 -605 -2439 -3411 -2988 -1587 709 2409 3428 2921 1457 -486 -2283 -3272 -3108 -1858 392
3276 392 2051 3176 3266 1946 -280 -2100 -3109 -3148 -1849 59 1863 2901 3136 1731 34 -1798
3292 -1798 -3016 -2896 -2201 -119 1651 2846 3124 2213 599 -1514 -3061 -3042 -2146 -819 1384 2740 3013
3309 3013 2016 679 -1196 -2621 -3099 -2511 -820 1162 2387 2897 2462 871 -1005 -2316 -2914 -2452 -1151
3326 -1151 1034 2351 3053 2597 1037 -778 -2136 -3007 -2494 -1265 677 2018 2975 2596 1383 -513
3342 -513 -2057 -2945 -2777 -1240 189 1917 2860 2537 1726 -227 -2096 -2771 -2648 -1791 126 1632 2622
3359 2622 2925 1725 242 -1666 -2628 -2795 -1657 -203 1272 2442 2674 2026 465 -1474 -2468 -2772 -1987
3376 -1987 -496 1209 2359 2860 2106 544 -1033 -2367 -2531 -2008 -735 1083 2392 2792 2094 757
3392 757 -954 -2220 -2618 -2197 -671 575 2106 2508 2155 912 -697 -1838 -2787 -2209 -1017 423 1921
3409 1921 2690 2420 1185 -388 -1835 -2739 -2438 -1216 175 1801 2477 2376 1304 -223 -1569 -2393 -2388
3426 -2388 -1502 32 1574 2401 2354 1382 328 -1376 -2405 -2369 -1639 -107 1278 2395 2432 1796 55 -1162
3444 -1162 -2421 -2300 -1607 -246 1229 2159 2572 1954 298 -1134 -1853 -2399 -1769 -824 905 2037 2408
3461 2408 1783 371 -691 -1813 -2167 -2077 -724 629 1902 2249 1878 747 -481 -1939 -2224 -2022 -963
3478 -963 408 1586 2330 2146 905 -445 -1612 -2271 -2005 -1079 257 1490 2388 2027 1200 -140 -1510
3495 -1510 -2490 -2013 -1191 296 1435 2082 2097 1223 40 -1183 -2111 -2042 -1268 -115 971 2124 2004 1482
3513 1482 88 -1126 -1617 -2089 -1648 -331 1131 1778 2289 1525 233 -861 -1876 -2045 -1461 -385 792
3530 792 1853 2050 1836 389 -683 -1773 -2096 -1784 -439 760 1638 1906 1836 611 -564 -1713 -2083
3547 -2083 -1756 -922 563 1732 1884 1624 663 -350 -1621 -1946 -1686 -1039 434 1514 1857 1846 945 -215
3565 -215 -1324 -1907 -1867 -970 273 1166 1776 1672 926 -141 -1186 -1716 -2213 -1102 179 1058 1853 1673
3583 1673 1024 161 -849 -1571 -1644 -1243 -111 981 1727 1845 1255 338 -905 -1788 -1737 -1443 -221 736 1530
3602 1530 1801 1331 402 -806 -1560 -1607 -1322 -316 568 1375 1992 1418 538 -502 -1393 -2047 -1354 -373 515
3621 515 1424 1994 1610 704 -457 -1195 -1944 -1468 -690 265 1277 1751 1667 754 -326 -1039 -1727 -1434 -698
3640 -698 169 1039 1622 1478 893 -82 -1320 -1375 -1606 -1052 231 1077 1598 1496 844 47 -1216 -1680 -1540
3659 -1540 -1112 178 786 1380 1678 1137 106 -807 -1547 -1410 -954 -175 1007 1523 1350 1003 82 -616 -1338
3678 -1338 -1512 -1173 -219 520 1316 1652 1149 538 -372 -1438 -1554 -1377 -440 527 1365 1482 1312 573 -479
3697 -479 -1339 -1580 -1108 -271 153 894 1429 1405 716 -434 -882 -1642 -1347 -747 143 1118 1564 803 732 -35
3717 -35 -991 -1205 -1531 -633 162 925 1339 1294 532 -58 -1003 -1413 -1271 -873 -240 624 1253 1188 866 138 -856
3738 -856 -1315 -1370 -885 -110 534 1279 1262 873 189 -628 -1274 -1210 -1006 -184 743 1225 1336 937 353 -569 -1166
3759 -1166 -1361 -1053 -451 535 1052 1244 949 291 -370 -1133 -1014 -1033 -486 339 1131 1283 1109 366 -130 -969
3779 -969 -1287 -1124 -231 186 808 1267 1012 663 -218 -815 -1157 -1023 -551 456 666 1282 970 592 -198 -947
3799 -947 -1245 -1185 -857 139 533 1013 1113 440 -67 -783 -1268 -1250 -731 -13 937 1131 1156 879 -211 -766 -867
3820 -867 -1242 -865 -99 793 998 992 734 98 -471 -1313 -1192 -717 -216 730 1064 972 971 496 -778 -920 -1026
3841 -1026 -815 -202 252 911 1014 936 378 -260 -1196 -1103 -975 -350 699 1017 1070 1023 306 -261 -854 -1034 -976
3862 -976 -520 264 600 1111 884 625 -148 -980 -1118 -819 -722 188 639 1101 847 567 35 -618 -1100 -1102 -649
3883 -649 -45 722 1167 996 544 75 -498 -1099 -936 -587 8 604 1013 1090 537 115 -489 -900 -998 -682 -201
3904 -201 607 688 1061 873 -5 -448 -787 -1243 -719 56 587 753 1096 805 499 -299 -924 -1133 -790 -323
3924 -323 388 755 1073 572 307 -331 -773 -723 -831 -174 320 857 893 639 74 -233 -866 -1110 -908 -389 328
3945 328 831 841 924 423 -264 -705 -808 -939 -471 105 544 1072 876 381 -64 -594 -959 -970 -481 50 480
3966 480 798 967 350 -63 -593 -832 -909 -552 38 526 704 714 305 60 -436 -760 -863 -551 -50 570 655
3987 655 830 554 101 -586 -959 -924 -457 -178 332 870 854 499 -75 -381 -871 -1291 -667 -162 475 652 711
4008 711 804 9 -541 -789 -973 -714 -251 386 592 1000 603 144 -324 -740 -824 -773 -246 53 601 744 726
4029 726 193 -80 -668 -923 -663 -224 236 855 958 711 252 -165 -295 -947 -648 -397 107 707 761 752 498
4050 498 -16 -753 -976 -1006 -204 73 675 928 1139 629 -158 -358 -820 -873 -598 16 490 887 839 586 158
4071 158 -684 -508 -737 -496 -3 360 825 704 471 58 -326 -794 -794 -595 -294 381 751 762 488 386 -214
4092 -214 -665 -759 -538 -142 485 739 857 752 399 -257 -645 -878 -704 -237 158 691 1015 439 253 -81
4112 -81 -560 -867 -857 -334 83 711 877 812 339 -194 -532 -778 -882 -466 -122 695 963 772 533 -231 -684
4133 -684 -744 -803 -382 -5 448 746 826 669 94 -652 -604 -513 -495 -39 501 771 641 594 99 -465 -846 -793 -528
4156 -528 -130 383 716 896 700 28 -418 -758 -820 -687 -295 352 980 691 795 70 -344 -545 -835 -567
4176 -567 -359 81 817 755 578 251 -40 -755 -668 -741 -146 153 670 733 650 199 -395 -491 -1023 -813 -224 389
4198 389 559 916 547 383 -57 -699 -772 -683 -410 -36 626 723 865 393 -221 -581 -664 -668 -370 106 588 713
4220 713 779 604 55 -561 -689 -744 -496 78 596 823 783 707 69 -436 -559 -769 -478 -106 282 1077 908
4241 908 701 104 -465 -799 -751 -588 -136 228 788 798 745 242 -555 -813 -913 -703 -300 215 649 922 645
4262 645 236 -319 -722 -927 -523 -316 143 718 760 773 316 -329 -584 -782 -698 -320 145 578 803 791 181
4283 181 -270 -685 -710 -697 -331 67 669 782 749 389 -35 -545 -735 -940 -570 -143 287 620 803 331 -49
4304 -49 -443 -790 -731 -464 155 641 893 579 620 20 -314 -620 -986 -224 44 356 970 744 603 107 -475
4325 -475 -859 -1033 -604 -301 425 828 1046 586 60 -155 -764 -655 -647 -252 332 601 910 819 194 -386 -652
4346 -652 -932 -718 -305 385 575 670 882 140 -126 -746 -958 -741 -273 198 969 1298 730 560 -293 -577
4366 -577 -777 -769 -395 177 589 896 896 381 97 -663 -788 -766 -469 -39 602 847 751 368 108 -380 -761 -651
4388 -651 -579 -369 576 812 849 764 16 -519 -663 -678 -592 -70 487 710 995 684 147 -463 -781 -848 -666 -151
4410 -151 328 757 790 698 316 -282 -904 -729 -451 -340 399 842 942 771 478 -222 -716 -623 -533 -658 262
4431 262 666 817 809 506 -204 -683 -970 -916 -315 250 592 1059 779 509 -294 -699 -809 -770 -541 -99 598
4452 598 1022 816 407 -37 -654 -973 -945 -407 88 462 782 840 467 47 -496 -750 -1021 -390 13 612 833
4473 833 942 800 124 -377 -874 -968 -631 -93 254 681 1012 697 319 -485 -806 -1246 -600 -108 277 706
4493 706 998 770 170 -233 -809 -862 -937 -276 251 947 896 797 340 -490 -841 -1009 -960 -253 110 741 871 956
4515 956 399 -2 -691 -829 -826 -415 235 754 1049 636 688 16 -889 -907 -892 -478 -210 472 803 730 557 -57
4537 -57 -742 -815 -900 -636 -73 433 845 850 543 90 -515 -732 -1199 -871 -56 563 934 990 468 -58 -402 -1008
4559 -1008 -1048 -587 -133 425 985 970 584 179 -539 -996 -1107 -716 -258 59 772 921 704 294 -197 -746
4579 -746 -1012 -519 -133 354 802 976 667 342 -185 -593 -974 -848 -425 74 662 972 586 453 -215 -710
4599 -710 -836 -877 -563 142 657 1198 937 616 -310 -537 -895 -956 -542 88 634 963 1199 659 -85 -534 -840
4620 -840 -860 -482 -133 594 915 981 781 -32 -451 -752 -898 -731 -113 359 935 967 713 305 -390 -624 -804
4641 -804 -852 -252 449 755 1233 755 318 -348 -892 -988 -797 -291 8 520 940 720 394 -187 -600 -881 -876
4662 -876 -301 353 635 975 816 470 -216 -760 -1086 -924 -675 62 606 1098 758 440 -266 -627 -834 -798
4682 -798 -546 -4 613 999 1009 426 -1 -530 -922 -982 -571 -37 537 940 930 377 163 -589 -843 -771 -569
4703 -569 0 374 757 1110 884 130 -642 -1099 -1046 -759 -259 486 800 1017 628 325 -652 -900 -994 -645 -106
4724 -106 470 668 848 839 267 -360 -958 -966 -817 -305 435 797 1073 935 283 -238 -812 -1137 -741 -465 95
4745 95 915 1068 836 492 -25 -577 -897 -806 -539 11 544 989 1102 463 -29 -612 -900 -1067 -526 -37 781
4766 781 948 821 479 -8 -512 -911 -1000 -595 -209 580 745 760 718 23 -478 -943 -838 -679 -84 289 824
4787 824 953 795 21 -482 -647 -1095 -1033 -368 380 918 846 806 409 -518 -919 -785 -724 -333 283 907 718
4808 718 710 302 -195 -622 -960 -791 -433 303 865 873 914 484 -251 -759 -804 -795 -548 4 754 995 1066 475 -162
4831 -162 -666 -963 -740 -462 147 572 1032 817 455 11 -305 -1139 -891 -414 -34 494 885 1001 549 254
4851 254 -577 -982 -730 -389 -187 411 815 1039 616 76 -564 -963 -841 -738 -178 626 932 1082 797 194
4871 194 -63 -822 -995 -814 -399 447 823 886 647 258 -347 -989 -963 -899 -416 177 674 963 814 352 -288
4892 -288 -698 -952 -787 -612 -46 807 783 862 379 -76 -615 -994 -644 -372 -60 607 951 1076 401 57 -577
4913 -577 -766 -718 -680 209 583 889 841 693 -118 -522 -617 -875 -468 114 482 916 806 714 245 -370 -625 -1065
4935 -1065 -566 -214 538 690 717 432 286 -246 -932 -996 -726 -211 367 783 863 665 296 -343 -635 -896 -736
4956 -736 -303 -53 647 937 878 259 -167 -639 -828 -887 -389 113 643 847 842 466 -255 -813 -977 -700 -396
4977 -396 121 617 624 867 450 -107 -552 -967 -916 -514 178 463 778 844 350 35 -473 -760 -836 -533 -92 472
4999 472 801 1007 591 7 -346 -791 -955 -663 11 521 663 802 701 103 -339 -729 -806 -730 -58 266 682
5020 682 894 776 63 -326 -625 -841 -734 -214 216 604 998 798 278 -195 -667 -680 -609 -283 240 736 877
5041 877 742 161 -185 -787 -869 -806 -394 228 556 922 730 508 -50 -548 -872 -708 -362 78 638 827 803
5062 803 618 -148 -583 -787 -643 -686 33 662 494 824 514 87 -513 -850 -732 -634 -34 365 881 691 554
5083 554 49 -386 -806 -854 -564 -71 461 604 825 676 386 -183 -753 -885 -734 -191 257 464 679 614 300
5104 300 -296 -594 -782 -854 -456 326 594 814 432 297 -117 -530 -738 -624 -448 162 628 813 636 250
5124 250 84 -638 -761 -827 -336 64 513 834 858 314 -112 -315 -847 -778 -349 247 418 805 802 368 -14 -601
5146 -601 -697 -547 -441 -71 582 666 780 433 179 -303 -858 -895 -690 -127 551 683 755 470 142 -491 -653
5167 -653 -797 -423 43 281 496 835 414 121 -152 -560 -651 -660 -218 110 585 597 644 345 -93 -450 -782 -701
5189 -701 -159 262 696 726 630 264 -228 -365 -647 -709 -407 123 611 782 575 501 -79 -328 -710 -578 -243
5210 -243 47 195 750 594 316 -147 -353 -570 -531 -432 5 424 639 619 456 151 -425 -767 -623 -469 83
5231 83 309 665 579 528 246 -493 -422 -541 -453 -71 133 604 685 397 69 -232 -558 -752 -468 -13 60 600
5253 600 352 528 314 -175 -558 -595 -541 -364 -52 439 581 395 330 -152 -407 -496 -650 -480 109 580 431
5274 431 605 259 -32 -442 -519 -490 -287 280 379 685 576 325 -41 -301 -788 -554 -292 55 185 726 713
5295 713 330 119 -385 -590 -656 -355 80 228 534 516 245 -14 -377 -597 -453 -419 -88 272 501 727 390
5316 390 112 -222 -481 -697 -473 -174 354 311 618 451 91 -224 -500 -619 -453 8 65 382 629 442 223
5337 223 -90 -488 -553 -562 -425 161 425 697 484 253 57 -389 -456 -406 -176 -58 370 512 305 320 -226 -446
5359 -446 -590 -416 -208 -8 382 585 475 275 -45 -260 -647 -564 -416 -336 148 565 383 355 -8 -215 -608
5380 -608 -508 -241 18 355 478 488 462 11 -202 -564 -600 -338 -441 317 377 413 489 -114 -291 -322 -569 -355
5402 -355 -252 238 575 503 496 155 -199 -435 -398 -314 -120 44 444 580 650 155 -239 -261 -465 -466 -336 242 180
5425 180 408 383 251 122 -432 -461 -484 -290 11 204 413 319 114 -22 -178 -293 -551 -186 -117 186 286 525
5447 525 266 77 -296 -613 -407 -250 -128 366 569 471 236 85 -326 -423 -684 -463 -100 -66 126 474 295
5468 295 52 -212 -395 -471 -74 -173 172 434 154 350 185 -63 -297 -354 -293 -237 273 305 290 239 218 72 -234
5491 -234 -292 -344 -18 -29 346 459 254 183 -105 -381 -321 -392 49 125 232 292 222 426 -102 -263 -409 -313 -248 -150
5515 -150 27 199 385 229 -44 -91 -478 -138 -209 3 -21 319 256 251 -5 -230 -296 -281 -274 19 240 228 415 316
5539 316 -8 -295 -297 -274 -385 -82 -58 123 258 114 134 -78 -294 -438 -329 -186 299 453 333 316 179 -11
5561 -11 -231 -546 -62 -224 -30 140 301 181 6 -173 -364 -271 -328 -254 134 90 324 340 232 204 -195 -274 -277
5584 -277 -90 151 58 238 77 134 39 -206 -342 -545 -210 -67 176 125 498 337 63 -334 -97 -150 -195 51
5606 51 -57 303 222 258 105 69 -335 -335 -240 48 269 327 311 231 -23 -152 -182 -202 -258 -191 -92 235 204 183 182 -139
5632 -139 -425 -442 -290 30 156 -88 305 548 136 -20 -156 -204 -247 -306 -26 161 283 115 322 108 -126
5653 -126 -184 -339 -164 55 241 108 64 218 -69 -48 -183 -259 -54 43 105 -10 242 96 100 -275 -177 -295 -74
5676 -74 -149 -35 218 118 198 25 -199 -450 -262 -167 290 44 152 306 4 49 -168 -453 -6 -111 -73 84
5698 84 65 265 282 100 14 -25 -348 -318 -249 138 129 255 7 246 -65 -291 -76 -105 297 -44 109 316 77
5721 77 -37 72 -255 -304 84 -33 -41 234 221 59 28 -70 -97 -313 -86 -179 -176 53 98 14 25 -83 -167 -137 -286
5746 -286 -196 49 127 384 71 12 -113 2 -130 -239 -149 47 192 91 221 227 0 -80 -47 -282 -239 -58 -18
5769 -18 292 230 145 -44 -119 -57 -118 -142 -22 -29 137 181 33 -184 -57 -44 -182 -190 88 188 239 196 -18 -55 -111 -61
5795 -61 -76 22 -192 -13 243 137 179 -50 -219 -168 -77 -160 -11 -41 262 -37 -4 1 -63 -158 -87 -8 -3 -101 -174 160
5821 160 187 160 -52 -270 -307 -227 -191 62 42 140 112 80 72 -89 104 -108 -16 81 114 -50 285 248 35 -176 -68
5846 -68 65 -115 111 323 109 -132 78 -120 59 -91 -45 -208 -45 27 6 -71 -277 -172 -24 -204 -70 46
5868 46 88 0 75 -202 -82 -4 -91 164 -68 -161 114 221 56 -127 5 36 -269 -250 85 -127 -115 113 -289
5891 -289 154 -107 -124 50 -20 -1 102 -32 -55 79 64 -291 -120 -178 5 -302 56 -215 -12 40 13 -30 -258
5914 -258 65 -16 99 -87 -24 -73 28 114 85 91 -61 32 -84 72 100 -108 223 185 -208 -78 77 172 -84 -77
5938 -77 117 -13 -53 -2 18 -173 218 -4 -124 -77 9 143 197 156 91 -176 24 -23 -8 156 -26 96 220 122
5962 122 -82 66 -165 -163 27 -59 84 185 20 101 12 -37 -69 121 -29 -156 137 6 252 -60 95 -12
5984 -12 -182 -82 -147 -77 204 83 87 122 -89 -217 -25 -208 -121 -129 103 272 41 32 165 33 -92 -132 39 49
6008 49 315 61 288 90 78 -71 -121 -299 -68 171 159 -102 232 87 -111 -79 -58 -47 -10 -142 -58 -82 200
6031 200 304 -18 72 -111 154 -220 -24 -99 12 52 182 -212 40 -133 -218 -1 -99 -38 134 69 147 -84 19
6054 19 -128 -69 81 -188 90 -10 37 -15 43 49 -64 -280 65 45 -251 -8 267 74 15 -98 -145 -48 -113 -86
6078 -86 -188 22 -231 193 -144 113 19 -203 -182 -2 -37 97 174 182 32 311 -74 -33 -225 -190 -9 183 170
6101 170 57 249 147 9 -40 -16 -252 71 -141 44 57 25 33 -216 -80 5 -257 -22 124 21 36 139 87
6124 87 -27 -30 -231 -191 -8 -74 198 156 69 152 -104 -32 -36 -125 -114 52 10 -214 84 -63 279 52 -256 -99 -65
6149 -65 146 46 102 412 110 -85 47 -357 57 -164 61 -13 167 110 108 9 -153 -71 -263 -63 -3 50 398
6172 398 133 -33 73 -110 18 44 69 -68 69 86 311 48 168 -188 -132 -85 -183 -158 -34 115 285 67
6194 67 5 -237 -194 -109 -74 -142 213 119 110 164 175 106 78 -106 -385 -81 -82 -9 198 212 171 -26 -134 -208 -232 -106 32
6221 32 292 143 130 95 22 -280 -213 -66 -41 113 168 70 479 192 204 -84 -17 -282 -97 8 167 332 57
6244 57 181 14 72 -135 7 -185 -97 -106 165 53 213 177 165 -252 -289 -216 36 156 40 83 143 86 -27 -66
6268 -66 -234 -219 65 36 306 154 -14 -41 -143 60 -113 -374 -337 -219 -20 290 227 81 214 -70 -178 -129
6290 -129 -199 -248 -105 147 315 52 144 -42 -366 -39 -238 56 -16 364 403 212 17 -25 -183 -199 -79 -229
6312 -229 55 106 146 50 -80 -218 -256 -336 10 -125 -201 283 197 306 197 -17 -126 -49 -9 -66 161 52 108 82
6336 82 94 249 -117 -213 -304 -259 -64 -86 238 215 143 117 -230 -66 -240 -85 -18 81 -39 28 209 24 -46 -12 -245
6361 -245 -292 -203 144 121 82 113 14 -31 -58 -206 -332 -75 -63 189 282 101 287 -135 -315 -213 -204 -111 246 59
6385 59 400 163 127 -48 -368 27 -135 83 110 31 146 271 109 64 115 -328 -334 -186 -51 85 309 178 -5
6408 -5 -20 53 -289 -167 -175 -63 209 179 338 145 192 -243 -57 -414 -173 -8 63 254 158 216 -126 -144 -117 -104 -286
6433 -286 -241 -102 246 124 262 -25 -28 -135 -268 -52 -112 -39 56 413 -3 189 -40 -256 -331 -329 -36 1 129
6456 129 201 157 41 -109 -207 -286 -375 -124 -41 387 82 254 352 250 -183 -225 -366 -6 -35 169 158 158 124 24
6480 24 -107 -113 -275 -261 49 101 84 142 102 8 -130 -287 -257 -78 5 -103 398 282 107 137 -44 -221 -383 -237
6504 -237 -83 -64 184 163 209 144 -141 -151 -53 -91 -141 205 358 111 153 239 -63 -57 -154 -272 -165 -93 -66 69 275
6529 275 61 -180 -246 -151 -104 -39 -54 13 338 226 121 126 -128 -175 -255 -239 92 -83 187 436 23 38 -178 73
6553 73 -320 -11 -175 24 289 316 110 -1 9 3 -232 -202 -236 37 123 56 204 -27 87 132 -108 -191 -54 94
6577 94 103 276 143 -74 162 -150 -275 -131 -253 69 260 376 214 -43 37 -121 -1 -154 -263 -61 165
6598 165 390 43 180 291 -322 -218 -276 -282 -37 227 156 239 382 5 -251 -78 -300 -239 -167 -37 285 321 198
6621 198 54 -38 -330 -240 -230 -148 80 315 38 411 95 94 -33 -265 -332 32 169 307 515 410 120 -132
6643 -132 -329 -516 -179 22 7 108 322 236 166 -247 -264 -108 -206 -323 150 133 521 285 157 76 -121 -188 -83
6666 -83 -250 80 360 50 150 206 209 -113 -259 -423 -26 50 -43 215 203 219 -18 93 -172 -291 -201 133 75
6689 75 212 197 304 300 135 -273 -293 -331 -194 142 375 285 143 259 77 -283 -280 -347 94 56 285 461 223 20
6713 20 -52 -235 -241 -33 -123 109 150 231 342 83 61 44 -231 -169 -149 -316 -35 422 300 11 39 -214 -218 -69 -99
6738 -99 -171 158 187 412 253 120 -143 -148 -75 -338 -10 28 200 346 378 136 -163 -372 -296 -263 -142 93 132 304
6762 304 287 234 13 -170 -360 -398 -217 -71 213 378 217 484 -147 -160 -355 -236 -260 -108 115 153 331 220
6784 220 -12 -110 -165 -105 -147 -22 128 15 417 266 -40 96 -109 -223 -257 6 -54 273 261 171 193 -109 -161
6807 -161 -407 -240 -286 204 316 231 452 130 88 -169 -130 -164 -161 -16 246 195 371 81 -68 -308 -528 -133 -18
6830 -18 -107 263 404 180 245 -59 -355 -160 -326 -93 4 219 352 367 157 -45 -224 -275 -337 -538 -33 190
6852 190 86 314 189 173 -104 -369 -431 -156 117 304 120 173 127 222 -220 -298 -397 -155 27 198 196 437 259
6875 259 21 113 -338 -455 -308 -85 -10 341 351 198 105 -193 -503 -416 -276 -197 66 192 209 101 -75 91
6897 91 -156 -490 -44 -331 44 170 433 425 -58 64 -347 -246 -403 -137 161 36 341 255 212 -113 -111 -367
6919 -367 -256 -229 -41 235 255 360 216 63 -188 -448 -114 -312 -212 277 347 471 360 57 -315 -368 -359 -265
6941 -265 -68 72 200 391 238 123 -279 -245 -346 -87 -150 172 133 195 395 100 -95 -159 -273 -237 -281 -8
6963 -8 167 372 90 73 -5 -398 -220 -316 -355 65 158 330 317 183 -90 -131 -184 -325 -58 39 222 236 224 130 82
6988 82 -216 -215 -255 -151 90 298 280 195 300 31 -87 -157 -297 -460 -180 31 386 406 144 213 -36 -427 -434 -285
7012 -285 -45 -40 301 329 324 250 65 -177 -329 -275 -136 -42 376 434 443 210 -12 -274 -445 -279 -77 43 163 348
7036 348 347 307 24 -255 -126 -417 -262 250 321 318 554 125 156 -150 -295 -261 -145 -107 46 417 387 199 -99
7059 -99 -163 -300 -322 -275 104 55 310 505 223 -3 -112 -189 -337 -233 -206 292 152 454 361 -59 26 -142 -342
7082 -342 -307 -87 -19 334 508 136 0 11 -235 -443 -447 48 -61 140 280 592 282 30 -116 -395 -91 -324
7104 -324 272 285 385 312 189 -70 -422 -197 -309 -130 -84 96 206 480 291 150 -262 -291 -86 -247 -79
7125 -79 203 340 414 47 82 -121 -271 -437 -352 -116 116 419 306 364 339 -147 -188 -212 -312 -168 223 334 475
7148 475 405 290 -147 -337 -450 -373 -152 33 204 430 417 310 38 -391 -522 -619 -188 135 201 260 266 173 -1
7171 -1 -166 -475 -237 -326 -80 273 404 269 298 159 -158 -397 -339 -365 -181 140 537 570 374 208 -95 -481
7193 -481 -359 -414 -36 166 170 162 337 -14 -181 -355 -306 -401 -62 -15 85 508 444 -101 -33 -245 -338 -169 -221 79
7217 79 210 264 447 158 71 -239 -478 -503 -344 62 308 537 225 169 25 -196 -292 -211 -181 1 260 342 525
7240 525 153 107 -70 -320 -412 -360 -150 63 460 387 224 84 -219 -438 -313 -326 -197 168 324 537 384 166
7262 166 -129 -510 -334 -303 238 87 333 467 168 71 -47 -138 -311 -434 -244 36 0 178 310 5 -149
7283 -149 -319 -556 -178 -90 -19 418 150 319 282 -37 -430 -378 -587 -474 26 423 473 352 163 25 -21 -436
7305 -436 -344 -268 205 141 403 412 340 13 -281 -227 -361 -269 -153 99 487 472 418 94 -80 -350 -433 -275 -177 -21
7329 -21 469 281 250 75 120 -155 -485 -343 -70 302 71 513 285 208 -172 -322 -328 -435 29 228 453 305
7351 305 466 271 -20 -240 -205 -493 -235 -29 281 374 271 89 30 -233 -542 -472 -255 -12 436 312 318 493
7373 493 72 -56 -560 -548 -84 74 205 222 427 319 -4 -174 -313 -358 -256 71 171 397 547 356 54
7394 54 -240 -343 -406 -107 -277 101 360 345 356 83 -166 -136 -576 -500 -232 -18 192 306 331 210 -181 -142 -472
7417 -472 -353 -135 -72 428 467 555 156 168 -307 -379 -405 -185 57 260 348 168 429 -36 -10 -251 -394 -301 -93
7440 -93 242 509 276 530 68 -284 -425 -585 -285 17 141 387 352 431 101 -193 -496 -490 -207 -377 148 491
7462 491 469 302 119 -183 -512 -504 -360 -103 334 252 386 353 170 -183 -504 -401 -384 -170 105 472 457 375 249
7485 249 118 -306 -409 -407 -209 86 493 372 515 78 117 -151 -418 -356 -43 -162 160 467 370 232 87 -339
7507 -339 -342 -759 -374 184 87 335 474 313 0 -174 -382 -353 -126 -104 118 364 715 213 126 -107 -439 -334
7529 -334 -413 -168 -132 293 316 422 287 -37 -223 -401 -444 -250 95 393 419 446 86 -292 -296 -604 -227 -269 13
7552 13 41 465 376 472 -119 -395 -378 -526 -270 -148 165 346 568 454 211 -93 -479 -408 -277 214 202 585
7574 585 185 328 102 -225 -379 -525 -274 -66 129 313 590 315 66 -81 -238 -591 -286 -129 113 369
7594 369 487 468 108 -25 -367 -395 -498 -81 92 341 540 298 63 121 -276 -306 -262 -108 141 290 271 499
7616 499 445 -90 -332 -235 -441 -268 258 298 470 572 499 -28 -434 -434 -114 -405 -9 362 400 491 191 -87 -251
7639 -251 -439 -409 -466 -35 252 274 390 309 5 -265 -408 -375 -59 9 91 507 494 131 144 -183 -235 -379 -365 48
7663 48 6 433 681 499 169 -166 -367 -524 -528 -75 94 284 432 266 24 -115 -429 -349 -455 -174 24 211
7685 211 424 437 125 -116 -424 -353 -675 -272 22 295 644 559 146 4 -208 -322 -520 -365 -229 125 149
7706 149 468 382 4 -519 -497 -604 -288 -98 196 553 463 228 175 -160 -392 -439 -375 -92 178 489 299 449
7728 449 144 -137 -317 -392 -488 -106 76 286 390 368 130 -20 -227 -396 -495 -208 52 538 584 426 99 -149
7750 -149 -552 -287 -645 -214 6 255 455 457 545 198 -330 -331 -224 -388 13 177 496 357 394 -171 -334 -377
7772 -377 -380 -465 -253 140 531 468 326 238 -266 -387 -456 -272 -104 177 542 226 496 28 -379 -343 -710 -532
7794 -532 38 221 356 548 445 172 -338 -102 -296 -331 -79 216 353 493 160 94 -266 -421 -300 -459 -143
7815 -143 257 558 469 585 123 108 -361 -524 -235 -187 -177 433 612 419 278 -76 -128 -627 -517 -205 -19 283
7837 283 468 457 286 -20 -160 -359 -378 -165 46 162 475 399 444 81 -97 -467 -569 -401 29 111 290 391
7859 391 130 132 -47 -391 -452 -322 -203 331 188 425 268 305 -23 -567 -414 -542 -112 41 403 487 444 218
7881 218 88 -444 -600 -358 -101 -132 317 474 422 209 19 -446 -511 -427 -448 58 151 586 521 141 192 -269 -515
7904 -515 -464 -292 -14 240 486 558 376 -49 -318 -571 -354 -264 -34 296 295 427 259 64 -71 -247 -472 -424
7926 -424 39 243 312 352 259 125 -158 -195 -367 -191 -224 -58 414 371 327 100 21 -330 -337 -455 -398 81 387 452
7950 452 370 140 -125 -143 -493 -544 -144 -68 309 354 403 175 -342 -439 -307 -319 -242 -36 282 472 355 210 68
7973 68 -169 -442 -290 -121 -74 271 205 412 264 -121 -177 -493 -532 -338 201 116 331 441 389 80 -259 -430
7995 -430 -561 -543 -209 132 335 463 316 70 -26 -285 -534 -369 -35 90 215 258 192 259 -122 -311 -225 -369
8017 -369 -234 109 348 342 591 150 -168 -427 -473 -334 -299 4 291 436 311 256 -134 -147 -609 -276 -171 64
8039 64 260 664 412 240 -131 -198 -349 -406 -98 -196 170 260 449 332 67 -353 -428 -352 -155 -191 143 394 306
8062 306 461 75 -11 -307 -695 -281 -206 165 383 469 240 97 -309 -364 -413 -267 -142 -15 467 560 368 167
8084 167 -147 -369 -334 -295 -264 50 318 512 218 228 -125 -347 -550 -444 -291 -87 132 356 299 380 -66 -336
8106 -336 -438 -450 -273 103 279 250 527 123 139 -132 -434 -357 -246 -324 249 417 483 156 -188 -268 -606 -529 -403
8129 -403 84 79 428 398 490 69 -273 -174 -367 -226 -180 230 457 480 373 157 -179 -200 -252 -334 -222 178 208 446
8153 446 261 214 -156 -228 -338 -304 -298 230 322 517 436 169 -145 -336 -533 -350 -196 -5 87 364 426 126 159
8176 159 -249 -347 -352 -188 1 236 552 66 309 77 135 -340 -365 -350 -197
8191a97
##END NTUPLES=NMR FID
##END=
