##TITLE=1H_Pr AmC62
 200.13Hz, D2O.
 8 sc
 
19.3.2026
##JCAMPDX= 6.0         $$ Bruker NMR JCAMP-DX V2.0
##DATA TYPE= NMR FID
##DATA CLASS= NTUPLES
##ORIGIN= UXNMR, Bruker Analytische Messtechnik GmbH
##OWNER= pz
$$ XWIN-NMR		Version 3.5
$$ Thu Mar 19 13:25:49 2026 Russian Standard Time (UT+4h)  she@DPX200
##.OBSERVE FREQUENCY= 200.1313
##.OBSERVE NUCLEUS= ^1H
##.DELAY= (6, 6)
##.ACQUISITION MODE= SIMULTANEOUS
##.ACQUISITION SCHEME= undefined
##.AVERAGES= 8
##.DIGITISER RES= 18
##SPECTROMETER/DATA SYSTEM= spect
##.PULSE SEQUENCE= zg30
##.SOLVENT NAME= D2O
##.SHIFT REFERENCE= (INTERNAL, D2O, 0, 14.3821)
##AUDIT TRAIL= $$ (NUMBER, WHEN, WHO, WHERE, WHAT)
$$ ##TITLE= Audit trail, XWIN-NMR		Version 3.5
$$ ##JCAMPDX= 5.01
$$ ##ORIGIN= Bruker BioSpin GmbH
$$ ##OWNER= she
$$ F:/spectra/data/she/nmr/H-C/1/audita.txt
$$ ##AUDIT TRAIL=  $$ (NUMBER, WHEN, WHO, WHERE, WHAT)
(   1,<2026-03-19 13:24:11.17 +0400>,<she>,<DPX200>,
      <created by zg, POWCHK disabled, PULCHK disabled
       configuration hash MD5:
       00 E9 B6 7A A2 85 ED C7 34 08 36 98 17 FE 4E 26
       data hash MD5: 16K
       96 A4 8D D0 67 BE AB A3 1D 8A 55 A5 70 30 A3 DE>)
$$ ##END=
$$ 
$$ hash MD5
$$ 20 EB A8 5F 46 00 9C E4 6C 7F 35 68 B5 82 AB 16
##$RELAX= 
##$RELAX= 
##$RELAX= 
##$RELAX= 
##$RELAX= 
##$RELAX= 
$$ Bruker specific parameters
$$ --------------------------
##$DU= <F:/spectra>
##$EXPNO= 1
##$NAME= <H-C>
##$PROCNO= 1
##$TYPE= <nmr>
##$USER= <she>
##$AMP= (0..31)
100 100 100 100 100 100 100 100 100 100 100 100 100 100 100 100 100 100 
100 100 100 100 100 100 100 100 100 100 100 100 100 100 
##$AQSEQ= 0
##$AQ_mod= 1
##$AUNM= <au_zg>
##$AUTOPOS= <>
##$BF1= 200.13
##$BF2= 200.13
##$BF3= 200.13
##$BF4= 200.13
##$BF5= 200.13
##$BF6= 200.13
##$BF7= 200.13
##$BF8= 200.13
##$BYTORDA= 1
##$CFDGTYP= 0
##$CFRGTYP= 5
##$CHEMSTR= <none>
##$CNST= (0..31)
1 1 145 1 1 1 1 1 1 1 1 1 1 1 1 1 1 1 1 1 1 1 1 1 1 1 1 1 1 1 1 1 
##$CPDPRG= <>
##$CPDPRG1= <>
##$CPDPRG2= <>
##$CPDPRG3= <>
##$CPDPRG4= <mlev>
##$CPDPRG5= <mlev>
##$CPDPRG6= <mlev>
##$CPDPRG7= <mlev>
##$CPDPRG8= <mlev>
##$CPDPRGB= <>
##$CPDPRGT= <>
##$D= (0..31)
0 0.7 0 0 0 0 0 0 0 0 0 0.03 0 0 0 0 0 0 0 0 0 0 0 0 0 0 0 0 0 0 0 0 
##$DATE= 1773912250
##$DBL= (0..7)
120 120 120 120 120 120 120 120 
##$DBP= (0..7)
150 150 150 150 150 150 150 150 
##$DBP07= 0
##$DBPNAM0= <>
##$DBPNAM1= <>
##$DBPNAM2= <>
##$DBPNAM3= <>
##$DBPNAM4= <>
##$DBPNAM5= <>
##$DBPNAM6= <>
##$DBPNAM7= <>
##$DBPOAL= (0..7)
0.5 0.5 0.5 0.5 0.5 0.5 0.5 0.5 
##$DBPOFFS= (0..7)
0 0 0 0 0 0 0 0 
##$DE= 6
##$DECBNUC= <off>
##$DECIM= 32
##$DECNUC= <off>
##$DECSTAT= 4
##$DIGMOD= 1
##$DIGTYP= 9
##$DL= (0..7)
0 120 120 120 120 120 120 120 
##$DP= (0..7)
150 150 150 150 150 150 150 150 
##$DP07= 0
##$DPNAME0= <>
##$DPNAME1= <>
##$DPNAME2= <>
##$DPNAME3= <>
##$DPNAME4= <>
##$DPNAME5= <>
##$DPNAME6= <>
##$DPNAME7= <>
##$DPOAL= (0..7)
0.5 0.5 0.5 0.5 0.5 0.5 0.5 0.5 
##$DPOFFS= (0..7)
0 0 0 0 0 0 0 0 
##$DQDMODE= 0
##$DR= 18
##$DS= 0
##$DSLIST= <SSSSSSSSSSSSSSS>
##$DSPFIRM= 0
$$ [...]
##$SUBNAM0= <"">
##$SUBNAM1= <"">
##$SUBNAM2= <"">
##$SUBNAM3= <"">
##$SUBNAM4= <"">
##$SUBNAM5= <"">
##$SUBNAM6= <"">
##$SUBNAM7= <"">
##$SUBNAM8= <"">
##$SUBNAM9= <"">
##$SW= 18.0517328524113
##$SWIBOX= (0..15)
0 0 2 0 0 0 0 0 0 0 0 0 0 0 0 0 
##$SW_h= 3612.71676300578
##$TD= 16384
##$TD0= 1
##$TE= 0
##$TE2= 300
##$TE3= 300
##$TEG= 300
##$TL= (0..7)
0 120 120 120 120 120 120 120 
##$TP= (0..7)
150 150 150 150 150 150 150 150 
##$TP07= 0
##$TPNAME0= <>
##$TPNAME1= <>
##$TPNAME2= <>
##$TPNAME3= <>
##$TPNAME4= <>
##$TPNAME5= <>
##$TPNAME6= <>
##$TPNAME7= <>
##$TPOAL= (0..7)
0.5 0.5 0.5 0.5 0.5 0.5 0.5 0.5 
##$TPOFFS= (0..7)
0 0 0 0 0 0 0 0 
##$TUNHIN= 0
##$TUNHOUT= 0
##$TUNXOUT= 0
##$USERA1= <user>
##$USERA2= <user>
##$USERA3= <user>
##$USERA4= <user>
##$USERA5= <user>
##$V9= 5
##$VALIST= <valist>
##$VCLIST= <CCCCCCCCCCCCCCC>
##$VD= 0
##$VDLIST= <DDDDDDDDDDDDDDD>
##$VPLIST= <PPPPPPPPPPPPPPP>
##$VTLIST= <TTTTTTTTTTTTTTT>
##$WBST= 1024
##$WBSW= 4
##$XGAIN= (0..3)
0 0 0 0 
##$XL= 0
##$YL= 0
##$YMAX_a= 595091
##$YMIN_a= -693422
##$ZGOPTNS= <>
##$ZL1= 120
##$ZL2= 120
##$ZL3= 120
##$ZL4= 120
##$ABSF1= 10
##$ABSF2= 0
##$ABSG= 5
##$ABSL= 3
##$ALPHA= 0
##$AQORDER= 0
##$ASSFAC= 0
##$ASSFACI= 0
##$ASSFACX= 0
##$ASSWID= 0
##$AUNMP= <proc_1d>
##$AZFE= 0.1
##$AZFW= 0.1
##$BCFW= 1
##$BC_mod= 2
##$BYTORDP= 1
##$COROFFS= 0
##$CY= -3
##$DATMOD= 1
##$DC= 2
##$DFILT= <>
##$DTYPP= 0
##$F1P= 0
##$F2P= 0
##$FCOR= 0.5
##$FTSIZE= 0
##$FT_mod= 4
##$GAMMA= 1
##$GB= 0.15
##$INTBC= 1
##$INTSCL= 1
##$ISEN= 128
##$LB= 0.25
##$LEV0= 0
##$LPBIN= 0
##$MAXI= 10000
##$MC2= 0
##$MEAN= 0
##$ME_mod= 0
##$MI= 1.114404
##$NCOEF= 0
##$NC_proc= 0
##$NLEV= 6
##$NOISF1= 3.799351
##$NOISF2= 2.8
##$NSP= 1
##$NTH_PI= 0
##$NZP= 0
##$OFFSET= 14.38212
##$PC= 1
##$PHC0= -3703.985
##$PHC1= 5.792301
##$PH_mod= 1
##$PKNL= yes
##$PPARMOD= 0
##$PSCAL= 0
##$PSIGN= 0
##$REVERSE= no
##$SF= 200.129724274929
##$SI= 16384
##$SIGF1= 3
##$SIGF2= 2
##$SINO= 400
##$SIOLD= 16384
##$SREGLST= <1H.CDCl3>
##$SSB= 0
##$STSI= 0
##$STSR= 0
##$SW_p= 3205.1282051282
##$SYMM= 0
##$S_DEV= 0
##$TDeff= 0
##$TDoff= 0
##$TI= <>
##$TILT= no
##$TM1= 0
##$TM2= 0
##$TOPLEV= 0
##$USERP1= <user>
##$USERP2= <user>
##$USERP3= <user>
##$USERP4= <user>
##$USERP5= <user>
##$WDW= 1
##$XDIM= 8192
##$YMAX_p= 0
##$YMIN_p= 0
$$ End of Bruker specific parameters
$$ ---------------------------------
##NTUPLES= NMR FID
##VAR_NAME=  TIME,          FID/REAL,        FID/IMAG
##SYMBOL=    X,             R,               I
##VAR_TYPE=  INDEPENDENT,   DEPENDENT,       DEPENDENT
##VAR_FORM=  AFFN,          ASDF,            ASDF
##VAR_DIM=   8192,          8192,            8192
##UNITS=     SECONDS,       ARBITRARY UNITS, ARBITRARY UNITS
##FACTOR=    0.0002768,     1,               1
##FIRST=     0,             0,               0
##LAST=      2.2672688,     0,               0
##MIN=       0,             -693422,         0
##MAX=       2.2672688,     595091,          0
$$ Real data points
##PAGE= N=1
##DATA TABLE= (X++(R..R)), XYDATA
$$ plain form
0 0 0 0 0 0 0 0 0 0 0 0 0 0 0 -8 0 -8 8 -8 10 -9 16 -16 17 -24 25 -32 37 -40 49 -53 62 -71 78 -91 99 -113 125
37 125 -138 156 -171 193 -213 234 -261 286 -316 348 -382 424 -464 513 -564 621 -693 763 -848
56 -848 947 -1062 1202 -1363 1570 -1830 2169 -2643 3323 -4402 6312 -10377 22592 -136209
70 -136209 -688256 -556810 -324592 -319976 -45098 425255 536672 464483 424981 77677 -485681
81 -485681 -641265 -429847 -276873 -81255 305615 562617 534863 365754 55874 -349976
91 -349976 -555489 -485478 -323493 -90932 243790 506204 562075 413145 70859 -318993
101 -318993 -503361 -472663 -363604 -134190 223419 479146 509189 404480 161498 -225629
111 -225629 -511761 -506096 -340749 -147269 129609 437056 559014 418671 130574 -180909
$$ packed form
0@%%%%%%%%%%%%%qQqJ6j6J8j9K5l2L3m1M9n7O9p7Q9j02J15j33J49j69J90k12K38
37A25k63K94l27L64m06M47m95N47o02O64p30Q06q88R77j077J185j314J456j611
56h48J795k009K264k565K933l400L999m812N966p725J0714j6689L2969j58801
70a36209n52047J31446K32218M616K74878M70353J11417p2189l9502l47304n63358
81d85681j55584K11418J52974J95618L86870K57002k7754j69109l09880m05850
91c49976k05513P0011J61985K32561L34722K62414N5871j48930l42286l89852
101c18993j84368L0698J09059K29414L57609K55727L0043j04709k42982l87127
111b25629k86132N665J65347J93480K76878L07447J21958j40343k88097l11483
$$ plain form
121 -180909 -413002 -478380 -392702 -209281 84820 420791 566976 418912 141536 -122690
131 -122690 -361529 -485133 -403019 -208839 26307 342664 573058 461787 141976 -92339
141 -92339 -276103 -472620 -471332 -224226 42490 280841 509795 496899 189084 -82801 -222273
152 -222273 -412497 -515594 -293011 51824 267856 428252 495936 287056 -51904 -256174
162 -256174 -372959 -453061 -337014 -36487 242609 426480 480337 312684 13005 -224122
172 -224122 -378938 -451494 -334564 -67177 188343 388899 482233 343096 51830 -182931
182 -182931 -347581 -458494 -372791 -93054 172930 353376 456277 369762 97989 -153674
192 -153674 -316320 -436352 -404105 -146792 154497 340843 423481 375944 159955 -113066
$$ packed form
121a80909k32093o5378Q5678J83421K94101L35971J46185j48064k77376k64226
131a22690k38839j23604Q2114J94180K35146L16357K30394j11271l19811k34315
141i2339j83764j96517J288K47106K66716K38351K28954j2896l07815k71885j39472
152b22273j90224j03097K22583L44835K16032J60396O7684k08880l38960k04270
162b56174j16785q0102J16047L00527K79096J83871N3857j67653k99679k37127
172b24122j54816p2556J16930K67387K55520K00556R3334j39137k91266k34761
182a82931j64650j10913Q5703K79737K65984J80446J02901q6515k71773k51663
192a53674j62646j20032L2247K57313L01289J86346Q2638m7537k15989k73021
$$ plain form
202 -113066 -316960 -423406 -389884 -183936 94346 313659 421223 384934 194814 -67641
212 -67641 -294708 -419060 -392984 -208699 51974 281850 408569 389486 224743 -24241
222 -24241 -264736 -406801 -395333 -239834 5454 256893 404594 386744 240814 21963
232 21963 -225435 -397253 -397843 -257517 -40485 214561 397177 395226 253429 58058 -180546
243 -180546 -383014 -409642 -271200 -66578 170909 369980 402280 277339 88847 -145661
253 -145661 -360470 -410220 -288691 -98623 132625 348048 403969 292043 117249 -105970
263 -105970 -335616 -410771 -302133 -126759 88709 320284 411137 309089 134587 -70237
273 -70237 -298219 -407768 -323024 -148975 57141 284109 403030 330709 159952 -42245
$$ packed form
202a13066k03894j06446L3522K05948K78282K19313J07564l6289j90120k62455
212f7641k27067j24352K6076J84285K60673K29876J26719j9083j64743k48984
222b4241k40495j42065J1468J55499K45288K51439J47701j7850j45930k18851
232B1963k47398j71818n90J40326K17032K55046J82616j951j41797j95371k38604
243a80546k02468k6628J38442K04622K37487J99071L2300j24941j88492k34508
253a45661k14809m9750J21529J90068K31248K15423N5921j11926j74794k23219
263a05970k29646p5155J08638J75374K15468K31575R0853j02048j74502k04824
273g0237k27982j09549Q4744J74049K06116K26968J18921p2321j70757k02197
$$ plain form
283 -42245 -265955 -396223 -340477 -175661 29245 253946 387688 342459 187603 -10099
293 -10099 -235882 -383792 -351934 -198017 -293 221109 373339 355423 210250 15405
303 15405 -203630 -363540 -362301 -223818 -26266 190428 350489 363380 238179 40622 -177241
314 -177241 -338168 -363622 -252246 -55875 166248 328336 360889 262324 72124 -152095
324 -152095 -318263 -359142 -273239 -87885 139784 308911 354368 280372 104526 -123417 -299154
335 -299154 -353508 -289249 -118609 110560 288082 347379 295932 135691 -94757 -279136 -344606
346 -344606 -301025 -148689 80459 267357 337527 306740 166172 -64680 -259890 -333203 -307786
357 -307786 -179171 47017 248500 328383 310268 192980 -30415 -239585 -325340 -309622 -202457
$$ packed form
283d2245k23710j30268N5746J64816K04906K24701J33742m5229j54856j97702
293a0099k25783j47910L1858J53917J97724K21402J52230j7916j45173j94845
303A5405k19035j59910J239J38483J97552K16694J60061J2891j25201j97557k17863
314a77241j60927k5454J11376J96371K22123J62088L2553r8565j90200k24219
324a52095j66168m0879Q5903J85354K27669J69127M5457p3996j75846k27943j75737
335b99154n4354O4259J70640K29169J77522N9297n1447j60241k30448j84379o5470
346c44606M3581J52336K29148J86898P0170l0787j40568k30852j95210p3313K5417
357c07786J28615K26188K01483P9883j8115j17288k23395k09170q5755J5718J07165
$$ plain form
368 -202457 11754 226038 321893 312145 211740 4161 -212671 -316477 -313122 -221569 -21586
379 -21586 198995 312289 315340 229567 35624 -185291 -304518 -313624 -238230 -54423 170217
390 170217 301818 316029 242407 66772 -153964 -292511 -315928 -250338 -82417 138482 287702
401 287702 318738 252914 90319 -121472 -272420 -317184 -265122 -107731 109038 270618 319051
412 319051 263412 111505 -91436 -250529 -314100 -276289 -130969 78874 250044 317840 274320
423 274320 131087 -62988 -227955 -310786 -286235 -148430 50596 222787 311226 286963 150392
434 150392 -37233 -201905 -303100 -299544 -167566 30046 199214 297573 295062 172811 -12635
445 -12635 -179195 -290528 -305147 -188061 2618 174016 286626 303450 191801 9131
$$ packed form
368b02457K14211K14284R5855r748j00405k07579k16832j03806L355R1553J99983
379b1586K20581J13294L051q5773j93943k20915j19227r106P5394J83807K24640
390A70217J31601J4211p3622j75635k20736j38547k3417O5590J67921K20899J49220
401B87702L1036o5824j62595k11791j50948m4764N2062J57391K16769J61580M8433
412C19051n5639j51907k02941j59093o3571L7811J45320K09843J71170O7796m3520
423B74320j43233j94075j64967q2831K4551J37805J99026J72191Q8439k4263j36571
434A50392j87625j64672j01195L556J31978J97612J69168R8359k511j22251j85446
445a2635j66560j11333j4619J17086J90679J71398J12610J6824j11649j82670
$$ plain form
455 9131 -155848 -275093 -309357 -205832 -18482 148540 265117 306051 216754 35312 -136432
466 -136432 -261936 -310465 -223194 -39240 128011 245314 301519 235085 61334 -113733 -242967
477 -242967 -307629 -243650 -65522 110389 230062 293164 248708 88698 -91991 -227136 -298386
488 -298386 -254465 -92884 83902 210858 286513 264729 117449 -71664 -214375 -288787 -261121
499 -261121 -118750 59682 196428 275697 266769 142750 -39028 -196142 -286863 -270410 -137681
510 -137681 36915 178369 268033 272200 158136 -18543 -173166 -269539 -275499 -164962 9871
521 9871 164266 261307 273939 175846 6252 -155315 -259519 -273901 -179849 -17154 142370
532 142370 250584 273664 191742 34125 -135036 -253425 -273271 -189178 -43039 117658 244237
$$ packed form
455I131j64979j19245l4264J03525J87350J67022J16577M0934q9297j81442j71744
466a36432j25504m8529Q7271J83954J67251J17303N6205o6434j73751j75067j29234
477b42967o4662O3979J78128J75911J19673O3102m4456j60010j80689j35145p1250
488b98386M3921J61581J76786J26956P5655k1784j47280j89113j42711p4412K7666
499b61121J42371J78432J36746P9269q928j24019j81778j57114r0721J6453J32729
510a37681J74596J41454Q9664M167j14064j76679j54623r6373n960J10537J74833
521I871J54395R7041J2632r8093j69594j61567j04204j4382R4052J62695J59524
532A42370J08214K3080q1922j57617j69161j18389j9846Q4093J46139J60697J26579
$$ plain form
543 244237 275288 195924 54574 -103325 -236821 -278895 -203495 -62898 92256 229354 279518
554 279518 209340 71158 -82255 -220021 -275358 -212290 -84727 63846 212145 282995 221812
565 221812 87054 -59397 -200842 -274339 -224751 -99570 44297 191317 274231 231059 108989
576 108989 -34183 -183509 -271161 -232693 -116031 20503 171010 270015 239671 122863 -13245
587 -13245 -160444 -262125 -241482 -133820 -813 150353 260972 246755 139808 8094
597 8094 -140394 -253133 -245695 -145293 -21537 123961 247921 255835 156184 24530 -118468
608 -118468 -237282 -252358 -163888 -36836 106413 229515 255322 174563 45213 -99934 -222358
619 -222358 -253720 -182700 -54705 93068 214169 249207 189344 67979 -83798 -209075 -246887
$$ packed form
543B44237L1051p9364j41350j57899j33496m2074P5400J40597J55154J37098N0164
554B79518p0178j38182j53413j37766n5337O3068J27563J48573J48299P0850o1183
565B21812j34758j46451j41445p3497M9588J25181J43867J47020Q2914m3172j22070
576A08989j43172j49326q7652L8468J16662J36534J50507R9005l0344j16808j36108
587a3245j47199j01681K0643J07662J33007J51166J10619j4217j06947j31714
597H094j48488j12739P438J00402J23756J45498J23960P914r9651j31654j42998
608a18468j18814j5076Q8470J27052J43249J23102K5807q0759j29350j45147j22424
619b22358l1362P1020J27995J47773J21101L5038n9863j21365j51777j25277l7812
$$ plain form
630 -246887 -194374 -79646 73740 205220 245713 196064 87628 -61806 -195975 -244106 -201390
641 -201390 -96451 51642 187165 241627 208044 106182 -44281 -180755 -236881 -209509 -115807
652 -115807 33140 173427 232571 210952 125583 -20577 -165317 -230180 -213989 -134598 10402
663 10402 159684 227234 211904 139450 3812 -146562 -223699 -216763 -148483 -14204 139440
674 139440 220877 216778 153610 24217 -129130 -215304 -217596 -160317 -35099 120239 210618
685 210618 216399 166448 47888 -110228 -209136 -217466 -168649 -56283 98954 202834 217453
696 217453 172297 65817 -86232 -196349 -218454 -177936 -74547 76519 190640 218878 181572
707 181572 80889 -67388 -182356 -215981 -185515 -90923 55949 176339 216129 188894 97698
$$ packed form
630b46887N2513J14728J53386J31480M0493m9649j08436j49434j34169m8131M2716
641b01390J04939J48093J35523N4462l3583j01862j50463j36474n6126K7372R3702
652a15807J48947J40287N9144k1619q5369j46160j44740o4863J6191P9391J45000
663A0402J49282O7550j5330p2454j35638j50374p7137O936O8280J34279J53644
674A39440Q1437m099o3168j29393j53347q6174k292N7279J25218J55338R0379
685B10618N781m9951j18560j58116r8908q330M8817J12366J55237J03880J4619
696B17453m5156j06480j52049j10117k2105M0518J03389J51066J14121K8238l7306
707A81572j00683j48277j14968l3625L0466R4592J46872J20390L9790k7235r1196
$$ plain form
718 97698 -46277 -168946 -214543 -191458 -104258 35880 160034 212163 194996 111505 -26014
729 -26014 -151658 -210477 -198874 -117579 18035 143073 206378 202032 124728 -9436 -134712
740 -134712 -201596 -203701 -132271 -266 125844 197754 206755 138468 7756 -118239 -191641
751 -191641 -206805 -146027 -17632 109263 187201 208196 151701 25579 -100494 -180529 -208135
762 -208135 -158793 -34938 92845 175436 207593 163323 43313 -83234 -168089 -207502 -170030
773 -170030 -51591 75719 161970 205295 174795 60380 -66852 -155055 -203753 -180592 -68779
784 -68779 60225 149133 199417 183696 77920 -51137 -142513 -197062 -187366 -86469 43219
795 43219 137240 193898 188961 93948 -34048 -130268 -190778 -192049 -101906 26217 124207 186963
$$ packed form
718I7698j43975j22669m5597K3085Q7200J40138J24154N2129j7167q3491j37519
729b6014j25644n8819J1603Q1295J35614J25038O3305m346p7304j34164j25276
740a34712o6884k105P1430J32005J26110P1910R001o8287j30712j25995p3402
751a91641j5164O0778J28395J26895P7938K0995n6495j26122j26073q0035k7606
762b08135M9342J23855J27783Q2591L2157m4270j20010j26547q4855l9413L7472
773a70030J18439J27310Q6251M3325l0500j14415j27232q8203m8698K3161J11813
784f8779J29004Q8908N0284j5721j05776j29057r1376n4549R696J00897J29688
795D3219R4021N6658m937r5013j27996r6220o0510j271R0143J28123R7990O2756
$$ plain form
807 186963 192947 108956 -16641 -117275 -183599 -194698 -116216 8641 111326 179405 193960
818 193960 122231 1774 -103448 -176865 -195097 -127473 -9397 96505 172530 194647 132570
829 132570 18631 -87956 -168853 -195719 -137332 -26189 80534 163569 195019 142470 34979
840 34979 -72713 -159006 -194432 -145968 -43028 63951 154021 193814 149898 51278 -55001
851 -55001 -148912 -193562 -152894 -58062 45393 142306 193027 156682 64517 -36690 -135371 -191917
863 -191917 -160165 -70838 28185 127917 189674 163791 77340 -20431 -121177 -187467 -166184 -83014
875 -83014 12159 113282 184879 169485 88805 -4549 -105694 -182077 -171726 -93662 -2434 97296
887 97296 177655 174674 100165 9212 -90840 -173706 -175827 -105041 -15781 83207 168700 177048
$$ packed form
807A86963N984q3991j25597j00634o6324j1099P8482J24857J02685O8079J4555
818A93960p1729j20457j05222p3417j8232O7624J18076J05902P6025K2117o2077
829A32570j13939j06587q0897k6866N8387J11143J06723Q3035L1450n2549j07491
840C4979j07692q6293l5426M8464J02940J06979R0070L9793m3916r8620j06279
851e5001r3911m4650M0668R4832J03455R6913N0721l6345r2165j01207r8681n6546
863a91917L1752Q9327R9023R9732O1757k5883q6451r7771j00746o6290K1283Q3170
875h3014R5173J01123P1597j5394q0680r3354j01145p6383J0351P8064R1228R9730
887I7296Q0359k981p4509r0953j00052q2866k121P0786Q9260R8988Q5493Q348
$$ plain form
899 177048 110749 22982 -76164 -164454 -178040 -114911 -28675 68783 158779 177886 120263 35863
911 35863 -61724 -153734 -178143 -125205 -41990 55355 147590 176563 129730 49189 -48506 -142498
923 -142498 -175504 -133946 -55787 42385 137386 173093 137153 63303 -34361 -132275 -172081 -140149
935 -140149 -69042 28118 126299 168940 142473 75772 -19955 -120036 -166882 -146007 -83164 13894
947 13894 115692 163498 146078 89027 -4767 -108832 -161069 -148135 -95120 -2865 102993
958 102993 158337 148757 100009 10946 -95800 -155251 -150156 -105236 -17965 89967 151955 149652
970 149652 109045 25959 -82202 -148510 -150573 -113229 -32647 75798 144718 150395 116690 39756
982 39756 -68818 -140881 -149929 -119667 -46535 60926 136909 150266 123128 52905 -53557 -132965
$$ packed form
899A77048o6299q7767r9146q8290j3586O3129Q6236R7458Q9996J9107n7623q4400
911C5863r7587r2010k4409N2938Q3215R7345R2235K8973m6833q0541r7695r3992
923a42498l3006M1558P8159R8172R5001L5707l5940p3850r7664r7914l9806L1932
935a40149P1107R7160R8181M2641k6467o6701r5727j00081m6846K0875O2843R7058
947A3894J01798M7806j7420n7051r3794j04065n2237J2934N3015R2255J05858
958A02993N5344r580m8748q9063j06746n9451N095M4920Q7271J07932O1988k303
970A49652m0607q3086j08161o6308k063L7344Q0582J08445O8920N677l3705p6934
982C9756j08574p2063r048L0262P3132J07461P5983J3357k7138p0223j06462p9408
$$ plain form
994 -132965 -150317 -124986 -57608 45973 126900 149269 128497 63864 -39334 -122902 -148234
1005 -148234 -130185 -68993 30870 117149 147754 132839 73960 -24349 -111794 -146650 -134043 -77632
1017 -77632 17191 104194 144717 138113 83661 -11729 -100442 -142435 -138432 -87034 5035 92896
1029 92896 138671 140351 93065 1391 -87684 -136123 -140841 -96694 -7856 80886 132312 142222
1041 142222 102011 13542 -76054 -128574 -141555 -105511 -20406 68569 124383 142841 110936 26018
1053 26018 -64333 -120520 -141592 -114303 -32487 57855 116110 140456 118046 39106 -51795 -111575
1065 -111575 -139372 -121704 -45726 45499 107727 138984 124670 50335 -40378 -101753 -135394 -127727
1077 -127727 -57541 34417 97962 134164 130400 63094 -29408 -94095 -131096 -131493 -68315 22847
$$ packed form
994a32965j7352K5331O7378J03581Q0927K2369k0772o4633j03198q3568k5332
1005a48234J8049O1192R9863Q6279L0605j4915n8879r8309q7445l4856J2607N6411
1017g7632R4823Q7003M0523o604n4452r5390q8713m1993M003N1398R2069Q7861
1029I2896M5775J680m7286r1674q9075m8439m718M4147Q8838Q8742N1426R910
1041A42222m0211q8469q9596n2520j2981L6044Q5105Q8975N5814J8458l1905q4918
1053B6018r0351n6187k1072K7289Q1816R0342N8255K4346k2410p8940r0901n9780
1065a11575k7797J7668P5978R1225O2228L1257j4314p4335r0713o1375l3641P667
1077a27727P0186R1958O3545L6202l764o7306r2502o4687l7001l97O3178R1162
$$ plain form
1089 22847 89959 128962 131982 73141 -16325 -83764 -125925 -134029 -78773 10147 80207 124623
1101 124623 134150 81808 -4883 -73510 -119987 -134645 -87682 -2500 68879 118376 136251 91725
1113 91725 7271 -64342 -114880 -135073 -94950 -13749 58506 111297 134776 98083 20010 -52350
1125 -52350 -108519 -135511 -102186 -24755 48237 105293 134401 104143 29872 -41671 -99993 -133121
1137 -133121 -107785 -36589 35699 97506 133313 110215 40579 -31278 -93438 -130995 -111151 -45484
1149 -45484 24302 87977 129969 114071 51034 -18512 -84113 -128977 -116015 -54986 13840 79028
1161 79028 126086 116722 59464 -7358 -73826 -123592 -118837 -64527 1896 69681 122203 119899
1173 119899 67708 2940 -64267 -118664 -120155 -71286 -8662 58780 115956 121718 75469 13427
$$ packed form
1089B2847O7112L9003L020n8841q9466o7439m2161q104N5256Q8920P0060M4416
1101A24623R527n2342q6691o8627m6477j4658M6963Q5182P1379M9497J7875m4526
1113I1725q4454p1613n0538k0193M0123Q1201P2255N2791K3479l6693p8073p2360
1125e2350n6169k6992L3325P7431P2992N7056K9108l0258p4271p1543n8322l3128
1137a33121K5336P1196P2288O1807L5807k3098o9636p1857o2160l7557J9844O5667
1149d5484O9786O3675M1992j5898o3037o9546o5601m4864J2962O1029O8826O5188
1161G9028M7058r364n7258o6822o6468m9766M755N4310O6423O7785N2522k304
1173A19899n2191o4768o7207n4397j491M8869O2624O7442N7176N762m6249o2042
$$ plain form
1185 13427 -54561 -113173 -121848 -78669 -17967 49377 109577 121630 82018 23312 -43950 -106234
1197 -106234 -122122 -85285 -27987 39189 103293 121941 87642 31889 -33908 -98624 -121102 -90615
1209 -90615 -36685 29096 94706 120289 93399 41258 -24252 -90751 -118973 -95522 -45436 19343
1221 19343 86917 117872 96884 49796 -13225 -82132 -116223 -99165 -53853 8592 77955 114878
1233 114878 100552 57338 -3836 -73185 -112165 -102294 -61585 -1053 68809 110267 103196 65075
1245 65075 6057 -64134 -107937 -103989 -68722 -11048 59541 105607 104385 71552 15935 -54314
1257 -54314 -102825 -105266 -75164 -20551 50008 99996 104706 77474 24853 -45335 -96723 -104547
1269 -104547 -80479 -29627 40556 94240 104282 82761 34386 -35849 -90975 -103967 -84585 -38656
$$ packed form
1185A3427o7988n8612q675M3179O0702O7344O0200J2053l9612n8706o7262o2284
1197a06234j5888L6837N7298O7176O4104J8648l4299n5753o5797o4716k2478L0487
1209i0615N3930O5781O5610K5583k6890n2141o5510o6499k8222K3451N0086O4779
1221A9343O7574L0955k0988m7088o3021o8907l4091J7058M5312O2445O9363L6923
1233A14878j4326m3214o1174o9349l8980R871M0709O0532O9862M1458p071l8121
1245F5075n9018p0191m3803L948L5267N7674P0589M6066j222l2833n5617p0249
1257e4314m8511k441L0102N4613P0559M9988M710k7232n2621p0188n1388p824
1269a04547K4068N0852P0183N3684J0042k1521m8375p0235n5126j2992J9382M5929
$$ plain form
1281 -38656 31015 87502 102905 86297 42615 -25676 -83878 -102251 -88193 -46846 21316 80501
1293 80501 101007 89512 50445 -16160 -76868 -99715 -90798 -54343 11405 73636 98512 91616
1305 91616 57535 -6455 -69482 -97038 -92489 -60775 1744 65260 95344 93392 64099 2977
1317 2977 -61152 -92893 -94043 -67033 -7451 57040 90813 94275 69939 12597 -52560 -88834
1329 -88834 -94327 -72572 -16994 48405 86705 94475 74839 21019 -43728 -83796 -94586 -76991
1341 -76991 -25018 39248 80719 94173 79521 29094 -35047 -77737 -93340 -81398 -33189 30776
1353 30776 74850 92334 83257 37336 -26232 -71942 -91366 -84493 -40923 21969 68600 90456
1365 90456 86074 44552 -17642 -64905 -89158 -87804 -47991 13844 61931 87299 88338 51529
$$ packed form
1281c8656O9671N6487J5403j6608m3682o8291n8202j8373J4058M1347O8162N9185
1293H0501K0506j1495l9067o6605o0708k2847Q917L6455O5748O2231K4876o896
1305I1616l4081o3990o3027k7556M549L1714O2519O3516L0084j952k9293o1122
1317B977o4129l1741j150K7010N9582O4491L3773L462k4336n7342o5157l6274
1329h8834n493K1755N5578O5399L8300P770j9636n3820o4747m0068j0790J7595
1341g6991N1973O4266M1471J3454j4652n0427o4141m2690j5603J1942M8209O3965
1353C0776M4074J7484r077m5921o3568m5710j9424O873M3570O2892M6631K1856
1365I0456m382m1522o2194m7263k4253J354L9813O1835M8087K5368J039l6809
$$ plain form
1377 51529 -9540 -58352 -85546 -89171 -54644 5032 55095 83767 89419 57965 -918 -51240
1389 -51240 -81880 -90065 -60885 -2991 47508 79788 90229 63519 7162 -44157 -77356 -90390
1401 -90390 -66527 -11087 40734 74815 89902 68527 15276 -36869 -72516 -89400 -70595 -19205
1413 -19205 33070 70095 88979 72501 22709 -29010 -67415 -88448 -74296 -26283 25020 64434
1425 64434 87623 76184 29710 -21286 -61320 -86695 -77474 -32989 17336 58302 85490 78969
1437 78969 36142 -13564 -55225 -84352 -79956 -39071 9599 51636 83166 81362 41877 -6148
1449 -6148 -48502 -81634 -82377 -44600 2887 44645 79285 83200 47615 767 -41348 -77560 -83769
1462 -83769 -50352 -4333 38339 75340 83943 52784 7948 -34631 -73136 -84266 -55039 -11297
$$ packed form
1377E1529o1069m8812k7194l625L4527N9676N0063K8672N652l1454n8883n0322
1389e1240l0640q185K9180N7894N0499L2280J0441k6710n6357n1319l3199j3034
1401i0390K3863N5440N1821L4081J5087k1375n3251n2145l5647j6884J8805N1390
1413a9205N2275L7025J8884j6478m9792n1719l8405k1033J4152M8013N1303L9414
1425F4434K3189j1439m6474n0996m0034k5375R221M4485N0325M0966K7188o521
1437G8969m2827m9706m1661k9127M396M0885M8670M2037L1530j804l9485m8025
1449f148m2354l3132p43L7777M7487M1758L4640L915l5585m6848m2115l6212o209
1462h3769L3417M6019M2672L7001Q603l1159m4836m2579l8505j1130K9227M3742
$$ plain form
1474 -11297 31050 70815 84472 57381 14412 -27773 -68192 -83925 -59356 -17512 24302 65277
1486 65277 83354 61717 21241 -21047 -63256 -83186 -63395 -23896 17789 60302 81693 64474
1498 64474 26886 -14272 -57236 -81111 -66556 -30289 11255 54847 79762 67799 33091 -8233
1510 -8233 -52150 -78023 -68570 -36306 4589 49313 76954 69455 39036 -1309 -46809 -75888
1522 -75888 -70029 -41044 -1910 43843 74081 70264 43419 5676 -39757 -72341 -71140 -45954
1534 -45954 -8831 37178 71123 71557 47734 11637 -34127 -68734 -71305 -49348 -15329 30090
1546 30090 67107 71757 51391 18617 -26716 -65373 -71951 -52579 -21110 23369 62607 71157
1558 71157 54086 24023 -19418 -60172 -71341 -55980 -27146 16124 58440 71303 57077 29395
$$ packed form
1474a1297M2347L9765J3657k7091m2969m2185m0419j5733K4569M1844M1814M0975
1486F5277J8077k1637m0476m2288m2209j9930J9791L9499M1685M2513K1391j7219
1498F4474l7588m1158m2964k3875J4555L6267M1544M3592K4915j1963l4708m1324
1510h233m3917k5873R453L2264M0895M4724K7641p499l0419m0345m5500k9079
1522g5888N859K8985L9134M5753L0238l817k6845l7743m5433l2584J201K5186
1534d5954L7123M6009L3945M34k3823l6097m5764l4607k571K1957L4019M5419
1546C0090L7017M650k0366l2774m5333l8657o578J9372L1469M4479L9238Q550
1558G1157j7071l0063m3441m0754j1169J5361K8834M3270M2316J2863j4226k7682
$$ plain form
1570 29395 -12832 -55721 -70274 -57703 -31781 8910 52488 69927 59079 34276 -5595 -49694
1582 -49694 -69776 -60120 -35800 2929 46541 67888 60690 38307 753 -43451 -66731 -61892
1594 -61892 -40800 -3521 40990 65477 62247 42181 6377 -38102 -63620 -62101 -44188 -9556
1606 -9556 34596 61771 63029 46689 12165 -32552 -60450 -62741 -47840 -14384 29615 57885
1618 57885 62087 50158 17985 -26600 -56073 -62072 -52361 -20615 24322 54421 61593 53162 23467
1631 23467 -21637 -51991 -60512 -54879 -26449 18521 50278 60318 56305 28973 -16222 -48369
1643 -48369 -58999 -56403 -31198 13206 45736 57556 57428 34668 -10010 -44012 -57030 -57964 -36770
1656 -36770 7322 42189 55506 57957 38682 -4075 -39463 -54259 -58440 -40906 978 37051
$$ packed form
1570B9395m2227m2889j4553J2571K5922M0691M3578J7439j0848k4803l9871m4099
1582d9694k0082R656K4320L8729M3612K1347p198k2383l7554m4204k3280M839
1594f1892K1092L7279M4511K4487l230k0066l5804m4479k5518J519J7913L4632
1606i556M4152K7175J258j6340l4524m4717k7898k291J4901L3456M3999K8270
1618E7885M202j1929l2173m4585k9473n999R711L1746M4937L0099P172q431k9695
1631B3467m5104l0354q521N633K8430M4970L1757J0040m013k7332m5195l2147
1643d8369j0630K596K5205M4404L2530J1820j28k2760m4678l4002j3018r34K1194
1656c6770M4092L4867J3317K451j9275m2757l5388j4796m181J7534M1884L6073
$$ plain form
1668 37051 53062 58647 43096 1720 -35408 -52094 -58115 -44729 -4897 32140 50377 58318
1680 58318 46482 7821 -29721 -49429 -58270 -47623 -10436 27243 47901 58217 48871 13134
1692 13134 -24472 -45941 -57811 -50261 -15685 21853 44524 57496 51257 18148 -19237 -43036
1704 -43036 -56822 -52090 -20319 16135 40734 56346 52816 22364 -13328 -38738 -55815 -53712
1716 -53712 -24321 10876 36644 55113 54565 26253 -8458 -34197 -53728 -55554 -28531 5840
1728 5840 32285 53095 55979 30286 -3677 -29713 -51845 -56572 -31972 1058 27328 50444
1740 50444 56829 33750 1246 -24911 -49135 -57609 -35583 -3428 22252 47201 57488 37357
1752 37357 5630 -20138 -45444 -57504 -38879 -7898 18047 43801 57367 40415 9973 -15830
$$ packed form
1668C7051J6011N585j5551m1376l7128j6686o021J3386L9832L7037J8237P941
1680E8318j1836l8661l7542j9708q841J0647L7187L7679K0658J0316r346l5737
1692A3134l7606k1469j1870P550L4576L7538K2671J2972o239l3109l7385k3799
1704d3036j3786M732L1771L6454K4599J5612l530l0452l5692k5410j7077K103
1716e3712K9391L5197K5768J8469n48k8312l4711k5739j9531j826K7023L4371
1728E840K6445K0810K884k5693l3963k6036k2132m727K4600L3030K6270K3116
1740E0444O385k3079l2504k6157k4224q474K2026L2155K5680K4949J0287k0131
1752C7357l1727k5768k5306j2060J8625L0981K5945K5754J3566j6952l0442k5803
$$ plain form
1764 -15830 -41784 -56797 -41784 -12049 13384 40084 56603 43212 14262 -11560 -37760 -55604
1776 -55604 -44451 -16320 9414 35959 54774 45621 18622 -7092 -34223 -53745 -46317 -20713
1788 -20713 4975 32370 52982 47050 22365 -2518 -30280 -52035 -47780 -24537 412 28280
1800 28280 50714 48083 26302 1459 -26393 -49646 -48397 -28208 -3925 24408 48381 48451 29648
1813 29648 5836 -22573 -46998 -48347 -30999 -8293 20440 45808 48647 32296 10491 -18158
1825 -18158 -44396 -48294 -33392 -12720 15858 43201 48104 34451 14760 -13947 -41880 -47674
1837 -47674 -35522 -16935 11341 40389 47516 35716 18620 -8955 -38723 -47158 -36710 -20423
1849 -20423 6580 36955 47000 37498 22055 -4297 -35490 -46373 -37850 -23702 1913 33200
$$ packed form
1764a5830k5954j5013J5013K9735K5433K6700J6519j3391k8950k5822k6200j7844
1776e5604J1153K8131K5734K6545J8815r153k6999k5714k7131j9522P428K5604
1788b0713K5688K7395K0612n932k4685k4883k7762k1755M255K3243K4949K7868
1800B8280K2434k631k1781k4843k7852k3253J249K0189K4283K8333K3973P0j8803
1813B9648k3812k8409k4425j349J7348K2706K8733K5368K839j6351k1805k8649
1825a8158k6238l898J4902K0672K8578K7343M903j3653j9691k8707k7933n794
1837d7674J2152J8587K8276K9048P127j1800j7096k7575k9768q435J0448J6287
1849b0423K7003L0375J0045r502j5443k6352l1193j0883Q523J4148K5615L1287
$$ plain form
1861 33200 46011 38289 24972 720 -31484 -45221 -38609 -26314 -2740 29129 44563 39100
1873 39100 27342 4912 -26989 -43812 -39711 -28611 -6903 24755 42680 40143 29802 8686
1885 8686 -22848 -41731 -40186 -30599 -10536 20618 40446 40122 31660 12511 -18333 -39280 -40474
1898 -40474 -32656 -14016 15923 37547 40483 33601 15493 -14095 -35981 -40363 -34463 -17214 12364
1911 12364 34546 39889 35513 18745 -10450 -32976 -39667 -36257 -19961 8553 31480 38800 37020
1924 37020 21835 -6494 -29578 -37879 -37471 -23321 4828 27949 37306 37932 25001 -2889 -26506
1937 -26506 -36104 -38460 -26594 997 24931 35164 38377 28322 657 -23580 -34231 -38349 -29672
1950 -29672 -2890 21840 33297 38237 30973 4864 -20455 -31981 -38187 -32044 -6531 19021 30946
$$ packed form
1861C3200J2811p722j3317k4252l2204j3737O612J2295K3574L1869J5434n463
1873C9100j1758k2430l1901j6823M101J1100K1708L1658J7925k537j0341k1116
1885H686l1534j8883J545R587K0063L1154J9828l24q462j9149l0844k0947j194
1898d0474P818J8640K9939K1624K936o882j8108k9588k1886m382N900J7249K9578
1911A2364K2182N343m376j6768k9195k2526o691L410J6296K8514K2927P320j780
1924C7020j5185k8329k3084q301M08J4150K8149K3121R357O26j2931k7890k3617
1937b6506r598k356J1866K7591K3934J0233L213j0055k7665k4237j0651m118Q677
1950b9672K6782K4730J1457M940p264k6109k5319j1526o206O143K5513K5552J1925
$$ plain form
1963 30946 37612 33208 8318 -17128 -29803 -37060 -34171 -10661 15462 28842 36981 34870 12377
1976 12377 -14058 -27906 -36094 -35153 -13810 12057 26577 35738 35652 15612 -10291 -25366 -35027
1989 -35027 -36350 -17294 8712 24416 34580 36511 18740 -6691 -23094 -33882 -36493 -20119
2001 -20119 4474 21756 33622 36616 21309 -2637 -20616 -33143 -36776 -22123 537 18789
2013 18789 32045 36667 23136 974 -17069 -31416 -37169 -24183 -2690 15635 31161 37035
2025 37035 24807 4371 -13689 -30035 -37226 -25697 -5777 11989 28949 37344 26626 6919
2037 6919 -10407 -27961 -37175 -27130 -8136 8764 26013 36675 28269 9758 -6806 -25001
2049 -25001 -36673 -28959 -11039 5789 24011 36108 29611 12063 -4027 -21973 -35721 -30456
$$ packed form
1963C0946O666m404k4890k5446j2675p257K889K3510K6123J3380Q139k111k2493
1976A2377k6435j3848q188R41K1343K5867J4520R161q6k0040k5903j5075r661
1989c5027j323J9056K6006J5704J0164J931j7771k5431j6403j0788k611J6374
2001b0119K4593J7282J1866K994j5307k3946j7979j2527l633J4653K2660J8252
2013A8789J3256M622j3531k2162j8043j4347n753J2986K1493J8325J5526N874
2025C7035j2228k0436j8060j6346p191J1529J9920J7766J6960Q395j0718j9707
2037F919j7326j7554r214J0045J8994J6900J7249J0662q406j8511j6564j8195
2049b5001j1672P714J7920J6828J8222J2097o497j7548j6090j7946j3748N265
$$ plain form
2061 -30456 -13562 2396 20553 35460 31006 14535 -1659 -19283 -34285 -31554 -15730 -107
2073 -107 17284 33184 32147 17238 1440 -16191 -32707 -32822 -18256 -2335 15116 31446 32575
2086 32575 19453 3835 -13342 -30212 -33223 -20647 -5138 12394 29601 33110 21436 5959
2098 5959 -11030 -28145 -32228 -22416 -7497 9592 27122 32520 23454 8913 -8601 -26132 -32282
2111 -32282 -24146 -10167 7256 25208 31612 24303 11655 -5522 -23670 -31778 -25384 -12835 4283
2124 4283 23032 31184 25541 13955 -2863 -21699 -30467 -25769 -15240 1004 20558 30048 26286
2137 26286 16305 380 -19796 -29667 -26285 -17264 -1733 18181 29044 26422 17941 3347 -16617
2150 -16617 -28680 -26911 -18646 -4623 15708 28266 26888 19340 6052 -14126 -27341 -26769 -19988
$$ packed form
2061c0456J6894J5958J8157J4907m454j6471j6194j7624j5002K731J5824J5623
2073a07J7391J5900j037j4909j5798j7631j6516j15J4566J5921J7451J6330J129
2086C2575j3122j5618j7177j6870l011J2576J5509J7532J7207L509j1674j5477
2098E959j6989j7115m083R812J4919J7089J7530N398r066j4541j7514j7531o150
2111c2282Q136J3979J7423J7952O404p309j2648j7177j8148q108O394J2549J7118
2124D283J8749Q152n643j1586j6818j8836q768M698J0529J6244J9554R490l762
2137B6286r981j5925k0176r871L382R021J5531J9914J0863k622q481j4594j9964
2150a6617j2063J769Q265J4023K0331J2558j378p548j3288k0178j3215N72O781
$$ plain form
2163 -19988 -7650 12402 26914 26868 20440 9081 -11175 -26196 -26860 -20978 -9843 9453 25138
2176 25138 26712 21662 11343 -7684 -24279 -26865 -22264 -12071 6686 23383 26988 22384 12961
2189 12961 -5206 -22192 -26499 -22919 -14125 3496 21280 26202 23533 15042 -2488 -20179 -26273
2202 -26273 -23666 -15630 1385 18772 25513 24090 16790 178 -17439 -24971 -24390 -17427 -1162 16496
2216 16496 24366 24498 18121 2412 -15102 -23706 -24736 -19008 -3537 13874 22955 24700 20073 4598
2230 4598 -12850 -22068 -24749 -20635 -5667 11642 21130 24516 21245 7253 -10520 -20438 -24537 -22148
2244 -22148 -7956 9472 19581 24454 22769 8895 -8529 -18785 -24040 -23317 -10159 7047 17656
2257 17656 23402 23690 11302 -6291 -16957 -22826 -24116 -12690 5168 16025 22436 24204 13655
$$ packed form
2163a9988J2338K0052J4512m6o428j1359k0256j5021o64N882J1135J9296J5685
2176B5138J574n050j0319j9027j6595k586M601J0193J8757J6697L605m604r423
2189A2961j8167j6986m307L580Q794J7621J7784M922k669q491j7530j7691o094
2202b6273K607Q036J7015J7387O741j423p300j6612j7617p532N81O963J6265J7658
2216A6496P870J32o377j5709j7514q604j030N728J5471J7411R081J745m627j5475
2230D598j7448r218k681M114J4968J7309R488L386l271j3992j7773r918m099K389
2244b2148J4192J7428J0109M873j685j3874j7424j0256n255P23J3158J7206J0609
2257A7656N746K88j2388j7593j0666n869j290J1426J7858J0857O411J768j0549
$$ plain form
2270 13655 -4053 -15326 -21953 -24441 -14640 2906 14655 21325 24484 15655 -1522 -13737 -20595
2283 -20595 -24420 -16450 369 12690 20219 24362 17298 874 -11885 -19576 -24199 -17955 -2067
2296 -2067 10915 19106 24006 18742 3222 -9970 -18660 -23954 -19121 -4585 8915 17834 23745 19623
2310 19623 5671 -7693 -17158 -23479 -20200 -6693 6721 16516 23300 20502 7374 -5551 -15974
2323 -15974 -23071 -20550 -8541 4423 14934 22970 21040 9421 -3164 -13897 -22607 -21189 -9950
2336 -9950 2031 12856 22229 21807 10952 -1121 -11960 -22007 -21950 -11478 41 11019 21393
2349 21393 22167 12140 993 -9981 -20740 -22405 -12912 -2047 8970 20148 22640 13634 2669
2362 2669 -7598 -19423 -22745 -14129 -3391 6927 18560 22810 14967 4376 -5998 -18029 -22797
$$ packed form
2270A3655j7708j1273o627k488R801J7546J1749O670L159q829j7177j2215o858
2283b0595l825P970J6819J2321P529M143p064j6424j2759p691m623O244J5888
2296b067J2982Q191M900n264j5520j3192q690n294M833J4536J3500Q919N911m122
2310A9623j3952j3364r465o321L279J3507J3414R795O784k798j3128j2925j0423
2323a5974p097K521J2009J2964J0511Q036j930j1619j2585j0733q710J418J1239
2336i950J1981J0825R373m22j0855j2073j0839j0047N7J0472J1519J0978J0374
2349B1393P74j0027j1147j0974j0759j665R493J0865J1017J1178K492r006j0965
2362B669j0267j1825l322Q616J0738J0318J1633M250p843j0591j0374j2031m768
$$ plain form
2375 -22797 -15341 -4838 4730 17081 22734 16025 5728 -3783 -16169 -22634 -16345 -6298 3131
2388 3131 15404 22551 17045 7098 -2467 -14386 -22111 -17659 -7858 1617 13495 21756 17977 8693
2402 8693 -663 -12911 -21202 -18283 -9281 -357 11859 20777 18661 10168 791 -10869 -20186 -18800
2416 -18800 -11111 -1785 10105 19795 18837 11761 2589 -9500 -19178 -18766 -12336 -3474 8587 18483
2430 18483 18924 12901 4451 -7810 -17904 -18622 -13511 -5498 7123 17512 18568 13832 6225 -6285
2444 -6285 -16931 -18450 -14232 -7042 5168 16371 18148 14561 8084 -4076 -15603 -18008 -14779 -8831
2458 -8831 3432 15477 17963 14748 9641 -2183 -14774 -17679 -14511 -10192 1191 14032 17493
2471 17493 15064 10641 -271 -13616 -17561 -14998 -11438 -678 12813 17101 15203 11819 1683
$$ packed form
2375b2797P456J0503R568J2351N653o709j0297r511j2386o465O289J0047R429
2388C131J2273P147n506r947r565j1919p725M452R801R475J1878Q261l779r284
2402H693r356j2248q291K919R002Q924J2216Q918k116q493r377j1660r317J386
2416a8800P689R326J1890R690r58p076r172j2089r678M12O430Q862J2061R896
2430A8483M41o023q450j2261j0094p18N111Q013J2621J0389J056m736p607j2510
2444f285j0646j519M218P190J2210J1203J777l587o477j2160j1527k405L229N948
2458h831J2263J2045K486l215n107j1824j2591k905L168M319J1383J2841L461
2471A7493k429m423j0912j3345l945K563L560J0760J3491M288j898l384j0136
$$ plain form
2484 1683 -11846 -16879 -15232 -12151 -2724 11007 16898 15298 12531 3469 -10117 -16433 -15281 -13013
2498 -13013 -4401 9005 15990 15599 13464 5276 -8344 -15583 -15462 -13682 -5852 7273 14877 15503 13937
2513 13937 6497 -6382 -14401 -15584 -14642 -7315 5770 13902 15253 14592 7813 -4823 -12913 -15188
2527 -15188 -14997 -8408 4063 12206 15103 15458 9025 -3327 -11734 -14692 -15495 -9427 2726 11093 14330
2542 14330 16013 10177 -1876 -9947 -14172 -16402 -10753 1294 9864 13637 16275 11133 -555 -8831
2556 -8831 -12909 -16224 -12082 -217 8261 12588 16203 12614 899 -7914 -12197 -16214 -12999 -1694
2570 -1694 6984 11649 16001 13600 2578 -6476 -11415 -16067 -14147 -3177 5928 10689 15593 14329
2584 14329 3724 -5180 -9987 -15370 -14617 -4936 4584 9812 15374 14860 5422 -4149 -9544 -14573 -14831
$$ packed form
2484A683j3529n033J647L081R427J3731N891j600k767r062j3586o316J152K268
2498a3013Q612J3406O985l91k135q188j3620p239J21J780P830J3125P604O26j566
2513A3937p440j2879q019j183R42P327J3085Q132J351o61o779j2636q090k275
2527a5188J91O589J2471Q143K897L55o433j2352q407k958q03O068J2153Q367L237
2542A4330J683n836j2053q071m225k230N649J2047Q570L773K638n142j1688q276
2556h831m078l315M142J1865Q478M327L615l589j1715q813m283m017L215J1305
2570a694Q678M665M352k401j1022r054m939m652J920J0970R105M761M904j264
2584A4329j0605q904m807n383P53R681R520N228N562n14r438r571n395n029k58
$$ plain form
2599 -14831 -5888 3327 8932 14265 15080 6778 -2610 -8791 -14314 -15092 -7190 2035 8003 13770 15150
2614 15150 8117 -1181 -7314 -13440 -15326 -8690 378 7098 13532 14945 9123 252 -6583 -12760 -14860
2629 -14860 -9287 -1330 5828 12714 15218 9722 2144 -5012 -12464 -15255 -9986 -2469 4387 11861 14870
2644 14870 9936 2913 -3742 -11375 -15233 -10716 -3689 3104 11235 15372 10943 3978 -2274 -10309 -14971
2659 -14971 -10987 -4276 1234 9459 15191 11460 5013 -829 -9164 -14949 -11594 -5320 514 8339 14641
2674 14641 11859 5581 555 -7634 -14668 -12416 -6142 -796 7204 14315 12601 6463 1500 -6502 -13701
2689 -13701 -12647 -6869 -2035 5749 13196 13064 7519 2354 -5112 -13080 -13194 -7661 -2492 4514 12697
2704 12697 13129 8006 3505 -3819 -11827 -13245 -8537 -3711 3326 11730 13096 8742 4077 -2939 -11073
$$ packed form
2599a4831Q943R215N605N333Q15q302r388o181n523p78P902R225N968N767J380
2614A5150p033r298o133o126j886O636R068O720O434J413n822q871o835o177k100
2629a4860N573P957P158O886K504n496p578p156p452k791N269P517O856P474L009
2644A4870m934p023o655p633l858M517P027O793Q131M137m429o965o252q035m662
2659a4971L984O711N510Q225N732l731o447n842q335n785L355O274N834P825O302
2674A4641k782o278n026q189p034K252O274N346Q000P111j714o138m963q002p199
2689a3701J054N778M834P784P447j32n545n165p466p968j14N533N169P006Q183
2704A2697M32n123m501p324q008j418M708M826P037Q404J366m354m665p016q134
$$ plain form
2719 -11073 -12817 -8943 -4790 2306 10546 12768 9447 5168 -1583 -10306 -12606 -9791 -5638 1277 9745
2734 9745 12253 9777 6262 -732 -9084 -12069 -10213 -6793 -51 8870 11881 10221 7033 451 -8070
2749 -8070 -11689 -10200 -7652 -1155 7792 11541 10270 8057 1860 -7532 -11302 -10164 -8356 -2227 6813
2764 6813 11019 10194 8356 3035 -6392 -10750 -10099 -8944 -3747 5796 10571 9890 9188 4228 -5165 -10237
2780 -10237 -9808 -9075 -4907 4600 10044 9615 9392 5334 -4093 -9586 -10070 -9673 -5912 3412 9251 9666
2796 9666 9612 6116 -2691 -8722 -9558 -9837 -6563 2343 8666 9634 9698 6839 -1463 -7885 -9586 -10072 -7114
2813 -7114 894 7499 9547 10159 7482 -291 -7036 -9061 -10159 -7531 4 6721 8933 10034 8057
2828 8057 560 -6161 -8598 -10246 -8517 -1000 5523 8541 10218 8531 1612 -4906 -8135 -10293 -8753
$$ packed form
2719a1073j744L874M153P096Q240K222l321m279o751q723k300K815M153O915Q468
2734I745K508k476l515o994q352k985J856L420O742Q921L011j660l188o582q521
2749h070l619J489K548O497Q947L749j271k213o197r392l770J138J808O129R040
2764F813M206q25j838n321r427m358O51J155N197R543M775o81p02m960r393n072
2780a0237M29P33M168R507N444m29k23m058r427n493m84L97L761R324N839M15
2796I666n4l496q807o031q36k79L274Q906O323R68O4k859q302o422j701m86K958
2813g114Q008O605K048O12k677p773o745k025j098K628P535O717K212J101j977
2828H057p497o721k437j648J729P517O523L018J677j687o919o518l229k158J540
$$ plain form
2843 -8753 -1789 4489 7771 10355 8903 2169 -4060 -7478 -10282 -9560 -2761 3474 6827 10081 9667
2858 9667 3042 -3282 -6617 -9955 -9777 -3205 2809 6275 9726 10048 4023 -2256 -5613 -9432 -10360 -4208
2874 -4208 2013 5490 9093 10262 4785 -1376 -5067 -8737 -10446 -5256 1352 4624 8665 10181 5618
2889 5618 -584 -4235 -8482 -10453 -6040 212 4194 7941 10545 6508 55 -3944 -7840 -10439 -6766
2904 -6766 -666 3391 7330 10601 7050 1022 -2981 -7133 -10259 -7307 -1386 2691 6723 10086 7888
2919 7888 2084 -2270 -6698 -9815 -7682 -2549 1796 6359 9834 7787 3024 -1441 -6067 -9856 -7983
2934 -7983 -3317 1008 5596 9572 8179 3413 -722 -5340 -9338 -8387 -3915 125 5000 9327 8282
2949 8282 4095 393 -4551 -9171 -8329 -4297 -732 3929 8988 8560 4581 1234 -3714 -8628 -8277 -4668
$$ packed form
2843h753O964O278L282K584j452o734o229l418k804P22O799O235L353L254m14
2858I667o625o324l335l338J78O572O014L466L451L22o025o279l357l819r28O152
2874d208O221L477L603J169n477o161l691l670j709N190O608L272M041J516m563
2889E618o202l651m247j971M413O252L982L747K604m037o453l999l896k599L673
2904f766O100M057L939L271l551o028m003m152l126K952N921M077M032L363k198
2919G888n804m354m428l117K133N133M345M563L475k047m763m465m626l789J873
2934g983M666M325M588L976j393m766m135m618l998R51M472M040M875M327j045
2949H282m187l702m944m620Q42M032L565M661N059m28l979l347m948m914L51L609
$$ plain form
2965 -4668 -1498 3392 8563 8584 5054 1779 -2706 -8303 -8472 -5170 -2100 2459 8081 8654 5484 2309
2981 2309 -1846 -7720 -8891 -5774 -2896 1559 7562 9217 5793 2928 -1143 -6785 -8708 -5795 -3066
2996 -3066 437 6415 8710 6226 3426 -354 -6074 -8522 -6321 -3604 61 5774 8268 6437 4067
3011 4067 404 -5361 -8300 -6677 -4305 -694 4906 8193 6782 4624 1038 -4645 -7823 -6476 -4686
3026 -4686 -1394 4300 7733 6914 5023 1969 -4228 -7644 -7123 -5328 -2090 3791 7161 6726 5710 2436
3042 2436 -3338 -6960 -6849 -5595 -2770 2951 6910 6637 5815 2787 -2598 -6763 -6655 -5684 -3303 2388
3058 2388 6418 6515 6334 3912 -2000 -6256 -6256 -6046 -4053 1387 5961 6533 6221 4570 -1054 -5711 -6355
3075 -6355 -6338 -4588 943 5523 6330 6190 4926 -475 -5144 -5980 -6421 -5382 7 4787 6028 6393 5313
$$ packed form
2965d668L170M890N171K1l530l275m485n597j69L302L070M559N622N73l170l175
2981B309m155n874j171L117K878M455O003J655l424k865m071n642j923K913K729
2996c066L503N978K295k484k800l780n720k448K201K717L665N713K494j831k370
3011D067l663n765k939J623K372L611N600L287j411k158l586n683l178J347J790
3026d686L292N694L433q19j891l054o197l416N21J795L238N881L370m35j016l274
3042B436n774l622J11J254K825N721L959k73q22l028n385m165J08R71K381N691
3058B388M030R7j81k422n912m256%K10J993N440M574N72l12j651n624m657o44
3075f355J7J750N531M580Q07j40j264n401m669q36m41J039N389M780J241L65j080
$$ plain form
3092 5313 296 -4540 -5871 -6251 -5648 -726 4158 5588 6167 5619 1190 -4072 -5746 -6436 -6083 -1321
3108 -1321 3469 5349 5950 5732 1593 -3187 -5136 -6161 -6084 -2194 2829 5095 6297 6238 2070 -2480
3124 -2480 -4714 -6078 -6099 -2491 2069 4647 6061 6533 3038 -1941 -4421 -5996 -6619 -3156 1507 4110
3140 4110 5951 6611 3263 -1326 -3826 -5618 -6702 -3704 907 3549 5665 6795 3703 -881 -3396
3155 -3396 -5548 -6694 -4007 357 2889 5426 6872 4256 24 -2771 -5247 -6858 -4504 18 2746
3170 2746 4833 6809 4636 498 -2122 -4796 -6756 -4854 -769 2243 4574 6635 5329 849 -1752
3185 -1752 -4335 -6667 -5380 -1213 1543 4019 6565 5574 1613 -1333 -4078 -6357 -5371 -1897 1254
3200 1254 3462 6438 5760 2367 -854 -3542 -5941 -5782 -2202 658 3372 6125 5917 2595 -428 -2959
$$ packed form
3092E313n017m836j331l80O03M922M884J430N79n48m429n262j674o90L53M762
3108a321M790J880O01k18m139m780j949j025P7L890N023K266J202n9m168m550
3124b480k234j364k1L608M560K578J414M72l495m979k480j575o23L463M663K603
3140D110J841O60l348m589k500j792j084K998M611K642K116J130l092m584k515
3155c396k152j146K687M364K532K537J446k616m232k795k476j611K354M522K728
3170B746K087J976k173m138k620k674j960J902M085L012K331K061j306m480k601
3185a752k583k332J287M167K756K476K546r91l961k946k745k279R86L474L151
3200A254K208K976o78l393l221k688k399J59L580K860K714K753k08l322l023k531
$$ plain form
3216 -2959 -5894 -5954 -2728 -18 2846 5642 5934 3116 153 -2595 -5618 -5932 -3122 -365 2184 5321
3232 5321 5958 3217 643 -2063 -5274 -6100 -3594 -982 2064 4981 6118 3695 1146 -1653 -4980
3247 -4980 -5844 -3981 -1344 1206 4701 6129 4075 1524 -770 -4572 -6301 -4244 -1745 854 4249
3262 4249 5994 4358 2092 -582 -4208 -5961 -4394 -2166 288 4094 5784 4456 2181 67 -3764
3277 -3764 -6005 -4438 -2449 -383 3371 5840 4516 2680 693 -3097 -5622 -4640 -2898 -876 2907
3292 2907 5579 4629 2950 1239 -2601 -5637 -4817 -2932 -1573 2403 5408 4839 3019 1698 -1904 -5150
3308 -5150 -4962 -3311 -1800 1685 5135 4884 3590 2112 -1645 -4804 -4858 -3440 -2077 1275 4671 4906
3324 4906 3709 2028 -990 -4555 -4687 -3929 -2601 927 4227 4867 3809 2697 -810 -4092 -4598 -3990
$$ packed form
3216b959k935o0L226K710K864K796K92k818k963k748l023l14K810K757K549L137
3232E321O37k741k574k706l211q26K506K612L046K917J137k423k549k799l327
3247d980q64J863K637K550L495J428k054k551k294l802j729K057K499K599L395
3262D249J745j636k266k674l626j753J567K228K454L806J690j328k275k114l831
3277c764k241J567J989K066L754K469j324j836j987l790k525R82J742K022L783
3292B907K672r50j679j711l840l036Q20J885J359L976L005n69j820j321l602l246
3308e150J88J651J511L485L450k51j294j478l757l159n4J418J363L352L396K35
3324D906j197j681l018l565j32P58J328L528L300O40j058j112l507l282n06O08
$$ plain form
3340 -3990 -2886 458 3771 4602 3924 3341 -83 -3642 -4420 -4232 -3252 -140 3685 4414 4158 3172 568
3357 568 -3285 -4303 -4159 -3839 -762 3079 4134 3939 3867 1026 -3017 -4279 -3938 -3824 -1094 2775 3947
3374 3947 3962 4058 1194 -2493 -3787 -4177 -4086 -1762 2398 3953 4004 4141 2049 -2153 -3785 -3767 -4149 -2280
3392 -2280 1803 3580 3939 4247 2140 -1763 -3384 -3853 -4304 -2540 1522 3404 3700 4348 2732 -1004
3408 -1004 -3009 -3652 -4387 -2836 955 2968 3503 4237 2768 -611 -2952 -3691 -4634 -3049 544 2750
3424 2750 3560 4568 3191 -262 -2210 -3297 -4419 -3200 3 2178 3297 4578 3615 113 -2044
3439 -2044 -3339 -4261 -3737 -410 1772 3144 4554 3730 508 -1761 -3008 -4370 -3710 -597 1324 2881
3455 2881 4622 3957 1030 -1308 -2672 -4527 -3962 -1069 1192 2514 4282 4167 1269 -1022 -2270 -4376
$$ packed form
3340c990J104L344L313Q31o78n83l424l559p78J88R80L112L825P29k56r86k604
3357E68l853j018J44L20L077L841J055j95p2k841m043j262L41J14K730L869J172
3374C947J5R6k864l687j294l90R1K324M160J555N1J37k092m202j632J8l82J869
3392b280M083J777L59L08k107l903j621m69m51J764M062J882K96O48j616l736
3408a004k005o43p35J551L791K013N35P34j469l379k341p39r43J585L593K206
3424B750Q10J008j377l453j948j087j122J219L203K175J119J281r63l502k157
3439b044j295r22N24L327K182J372J410q24l222k269j247j362O60L113J921J557
3455B881J741o65k927k338j364j855N65K893K261J322J768j15k898k291j248k106
$$ plain form
3471 -4376 -4129 -1288 778 2260 4125 4358 1591 -510 -1983 -4242 -4597 -1701 427 1915 3814 4348
3487 4348 1863 -350 -1601 -3919 -4392 -2182 271 1691 3699 4543 2284 93 -1257 -3661 -4251 -2424
3503 -2424 -45 953 3367 4318 2511 439 -983 -3285 -4655 -2783 -519 800 3227 4668 2874
3518 2874 768 -759 -3072 -4472 -2842 -820 627 3040 4419 3042 970 -404 -2864 -4541 -2928
3533 -2928 -1185 237 2476 4471 3147 1296 -260 -2442 -4346 -3276 -1365 -127 2101 3994 3220
3548 3220 1627 263 -2033 -4267 -3280 -1617 -442 1905 4252 3300 1723 414 -1830 -4029 -3578 -1621
3564 -1621 -989 1567 3809 3431 1982 1113 -1444 -3989 -3512 -1944 -1264 1400 3923 3352 2117 1232 -1002
3581 -1002 -3522 -3364 -2184 -1566 750 3512 3593 2256 1401 -712 -3410 -3452 -2308 -1665 512 3515 3671
$$ packed form
3471d376K47K841K066J482J865K33k767k101j473k259l55K896K128J488J899N34
3487D348k485k213j251k318m73K210K453J420K008Q44k259k191j350k404n90J827
3503b424K379R98K414R51j807k072j422k302j370J872K264J319K427J441j794
3518B874k106j527k313j400J630K022J447K413J379j377k072j374k460j677J613
3533b928J743J422K239J995j324j851j556k182j904J070J911J238K228J893p74
3548C220j593j364k296k234R87J663J175K347K347r52j577j309k244k199M51J957
3564a621O32K556K242l78j449q69k557k545M77J568O80K664K523n71j235q85k234
3581a002k520J58J180O18K316K762Q1j337q55k113k698m2J144O43K177L003J56
$$ plain form
3598 3671 2286 1702 -247 -3361 -3626 -2635 -1899 133 3120 3670 2475 1767 -190 -2747 -3461 -2505 -1992
3615 -1992 -166 2647 3288 2895 2277 226 -2489 -3433 -2630 -2214 -396 2551 3187 2854 2291 583 -2230
3632 -2230 -3231 -2698 -2460 -736 2118 3004 2789 2364 1087 -1954 -2929 -2747 -2748 -1148 1781 3086 2857 2975
3650 2975 1121 -1670 -2727 -2764 -2731 -1295 1761 2722 2708 3004 1570 -1393 -2684 -2696 -2825 -1608 1479 2713
3668 2713 2526 2779 1602 -1149 -2597 -2471 -2944 -1842 1084 2350 2645 2975 2031 -946 -2355 -2790 -3134
3685 -3134 -2014 398 2187 2455 3199 2270 -634 -1995 -2487 -3057 -2295 352 2047 2258 3125 2241 -234
3702 -234 -1717 -2510 -3139 -2556 286 1621 2421 2995 2803 133 -1617 -2324 -3261 -2466 -289 1244 2360
3719 2360 3006 2716 425 -1148 -1989 -3011 -2632 -493 1470 2141 3051 2717 671 -1088 -1953 -2992 -2794
$$ packed form
3598C671j385n84j949l114k65R91P36K032K987N50j195p08j957k557p14R56N13
3615a992J826K813O41l93o18k051k715r44Q03M16J818K947O36l33n63j708k813
3632b230j001N33K38J724K854Q86k15m25j277l041r75J82jJ600K929J305k29J18
3650B975j854k791j057l7L3J436L056R61j4K96j434k963j291j2j29J217L087J234
3668B713j87K53j177k751j448J26m73J102K926J266K95L30r44k977j409m35l44
3685c134J120K412J789K68P44r29k904j361m92n70P62K647J695K11Q67q84k475
3702b34j483p93o29N83K842J335Q00N74j92k670j750p07r37P95K177J533J116
3719B360O46k90k291j573q41j022L79K139J963O71R10l34k046j759q65j039J98
$$ plain form
3736 -2794 -968 955 1746 2960 3106 859 -924 -1765 -2825 -3088 -866 749 1475 2959 3216 1246
3752 1246 -388 -1583 -2705 -2990 -1504 450 1376 3008 3212 1204 -505 -1267 -2627 -3274 -1582 270
3768 270 1174 2674 3210 1785 -184 -1132 -2839 -3264 -1816 38 1092 2515 3335 1627 4 -930 -2257
3785 -2257 -3024 -1830 -165 796 2111 3327 1941 382 -728 -2009 -3140 -2215 -390 664 2047 3305
3801 3305 2252 523 -442 -1973 -3021 -2326 -791 410 1869 3088 2435 535 -204 -1777 -3117 -2454
3817 -2454 -828 225 1497 3064 2511 948 -106 -1691 -2911 -2460 -1028 122 1388 2760 2407 1091
3833 1091 -16 -1170 -3035 -2552 -991 -141 1241 2950 2411 1140 274 -1304 -2935 -2688 -1295 -594
3849 -594 933 2643 2617 1503 551 -876 -2601 -2549 -1490 -759 863 2589 2670 1641 812 -728 -2388
$$ packed form
3736b794J826J923P91J214J46k247j783q41j060k63K222J615P26J484K57j970
3752A246j634j195j122k85J486J954R26J632K04k008j709p62j360o47J692J852
3768B70R04J500N36j425j969r48j707m25J448J854J054J423Q20j708j623r34j327
3785b257p67J194J665R61J315J216j386j559j110j281j131R25J825J054J383J258
3801C305j053j729r65j531j048O95J535J201J459J219o53j900p39j573j340O63
3817b454J626J053J272J567n53j563j054j585j220M51J432J150J266J372l53j316
3833A091j107j154j865M83J561Q50J382J709n39j271q66j578j631K47J393P01
3849e94J527J710k6j114r52j427j725N2J059P31J622J726Q1j029q29j540j660
$$ plain form
3866 -2388 -2749 -1484 -755 464 2521 2724 1613 1099 -343 -2389 -2624 -1730 -1046 240 2082 2835 1912
3883 1912 1141 -28 -1897 -2492 -1755 -1090 183 1931 2575 1655 1341 -119 -1631 -2460 -1744 -1457 -192
3900 -192 1865 2479 1873 1353 396 -1705 -2648 -2031 -1559 -345 1507 2461 1887 1589 360 -1369 -2277 -2002
3918 -2002 -1774 -671 1362 2468 2042 1675 721 -1420 -2198 -2062 -1731 -990 1204 2353 1969 1801 981 -1041
3936 -1041 -2368 -2186 -1863 -979 984 2138 2092 1988 1099 -925 -2155 -1835 -1593 -1362 643 2048 2173 1810
3954 1810 1294 -579 -1938 -1974 -2206 -1475 483 1901 1834 1974 1516 -594 -1650 -1963 -2087 -1626 297 1662
3972 1662 2009 2122 1803 -60 -1529 -1942 -1701 -1725 210 1316 1784 2152 1697 131 -1623 -1808 -2155 -1889
3990 -1889 -7 1449 1666 1792 1774 412 -1134 -1841 -2048 -1861 -327 1309 1840 1989 1935 529 -1143 -1644
$$ packed form
3866b388l61J265P29J219K057K03j111n14j442k046k35Q94O84J286J842P53r23
3883A912p71j169j869n95P37O65J273J748O44r20l14j460j512q29P16K87J265
3900a92K057O14o06n20r57k101r43O17M72J214J852R54n74k98j229j729r08K75
3918b002K28J103K033J106m26l67r54k141p78J36L31P41K194J149l84j68q20k022
3936a041j327J82L23Q84J963J154m6j04q89k024j230L20K42K31K005J405J25l63
3954A810n16j873j359l6k32P31J958J418o7J40m58k110j056l13j24M61J923J365
3972A662L47J13l19j863j469m13K41k4J935J106M68L68m55j566j754j85l47K66
3990a889J882J456K17J26j8j362j546p07k07J87J534J636N31J49n4j406j672n01
$$ plain form
4008 -1644 -1933 -1770 -561 1083 1629 1944 1649 816 -1118 -1566 -2080 -1948 -860 805 1650 2003 1893 951
4026 951 -650 -1498 -1978 -2114 -1105 799 1305 1775 2060 886 -483 -1197 -1820 -2161 -991 367 1096 1847
4044 1847 2203 1014 -490 -1133 -1649 -2111 -1324 210 1011 1783 2124 1420 -102 -1156 -1661 -2130 -1263 307
4062 307 1199 1629 2221 1478 -128 -952 -1532 -2043 -1507 45 849 1407 2049 1342 -78 -748 -1419 -2247 -1728
4081 -1728 -188 670 1338 2092 1737 284 -648 -1397 -2149 -1764 -439 609 1396 2075 1575 406 -488 -1166
4099 -1166 -1913 -1874 -692 173 968 2042 1910 648 -303 -1183 -2053 -1971 -614 430 916 1983 1980 732 -455
4118 -455 -1015 -1963 -2033 -864 237 1047 1984 2157 751 -62 -909 -1902 -2163 -658 22 936 1675 1998 1244
4137 1244 231 -705 -1903 -2063 -1179 -221 415 1520 1901 1151 26 -500 -1686 -2100 -1309 -258 328 1696
$$ packed form
4008a644k89J63J209J644N46L15k95q33j934m48n14J32J088J665Q45L53j10r42
4026I51j601q48m80j36J009J904N06M70K85j174j369p14o23l41J170J358P29P51
4044A847L56j189j504o43n16m62P87J534Q01P72L41p04j522j054n05m69Q67J570
4062C07Q92M30N92p43j606q24n80n11N36J552Q04N58O42p07j420o70o71q28N19
4081a728J540Q58O68P54l55j453r32p49p52L85J325J048P87O79n00j169q94o78
4099a166p47L9J182Q65P95J074j32j262r51q80q70Q2J357J044M86J067lj248j187
4118d55n60r48p0J169J101Q10R37J73j406q13q47r93k61J505O80R14P39L23p54
4137A244j013r36j198j60Q84R58O36J105L81p50j125n26j186m14P91J051N86J368
$$ plain form
4155 1696 1944 1073 270 -265 -1630 -1887 -1132 -365 204 1597 1987 1262 477 -216 -1522 -1969 -1103 -647 204
4174 204 1386 2116 1355 488 -181 -1364 -1960 -1285 -564 116 1133 2019 1305 577 187 -1096 -2079 -1390 -729
4193 -729 -133 1108 1860 1461 780 157 -1157 -1836 -1513 -743 -212 787 1940 1664 803 547 -879 -1900
4211 -1900 -1466 -769 -306 916 1635 1541 965 494 -858 -1558 -1478 -1056 -710 621 1825 1394 1106 612 -752
4230 -752 -1574 -1490 -1210 -792 406 1783 1540 1336 723 -592 -1661 -1453 -1128 -649 517 1627 1287 1098
4248 1098 748 -331 -1466 -1463 -1305 -783 261 1287 1461 1222 974 -337 -1438 -1314 -1014 -1131 54 1364
4266 1364 1309 1236 1131 18 -1308 -1462 -1365 -1045 -8 1076 1202 1192 1232 58 -1250 -1367 -1276 -1178 -151 1106
4286 1106 1339 1038 1227 283 -1043 -1140 -1247 -1180 -367 969 1490 1325 1330 496 -957 -1061 -1407 -1255 -541 959
$$ packed form
4155A696K48q71q03n35j365k57P55P67N69J393L90p25p85o93j306m47Q66M56Q51
4174B04J182P30p61q67o69j183n96O75P21O80J017Q86p14p28l90j283r83O89O61
4193g29N96J241P52l99o81o23j314o79L23P70N31R99J153k76q61k56j426j021
4211a900M34O97M63J222P19r4n76m71j352p00Q0M22L46J331J204m31k88m94j364
4230g52q22Q4K80M18J198J377k43k04o13j315j069K08L25M79J166J110l40j89
4248A098l50j079j135LJ58N22J044J026J74k39k48j311j101J24L00j17J185J310
4266A364n5p3j05j113j326j54R7L20J037J084J26j0M0j174j308j17R1R8J027J257
4286A106K33l01J89r44j326r7j07O7Q13J336N21j65Nq34j453j04l46J52P14J500
$$ plain form
4306 959 1402 1108 1362 645 -807 -1291 -1352 -1300 -709 626 1345 1374 1350 709 -604 -1165 -1304 -1521 -907 545
4326 545 1273 1323 1376 816 -449 -1085 -1233 -1438 -1044 365 1070 1379 1492 878 -434 -1002 -1242 -1494 -910 165
4346 165 914 1132 1318 856 -13 -950 -1079 -1591 -997 -70 895 1051 1522 1092 -184 -756 -889 -1498 -1248 176
4366 176 900 1208 1686 1109 -152 -555 -1020 -1504 -1415 -156 738 968 1488 1453 126 -674 -781 -1174 -1350 -140
4386 -140 587 761 1424 1360 458 -709 -537 -1538 -1522 -354 285 571 1360 1195 222 -572 -823 -1222 -1443 -390
4406 -390 461 697 1375 1441 489 -338 -659 -1278 -1500 -745 153 519 1141 1724 792 -223 -797 -1294 -1434 -747
4426 -747 121 499 1268 1460 612 36 -544 -1234 -1531 -646 94 418 1298 1579 838 39 -299 -1057 -1341 -789
4446 -789 -59 201 1061 1591 655 66 -155 -1162 -1506 -1061 -54 133 1083 1502 806 329 -220 -994 -1392
$$ packed form
4306I59M43k94K54p17j452m84o1N2N91J335P19K9k4o41j313n61j39k17O14J452
4326E45P28N0N3n60j265o36j48k05L94J409P05L09J13o14j312n68k40k52N84J075
4346A65P49K18J86m62q69r37j29n12N94R27R65J56M71m30j276n72j33o09K50J424
4366A76P24L08M78n77j261m03m65m84Q9J259Q94K30N20l5j327q00j07l93j76J210
4386a40P27J74O63o4r02j167J72j001J6J168O39K86P89j65r73p94k51l99k21J053
4406c90Q51K36O78O6r52q27l21o19k22P55Q98L66O22N83r32j015n74m97j40O87
4426g47Q68L78P69J92q48n76n80o90k97Q85P40L24Q80K81p41p99l38p58k84N52
4446g89P30K60Q60N30r36n89k21j007l44M45J007J87R50M19o96m77n49p74l98
$$ plain form
4465 -1392 -1063 -489 130 952 1413 1019 319 -216 -860 -1359 -988 -317 -83 974 1344 855 432 -36 -952
4484 -952 -1538 -884 -293 146 780 1400 977 539 -8 -675 -1594 -915 -566 -114 780 1536 1187 460 131 -551
4504 -551 -1294 -976 -547 -157 451 1319 881 643 384 -445 -1232 -1290 -710 -588 736 1143 1135 590 421 -409 -1079
4525 -1079 -1237 -568 -406 243 1185 1199 385 241 -251 -1256 -1230 -776 -609 341 1079 1056 756 615 -255 -1217
4545 -1217 -1046 -788 -526 146 1076 1273 791 462 -136 -931 -1004 -929 -526 182 904 940 823 506 -85 -780 -1212
4566 -1212 -705 -542 -102 841 1088 989 807 138 -1004 -1052 -911 -812 91 820 1134 732 818 160 -776 -1020 -768
4587 -768 -795 -51 837 929 912 822 410 -663 -969 -964 -854 -314 582 1176 942 815 227 -885 -984 -1064 -708 -453
4609 -453 566 906 937 794 487 -389 -944 -927 -977 -373 475 1090 701 882 543 -288 -904 -885 -916 -751 384
$$ packed form
4465a392L29N74O19Q22M61l94p00n35o44m99L71O71K34J057L70m89m23m68r16
4484i52n86O54N91M39O34O20m23m38n47o67r19O79L49M52Q94P56l49p27l29o82
4504e51p43L18M29L90O08Q68m38k38k59q29p87n8N80J22J324M07qn45j69q30o70
4525a079j58O69J62O49R42J4q14j44m92j005K6M54J67R50P38k3l00j41q70r62
4545a217J71K58K62O72R30J97m82l29n98p95p3P5M03P08P22L6j17l17n91o95m32
4566a212N07J63M40R43K47r9j82o69j142m8J41R9R03P29L14m02Q6o58r36k44K52
4587g68k7P44Q88R2j7r0m12j073l06NJ10N40Q96N94k34j27n88j112r9q0L56K55
4609d53J019L40L1j43l07q76n55J7n0O04Q48O15l89J81l39q31o16J9l1J65J135
$$ plain form
4630 384 989 911 891 520 -75 -901 -1023 -1059 -698 183 795 706 1011 659 -62 -724 -914 -1020 -631 244 811
4651 811 668 920 871 93 -632 -828 -820 -767 1 549 539 1239 884 -20 -563 -839 -864 -718 -4 698 658 851
4673 851 858 54 -508 -794 -988 -728 40 416 728 885 1049 260 -478 -519 -1026 -957 -193 426 637 855 1033
4694 1033 140 -245 -671 -1143 -1049 -371 329 769 784 1184 515 -216 -724 -945 -1103 -341 643 621 734 1045 661
4715 661 -422 -480 -766 -1143 -347 287 652 703 1112 608 46 -327 -982 -1000 -598 71 304 1058 1012 362 -150
4736 -150 -345 -642 -1189 -659 -7 389 833 1067 799 18 -417 -857 -892 -486 -75 409 713 1272 576 108
4756 108 -237 -619 -1086 -703 -51 179 754 1101 793 212 -184 -848 -991 -867 77 47 556 1144 825 341
4776 341 -193 -414 -1058 -926 -482 41 670 1036 842 394 95 -487 -1130 -557 -131 110 727 895 834 289
$$ packed form
4630C84O05p8k0l71n95q26j22l6L61Q81O12q9L05l52p21o62j90j06L89Q75N67
4651H11j43K52m9p78p25j96QN3P68N48j0P00l55r04n43k76k5J46P14P02m0J93
4673H51Pq04n62k86j94K60P68L76L12J57J64p89p38m1n07O9P64O19K11K18J78
4694A033q93l85m26m72R4O78P00M40J5M00o69p31n08k21j58P62R84k2J13L11l84
4715F61j083n8k86l77P96O34L65N1M09n04n62l73o55j8M02O69K33P54m6o50n12
4736a50j95k97n47N30O52L96M44K34k68p81m35m40l5M06M11M84L04N59o96m68
4756A08l45l82m67L83O52K30N75L47l08n81l96o64j43J24R44l0N09N88l19m84
4776C41n34k21o44J32M44N23O29L66j94m48k99n82o43N73M26K41O17J68o1n45
$$ plain form
4796 289 209 -368 -1058 -867 -333 -63 391 1076 886 454 59 -449 -898 -865 -491 76 405 800 833 594 263
4817 263 -312 -914 -1025 -612 -3 373 737 873 710 96 -38 -749 -946 -615 -181 261 1073 948 634 173
4837 173 -189 -849 -948 -542 -478 34 847 1055 767 426 -263 -916 -1012 -643 -378 178 717 971 594 353 -107
4858 -107 -688 -911 -629 -433 -79 716 939 507 446 243 -540 -987 -665 -324 -216 521 926 795 393 186
4878 186 -594 -1008 -634 -642 -100 475 843 640 798 60 -496 -889 -836 -689 -572 461 846 847 424 207 -413
4899 -413 -667 -610 -659 -442 325 842 846 518 253 -240 -1010 -671 -776 -362 413 765 621 661 450 -298 -801 -512
4921 -512 -501 -418 83 697 686 684 565 -73 -718 -606 -618 -420 37 507 709 835 650 -8 -621 -804 -584 -505
4943 -505 60 745 670 821 627 39 -755 -824 -692 -703 66 519 723 739 781 -43 -513 -481 -665 -656 -238 509 614
$$ packed form
4796B89q0n77o90J91N34K70M54O85j90m32l95n08m49L3L74N67L29L95L3k39l31
4817B63n75o02j11M13O09L76L64J36j63o14j34p11j97L31M34M42Q12j25l14m61
4837A73l62o60r9M06O4N12Q13K08k88l41o89o53r6L69K65N56N39K54l77k41m60
4858a07n81k23K82J96L54P95K23m32o1k03p83m47L22L41J08P37M05j31m02k07
4878A86p80m14L74qN42N75L68k03J58p38n56l93N3J47J17J033L85Jm23k17o20
4899d13k54N7m9K17P67N17Ml28k65m93p70L39j05M14P75L52j44M0k11p48n03K89
4921e12J1Q3N01O14j1kj19o38o45J12j2J98M57M70K02J26j85o58o13j83K20P9
4943e05N65O85p5J51j94n88p94o9J32j1P69M53K04J6M2q24m70L2j84RM18P47J05
$$ plain form
4966 614 850 947 156 -544 -624 -624 -761 -123 558 502 801 929 202 -342 -788 -608 -722 -395 508 587 622 788
4988 788 200 -349 -700 -594 -927 -214 426 531 659 680 486 -265 -436 -650 -738 -528 332 678 786 844 301
5009 301 -267 -398 -644 -904 -664 180 656 695 791 483 -155 -382 -870 -934 -602 -156 238 565 924 788 98
5030 98 -298 -743 -821 -308 73 297 379 822 503 194 -276 -743 -803 -655 -49 210 654 1006 830 99 -362
5051 -362 -435 -986 -857 -261 202 467 907 467 28 29 -310 -902 -767 -308 203 540 977 800 225 -56 -477
5072 -477 -953 -774 -348 34 369 763 661 449 -176 -553 -801 -968 -385 52 298 720 883 379 -267 -266 -689
5093 -689 -949 -359 11 387 825 925 304 -166 -336 -914 -714 -490 -73 137 866 868 512 80 -306 -948 -784
5114 -784 -361 -112 232 695 734 427 243 -290 -524 -857 -367 -224 35 535 982 630 194 -139 -458 -832
$$ packed form
4966F14K36R7p91p00q0%j37O38O81n6K99J28p27n44m46J80j14L27R03P9L5J66
4988G88n88n49l51J06l33P13O40J05J28K1j94p51j71k14q8K10Q60L46J08N8n43
5009C01n68j31k46k60K40Q44M76L9R6l08o38k27m88o4L32M46L94L27L59j36o90
5030I8l96m45p8N13L81K24Q2M43l19l09m70m67o0J48O06K59M44L52j76p31m61
5051c62p3n51J29N96M63K65M40m40m39Jl39n92J35M59N11L37M37j77n75k81m21
5072d77m76J79M26L82L35L94j02k12o25l77k48j67N83M37K46M22J63n04o46Jm23
5093f89k60N90L70L76M38J00o21m70j70n78K00K24M17K10P29Kl56m32l86o42J64
5114g84M23K49L44M63L9l07j84n33k34l33M90J43K59N00M47l52m36l33l19l74
$$ plain form
5134 -832 -681 -379 107 680 942 575 168 4 -560 -1013 -581 -302 94 721 852 846 337 -75 -363 -764 -554
5155 -554 -488 -108 449 948 715 281 42 -580 -761 -621 -389 58 435 895 857 637 203 -518 -817 -791 -385
5176 -385 -181 205 746 410 435 63 -257 -664 -784 -455 -103 342 894 736 630 311 -195 -788 -878 -391 -366
5197 -366 223 768 598 650 430 -92 -601 -765 -396 -177 161 696 744 467 177 -144 -660 -724 -701 -462 167
5218 167 463 723 655 519 27 -556 -792 -681 -411 63 528 746 569 451 -50 -652 -767 -653 -682 -35 525
5239 525 635 554 459 123 -360 -822 -767 -456 16 680 590 624 735 174 -422 -591 -698 -492 -343 542 680 606
5261 606 524 225 -254 -668 -481 -748 -307 226 482 605 449 275 -398 -413 -578 -680 -281 220 653 479 915
5282 915 383 -286 -513 -722 -620 -478 234 381 446 577 327 -179 -360 -481 -765 -381 86 623 390 647
$$ packed form
5134h32J51L02M86N73K62l67m07j64n64m53M32K79L96O27J31on09m12k88m01K10
5155e54O6L80N57M99k33m34k39o22j81J40K32M47L77M60l8k20m34p21k99K6M06
5176c85K04L86N41l36K5l72l20m07j20L29L52M45N52j58j06l19n06n93r0M87K5
5197c66N89N45j70N2k20n22n09j64L69K19L38N35M8k77k90l21n16o4K3K39O29
5218A67K96K60o8j36m92n83k36J11K70M74M65K18j77j18n01o02j15J14k9O47N60
5239E25J10q1r5l36m83m62N5L11M72O64r0L4J11n61n96j69j07K06J49Q85J38p4
5261F06q2k99m79m14J87k67M41N33K56J23j56j74o73j5j65j02L99N01M33j74M36
5282I15n32o69k27k09J02J42P12J47O5J31k50n06j81j21k84L84M67N37k33K57
$$ plain form
5302 647 646 74 -412 -555 -730 -664 108 372 399 749 457 72 -437 -454 -712 -652 -143 377 406 612 645 -113 -340
5325 -340 -464 -732 -726 168 337 406 897 892 138 -236 -435 -745 -770 -93 215 679 663 420 53 -209 -338 -679
5347 -679 -689 -250 255 361 854 687 216 -101 -458 -847 -779 -336 181 315 690 801 287 -17 -426 -712 -808
5368 -808 -278 -11 392 561 618 464 29 -538 -666 -770 -287 34 514 801 600 519 4 -290 -661 -793 -379
5389 -379 106 289 739 574 499 -115 -296 -698 -931 -406 177 441 352 629 461 -12 -370 -485 -761 -382 -118
5410 -118 307 523 919 444 136 -137 -500 -731 -448 -322 -87 537 957 548 279 94 -651 -760 -441 -312
5430 -312 177 386 559 762 308 189 -551 -654 -450 -168 -102 425 766 655 184 -47 -212 -849 -805 -632 113
5451 113 368 600 537 208 11 -473 -650 -592 -268 -164 215 885 409 359 -21 -556 -605 -718 -208 -243 314 823
$$ packed form
5302F47jn72m86j43j75O6P72K64K7L50k92l85n09j7k58O0N09N20K9K06L3p58k27
5325c40j24k68OQ94J69O9M91np54l74j99l10k5O77L08M64j6k43l67k62j29l41
5347f79j0M39N05J06M93j67m71l17l57l89O8M43N17J34L75J11n14l04m09k86r6
5368h08N30K67M03J69N7j54m35n67j28j04M83L21M80K87k01q1n15k94l71j32M14
5389c79M85J83M50j65p5o14j81m02k33N25N83K64q9K77j68m73l58j15k76L79K64
5410a18M25K16L96m75l08k73l63k31K83J26K35O24M20m09k69j85p45j09L19J29
5430c12M89K09J73K03m54j19p40j03K04K82O6N27L41j11m71k31j65o37M4J73P45
5451A13K55K32o3l29j97m84j77N8L24J04L79O70m76n0l80n35m9j13N10l5N57N09
$$ plain form
5473 823 766 593 133 6 -549 -873 -381 -239 137 666 617 499 277 -259 -854 -731 -374 -315 81 699 708 508
5495 508 256 -146 -435 -583 -478 -299 -45 535 801 504 90 -33 -399 -678 -544 -150 -42 640 691 443
5515 443 557 32 -433 -569 -566 -518 -176 369 423 426 631 -115 -569 -725 -407 -255 -78 423 661 439 421 135
5537 135 -334 -732 -451 -576 -253 413 484 622 505 14 -357 -501 -693 -384 -184 287 631 638 818 291 -408
5558 -408 -407 -470 -674 -317 235 432 670 343 180 -253 -685 -753 -602 -455 178 396 639 625 379 -81 -513 -699
5580 -699 -737 -278 209 543 560 566 345 -319 -394 -473 -617 -445 66 456 525 690 610 -99 -565 -488 -590 -448 -57
5603 -57 229 420 662 343 165 -373 -659 -747 -576 -150 175 603 673 464 304 -485 -594 -605 -383 -82 208
5624 208 541 600 628 12 -37 -363 -609 -689 -123 279 514 693 607 361 -211 -426 -754 -431 -189 5 504 561
$$ packed form
5473H23n7j73m60j27n55l24M92J42L76N29m9j18k22n36n95J23L57N9L96O18Rk00
5495E08k52m02k89j48J05J79K54N80K66k97m14j23l66k79J34L94J08O82N1k48
5515D43J14n25m65j36LM8L42N45N4LK05p46m54j56L18J52J77N01K38k22j8k86
5537A35m69l98K81j25L23O66P1J38j17m91l71j44j92L09K00M71L44PJ80n27o99
5558d08Jo3k04L57N52J97K38l27j63m33m32o8J51J47O33K18K43j4k46m60m32j86
5580f99l8M59M87L34J7Ok21o64p5p9j44J72N11L90O9J65q0p09m66P7j02J42L91
5603e7K86J91K42l19j78n38k86q8J71M26L25M28P0k09j60p89j09j1K22L01K90
5624B08L33N9K8o16m9l26k46q0N66M02K35J79q6k46n72k15l28L23K42J94M99N7
$$ plain form
5646 561 501 271 -199 -130 -652 -619 -322 -58 358 688 493 425 -45 -457 -738 -558 -189 82 395 663 668 313
5668 313 32 -308 -612 -736 -228 14 256 510 757 436 93 -235 -373 -699 -492 -215 334 439 785 484
5688 484 244 -73 -302 -813 -370 -139 155 478 539 452 -25 -100 -470 -566 -662 5 39 407 750 519 -22 -266
5710 -266 -367 -616 -745 -184 307 517 641 495 170 -81 -288 -492 -531 32 99 295 717 566 215 -45 -562
5731 -562 -712 -405 -255 -80 305 703 613 433 49 -230 -898 -720 -228 -49 321 596 519 343 -8 -251 -582
5752 -582 -774 -205 -69 310 432 496 395 -14 -228 -391 -320 -336 36 390 368 571 200 206 -29 -336 -598 -428
5774 -428 -14 262 649 646 276 343 -160 -446 -537 -450 -399 168 652 630 555 479 -52 -478 -546 -442 -302 78 497
5797 497 616 360 397 211 -597 -577 -344 -363 27 527 637 708 405 83 -435 -402 -432 -260 -92 373 519 477
$$ packed form
5646E61o0k30m70O9n22L3K97K64M16L30j95o8m70m12k81J80L69K71L13K68Nl55
5668C13k81l40l04j24N08K42K42K54K47l21l43l28j38l26K07K77N49J05L46l01
5688D84k40l17k29n11M43K31K94L23O1q7m77p5l70r6r6O67L4L68L43k31n41k44
5710b66j01k49j29N61M91K10J24j46l25k51k07k04l9N63O7J96M22j51l51k60n17
5731e62j50L07J50J75L85L98r0j80l84k79o68J78M92J79L70K75p7j76l51k43l31
5752e82j92N69J36L79J22O4j01m09k14j63P1j6L72L54k2K03l71Ok35l07k62J70
5774d28M14K76L87ll70O7n03k86r1Q7N1N67M84k2p5p6n31m26o8J04J40L80M19
5797D97J19k56L7j86q08K0K33j9L90N00J10P1l03l22n18L3l0J72J68M65J46m2
$$ plain form
5819 477 551 162 -288 -709 -491 -167 -58 133 480 455 494 -71 -190 -532 -523 -586 -181 194 620 546 319 77
5841 77 -328 -366 -385 -457 -152 108 470 608 827 420 -7 -564 -412 -334 -307 42 328 534 589 231 -213 -618
5863 -618 -637 -533 -341 116 436 398 682 114 -110 -341 -552 -538 -395 -146 251 407 486 359 -35 -425 -403 -529
5885 -529 -421 74 274 658 494 425 122 -336 -413 -602 -390 -21 110 455 566 429 195 -261 -450 -615 -661
5906 -661 -256 223 517 417 323 13 -133 -686 -442 -522 -97 449 386 435 394 76 -166 -398 -538 -688 -132 81
5928 81 328 522 670 360 -204 -173 -503 -560 -314 107 70 470 670 353 -16 -135 -394 -544 -331 29 457
5949 457 428 507 411 7 -340 -540 -361 -228 -86 165 714 664 456 141 -273 -231 -475 -366 -134 337 460 491
5971 491 337 -47 -336 -122 -594 -388 -103 75 355 649 381 -31 -170 -385 -253 -290 -86 73 349 555
$$ packed form
5819D77P4l89m50m21K18L24J09J91L47k5L9n65j19l42Ro3M05L75M26p4k27k42
5841G7m05l8j9p2L05K60L62J38K19m07m27n57J52P8K7L49K86K06N5l58m44m05
5863f18j9J04J92M57L20l8K84n68k24k31k11J4J43K49L97J56P9j27l94l90K2j26
5885e29J08M95K00L84j64o9l03m58p7j89K12L69J31L45J11j37k34m56j89j65m6
5906f61M05M79K94j00r4l10j46n53K44q0M25N46o3M9m1l18k42k32j40j50N56K13
5928H1K47J94J48l10n64L1l30n7K46M21l7M00K00l17l69j19k59j50K13L60M28
5949D57k9P9r6m04l47k00J79J33J42K51N49n0k08l15m14M2k44J09K32M71J23L1
5971D91j54l84k89K14m72K06K85J78K80K94k68m12j39k15J32l7K04J59K76K06
$$ plain form
5991 555 348 266 -20 -224 -710 -240 -222 28 326 443 516 249 -60 -328 -411 -478 -309 63 246 543 491 142
6013 142 136 -299 -469 -435 -45 -164 59 485 341 283 90 -89 -586 -363 -404 17 129 437 450 255 108 -99
6035 -99 -455 -540 -286 -111 41 405 320 379 131 -167 -576 -479 -500 -101 209 489 566 315 305 -3 -406 -494 -388
6058 -388 -264 -167 463 899 455 185 -47 -266 -514 -437 -126 130 383 533 322 413 175 -422 -421 -353 -393 107
6080 107 307 342 516 200 0 -509 -482 -599 -257 172 152 375 405 345 165 -211 -430 -288 -357 -107 301 512
6102 512 571 340 76 -137 -370 -556 -224 -191 57 235 376 402 253 80 -255 -324 -455 -257 120 338 323 219
6124 219 137 -148 -379 -491 -350 -168 297 318 278 568 351 -138 -286 -298 -322 28 7 336 137 495 280 -145
6146 -145 -349 -266 -381 -258 64 248 592 629 317 15 -304 -529 -458 -335 -26 188 192 462 331 37 -188 -287
$$ packed form
5991E55k07q2k86k04m86M70J8K50K98J17P3k67l09k68q3o7J69L72J83K97n2l49
6013A42om35j70L4L90j19K23M26j44n8j93j79m97K23m1M21J12L08J3j95j47k07
6035i9l56q5K54J75J52L64q5N9k48k98m09R7k1L99L10K80P7k51j0l08m03q8J06
6058c88J24R7O30M36m44k70k32k19k48P7L11K56K53J50k11R1k38n97JO8m0N00
6080A07K00L5J74l16k00n09K7j17L42M29k0K23L0o0j80l76k19J42o9K50M08K11
6102E12N9k31k64k13k33j86L32L3K48J78J41K6j49j73l35o9j31J98L77K18j5j04
6124B19q2k85k31j12J41J82M65K1m0K90k17m89j48j2k4L50k1L29j99L58k15m25
6146a45k04Q3j15J23L22J84L44L7l12l02l19k25P1J23L09K14MK70j31k94k25r9
$$ plain form
6168 -287 -370 -455 68 289 299 376 146 -106 -174 -380 -322 -361 -269 293 285 378 397 114 -220 -278 -300 -130 49 230 634
6193 634 476 149 57 -113 -253 -379 -624 -109 2 216 314 452 225 -181 -357 -420 -588 -255 198 214 483
6214 483 203 282 -229 -570 -479 -323 -47 -61 303 224 546 155 -77 -391 -325 -542 -338 -105 31 488 334 303
6236 303 159 -334 -350 -322 -401 -54 25 332 495 515 50 -71 -374 -348 -471 -112 114 280 331 383 -110 -122 -420
6259 -420 -421 -520 -199 135 293 640 362 238 -177 -339 -298 -469 -333 295 51 592 251 176 -9 -220 -488 -441
6281 -441 -206 15 55 398 546 115 22 -214 -396 -321 -6 -152 233 332 325 376 -183 -181 -444 -294 -278 -45 73
6304 73 288 459 34 86 -179 -318 -180 -20 46 -120 408 483 69 324 129 -144 -288 -358 -244 105 326 397
6326 397 383 217 -75 -297 -402 -477 -382 41 351 492 104 229 -53 -381 -368 -390 -340 134 255 329 436 223
$$ packed form
6168b87q3q5N23K21J0P7k30k52o8k06N8l9R2N62qR3J9k83l34n8k2J70J79J81M04
6193F34j58l27r2j70j40j26k45N15J11K14R8J38k27m06j76o3j68L33M53J6K69
6214D83k80P9n11l41R1J56K76j4L64p9L22l91k32l14O6k17K04K33J36M57j54l1
6236C03j44m93j6K8p9L47P9L07J63K0m65j21l03K6j23L59K26J66N1N2m93j2k98
6259d20jr9L21L34J58L47k78j24m15j62M1j71J36O28k44N41l41p5j85k11k68M7
6281d41K35K21M0L43J48m31r3k36j82P5L15j46L85R9pN1n59Kk63J50J6K33J18
6304G3K15J71m25N2k65j39J38J60O6j66N28P5m14K55j95k73j44p0J14L49K21P1
6326C97j4j66k92k22j05p5R5M23L10J41l88J25k82l28J3k2N0M74J21P4J07k13
$$ plain form
6348 223 63 -302 -452 -286 -242 -167 288 524 274 174 -4 -155 -444 -309 147 -104 175 349 267 218 35
6369 35 -228 -640 -563 -87 -212 36 579 421 276 160 28 -332 -240 -295 -108 108 369 393 332 260 -188 -296
6391 -296 -359 -291 -143 220 485 416 160 162 -97 -454 -298 -149 -125 69 412 292 191 158 -48 -345 -352 -296 -384 65
6415 65 483 439 407 244 -91 -117 -276 -293 -308 208 3 380 283 269 141 -285 -145 -169 -321 -6 251 456 376
6438 376 267 59 -3 -341 -284 -127 -40 120 79 362 354 136 -122 -130 -293 -243 -128 242 501 333 141 87 158 -433
6462 -433 -324 -91 -141 221 311 286 332 320 -180 -276 -127 -413 -76 52 260 332 490 166 -302 -244 -345 -335 -203
6485 -203 64 211 291 267 375 -135 -179 -323 -404 -56 -123 327 365 479 106 -169 -100 -411 -350 -113 -141 254 353
6508 353 307 99 26 -7 -116 -348 -289 -116 88 314 397 145 56 -71 -306 -171 -280 205 186 -36 470 244
$$ packed form
6348B23j60l65j50J66M4P5M55K36k50j00j78j51k89J35M56k51K79J74q2m9j83
6369C5k63m12P7M76j25K48N43j58j45j16j32l60R2n5J87K16K61K4o1p2m48j08
6391b96o3O8J48L63K65o9k56Kk59l57J56J49K4J94L43j20j01l3k06k97pN6q8M49
6415F5M18m4l2j63l35k6j59j7j5N16k05L77r7j4j28m26J40k4j52L15K57K05q0
6438C76j09k08o2l38N7J57Q7J60m1K83qk18k58qj63N0J15L70K59j68j92n4P1n91
6462d33J09K33n0L62R0k5M6j2n00r6J49k86L37J28K08P2J58l24m68N8j01J0J32
6485b03K67J47Q0k4J08n10m4j44q1L48o7M50L8J14l73k75O9l11O1K37k8L95R9
6508C53m6k08p3l3j09k32N9J73K04K26Q3k52q9j27k35J35j09M85j9k22N06k26
$$ plain form
6530 244 4 -117 -105 -188 -266 41 146 328 247 520 284 -256 -133 -230 -413 -34 -108 60 399 352 206 113 -111
6553 -111 -410 -409 -193 -69 272 330 503 109 -51 -114 -249 -253 -129 22 96 336 486 280 48 -143 -353 -396 -262
6576 -262 7 262 403 466 287 84 -95 -92 -436 -171 -273 223 269 354 347 104 -232 -261 -248 -434 -45 9 172
6599 172 457 327 -187 -81 -254 -423 -487 84 31 348 371 229 101 -38 -369 -417 -148 -45 -428 166 354
6620 354 323 166 -23 -207 -489 -120 -177 -85 44 292 422 33 40 -165 -314 -279 -224 -66 194 391 449 214 44
6643 44 -195 -359 -344 -260 -104 109 424 274 183 129 -70 -368 -73 -261 -211 181 364 358 305 152 -165 -105 -336
6666 -336 -398 1 129 259 304 289 147 -129 -273 -235 -141 -118 -51 253 276 268 92 136 -357 -479 -130 -372 13 124
6690 124 302 364 326 153 -239 -346 -258 -170 13 266 207 132 183 105 -136 -278 -272 -247 -50 327 85 214 313 87
$$ packed form
6530B44k40j21J2q3p8L07J05J82q1K73k36n40J23r7j83L79p4J68L39m7j46r3k24
6553a11k99JK16J24L41N8J73l94j60o3j35mJ24J51P4K40J50k06k32j91k10m3J34
6576b62K69K55J41O3j79k03j79Ll44K65j02M96M6Q5pk43l36k9J3j86L89N4J63
6599A72K85j30n14J06j73j69o4N71n3L17K3j42j28j39l31m8K69J03l83N94J88
6620C54l1j57j89j84k82L69n7R2J29K48J30l89Pk05j49L5N5J58K60J97N8k35j70
6643D4k39j64J5Q4J56K13L15j50r1n4j99k98K95j88N0L92J83on3j53l17O0k31
6666c36o2L99J28J30M5j5j42k76j44L8R4K3O7L04K3qj76M4m93j22L49k42L85J11
6690A24J78O2l8j73l92j07Q8Q8J83K53n9p5N1p8k41j42OK5J97L77k42J29R9k26
$$ plain form
6714 87 -61 -178 -323 -236 16 -63 303 313 407 8 -97 -301 -240 -285 -44 -158 131 134 66 239 -298 -141 -117 -155
6738 -155 -32 -25 188 341 307 117 -84 -346 -277 -82 -169 -127 33 282 207 386 75 -150 -235 -312 -52 179 173 139
6762 139 280 292 -21 -148 -274 -250 -191 21 159 21 234 211 75 -122 -108 -270 -430 12 326 383 313 267 25
6785 25 -46 -196 -325 -518 -141 228 196 265 248 111 -132 -226 -198 -219 -258 29 286 197 160 251 -2 -220 -139 -358
6809 -358 -188 26 25 301 150 295 76 -180 -189 -275 -365 38 366 340 229 98 -15 -174 -117 -307 -116 -63 106
6832 106 48 210 97 31 -87 -211 -408 -179 109 63 141 529 396 -125 13 -135 -244 -334 -202 4 357 392
6854 392 274 133 -101 -164 -108 -350 -6 10 39 124 215 139 19 -149 -195 -292 -92 180 263 370 188 -8 59 -265
6878 -265 -464 -155 -233 101 61 448 253 180 -111 -225 -258 -302 -216 -100 -57 195 362 -181 -23 -162 -150 -158 -298
$$ packed form
6714H7j48j17j45Q7K52p9L66J0R4l99j05k04O1m5K41j14K89Lo8J73n37J57K4l8
6738a55J23PK13J53l4j90k01k62O9J95q7M2J60K49p5J79l11k25q5p7K60K31ol4
6762A39J41J2l13j27j26K4N9K12J38j38K13k3j36j97J4j62j60M42L14N7p0m6k42
6785B5p1j50j29j93L77L69l2O9j7j37k43r4K8k1l9K87K57q9l7R1k53k18Q1k19
6809c58J70K14jK76j51J45k19k56rq6r0M03L28k6j11j31j13j59N7j90J91N3J69
6832A06n8J62j13o6j18j24j97K29K88m6P8L88j33n21J38j48j09r0J32K06L53L5
6854C92j18j41k34o3N6k42L44J6K9Q5R1p6j20j68m6r7K00K72Q3J07j82j96O7l24
6878b65j99L09p8L34m0L87j95p3k91j14l3m4Q6J16M3K52J67n43J58j39J2qj40
$$ plain form
6901 -298 -85 221 247 151 202 250 -61 -203 -195 -30 -162 -17 322 336 256 -84 -224 -352 -70 -130 -386 -46 26
6924 26 393 305 87 104 -316 -446 -26 -74 225 383 480 110 197 -179 -172 -295 -363 -229 -99 166 361 253 150
6947 150 280 -147 -126 -164 -220 -79 183 -37 199 321 124 -166 -262 -365 -197 57 180 357 223 25 -53 -182
6969 -182 -196 -243 -179 -117 -49 313 310 312 -220 -266 -342 -224 -132 -20 187 228 88 111 88 -267 -120 -78 -181 19 -34 303
6995 303 233 203 97 -112 -104 -43 -281 -123 187 88 50 88 142 -65 -39 -328 -85 -297 2 123 46 40 -6 -91 -194
7020 -194 -212 -177 -56 -208 195 233 511 158 53 -333 -18 -310 -175 -91 181 314 136 224 152 -73 -22 -215
7042 -215 -192 115 143 263 143 83 189 114 -116 -164 -187 -193 70 7 317 376 151 -249 -248 -171 -206 -34 316 405 311
7067 311 236 156 0 -207 -266 -366 -107 216 173 291 265 175 3 -247 -233 -216 -252 -98 99 159 248 92 81 -8
$$ packed form
6901b98K13L06K6r6N1M8l11j42QJ65j32J45L39J4q0l40j40j28K82o0k56L40P2
6924B6L67q8k18J7m20j30M20m8K99J58R7l70Q7l76Pj23o8J34J30K65J95j08j03
6947A50J30m27K1l8n6J41K62k20K36J22j97k90r6j03J68K54J23J77j34j98p8j29
6969a82j4m7O4O2O8L62lKn32m6p6J18R2J12K07M1j40K3k3l55J47M2j03K00n3L37
6995C03p0l0j06k09QO1k38J58L10r9l8L8N4k07K6k89K43k12K99J21p7om6q5j03
7020a94j8L5J21j52M03L8K78l53j05l86L15k92J35Q4K72J33j78Q8p2k25N1j93
7042b15K3L07K8J20j20o0J06p5k30m8k3oK63o3L10N9k25m00JP7l5J72L50Q9r4
7067C11p5q0j56k07n9j00K59L23m3J18k6r0j72k50J4J7l6J54J97O0Q9j56j1q9
$$ plain form
7091 -8 -375 -143 70 11 -66 182 404 129 27 -63 -131 -101 -260 -30 100 142 99 181 -154 -289 -280 -125 -113 83
7115 83 207 -2 307 388 -24 -119 -218 -278 -290 -65 8 66 261 364 111 2 -186 -251 -14 -184 94 123 170 49
7139 49 172 58 -330 -274 -56 -151 21 26 437 252 4 244 -210 -133 -417 -198 -28 69 192 312 47 -20 68
7162 68 -437 -380 144 -44 124 237 145 17 -3 24 -311 -91 -95 5 117 195 132 -22 114 -208 -346 -183 -330
7185 -330 -30 118 79 443 195 106 -32 -161 -130 -156 1 -24 220 257 134 82 -29 -137 -122 -235 -90 -339 68
7208 68 76 192 211 -29 -19 -155 -187 62 30 268 205 176 205 -89 -154 -155 -367 -198 115 12 258 207 116 -9 -81
7233 -81 -361 -274 -46 -129 204 121 209 178 -114 -228 -236 -96 -105 -52 36 246 198 285 149 -63 -153 -12 -65 -72 -60 157
7259 157 232 94 84 -166 -75 -301 -356 -57 289 252 162 94 125 -27 -147 43 -343 -133 117 23 224 186 199 107
$$ packed form
7091hl67K32K13n9p7K48K22k75j02r0o8L0j59K30J30M2m3Q2l35j35RJ55J2J96
7115H3J24k09L09Q1m12r5r9o0j2K25P3N8J95J03k53j09j88o5K37j70K78K9M7j21
7139D9J23j14l88N6K18r5J72NM11j85k48K40m54P7k84K19J70R7J23J20k65o7Q8
7162F8n05N7N24j88J68J13r2j28k0K7l35K20mJ00J12P8o3j54J36l22j38J63j47
7185c30L00J48l9L64k48q9j38j29L1k6J57k5K44L7j23n2j11j08J5j13J45k49M07
7208F8QJ16J9k40J0j36l2K49l2K38o3k9K9k94o5jk12J69L13j03K46n1r1j25p2
7233h1k80Q7K28q3L33q3Q8l1k92j14qJ40rN3Q8K10m8Q7j36k12r0J41n3pJ2K17
7259A57P5j38j0k50R1k26n5K99L46l7r0o8L1j52j20J90l86K10K50r4K01l8J3r2
$$ plain form
7283 107 26 -139 -158 -65 27 217 16 108 -150 42 32 -208 -117 95 119 113 271 150 50 -229 -108 -183 -299 -87
7307 -87 -21 226 71 256 174 -53 -220 -196 -207 -173 -60 151 150 157 329 180 -205 -258 -189 -119 -148 230 231 211 142 297
7333 297 -62 -281 -185 -252 -128 240 247 93 321 113 -17 -211 -82 -81 -36 11 94 290 25 141 -183 -180 -173 -371
7357 -371 -141 4 119 359 -10 239 -189 -56 -120 -252 -309 -42 152 41 427 204 -23 -152 -137 -365 -178
7378 -178 85 91 326 365 377 -11 -26 -128 -242 -88 100 135 249 233 371 90 -15 -224 -145 -78 -3 101 311
7401 311 143 241 -22 -24 -80 -235 -168 -46 122 132 278 108 49 -26 -122 -282 -315 -190 -197 135 85 205 121 52 -88
7426 -88 -307 -109 -110 227 -67 208 426 145 -182 -59 -41 -198 -94 -197 217 187 300 228 33 -238 -75 -119
7448 -119 -187 -18 150 190 217 16 235 -268 -272 -266 -25 -243 140 324 20 -11 -72 -70 -109 -294 -146 72 106 137 106
$$ packed form
7283A07q1j65j9R3R2J90k01R2k58J92j0k40R1K12K4oJ58j21j00k79J21p5j16K12
7307h7O6K47j55J85q2k27j67K4j1L4J13K11jPJ72j49l85n3O9P0k9L78Jk0o9J55
7333B97l59k19R6o7J24L68Pj54K28k08j30j94J29JM5M7Q3J96k65J16l24LPj98
7357c71K30J45J15K40l69K49m28J33o4j32n7K67J94j11L86k23k27j29J5k28J87
7378a78K63OK35L9J2l88j5j02j14J54J88L5J14j6J38k81j05k09P9O7P5J04K10
7401C11j68R8k63kn6j55O7J22J68J0J46j70n9p5r6j60l3J25pL32n0J20q4o9j40
7426h8k19J98jL37k94K75K18k81l27J23J8j57J04j03M14l0J13p2j95k71J63m4
7448a19o8J69J68M0K7k01K19n03mOK41k18L83J84l04l1o1Kl9j85J48K18L4L1l1
$$ plain form
7473 106 203 -97 214 -229 -167 116 -11 -55 158 321 -37 -7 -65 -432 -147 -348 152 30 102 316 77 -51
7495 -51 -247 -318 -198 42 -163 24 321 87 129 101 80 -128 -173 -137 -284 -6 226 116 326 99 -17 -174
7517 -174 -194 -199 -66 14 54 328 159 175 150 -219 -109 4 -105 -69 -14 73 90 247 40 -53 -245 -229 -98 -124 35
7542 35 -87 235 324 68 -66 -174 -181 -192 -284 -169 71 118 195 18 -96 -237 -41 -134 -57 -151 -26 124 58 95
7566 95 -26 -230 -48 -176 -128 -1 90 13 55 395 3 15 -145 -236 -202 -153 127 330 152 191 28 -37 -247 -63
7590 -63 -44 -36 40 215 181 145 -2 -27 -194 26 -3 41 -19 28 199 382 28 -47 -176 60 82 176 -54 61 223
7615 223 160 207 68 -333 -144 -139 -19 -63 -25 351 91 72 -200 -236 -172 -223 -82 85 204 38 163 384 23
7638 23 95 -48 -89 -127 20 50 17 218 -64 135 -95 -194 22 -208 -162 32 165 360 196 140 125 -128 -69 -269
$$ packed form
7473A06R7l00L11m43O2K83j27m4K13J63l58L0n8l67K85k01N00j22P2K14k39j28
7495e1j96p1J20K40k05J87K97k34M2k8k1k08m5L6j47K78K32j10K10k27j16j57
7517a74k0nJ33Q0M0K74j69J6k5l69J10J13j09L6N5Q7J7J57k07r3j92J6J31k6J59
7542C5j22L22Q9k56j34j08pj1r2J15K40M7P7j77j14j41J96r3P7r4J25J50o6L7
7566I5j21k04J82j28M8J27R1p7M2L40l92J2j60r1L4M9K80K03j78L9j63o5k10J84
7590f3J9QP6J75l4l6j47k5j67K20k9M4o0M7J71J83l54p5j29K36K2R4k30J15J62
7615B23o3M7j39m01J89NJ20m4L8L76k60j9k72l6O4n1J41J67J19j66J25K21l61
7638B3P2j43m1l8J47L0l3K01k82J99k30r9K16k30M6J94J33J95j64n6j5k53N9k00
$$ plain form
7662 -269 -63 109 274 88 30 14 -147 -191 -117 -89 -20 -42 86 116 128 120 -111 32 -266 -77 -80 128 -55 178
7686 178 50 -91 -52 -258 -310 -251 23 -83 36 161 27 80 -35 -41 -138 -225 4 -81 78 39 -30 -67 166 -73
7710 -73 -183 -173 -54 -48 51 -52 83 -19 -32 -22 -337 -159 -261 -172 -17 241 34 8 64 -82 -287 -186 -53
7733 -53 -140 -7 63 133 92 119 9 137 -117 -54 -15 -45 267 111 -96 -231 -36 62 -104 -4 -130 -73 -44 21
7757 21 31 43 -109 -248 -158 86 76 -37 147 -73 360 -29 40 -92 -95 -38 -146 83 139 237 -102 79 2 -63
7781 -63 -170 25 -39 104 -1 184 74 6 48 -210 -296 -234 -383 -106 58 392 71 121 -80 -153 43 -61 -47
7804 -47 -70 202 176 247 216 31 -40 -149 -188 -287 -149 79 71 210 186 6 -102 -74 -143 -47 13 17 60 312 6 186
7830 186 -29 -384 -140 -19 -266 -32 244 126 250 187 -34 -140 -152 -157 -17 -39 -6 91 195 261 1 12 -191
$$ packed form
7662b69K06J72J65j86n8j6j61m4P4K8O9k2J28L0J2qk31J43k98J89lK08j83K33
7686A78j28j41L9k06n2N9K74j06J19J25j34N3j15or7q7K29q5J59l9o9l7K33k39
7710g3j10J0J19OR9j03J35j02j3J0l15J78j02Q9J55K58k07k6N6j46k05J01J33
7733e3q7J33P0P0m1K7j10J28k54O3L9l0L12j56k07j35J95R8j66J00j26N7K9O5
7757B1J0J2j52j39R0K44j0j13J84k20M33l89O9j32lN7j08K29N6R8l39J81p7o5
7781f3j07J95o4J43j05J85j10o8M2k58q6O2j49K77J64L34l21N0k01p3J96j04J4
7804d7k3K72k6P1l1j85p1j09l9r9J38K28qJ39k4j80j08K8o9R6O0MM3K52l06J80
7830A86k15l55K44J21k47K34K76j18J24o3k21j06j2nJ40k2L3R7J04O6k60J1k03
$$ plain form
7853 -191 -124 -217 64 49 189 113 83 88 -234 -52 -156 -135 -62 121 234 -61 137 -86 114 -141 -124 -201 6 38
7877 38 66 -65 208 -61 -96 58 -162 -183 -227 -118 227 -8 -70 144 -50 -184 -113 -59 29 -153 22 155 -84
7900 -84 53 -72 44 -170 -73 -65 -4 63 64 289 -92 -111 -102 -328 -184 -127 -75 122 43 121 309 -61 -190 71 -147
7925 -147 -121 36 -4 26 89 192 164 -94 -177 -63 -109 -38 182 267 62 165 178 -179 -155 -189 39 -88 -7 103
7949 103 35 -2 -106 -11 -245 -90 -148 -167 -131 19 253 107 296 -83 -234 103 -141 -300 -5 313 12 220
7971 220 -22 -17 140 -66 -163 25 -103 138 253 349 -186 -4 21 -222 -5 -144 -179 86 120 97 62 87 -37
7994 -37 -16 -115 -120 -237 186 14 195 87 19 38 -29 -101 -97 -100 -13 53 141 191 73 -35 -52 -102 54 48 20 -18 200 3
8022 3 -194 -32 -161 -3 -250 -177 -3 230 268 132 -32 -32 -36 -143 -216 5 -376 119 109 269 -138 -16 147
$$ packed form
7853a91O7r3K81j5J40p6l0Nl22J82j04K1P3J83J13k95J98k23K00k55J7p7K07L2
7877C8K8j31K73k69l5J54k20k1m4J09L45k35o2K14j94j34P1N4Q8j82J75J33k39
7900h4J37j25J16k14R7QO1O7JK25l81j9Rk26J44N7N2J97p9P8J88l70j29K61k18
7925a47K6J57m0L0O3J03k8k58q3J14m6P1K20Q5k05J03J3l57K4l4K28j27Q1J10
7949A03o8l7j04R5k34J55n8j9L6J50K34j46J89l79j51L37k44j59K95L18l01K08
7971B20k42NJ57k06r7J88j28K41J15R6n35J82K5k43K17j39l5K65L4k3l5K5j24
7994c7K1r9nj17M23j72J81j08o8J9o7p2MlQ7O6Q8N0j18j08j7n0J56ok8l8K18j97
8022Cj97J62j29J58k47P3J74K33L8j36j64%mj07p3K21l81M95j0J60m07J22J63
$$ plain form
8045 147 -186 -107 -58 -193 -14 157 259 84 29 -132 1 -139 -161 97 -12 118 -10 183 65 -189 -95 66
8067 66 -74 -46 -42 132 21 249 -164 -191 -158 -107 -30 -52 120 96 119 -154 -65 -166 -112 -55 -57 -172 120 306 128
8092 128 -50 131 -260 -103 -4 34 -19 5 52 213 53 114 -17 -109 -119 -162 -70 -142 14 61 -78 101 37 -60 -10
8117 -10 -4 9 81 31 17 163 118 87 -203 -295 -57 269 16 54 -149 294 169 -32 -149 -194 -130 -300 61 73 55
8142 55 348 -62 -109 -69 -127 -10 45 -181 50 166 -32 11 198 -88 65 -118 -101 148 -176 216 -38 -30 -34 193
8166 193 118 -82 66 -84 -66 0 146 146 43 -1 -295 -153 108 -119 54 114 205 -11 -143 45 46 -74 -218
8189 -218 35 26
$$ packed form
8045A47l33P9M9j35J79J71J02j75n5j61J33j40k2K58j09J30j28J93j18k54R4J61
8067F6j40K8MJ74j11K28m13k7L3N1P7k2J72k4K3k73Q9j01N4N7kj15K92J86j78
8092A28j78J81l91J57R9L8n3K4M7J61j60O1j31r2j0m3R2p2J56M7j39J79o4r7N0
8117a0OJ3P2n0j4J46m5l1k90r2K38L26k53L8k03M43j25k01j17m5O4j70L61J2j8
8142E5K93m10m7M0n8J17N5k26K31J16j98M3J87k86J53j83J7K49l24L92k54QmK27
8166A93p5k00J48j50J8O6J46%j03m4k94J42K61k27J73O0R1k16j32J88Jj20j44
8189b18K53r
8191B6
$$ Imaginary data points
##PAGE= N=2
##DATA TABLE= (X++(I..I)), XYDATA
$$ plain form
0 0 0 0 0 0 0 0 2 0 5 -8 8 -16 16 -19 25 -32 41 -49 59 -73 85 -105 121 -143 169 -194 231 -265 306 -352 400
31 400 -459 518 -587 666 -745 841 -941 1052 -1174 1303 -1452 1609 -1781 1970 -2175 2404
47 2404 -2648 2920 -3216 3542 -3905 4303 -4747 5248 -5807 6452 -7183 8039 -9049 10258
61 10258 -11748 13621 -16075 19431 -24325 32172 -46802 83603 -382345 -501441 184275
72 184275 183719 370512 595091 491676 67312 -123312 -401480 -693422 -562215 -31231 253381
83 253381 372068 525973 523430 189199 -158691 -427576 -594157 -510071 -151074 168145 371849
94 371849 511989 502922 254937 -87798 -412877 -593727 -491154 -175350 105233 325121
104 325121 512249 510764 252742 -59980 -322012 -533229 -543186 -255205 101750 318296 445043
$$ packed form
0@%%%%%%KkNj3J6k4L2l5M4n7P3r0J08j32J58j90K26k64L12l63M25m96N71o58P52
31D00q59R77j105J253j411J586j782J993k226K477k755L061l390L751m145M579
47B404n052N568o136O758p447Q208r050R995j1055J2259j3635J5222j7088J9307
61A0258k2006K5369k9696L5506m3756N6497p8974J30405m65948j19096O85716
72A84275n56J86793K24579j03415m24364j90624k78168k91942J31207N30984K84612
83B53381J18687J53905k543l34231l47890k68885j66581Q4086L58997L19219K03704
94C71849J40140r067k47985l42735l25079j80850J02573L15804K80583K19888
104C25121J87128j485k58022l12722k62032k11217r957K87981L56955K16546J26747
$$ plain form
115 445043 497306 336860 -14676 -344236 -504588 -475759 -276582 5629 253975 438202
125 438202 521936 376893 11088 -328165 -467228 -454529 -317925 -42139 239956 401791
135 401791 479823 419480 91191 -311787 -461223 -410586 -337356 -137255 209086 433884 454009
146 454009 386977 155479 -238366 -461416 -404212 -319682 -203548 125183 447966 480114 349387
157 349387 178022 -129680 -432924 -467370 -321488 -169575 64721 357911 484818 398964
167 398964 197578 -97574 -378988 -460415 -363144 -197579 52625 327184 449678 399305
177 399305 239395 -44810 -344676 -449234 -372479 -235378 1219 304560 455918 397872
187 397872 244701 1960 -293444 -439764 -382348 -251069 -47525 250682 454506 421414
$$ packed form
115D45043N2263j60446l51536l29560j60352K8829J99177K82211K48346J84227
125D38202Q3734j45043l65805l39253j39063J2699J36604K75786K82095J61835
135D01791P8032o0343l28289m02978j49436N0637P3230K00101L46341K24798K0125
146D54009o7032k31498l93845k23050N7204Q4530J16134L28731L22783L2148j30727
157C49387j71365l07702l03244l4446J45882J51913K34296K93190J26907q5854
167C98964k01386k95152k81414q1427R7271J65565K50204K74559J22494n0373
177C99305j59910k84205k99866j04558P6755J37101K36597L03341J51358n8046
187C97872j53171k42741k95404j46320N7416J31279K03544K98207K03824l3092
$$ plain form
197 421414 249073 27576 -230972 -415008 -415640 -274818 -54600 210470 407896 426720 287869
208 287869 61442 -196388 -386975 -422523 -305108 -82379 180631 377590 422513 311775
218 311775 93962 -159925 -356822 -421371 -328892 -112711 143952 345592 423931 340688 118808
229 118808 -134678 -321300 -406794 -354518 -148002 114401 311930 408641 367005 158393 -109411
240 -109411 -296075 -386826 -371191 -189089 85860 292848 388667 371171 196418 -68465 -271772
251 -271772 -376344 -379976 -219274 50504 265100 372956 380157 227883 -35793 -245704 -357583
262 -357583 -383916 -250183 16418 237628 350974 382442 264247 1859 -227888 -341451
272 -341451 -375600 -276617 -26991 212437 338360 376283 285336 44666 -197524 -330315 -372728
$$ packed form
197D21414j72341k21497k58548j84036o32J40822K20218K65070J97426J8824j38851
208B87869k26427k57830j90587l5548J17415K22729K63010J96959M4923j10738
218C11775k17813k53887j96897o4549R2479K16181K56663K01640P8339q3243k21880
229A18808k53486j86622q5494N2276K06516K62403J97529R6711m1636k08612k67804
240a09411j86664r0751J5635J82102K74949K06988R5819j7496j74753k64883k03307
251b71772j04572l632J60702K69778K14596J07856P201j52274k63676k09911j11879
262c57583k6333J33733K66601K21210J13346L1468j18195k62388k29747j13563
272c41451l4149R8983K49626K39428J25923L7923r0947k40670k42190j32791m2413
$$ plain form
283 -372728 -293415 -66003 179327 324893 373958 299842 79431 -162630 -311584 -370624 -310757
294 -310757 -99611 148929 306627 367349 313526 114622 -130331 -296057 -363888 -320017 -133447
305 -133447 111956 289089 362592 321280 146742 -91067 -277515 -361767 -325070 -158728 71435
316 71435 264619 361529 329500 168317 -54235 -249364 -357095 -334510 -180084 37163 235229
327 235229 354574 339669 188493 -22490 -218859 -347084 -344245 -201173 6831 205554
337 205554 341999 346546 209106 8672 -187971 -334541 -352068 -220172 -22047 174086
347 174086 326690 353171 227949 37255 -155902 -317842 -358449 -237313 -47230 140983
357 140983 305749 358897 247534 60149 -125237 -294414 -361246 -257950 -70355 113270
$$ packed form
283c72728P9313K27412K45330J45566M9065p4116k20411k42061j48954n9040N9867
294c10757K11146K48540J57698O0722n3823j98904k44953j65726o7831M3871J86570
305a33447K45403J77133P3503m1312j74538k37809j86448q4252L6697J66342K30163
316G1435J93184R6910l2029j61183k22552j95129j07731K2585J54426K17247J98066
327B35229J19345j4905j51176k10983j96369j28225K839J43072K08004J98723
337B05554J36445M547j37440k00434j96643j46570j7527J31896J98125J96133
347A74086J52604K6481j25222j90694j93157j61940m0607J21136J90083J88213
357A40983J64766N3148j11363j87385j85386j69177o6832J03296J87595J83625
$$ plain form
367 113270 281166 358880 268582 83700 -101073 -270004 -356193 -276973 -96454 86662 257178
378 257178 352700 286385 110101 -75006 -246289 -348499 -291906 -121205 60547 231449
388 231449 343755 302232 135019 -51312 -221990 -335832 -305722 -147898 36690 208795
398 208795 329832 312599 161894 -26886 -201265 -320107 -310157 -174335 7195 186943
408 186943 317992 319602 185091 -2190 -180544 -304895 -311386 -195808 -20939 163271 302958
419 302958 322245 207743 25139 -160236 -290696 -310754 -215682 -48152 142343 287333
429 287333 317503 225476 55952 -136031 -277260 -307396 -231285 -78674 118175 276682 314711
440 314711 235334 82285 -107660 -262003 -306318 -243038 -102762 90635 258509 310896 248726
$$ packed form
367A13270J67896P7714r0298j84882j84773j68931q6189P9220J80519J83116J70516
378B57178R5522o6315j76284j85107j71283j02210N6593J70701J81752J70902
388B31449J12306m1523j67213j86331j70678j13842L0110J57824J84588J72105
398B08795J21037j7233j50705j88780j74379j18842R950J35822J81530J79748
408A86943J31049J610j34511j87281j78354j24351o491J15578J74869J84210J39687
419C02958J9287j14502j82604j85375j30460k0058R5072J67530J90495J44990
429B87333L0170r2027j69524j91983j41229l0136P6111J52611J96849J58507L8029
440C14711p9377j53049j89945j54343m4315O3280J40276J93397J67874N2387o2170
$$ plain form
451 248726 109441 -81630 -247892 -302370 -250944 -126136 63064 241630 304805 252909 133066
462 133066 -47278 -227583 -303008 -261468 -145548 37435 223438 299789 256210 149325 -16959
473 -16959 -202866 -296791 -268359 -164211 6435 199984 297528 264400 162319 8010 -175848
484 -175848 -288377 -275890 -178214 -17882 171721 284599 270533 179911 36832 -148067 -281422
495 -281422 -285475 -190826 -37979 143994 270535 277050 193183 55182 -119634 -259737 -289827
506 -289827 -212795 -61506 123727 258100 277423 206344 75868 -98489 -245471 -284970 -219348
517 -219348 -85075 91308 240003 283407 221808 93046 -76980 -227493 -283378 -231201 -101781
528 -101781 69169 218420 277654 234006 112781 -53452 -206197 -279240 -246078 -120016 51792
$$ packed form
451B48726j39285j91071j66262n4478N1426J24808J89200J78566O3175n1896j19843
462A33066j80344j80305p5425M1540J15920J82983J86003P6351m3579j06885j66284
473a6959j85907r3925K8432J04148J70646J93549R7544l3128j02081j54309j83858
484a75848j12529J2487R7676J60332J89603J12878j4066r0622j43079j84899j33355
495b81422m053R4649J52847J81973J26541O515q3867j38001j74816j40103l0090
506b89827P7032J51289J85233J34373J9323p1079j30476j74357j46982l9499O5622
517b19348J34273J76383J48695M3404o1599j28762j70026j50513n5885N2177J29420
528a01781J70950J49251N9234m3648j21225j66233j52745p3043L3162J26062J71808
$$ plain form
539 51792 197572 267282 246926 133640 -38123 -188446 -261819 -250837 -147058 26228 182294
550 182294 258715 252596 156253 -14813 -174750 -254367 -252868 -162573 3659 160914 244507
561 244507 256624 179739 9865 -159803 -245475 -252776 -180349 -21374 144324 236056 254553
572 254553 191364 34574 -135150 -231760 -255193 -197811 -43452 125863 222895 252616 206605
583 206605 57813 -117354 -219718 -250315 -209000 -68685 103270 210755 250248 217823 80547
594 80547 -95256 -206832 -247570 -219394 -89199 83387 195628 241253 225839 106990 -70901
605 -70901 -196316 -243348 -223746 -111358 57296 184329 239344 227386 122989 -43332 -178363
616 -178363 -240649 -229765 -129189 31034 169060 239969 231458 133622 -19397 -156473 -236939
$$ packed form
539E1792J45780O9710k0356j13286j71763j50323p3373J0982J03779J73286J56066
550A82294P6421o119r6343j71066j59937p9617J499R0295J66232J57255Q3593
561B44507J2117p6885j69874j69668q5672p301P2427J58975J65698R1732J8497
572B54553o3189j56790j69724r6610k3433N7382J54359J69315R7032K9721m6011
583B06605j48792j75167j02364l0597M1315J40315J71955J07485L9493l2425j37276
594H0547j75803j11576m0738K8176J30195J72586J12241M5625j5414j18849j77891
605g0901j25415m7032J9602J12388J68654J27033N5015j1958j04397j66321j35031
616a78363o2286J0884J00576J60223J38026P0909q511r7836j53019j37076q0466
$$ plain form
627 -236939 -236646 -140365 9899 145583 232535 241313 147797 -2747 -136992 -225362 -241076 -155871
639 -155871 -9031 127711 220793 241663 162816 21042 -117757 -218013 -243794 -166500 -28781
650 -28781 106399 210667 244843 172716 37391 -94928 -202580 -245916 -180535 -46941 85256
661 85256 196356 247119 186213 52622 -77174 -184843 -242503 -193854 -65956 66147 179128
672 179128 242804 199980 73661 -58447 -171078 -239184 -203965 -82706 47764 162655 237150
683 237150 208578 90126 -38124 -152359 -234287 -215565 -99121 32131 145340 228067 217856
694 217856 107818 -23177 -136988 -222055 -220463 -118147 12825 129597 218409 222832 125940
705 125940 -4470 -123125 -213738 -222458 -132163 -5577 113023 207864 224824 140547 14464
$$ packed form
627b36939K93R6281J50264J35684Q6952Q778r3516j50544j34245q8370j5714Q5205
639a55871J46840J36742R3082K0870p8847j41774j38799j00256k5781P7294J37719
650b8781J35180J04268L4176p2127j35325j32319j07652m3336O5381J33594J32197
661H5256J11100N0763o0906j33591j29796j07669n7660M8649J27898J32103J12981
672A79128O3676m2824j26319j32108j12631o8106L5219J21259J30470J14891P4495
683B37150k8572j18452j28250j14235q1928J8722J16444J31252J13209Q2727j0211
694B17856j10038j30995j13811q5067J592J02316J30972J16772Q8812M423r6892
705A25940j30410j18655r0613q720R0295J26586J18600R4841J6960q4277j26083
$$ plain form
716 14464 -106216 -202848 -225044 -147252 -23121 98373 196569 223535 153450 33246 -89657
727 -89657 -191176 -223052 -159980 -43105 82016 186679 221749 164290 52683 -72779 -181379
738 -181379 -220917 -168185 -61260 62804 174813 219566 172915 70416 -53466 -169369 -218121
749 -218121 -175241 -78122 43036 161822 216760 179839 86411 -33835 -155251 -214122 -181509
760 -181509 -94183 23016 147545 212665 184921 100902 -14473 -140029 -208455 -186433 -108699
771 -108699 3474 132170 207060 188429 114328 6099 -123310 -203181 -189707 -120160 -16003
782 -16003 114951 200900 191528 124327 24253 -104614 -195983 -193505 -130183 -32906 95942 191863
794 191863 195100 134533 39747 -86795 -185925 -195514 -139927 -48329 78046 181543 196383 143481
$$ packed form
716A4464j20680r6632k2196P7792J24131J21494R8196K6966p0085j20204j22903
727h9657j01519l1876O3072J16875J25121J04663L5070n7459j11607j25462j08600
738a81379l9538N2732J06925J24064J12009M4753m6651j02499j23882j15903m8752
749b18121M2880R7119J21158J18786N4938l6921r3428j20246j21416n8871L2613
760a81509Q7326J17199J24529O5120k7744q4019j15375j25556o8426K2022P7734
771a08699J12173J28696P4890j8631p4101j08229j29409p9871J3474O9547J04157
782a6003J30954Q5949r372o7201j00074j28867r1369K478O3322R7277J28848R5921
794A91863L237o0567r4786j26542r9130r589N5587R1598J26375J03497J4840n2902
$$ plain form
806 143481 54832 -69116 -174810 -195887 -148903 -62823 60194 169227 196266 152158 68512
817 68512 -51754 -161054 -194898 -157596 -76185 44380 155234 193304 160946 82248 -36316
828 -36316 -147584 -190579 -164876 -89826 28518 141659 188137 167062 95930 -19950 -134112
$$ packed form
806A43481q8649j23948j05694k1077M6984Q6080J23017J09033K7039m4108q3646
817F8512j20266j09300l3844L7302Q1411J20565J10854L8070l2358p8698j18564
828c6316j11268m2995K5703P5050J18344J13141M6478k1075p1132j15880j14162
$$ [...]
8191A56
##END NTUPLES=NMR FID
##END=
