##TITLE=1H_Pr AmC6
 200.13Hz, D2O.
 8 sc
 
17.3.2026
##JCAMPDX= 6.0         $$ Bruker NMR JCAMP-DX V2.0
##DATA TYPE= NMR FID
##DATA CLASS= NTUPLES
##ORIGIN= UXNMR, Bruker Analytische Messtechnik GmbH
##OWNER= pz
$$ XWIN-NMR		Version 3.5
$$ Tue Mar 17 13:49:03 2026 Russian Standard Time (UT+4h)  she@DPX200
##.OBSERVE FREQUENCY= 200.1313
##.OBSERVE NUCLEUS= ^1H
##.DELAY= (6, 6)
##.ACQUISITION MODE= SIMULTANEOUS
##.ACQUISITION SCHEME= undefined
##.AVERAGES= 8
##.DIGITISER RES= 18
##SPECTROMETER/DATA SYSTEM= spect
##.PULSE SEQUENCE= zg30
##.SOLVENT NAME= D2O
##.SHIFT REFERENCE= (INTERNAL, D2O, 0, 14.3821)
##AUDIT TRAIL= $$ (NUMBER, WHEN, WHO, WHERE, WHAT)
$$ ##TITLE= Audit trail, XWIN-NMR		Version 3.5
$$ ##JCAMPDX= 5.01
$$ ##ORIGIN= Bruker BioSpin GmbH
$$ ##OWNER= she
$$ F:/spectra/data/she/nmr/H-C/1/audita.txt
$$ ##AUDIT TRAIL=  $$ (NUMBER, WHEN, WHO, WHERE, WHAT)
(   1,<2026-03-17 13:47:45.01 +0400>,<she>,<DPX200>,
      <created by zg, POWCHK disabled, PULCHK disabled
       configuration hash MD5:
       00 E9 B6 7A A2 85 ED C7 34 08 36 98 17 FE 4E 26
       data hash MD5: 16K
       BB EE 6C F5 0D 50 2E 03 39 6E A7 E2 2D B7 7D 4D>)
$$ ##END=
$$ 
$$ hash MD5
$$ 4C 42 A9 23 5B AB 14 BF 95 96 48 B7 33 D3 C0 36
##$RELAX= 
##$RELAX= 
##$RELAX= 
##$RELAX= 
##$RELAX= 
##$RELAX= 
$$ Bruker specific parameters
$$ --------------------------
##$DU= <F:/spectra>
##$EXPNO= 1
##$NAME= <H-C>
##$PROCNO= 1
##$TYPE= <nmr>
##$USER= <she>
##$AMP= (0..31)
100 100 100 100 100 100 100 100 100 100 100 100 100 100 100 100 100 100 
100 100 100 100 100 100 100 100 100 100 100 100 100 100 
##$AQSEQ= 0
##$AQ_mod= 1
##$AUNM= <au_zg>
##$AUTOPOS= <>
##$BF1= 200.13
##$BF2= 200.13
##$BF3= 200.13
##$BF4= 200.13
##$BF5= 200.13
##$BF6= 200.13
##$BF7= 200.13
##$BF8= 200.13
##$BYTORDA= 1
##$CFDGTYP= 0
##$CFRGTYP= 5
##$CHEMSTR= <none>
##$CNST= (0..31)
1 1 145 1 1 1 1 1 1 1 1 1 1 1 1 1 1 1 1 1 1 1 1 1 1 1 1 1 1 1 1 1 
##$CPDPRG= <>
##$CPDPRG1= <>
##$CPDPRG2= <>
##$CPDPRG3= <>
##$CPDPRG4= <mlev>
##$CPDPRG5= <mlev>
##$CPDPRG6= <mlev>
##$CPDPRG7= <mlev>
##$CPDPRG8= <mlev>
##$CPDPRGB= <>
##$CPDPRGT= <>
##$D= (0..31)
0 0.7 0 0 0 0 0 0 0 0 0 0.03 0 0 0 0 0 0 0 0 0 0 0 0 0 0 0 0 0 0 0 0 
##$DATE= 1773740864
##$DBL= (0..7)
120 120 120 120 120 120 120 120 
##$DBP= (0..7)
150 150 150 150 150 150 150 150 
##$DBP07= 0
##$DBPNAM0= <>
##$DBPNAM1= <>
##$DBPNAM2= <>
##$DBPNAM3= <>
##$DBPNAM4= <>
##$DBPNAM5= <>
##$DBPNAM6= <>
##$DBPNAM7= <>
##$DBPOAL= (0..7)
0.5 0.5 0.5 0.5 0.5 0.5 0.5 0.5 
##$DBPOFFS= (0..7)
0 0 0 0 0 0 0 0 
##$DE= 6
##$DECBNUC= <off>
##$DECIM= 32
##$DECNUC= <off>
##$DECSTAT= 4
##$DIGMOD= 1
##$DIGTYP= 9
##$DL= (0..7)
0 120 120 120 120 120 120 120 
##$DP= (0..7)
150 150 150 150 150 150 150 150 
##$DP07= 0
##$DPNAME0= <>
##$DPNAME1= <>
##$DPNAME2= <>
##$DPNAME3= <>
##$DPNAME4= <>
##$DPNAME5= <>
##$DPNAME6= <>
##$DPNAME7= <>
##$DPOAL= (0..7)
0.5 0.5 0.5 0.5 0.5 0.5 0.5 0.5 
##$DPOFFS= (0..7)
0 0 0 0 0 0 0 0 
##$DQDMODE= 0
##$DR= 18
##$DS= 0
##$DSLIST= <SSSSSSSSSSSSSSS>
##$DSPFIRM= 0
$$ [...]
##$SUBNAM0= <"">
##$SUBNAM1= <"">
##$SUBNAM2= <"">
##$SUBNAM3= <"">
##$SUBNAM4= <"">
##$SUBNAM5= <"">
##$SUBNAM6= <"">
##$SUBNAM7= <"">
##$SUBNAM8= <"">
##$SUBNAM9= <"">
##$SW= 18.0517328524113
##$SWIBOX= (0..15)
0 0 2 0 0 0 0 0 0 0 0 0 0 0 0 0 
##$SW_h= 3612.71676300578
##$TD= 16384
##$TD0= 1
##$TE= 0
##$TE2= 300
##$TE3= 300
##$TEG= 300
##$TL= (0..7)
0 120 120 120 120 120 120 120 
##$TP= (0..7)
150 150 150 150 150 150 150 150 
##$TP07= 0
##$TPNAME0= <>
##$TPNAME1= <>
##$TPNAME2= <>
##$TPNAME3= <>
##$TPNAME4= <>
##$TPNAME5= <>
##$TPNAME6= <>
##$TPNAME7= <>
##$TPOAL= (0..7)
0.5 0.5 0.5 0.5 0.5 0.5 0.5 0.5 
##$TPOFFS= (0..7)
0 0 0 0 0 0 0 0 
##$TUNHIN= 0
##$TUNHOUT= 0
##$TUNXOUT= 0
##$USERA1= <user>
##$USERA2= <user>
##$USERA3= <user>
##$USERA4= <user>
##$USERA5= <user>
##$V9= 5
##$VALIST= <valist>
##$VCLIST= <CCCCCCCCCCCCCCC>
##$VD= 0
##$VDLIST= <DDDDDDDDDDDDDDD>
##$VPLIST= <PPPPPPPPPPPPPPP>
##$VTLIST= <TTTTTTTTTTTTTTT>
##$WBST= 1024
##$WBSW= 4
##$XGAIN= (0..3)
0 0 0 0 
##$XL= 0
##$YL= 0
##$YMAX_a= 428496
##$YMIN_a= -444675
##$ZGOPTNS= <>
##$ZL1= 120
##$ZL2= 120
##$ZL3= 120
##$ZL4= 120
##$ABSF1= 10
##$ABSF2= 0
##$ABSG= 5
##$ABSL= 3
##$ALPHA= 0
##$AQORDER= 0
##$ASSFAC= 0
##$ASSFACI= 0
##$ASSFACX= 0
##$ASSWID= 0
##$AUNMP= <proc_1d>
##$AZFE= 0.1
##$AZFW= 0.1
##$BCFW= 1
##$BC_mod= 2
##$BYTORDP= 1
##$COROFFS= 0
##$CY= -3
##$DATMOD= 1
##$DC= 2
##$DFILT= <>
##$DTYPP= 0
##$F1P= 0
##$F2P= 0
##$FCOR= 0.5
##$FTSIZE= 0
##$FT_mod= 4
##$GAMMA= 1
##$GB= 0.15
##$INTBC= 1
##$INTSCL= 1
##$ISEN= 128
##$LB= 0.25
##$LEV0= 0
##$LPBIN= 0
##$MAXI= 10000
##$MC2= 0
##$MEAN= 0
##$ME_mod= 0
##$MI= 1.114404
##$NCOEF= 0
##$NC_proc= 0
##$NLEV= 6
##$NOISF1= 3.799351
##$NOISF2= 2.8
##$NSP= 1
##$NTH_PI= 0
##$NZP= 0
##$OFFSET= 14.38212
##$PC= 1
##$PHC0= -3708.136
##$PHC1= 10.9923
##$PH_mod= 1
##$PKNL= yes
##$PPARMOD= 0
##$PSCAL= 0
##$PSIGN= 0
##$REVERSE= no
##$SF= 200.129724274929
##$SI= 16384
##$SIGF1= 3
##$SIGF2= 2
##$SINO= 400
##$SIOLD= 16384
##$SREGLST= <1H.CDCl3>
##$SSB= 0
##$STSI= 0
##$STSR= 0
##$SW_p= 3205.1282051282
##$SYMM= 0
##$S_DEV= 0
##$TDeff= 0
##$TDoff= 0
##$TI= <>
##$TILT= no
##$TM1= 0
##$TM2= 0
##$TOPLEV= 0
##$USERP1= <user>
##$USERP2= <user>
##$USERP3= <user>
##$USERP4= <user>
##$USERP5= <user>
##$WDW= 1
##$XDIM= 8192
##$YMAX_p= 0
##$YMIN_p= 0
$$ End of Bruker specific parameters
$$ ---------------------------------
##NTUPLES= NMR FID
##VAR_NAME=  TIME,          FID/REAL,        FID/IMAG
##SYMBOL=    X,             R,               I
##VAR_TYPE=  INDEPENDENT,   DEPENDENT,       DEPENDENT
##VAR_FORM=  AFFN,          ASDF,            ASDF
##VAR_DIM=   8192,          8192,            8192
##UNITS=     SECONDS,       ARBITRARY UNITS, ARBITRARY UNITS
##FACTOR=    0.0002768,     1,               1
##FIRST=     0,             0,               0
##LAST=      2.2672688,     0,               0
##MIN=       0,             -444675,         0
##MAX=       2.2672688,     428496,          0
$$ Real data points
##PAGE= N=1
##DATA TABLE= (X++(R..R)), XYDATA
0@%%%%%%%%%%%%%%%%PqRj6J6j6J6k4L2l5M1m6N2n9O7p9Q7r6J10j25J42j57J76
$$ 0 0 0 0 0 0 0 0 0 0 0 0 0 0 0 0 0 7 -1 8 -8 8 -8 8 -16 16 -19 22 -24 28 -31 36 -43 44 -52 58 -67 75 -82 94
39I4j96K19k44K67k97L28l62M02m40M84n35N90o50P15p91Q74r69J078j200J349
$$ 94 -102 117 -127 140 -157 171 -191 211 -229 255 -280 310 -340 375 -416 458 -511 567 -633 716
59G16j525J736j999K334k782L406m341N894q931J7051q1053k89141o7474O3229
$$ 716 -809 927 -1072 1262 -1520 1886 -2455 3439 -5492 11559 -69494 -358635 -426109 -362880
73c62880J42072K44901K69360J21687k8004j37157k51707k85006j38503M1976
$$ -362880 -220808 24093 293453 415140 387136 249979 -1728 -286734 -425237 -383261
83c83261J48672K21670K53548J60361j817j40876k34645k56388j57003O50J31235
$$ -383261 -234589 -12919 240629 400990 399173 258297 23652 -232736 -389739 -389089 -257854
94b57854K15806K41051J69774K9399j17234k26605k51137j63310k1099J05030
$$ -257854 -42048 199003 368777 398176 280942 54337 -196800 -360110 -381209 -276179
104b76179K01040K40583J77173M0207r4363j95681k42180j86902m4670R6527J85033
$$ -276179 -75139 165444 342617 382824 288461 92780 -149400 -336302 -380972 -284445 -99412
115i9412K21536J88570P1844p9760j92170k27904j80565o7087O5611J67561K17497
$$ -99412 122124 310694 382538 302778 110608 -117296 -297861 -364948 -299337 -131776 85721
126H5721J97723R1039o2542j77868k15618j84982q9915M7494J57924K03383J93933
$$ 85721 283444 374483 311941 134073 -81545 -266527 -356442 -308948 -151024 52359 246292
137B46292J15518l5992j70605k07935j77146j09433J3574J48941K07057J87060
$$ 246292 361810 325818 155213 -52722 -229868 -339301 -325727 -176786 30271 217331
147B17331J21183m985j50765k10273j74230j12525j6518J22464K12094J92781
$$ 217331 338514 333529 182764 -27509 -201739 -314264 -330782 -208318 3776 196557
157A96557J17469J6299j15758k07090j93395j15069j9682R5958J90770K00565
$$ 196557 314026 330325 214567 7477 -185918 -300987 -320669 -224711 -33941 166624
167A66624J33372K8009r6315j90024j96671j32176l4946Q3090J79085J96326J41719
$$ 166624 299996 328005 231690 41666 -155005 -287181 -322127 -239037 -59952 136374 278093
178B78093M6497p5888j77964j96110j40262n2160O1015J67783J99646J48580N7802
$$ 278093 324590 248702 70738 -125372 -265634 -317794 -256779 -88996 110650 259230 317032
189C17032n5399j62155j97178j48831o2757M1451J49411K00117J60074O6955m0344
$$ 317032 261633 99478 -97700 -246531 -309288 -267837 -118426 81691 241765 308720 268376
200B68376j41113j91932j63157p7076L1006J34062J89836J67566Q3460k4833j26600
$$ 268376 127263 -64669 -227826 -304902 -273896 -139834 50002 217568 301028 276195 149595
211A49595j83961j69745r2543J5782J20415J81773J71922R7858r255j12326j75653
$$ 149595 -34366 -204111 -296654 -280872 -160457 21316 193238 291096 281841 169515 -6138
222f138j73388j06054J042J05552J71089J75192J13265O028j00903j65509j73038
$$ -6138 -179526 -285580 -284538 -178986 -7897 167295 280560 286588 185685 20176 -152862
233a52862j19526j6068R3960J61448J72736J25851K4642q8566j57833j69635j29400
$$ -152862 -272388 -288456 -194496 -33048 139688 265539 290181 201615 43782 -125853 -255253
244b55253l5527P9487J55348J70950J32198M1933p1800j49983j68621j36119n1088
$$ -255253 -290780 -211293 -55945 115005 247203 289136 217336 67353 -101268 -237387 -288475
255b88475O3222J46068J68913J39244N7328n5926j41053j66329j41271o5763M7003
$$ -288475 -225253 -79185 89728 228972 286300 230374 89321 -77008 -218279 -284042 -237039
266b37039J36974J65245J43052P2742l8050j32271j64604j44104p8229K8590J25751
$$ -237039 -100065 65180 208232 280974 242924 110653 -53951 -198055 -276284 -247694 -121943
277a21943J63820J46379Q3529j9992j19120j62496j48251q8565J1637J11744J60704
$$ -121943 41877 188256 271785 251793 132673 -29823 -178074 -266639 -255002 -143258 17446
288A7446J50753R3636m445j05112j57518j51821r8736m354R7959J55667J53665
$$ 17446 168199 261835 257390 152278 -5240 -157061 -255797 -260151 -162192 -6525 147140
299A47140J02757J1107r0251j52084j54830j06962j8653Q2027J48793J56841J10660
$$ 147140 249897 261004 170753 18669 -136161 -243123 -261776 -179749 -30956 125885 236545
310B36545K4826p4114j43785j57775j15874l0858O6804J38553J58151J20778L7270
$$ 236545 261371 187257 43472 -114303 -230177 -261035 -194231 -55678 102473 223251 260521
321B60521o0470j33038j57589j24962m3823N3703J27758J56775J29151N0144m7456
$$ 260521 200051 67013 -90576 -215538 -259361 -205658 -77900 78875 208026 258170 210714
332B10714j22859j55034j32498n6518M0454J17690J53686J35812O2122l4175j12042
$$ 210714 87855 -67179 -199677 -256195 -215741 -98051 55635 191447 253569 219394 107352
343A07352j51106j38760o8676K7756J06932J48988J40801P4440k1330j01462j45659
$$ 107352 -43754 -182514 -251190 -223434 -116502 32486 173287 247727 226397 124935 -20724
354b0724j42833q1309J5259R6626J42551J44139Q6894q468r1661j39109j44726
$$ -20724 -163557 -244866 -229607 -132981 9570 153709 240603 232135 140474 1365 -143361
365a43361r2610J249Q6733J36475J44535R7633O109q1371j33503j44466j02071
$$ -143361 -235971 -234722 -147989 -11514 133021 230654 236763 155392 21889 -122577 -224648
376b24648j3472P5504J30056J44599J06043K0818o9327j26956j44160j10260k7085
$$ -224648 -238120 -162616 -32560 112039 218082 238900 169573 42617 -101543 -211803 -238888
387b38888O2858J23375J43391J13617L4564n6565j20254j42376j16413m1296N0052
$$ -238888 -176030 -52655 90736 204353 238917 182352 62098 -80278 -196691 -237987 -187935
398a87935J15784J41604J19298M7955m3027j12359j41235j21061n2600L5875J06573
$$ -187935 -72151 69453 188751 236706 193679 81320 -59915 -180976 -233576 -197701 -91128
409i1128J39634J24033N9659k9219j02954j39421j25274o3124K2213R6728J36462
$$ -91128 48506 172539 232198 202979 100025 -39396 -164670 -227794 -205581 -108853 27609
420B7609J28227O9497j5515r2603j36218j28826p2476Q838Q5785J33182J31496
$$ 27609 155836 225333 209818 117215 -19003 -147829 -220305 -211467 -125682 7500 138996
431A38996P7980k513q1569j31611j32430q0413k528P3346J27790J34671Q6507
$$ 138996 216976 214463 132894 1283 -131147 -211560 -214088 -140742 -12952 121719 208226
442B08226Q101o9585j25051j34633q9465j3739O3325J20668J35319R4423J9259
$$ 208226 216327 146742 21691 -112942 -202407 -216146 -152821 -32153 103166 197589 216848
453B16848n7669j17540j35650r7547k4827N1625J13289J36171J01798K9414m7292
$$ 216848 159179 41639 -94011 -191558 -216385 -164760 -51471 84700 186498 215912 168620
464A68620j08191j34187j05403l5787M0463J04307J34975J09172L9743l6407r9101
$$ 168620 60429 -73758 -179161 -214948 -174485 -70178 64797 173969 213712 177305 78204
475G8204j32304j11794m6149L0246R4603J31263J15653N0848k5941r0261j27524
$$ 78204 -54100 -165894 -212043 -181797 -87194 44069 159722 210570 184629 94368 -33156
486c3156j17237n8267J9284Q7080J27081J19455O1109j5533q1161j21551j20716
$$ -33156 -150393 -208660 -189376 -102296 24785 144240 205349 189816 108655 -12896 -133612
497a33612o9194P826P8412J21883J21887P2143m013p3591j17626j20503p7542
$$ -133612 -202806 -194980 -116568 5315 127202 199345 195332 121741 4115 -116388 -193930
508a93930m349O8379J16970J22916Q0112P932o2787j12643j22926q5368j4393
$$ -193930 -198279 -129900 -12930 109986 190098 198030 135243 22600 -100326 -185694 -200087
519b00087N9225J10459J22814Q7358J9514n3022j06296j22455r1855k6074M8012
$$ -200087 -140862 -30403 92411 179769 199283 146261 39965 -82490 -174345 -200419 -152407
530a52407J04720J22319R4011L0449m2750j00415j21017r6479l6631L6504R7673
$$ -152407 -47687 74632 168643 199092 156342 55927 -65090 -161569 -198200 -161696 -64023
541f4023J21130R7910M1393k9620r3866j22176j00583m4683K5500Q9110J19992
$$ -64023 57107 155017 196410 166790 72924 -49252 -149835 -194518 -169018 -79908 40084
552D0084J02053M9280j8400q4161j19322j05585n3767J4065Q0584J17967J05662
$$ 40084 142137 191417 173017 88856 -30466 -136051 -189818 -175753 -95169 22798 128460
563A28460N6697p256p4289j16702j09099o0506L662O9302J13748J10057O5024
$$ 128460 185157 177901 103612 -13090 -122189 -182695 -179033 -109731 4017 114074 179098
574A79098K360o4565j12638j11892o7779o191N9712J08758J11849P1649J2207
$$ 179098 181458 116893 4255 -107637 -175416 -181607 -121895 -13137 98712 170361 182568
585A82568n3529j06254j14384p5738j5519M9804J02504J13279P8802K1261m4159
$$ 182568 129039 22785 -91599 -167337 -182856 -133052 -30548 82731 161533 182794 138635
596A38635r9289j13870q2246k5891L9522R5766J14047Q4797L0166l4327r1684
$$ 138635 39346 -74524 -156770 -182661 -143139 -47373 66674 151471 181637 147310 55626
607E5626j13590q8571l4239L0363Q7750J11968R0980L9368k5368q4298j11007
$$ 55626 -57964 -146535 -180774 -150411 -62661 49307 140287 179655 154287 69989 -41018
618d1018r3924m3114K1206Q0268J09109R5636M8341j6751p7075j07019r6973n2626
$$ -41018 -134942 -178056 -156850 -76582 32527 128163 176504 159753 82678 -24341 -121314 -173940
630a73940J1357P3412J05955R7770N6667o247o9721j04255r8803o0161J516O5003
$$ -173940 -162583 -89171 16784 114554 171221 164974 95253 -9002 -107805 -167966 -166450 -101447
642a01447J02577R9817O3724L346o1434j00065j00180o7228q337N6943R8388J00387
$$ -101447 1130 100947 164671 168017 106583 6518 -93662 -160890 -169227 -112284 -13896 86491
654H6491P0135J3693n2828r6370j00502p2565j8687M8059R4013J00640P4969K3389
$$ 86491 156626 170319 117491 21121 -79381 -151946 -170633 -122574 -28561 72079 147048 170437
666A70437m2666r1825j01196p7026k7290L7721Q8493J01374P9120L1562l2621
$$ 170437 127771 35946 -65250 -142276 -169566 -131845 -43352 58022 137142 168704 136083
677A36083q5360j01209q1478l5644K7852Q2044J00512Q3602L9608k2801p8862
$$ 136083 50723 -50486 -131964 -167608 -139756 -57712 42800 126402 166010 143209 64347
688F4347j00135q4676m3505J7688P5219R9173Q6659M6624j2610p0876r8599q8584
$$ 64347 -35788 -120464 -163969 -146281 -71062 28111 114770 161394 148784 77908 -20691 -109275
700a09275m9742Q251O6912R7252Q9921N2736l704o2237r5402r1685n6314o14N8436
$$ -109275 -159017 -150766 -83854 13398 103319 156055 152351 90114 -5288 -96973 -153287 -153901 -95465
713i5465R3444R2453N9573M871n4055r1437r3209o2806q934M9964Q9021R3760
$$ -95465 -2021 90432 150005 154876 100821 9384 -83825 -146631 -155565 -105601 -16580 77180
725G7180O5607J3307m5815q6435r4383o8911j6804M1906Q3812R3964P1449K1162
$$ 77180 142787 156094 110279 23844 -70539 -139450 -156254 -114348 -30536 63428 134877 156039
737A56039l7808q0698r3797p4235k5343L3856P8141R3139P6219K9688k9654p5197
$$ 156039 118231 37533 -56264 -130499 -155842 -121986 -43845 49294 125513 155201 125547 50350
749E0350r2337p8516l4065K5738P2496R1173Q0238L7885k1101o9365r0099q2075
$$ 50350 -41987 -120503 -154568 -128830 -56334 34839 115077 152962 131861 62496 -27603 -109678
761a09678m1988J7259O6297Q8896Q2889M5750j2153o3642q7693q3835m9127P808
$$ -109678 -151666 -134407 -68110 20786 103675 149425 137272 73630 -14063 -97898 -147025 -139217
773a39217O0042Q6031Q4575N3041l257n6674q4885q5132n5923r66N2701Q3062
$$ -139217 -79175 6856 91431 144472 141215 84541 -344 -85476 -141399 -142365 -89664 -6602
785f602Q5455N9019N960m9265q1646q6017o1231r942M5257P9558Q6004O3861J4332
$$ -6602 78853 137872 143832 94567 12921 -73096 -134327 -144269 -99012 -19454 66550 130411 144743
798A44743m1316p7615q6209o5787j8372L7319P5187Q6102O8195K2186l3359p2945
$$ 144743 103427 25812 -60397 -126184 -144556 -107237 -32050 54052 122247 144433 111074 38129
810C8129q5889p0192k5801K9371P0354Q5363P1859K9764k5348o7743q4975p3364
$$ 38129 -47760 -117952 -143753 -114382 -44028 41335 113194 142958 117610 49867 -35108 -108472
822a08472l3039K1015O4946Q4254P4995L6077j6848o1892q3596p6510l9258J3440
$$ -108472 -141511 -120496 -55550 28704 103699 139776 122928 61036 -22560 -99070 -138328 -124888
834a24888N8239Q2756P7977M2226r691n5186q0962p9166m5362N674N1989P9644
$$ -124888 -66649 16107 94084 136310 126619 71433 -9529 -88695 -134057 -128383 -76394 3250
846C250Q0081M8221j823m8595p7667q1031n1185j914M4941P5916Q1374N4193N592
$$ 3250 83331 131552 129729 81134 3467 -77564 -128749 -130663 -85722 -9806 71568 125761 131353
859A31353m1345p3593q1991n7242r119L8033P1513Q1954N9723J2821l4646o9075
$$ 131353 90008 16415 -65576 -122818 -131937 -93904 -22391 59563 119286 132107 97461 28386
871B8386q1799o2227j6570L1233O6805Q1696O4147K0231k7980o4108q0848o6637
$$ 28386 -53413 -115640 -132210 -100977 -34172 47524 111671 131902 103922 39814 -41034 -107671
883a07671k3523K4412O1373Q0296O8548K7192k1235n8833p9024p0146l0766J7293
$$ -107671 -131194 -106782 -45409 34887 103435 130627 109392 50559 -28465 -98611 -129377 -112084
895a12084N6287P8022P1432L4420j3887n3484p6854p2706l7589J0054N1010P5489
$$ -112084 -55797 22225 93657 128077 114190 60706 -16148 -88854 -126443 -116389 -65379 10110
907A0110P3722M0622o520m7932p4276p4326m3382K602M4861P2813P5121M6313
$$ 10110 83832 124454 117934 70002 -4274 -78600 -121982 -119380 -74519 -1706 73415 119728
919A19728P17m1927p1285p5382m8775m332L8615O9318P5741N1232Q347l5538o7708
$$ 119728 120445 78518 7233 -68149 -116924 -121256 -82641 -13323 62418 113650 121997 86459 18751
932A8751p6084n3064j1694L2168O5477P6007N5579J4817k8506o3762p5752n7459
$$ 18751 -57333 -110397 -122091 -89923 -24446 51561 107140 121957 93451 29689 -46063 -103522
944a03522j8446K5525O1471P5360N9330K1484k1784n9237p5127o0602k4578J7825
$$ -103522 -121968 -96443 -34972 40388 99718 121202 99418 40181 -34946 -95548 -120126 -102301
956a02301N6845P4739O2280K7576j4617n3883p4434o3658l0183J1228N0864P3543
$$ -102301 -45456 29283 91563 119139 104522 50639 -23795 -87453 -117636 -106408 -55544 17999
968A7999O4963L2859p605m8000p2147o6507l6023M824M5108P0941O7619L8237
$$ 17999 82962 115821 108216 60216 -11931 -78438 -114461 -109637 -64529 6412 74031 112268
980A12268j392m2278o9369o8110m1121j958L8967O8175O9145M3273M862l5801
$$ 112268 110876 68598 -771 -68881 -110002 -111960 -72993 -4818 64327 107600 112462 76661
992G6661o6210o9615m5821p853L2571O4541P0017M7976J0685k9603o2301p0023
$$ 76661 10451 -59164 -104985 -112838 -80267 -15726 54291 102267 112952 83349 21048 -48975
1004d8975n0252j4047K6690O0559P0292N2059J6488k3953n7784o9981n3917j9610
$$ -48975 -99227 -113274 -86584 -26025 44267 96326 112814 88861 31077 -38904 -92821 -112431
1016a12431K0763N5636O9675N5901K2286j7762n3563o9101n7009k5251J4794N1080
$$ -112431 -91668 -36032 33643 89544 111830 94068 40505 -28596 -85605 -110856 -96062 -44982
1028d4982O8099N8374K8197j1410m8643o7483n9672l1009Q420M6227O6503O0659
$$ -44982 23117 81491 109688 98278 49635 -17848 -77520 -108529 -100109 -53882 12621 73280
1040G3280L3470n311m3182o5520o1420l5926J855M0661O4193O2435L8407J086
$$ 73280 106750 101439 58257 -7263 -68683 -104609 -102754 -62093 2100 64535 102942 104028
1052A04028l8211o3282o2427m0398m331L5224O1932O2859M2487P534l2450o0287
$$ 104028 65817 2535 -59892 -100290 -104621 -69397 -7465 55394 97881 105415 72965 12678
1064A2678o3651m4050j0503K9354N8913O3533M5883J3455k6439n7444o3240m7445
$$ 12678 -50973 -95023 -105526 -76172 -17259 46274 92157 105612 79173 21729 -41511 -88956
1076h8956j6439K3248N5457O3598M8812J9290k0050n3863o3271n0151k1935J7292
$$ -88956 -105395 -82147 -26690 36908 85720 105010 84960 31097 -32174 -82325 -104260 -86968
1088h6968N1425O3033N1295K4503j3921m9348o2408n3076k6763J0937M6770O2538
$$ -86968 -35543 27490 78785 103288 89367 40019 -22389 -75465 -102228 -91291 -44521 18017
1100A8017N3558K9203p767m4472o1600n4781l1247M610M2034O0502N5754L3652
$$ 18017 71575 100778 93011 48539 -13061 -67842 -99089 -94479 -52445 8057 63811 97463
1112I7463j766l9514n9840n6343l5721q52L6949N8653N7169L7432L494l4235n6949
$$ 97463 95697 56183 -3657 -60000 -95721 -96573 -59624 -971 56198 93630 97124 62889 5940
1125E940n7843l9486o514L1804N5745N8147M1284R231k9468n4087n8019m2998
$$ 5940 -51903 -91389 -97903 -66099 -10354 47793 89077 98308 68840 14753 -43266 -86264
1137h6264j1906K6310N2580N8123M4816J4527k3717n1073n7890m6288j7076K1061
$$ -86264 -98170 -71860 -19280 38843 83659 98186 74469 23396 -34494 -80782 -97858 -76797
1149g6797M9211N7616M7700J9596j8353m7229n7393m8871k2096J5597M5660N6624
$$ -76797 -27586 30030 77730 97326 78973 31744 -25649 -74520 -96616 -81019 -35359 21265
1161B1265N0083K4547j3258m3382n6168n1041k6719J0240M1383N5312N2040K9147
$$ 21265 71348 95895 82637 39255 -16913 -67954 -94673 -84433 -43050 12262 64302 93449
1173I3449p244l9578n4663n2579l1294M547L7530N3594N2998L3444j765l5143
$$ 93449 86205 46627 -8036 -60615 -91909 -87362 -49832 3762 56760 90204 88439 53296
1185E3296n2979n3363l5251j001L3040N1658N3753L6924L729l0256n0957n3659
$$ 53296 317 -53046 -88297 -89298 -56258 -4600 49153 86077 89806 59550 8593 -45066
1197d5066l8720o591K7916M9524N4182M0344R115k5516m8038n4479m1686j1553
$$ -45066 -83786 -90377 -62461 -12937 41245 81589 90704 65188 17150 -37329 -79015 -90568
1209i0568K2974M6556N3983M3164J4193k0090m5194n3862m4454j6690J7547M3667
$$ -90568 -67594 -21038 32945 76109 90302 70212 25018 -28844 -73298 -89988 -72441 -28774
1221b8774N3588M5524J8867j5039m1553n3375m6458k1278J2564L9555N2990M7508
$$ -28774 24814 70338 89205 74166 32613 -20762 -67220 -88498 -75934 -36379 16611 64119
1233F4119K3375j0116l7698n2080m8635k5334P646L5778N1380M9220K7452n141
$$ 64119 87494 77378 39680 -12400 -61035 -86369 -78723 -42945 8435 57655 85107 79966
1245G9966l3755n0357n0341k9050K607L1635M9591N0626L1157o04k9601m8330
$$ 79966 46211 -4146 -54487 -83537 -80930 -49295 296 50922 82079 81475 51874 3544
1257C544n0758l3171j734K7710M6674N1252L4936M248k5454m5693n1296l6698
$$ 3544 -47214 -80385 -82119 -54409 -7735 43517 78453 82701 57247 11554 -39742 -76440
1269g6440o692K3776M4327N1048L8111Q898k1291m2960n1023l9242j1534J9145
$$ -76440 -83132 -59356 -15029 36019 74130 83028 61737 18777 -32246 -71488 -83022 -63877
1281f3877M1490N0603M1026J3518j6950l9646n0542m2128j5790J4560L8285M9876
$$ -63877 -22387 28216 69242 82760 65810 26164 -24378 -66506 -82296 -67736 -29451 20425
1293B0425M3043J8328j2332l6928m9054m4022k0323R717L5448M8389M4911K2307
$$ 20425 63468 81796 69464 32536 -16518 -60540 -80863 -71146 -35698 12691 57602 79909
1305G9909p350l3349m8204m5387k4447N328L1292M7430M5852K6227k832k9660
$$ 79909 72559 39210 -8994 -54381 -78828 -73500 -42208 5222 51074 77301 74469 44809
1317D4809m6063m6661k7759N36K7437M5515M6661K9722J710k5559m4308m7306
$$ 44809 -1254 -47915 -75674 -75138 -47701 -2186 44475 74197 75907 50348 6040 -41266
1329d1266l1015l824K3263M3342M7436L2711N705k1263m2077m7563l3735q178
$$ -41266 -72281 -76105 -52842 -9500 37936 70647 76352 55089 13012 -34551 -68286 -76464
1341g6464J9313M0746M7557L5029J0044j7129l9306m7537l6130j2228J5345L7590
$$ -76464 -57151 -16405 31152 66181 76225 59096 19790 -27747 -63877 -76105 -60760 -23170
1353b3170M7365L7563J3693j2792l6270m7303l8497j5409J0935L4455M6634L9582
$$ -23170 24195 61758 75451 62659 26389 -20914 -59411 -74820 -63885 -29430 17204 56786
1365E6786J7497r026l2925m6119m0370j9359O969L1219M5426M1158K1178m839
$$ 56786 74283 65257 32332 -13787 -54157 -73516 -66547 -35328 10098 51256 72434 67595
1377F7595k9490m4539m2075k2722K850K7465M3843M2731K4314r54k5684m2891
$$ 67595 38105 -6434 -48509 -71231 -68381 -40916 2927 45658 69972 69018 43334 443
1389D43m2921k6147j069K3935M1877M3251K7656L012k2088m0509m3668k8917n378
$$ 443 -42478 -68625 -69694 -45759 -3882 39369 67025 70037 47949 7440 -36228 -65145 -70523
1402g0523K0281L9538M3611L0348P201j8047l8524m3766l1463r124J6321L7064
$$ -70523 -50242 -10704 32907 63255 70456 52409 13885 -29881 -61344 -70468 -54147 -17083
1414a7083M3710L2641J1069j4384l5816m3708l3416j2799J2196L4447M3328L4767
$$ -17083 26627 59268 70337 55953 20137 -23571 -56987 -69786 -57590 -23143 20185 54952
1426E4952J4584j0534l2856m2876l5479j6524Q575L1374M2267L6653J7824o338
$$ 54952 69536 59002 26146 -16730 -52209 -68733 -60158 -28784 13483 50136 67960 61622
1438F1622l0191m1944l7179j9142M371K8289M1340L7555K1013k298k6827m0731
$$ 61622 31431 -10513 -47692 -66834 -62463 -34174 7166 44721 65734 63436 36609 -4122
1450d122l8163k2579Q39K4906M0042L8540K3918J292k2991l9400l8902k5078l239
$$ -4122 -42285 -64864 -64025 -39119 923 39463 63381 64673 41682 2282 -36620 -61698 -64937
1463f4937K1206L8265L9206K6371M985j9409l7118l9525k7381p193J7701L6233
$$ -64937 -43731 -5466 33740 60111 65096 45687 8569 -30956 -58337 -65530 -47829 -11596
1475a1596L9377K8592Q994j5550l4975l9471l0004j0389J3672L3803L9400L0627
$$ -11596 27781 56373 65367 49817 14842 -24629 -54633 -65022 -51350 -17547 21853 52480
1487E2480J2331j1892l2511l9362l1503j3827J0025L0956L8930L2849J5414q551
$$ 52480 64811 52919 20408 -18954 -50457 -64284 -54259 -23303 15627 48476 63890 55339
1499E5339k9674l8583l3190j6767O330K8296L8295L3494J8410m553k6577l7779
$$ 55339 25665 -12918 -46108 -62875 -56545 -28249 10046 43540 61950 57397 30820 -6959
1511f959l4563j9575K924K5163L7187L4906K0880j067k3690l6321l5274k2247
$$ -6959 -41522 -61097 -58173 -33010 4177 39083 59963 58896 35206 -1115 -36389 -58636
1523e8636q34K2162L5588L5695K3562K435k0584l4988l5877k4358m197J8760L3982
$$ -58636 -59470 -37308 -1720 33975 57537 59972 39388 4400 -31477 -55835 -60032 -41272 -7290
1536g290L6121K5625N706j6981l3136l6134k6575p570J5471L1904L6215K7607
$$ -7290 28831 54456 60162 43181 10045 -26089 -52664 -60234 -44763 -12859 23356 50963
1548E0963Q939j3761l0817l5809k8687j0818J2220K9767L5842K9378J2285j0236
$$ 50963 59902 46141 15324 -20485 -49172 -59990 -47770 -18003 17839 47217 59502 49266
1560D9266k9027l5336l0162j3680Q732K7405L5330L0622J4937o713k6211l4895
$$ 49266 20239 -15097 -45259 -58939 -50207 -22802 12528 43150 58087 51374 25163 -9732
1572i732l1024j6705M974K4964L4609L1670J7983l621k3389l3998l1844j9421
$$ -9732 -40756 -57461 -52487 -27523 7086 38756 56739 53118 29729 -4269 -36113 -55534
1584e5534J516K2379L3260L2261K0605R0k0964l2644l2507k1882j598J9346L1972
$$ -55534 -54018 -31639 1621 33882 54487 54577 33613 969 -31538 -53420 -55018 -35672 -3700
1597c700L2759K2914L404j7828l1273l3128k3737m975J6411L0475L2783K4678
$$ -3700 29059 51973 55377 37549 6276 -26852 -50589 -55564 -39153 -8678 24105 48783
1609D8783O803j4993k9365l2880k5714q111J3128K8762L2760K6581R602j1736
$$ 48783 55586 40593 11228 -21652 -47366 -55477 -42349 -13587 19173 45754 55356 43620
1621D3620k7841l2394k7461j0963J0243K6504L2504K7843J2539q669k5504l1976
$$ 43620 15779 -16615 -44076 -55039 -44796 -18292 14212 42055 54594 45925 20421 -11555
1633a1555k8546j3898P047K4441L1762K8999J5262n842k3078l1459k9469j6354
$$ -11555 -40101 -53999 -46952 -22511 9251 38250 53512 47670 24592 -6867 -36336 -52690
1645e2690M165K1587L1184K9836J7721k707k0567l0245l0394j8526R41J9294K9373
$$ -52690 -48525 -26938 4246 34082 51803 49096 28529 -1716 -32110 -50636 -49695 -30401 -1028
1658a028L0761J9914M25j7814k9019l0791k0977j963J6654K8098L0972K2021L392
$$ -1028 29733 49647 50072 32258 3239 -27552 -48529 -50492 -33838 -5740 25232 47253 50645
1671E0645j5321k7215l0940k3011n006J4082K6369L0890K3843O515j2575k5677
$$ 50645 35324 8109 -22831 -45842 -50848 -36766 -10397 20493 44336 50851 38276 12599
1683A2599l0723k4817p861J1396K4862L0312K5360R324r742k3706l0541k5983
$$ 12599 -18124 -42941 -50802 -39406 -14544 15768 41128 50452 40710 17004 -13537 -39520
1695c9520j0452P989K3094K9990K6464J2129p117k1954k9320k7213j3255N554
$$ -39520 -49972 -41983 -18889 11101 37565 49694 42577 20623 -8697 -35910 -49165 -43611
1707d3611K0907K9125K7640J4612m423j9601k8883k8020j5326K758J8415K8310
$$ -43611 -22704 6421 34061 48673 44250 24649 -4234 -32254 -47580 -44822 -26407 1903
1719A903K8083J6685j042j7641k7448k8706j7594q7J5971K7321K8562J8467J756
$$ 1903 29986 46671 45629 27988 540 -28166 -45760 -45847 -29876 -2555 26007 44474 46230
1732D6230j5141k6353k8645j9809k692J3883K5727K8694K0584L954j2732k4719
$$ 46230 31089 4736 -23909 -43718 -46410 -32527 -6800 21894 42478 46432 33700 8981
1744H981k8728k1486n200J1375K3862K8851K2070O598r926k3296k8800k2630p742
$$ 8981 -19747 -41233 -46433 -35058 -11196 17655 39725 46323 36397 13101 -15699 -38329 -46071
1757d6071Q830K2218K8431K3413R062p552k1230k8208k3896j0295O067K0248K7779
$$ -46071 -37241 -15023 13408 36821 45883 38331 17101 -11107 -35003 -45298 -39231 -18983 8796
1770H796K4772J1300m992j9055k7566k4950j2606L646J8175K7072K5546J3517
$$ 8796 33568 44868 39876 20821 -6745 -31695 -44301 -40655 -22480 4592 30138 43655
1782D3655k476j7014k6626k5893j4443J158J6038K5840K6375J5426M3j4813k5201
$$ 43655 41179 24165 -2461 -28354 -42797 -41639 -25601 239 26614 42040 42083 27270 2069
1795B069k6505j6730j218J3491K4948K6475J7461K559j2393k4202k6527j8343
$$ 2069 -24436 -41166 -42384 -28893 -3945 22530 39991 42550 30157 5955 -20572 -38915
1807c8915l673J1246K3376K6550J9158N029j0275k2582k6677j9803o068R083K1849
$$ -38915 -42588 -31342 -7966 18584 37742 42771 32496 9914 -16763 -36566 -42634 -33551 -11702
1820a1702K6587K0486O980p678k1072k6395k1062q218O704J9863K6284K1661R275
$$ -11702 14885 35371 42351 34673 13601 -12794 -33856 -42074 -35370 -15507 10777 32438 41713
1833D1713n281j9214k6028k2173j0283M218J8150K5660K2698J1284l224j7237
$$ 41713 36432 17218 -8810 -30983 -41266 -37048 -18898 6762 29460 40744 37520 20283
1845B0283k5053k3075j2310J926J6112K5148K3139J3183o92j5235k4367k3533
$$ 20283 -4770 -27845 -40155 -38229 -22117 3031 26170 39353 38661 23426 -941 -24474
1857b4474j4226k43J3988K3859K3919J5051J379j2735k3649k3993j5776k667J1940
$$ -24474 -38700 -38943 -24955 -1096 22823 37874 39253 26518 2869 -21124 -36900 -39567 -27627
1870b7627K2771K4299J6342L769j0793k2205k4186j7170m770R780K1332K4316
$$ -27627 -4856 19443 35785 39554 28761 6556 -17630 -34800 -39570 -29790 -8458 15858
1882A5858J7662N980q475k0916k4236j8468o773P456J9963K4185J8918P999o422
$$ 15858 33520 39500 31025 10109 -14127 -32595 -39368 -31912 -11949 12236 31154 39153 32731
1895C2731j9102k4073j9428q785N115J8343K3891J9868R884m194j7489k3626k0449
$$ 32731 13629 -10444 -29872 -38657 -33542 -15199 8692 28560 38444 34250 16761 -6865 -27314
1908b7314j0489K718J6806K3278K0656J1688j877j5792k2742k1047j2404P93J4578
$$ -27314 -37803 -35085 -18279 4999 25655 37343 35466 19674 -3068 -24115 -36519 -35726 -21148
1921b1148K2623K1379J3023L46j3659k2236k1696j4014j203J2816K1814K1590
$$ -21148 1475 22854 35877 36223 22564 328 -21368 -35382 -36585 -23769 -1955 19635
1933A9635J4727K372j1846k1317k1746j5162l555J0946K0424K1956J5953M467
$$ 19635 34362 36734 24888 3571 -18175 -33337 -36892 -25946 -5522 16434 32387 36854
1945C6854r656k0299k1820j6448n555Q845J9511K1855J6955O565p879j8844k1836
$$ 36854 27198 6899 -14921 -31369 -36924 -28079 -8568 13287 30242 36807 28928 10084 -11752
1958a1752j7399p385O883J8125K1515J7955Q175n674j7342k1304j8448r076M406
$$ -11752 -29151 -36536 -29653 -11528 9987 27942 36117 30443 13101 -8203 -26651 -35727 -31321
1971c1321J6821K1105J8756R986l208j5904k1364j8811j0846K379J4977K0761
$$ -31321 -14500 6605 25361 35347 32139 16235 -5129 -23940 -34786 -32407 -17430 3331
1983C331J9221J1787j360j4203k0643j9539j2130K04J3443K0136J9816J2840O98
$$ 3331 22552 34339 32979 18776 -1867 -21406 -33536 -33332 -19889 247 20063 32903 33601
1996C3601j2553j9567j9853j3723j721J1453J9367K0047J4332K537j0491j8920
$$ 33601 21048 1481 -18372 -32095 -33816 -22363 -2996 17051 31383 33920 23429 4509
2008D509j9969j4988l542R655J8123K0200J5556M525q860j7630k0077j6118n415
$$ 4509 -15460 -30448 -33990 -24335 -6212 13988 29544 34069 25209 7579 -12498 -28616 -34031
2021c4031P768J7256J9923J6624O248o840j6419j9921j6874p343N944J5768J9668
$$ -34031 -26263 -9007 10916 27540 33788 26948 10529 -9392 -26266 -33609 -27665 -11897 7771
2034G771J7556P962m846j5359j9313j7961q647L820J4550J9393J7993R500l034
$$ 7771 25327 33289 28443 13084 -6229 -24190 -32837 -29017 -14467 4926 22919 32419 29385
2047B9385j3488j9290j8224j0295K173J2875J8882J8350J0990r21j2468j8095
$$ 29385 15897 -3393 -21617 -31912 -29739 -16864 2018 20368 31358 30437 17969 -126
2059a26j8733j1810M2J1574J7909J8819J2431P56j0693j7725j8634j3156j728
$$ -126 -18859 -30669 -30627 -19053 -1144 17675 30106 30862 20169 2444 -16190 -29346 -31074
2072c1074J0025J7074J8819J3682K648q989j7048j8582j4352l295Q200J6196J8726
$$ -31074 -21049 -3975 14844 28526 31174 22185 5137 -13445 -27797 -31092 -22892 -6696 12030
2085A2030J4838M248p356j5728j8852j5009n328O591J5132J8661J5559O197n824
$$ 12030 26868 31116 23760 8032 -10820 -25829 -31157 -24566 -9434 9227 24786 30983 25159
2098B5159j4595j8653j5857o643M816J3929J8300J6299P577l993j3368j7916j6836
$$ 25159 10564 -8089 -23946 -30589 -25773 -11844 6456 22755 30332 26339 12971 -4945 -21781
2111b1781q397L294J2733J7799J6973Q969k282j1957j7561j7260r540J372J1317
$$ -21781 -30178 -26884 -14151 3648 20621 29590 27308 15351 -2210 -19470 -29010 -27638 -16321
2124a6321J7166J7413J0454p48j0628j6910j7350j1283j8J0026J6332J7461J1667
$$ -16321 845 18258 28712 27964 17336 426 -16924 -28207 -28225 -18199 -1867 15594 27261
2137B7261J118r244j5796j7772j2272j877Q646J5755J7360J2802K566q015j4923
$$ 27261 28379 19135 3339 -14433 -26705 -28582 -19936 -4181 13179 25981 28547 20532 5609
2150E609j7468j3354l408P175J4540J7497J3737M234o268j4151j7435j4208m908
$$ 5609 -11859 -25213 -28621 -21446 -6906 10591 24328 28562 22294 8143 -9292 -23500 -28408
2163b8408N509J3644J7187J4600N536m509j3139j7227j4773o374L812J2726J6769
$$ -28408 -22899 -9255 7932 22532 28068 23559 10420 -6807 -21580 -27954 -24142 -11416 5353
2176E353J5324P092l342j1870j6594j5342p914K340J1207J6600J5766Q416j676
$$ 5353 20677 27769 24427 12557 -4037 -19379 -27293 -24953 -13746 2854 18620 27036 25360
2189B5360j0542j6284j6079q791P74R777J5975J6233R441j49r164j5399j6506
$$ 25360 14818 -1466 -17545 -26336 -25562 -15785 190 16423 25864 25715 16551 1152 -15354
2202a5354j0037n39Q455J5313J6314J0392J524p731j4867j6437j1094k014O989
$$ -15354 -25391 -25930 -17475 -2162 14152 24544 26068 18337 3470 -12967 -24061 -26075 -19086
2215a9086J4404J6494J1539K871o347j4010j6565j1942l537N764J3555J6496J2324
$$ -19086 -4682 11812 23351 26222 19875 5865 -10700 -22642 -26179 -20415 -6860 9636 21960
2228B1960M034m833j3048j6344j2972m611M164J2395J6272J3170N575l616j2011
$$ 21960 25994 21161 8113 -8231 -21203 -25814 -21650 -9255 7017 20187 25762 22146 10135
2241A0135j5998j3399n939K694J1339J5902J3634O712k142j0801j5627j4038p301
$$ 10135 -5863 -19262 -25201 -22507 -11168 4734 18368 25080 22938 12137 -3490 -17528 -24829
2254b4829J471J0305J5246J4354P773o29r603j5187j4675q278J67R111J4694J4666
$$ -24829 -23358 -13053 2193 16547 24320 23691 14088 -1099 -15774 -24052 -23885 -14774 -80 14586
2268A4586Q891M58q171j4559j4695r332j332P860J3827J4833R931J883p228j3619
$$ 14586 23477 23935 15764 1205 -13490 -22822 -24154 -16294 -2467 12366 22297 24180 16952 3333
2282C333j4644j0341k535O314J3358J4981J0664L086n743j2781j4951j1107l852
$$ 3333 -11311 -21652 -24187 -17873 -4515 10466 21130 24216 18473 5692 -9259 -20366 -24218
2295b4218N210J2432J4624J1589M411m326j2014j4732j1774n003L749J1395J4879
$$ -24218 -19008 -6576 8048 19637 24048 19722 7708 -7024 -18798 -23801 -20052 -8657 6222
2308F222J1940N393l059j1046j4386j2346n902K259J0461J4502J2386O532j695
$$ 6222 18162 23555 20496 9450 -4936 -17282 -23184 -20925 -10464 4038 16424 22956 21261
2321B1261r981j4103j2838o877R02R560J4086J2761P589o22q668j3789j3067q026
$$ 21261 11280 -2823 -15661 -22538 -21636 -12076 2010 14771 22360 21738 13070 -719 -13786 -21812
2335b1812q4Q059J3456J3132Q605P71p488j3288j3253q702j798P084J2749J3599
$$ -21812 -21896 -13837 -381 12751 21356 22127 14639 1351 -11902 -20604 -22402 -15318 -2569 11030
2349A1030R129K389o584j2652j3392r579k635N774J2025J3523R954L167n153j1535
$$ 11030 20159 22548 15964 3312 -10080 -19659 -22294 -16520 -4495 9028 18982 22149 16996 5461
2363E461j3474j0323l764M582J1224J3191J0785M425m047j0847j3370j0965m750
$$ 5461 -8013 -18336 -22100 -17518 -6294 6897 17682 22107 18060 7213 -6157 -17122 -21872
2376b1872L250J0575J3092J0986N621k569j0090j3105j1498n715J862R731J2943
$$ -21872 -18622 -8047 5045 16031 21652 19083 8993 -4112 -15610 -21325 -19463 -9732 3211
2389C211J1425O481j459r052j2823j1702o746Q34Q560J2367J1884P369k78p944
$$ 3211 14636 21117 19658 10606 -2217 -13919 -20665 -19831 -11271 1096 12980 20349 20071 12127
2403A2127j2310j2015p859l48P552J2081J2166Q117R20o975j1897j1884q662j539
$$ 12127 -183 -12198 -20057 -20405 -12853 -772 11394 19511 20431 13456 1559 -10325 -18987 -20526
2417b0526O278J1717J2068Q729K268n841j1240j2271r141k531N359J0694J2215
$$ -20526 -14248 -2531 9537 18266 20534 14693 3453 -8818 -17959 -20490 -15131 -4437 7778
2430G778R468L081m642j0335j2283r632l640L957J0219J2122R789M404l626r662
$$ 7778 17246 20327 15685 5350 -6933 -16565 -20205 -16248 -6029 6093 15882 20286 16660 6998
2444F998j2177j0154m674K995R443J1795J0324N152k326q851j1765j0638n668
$$ 6998 -5179 -15333 -20007 -17012 -7569 4226 14550 19702 17376 8525 -3240 -13878 -19546
2457a9546J856Q507J1582J0455O342j254p988j1441j1037o553Q28P664J1229J0952
$$ -19546 -17690 -9183 2399 12854 19196 17942 9954 -1487 -12524 -19077 -18249 -10585 644 11596
2471A1596P044k53p061j1056j1007p368m31O585J0763J1159P687J185o427j0437
$$ 11596 18640 18387 11326 270 -10737 -18105 -18536 -11951 -1188 9971 17658 18843 12416 1979
2485A979j1108q081j470N720J0203J1259Q327J907n263j0086j0882q687k657M811
$$ 1979 -9129 -17210 -18680 -12960 -2757 8502 16829 18736 13473 3387 -7495 -16182 -18839 -14028
2499a4028R676J1220Q994K791m269r198j1140r144l472L739Q987J0864R507L955
$$ -14028 -4352 6868 15862 18653 14384 5186 -5954 -15098 -18570 -14831 -5844 5020 14527 18482
2513A8482l454q411j0966r611m220K569Q346J0768R740M898k210p959j0711r829
$$ 18482 15028 6617 -4349 -13960 -18180 -15611 -7265 3503 13243 18141 15931 7972 -2739 -12568
2527a2568n348J623P401J0572J0160N736j019p276j0244j0390o007P38O757J0319
$$ -12568 -17916 -16293 -8892 1680 11840 17576 16557 9281 -963 -11353 -17360 -16622 -9865 454
2541D54J0255O206j10o344r916j0289o935k55O013R468J0713P010P43n558r220
$$ 454 10709 16915 16805 10461 545 -9744 -16679 -16934 -10921 -1453 9260 16270 17013 11455 2235
2556B235j0554p577j222N050R244J0435P668J677m405q875j0410p933k387L930
$$ 2235 -8319 -15896 -17118 -12068 -2824 7611 15279 16956 12551 3676 -6734 -14667 -17054 -13124
2570a3124R004J0203Q337K590l717q036j0640q445l047L137Q004J0280Q588L747
$$ -13124 -4120 6083 14420 17010 13293 5257 -5383 -13828 -16875 -13738 -5734 4546 13134 16881
2584A6881k763p565j0484q767l971K043P621J0148Q914M296j862o913r966r153
$$ 16881 14118 6553 -3931 -12698 -16669 -14626 -7005 3143 12057 16353 14491 7578 -2388 -11541
2598a1541m888J516O585R704R437N071p81o381r591r471n353M36N783R607R468
$$ -11541 -16429 -14913 -8328 1376 10813 15884 15103 8722 -869 -10340 -15693 -15257 -9474 133 9601
2613I601N874K0n748r006r626o189o00N257R029R629O410Q39m737q445r814o802
$$ 9601 15475 15495 9747 741 -8885 -15074 -15674 -10417 -1388 8241 14651 15490 10753 2308 -7506 -14308
2629a4308j335M209Q584R542P111J764l960q148r416p514k183L502P921R588P674
$$ -14308 -15643 -11434 -2850 6692 13803 15567 11607 3459 -5957 -13471 -15654 -12152 -4231 5357 13031
2644A3031K370k915p520r552p977k894K714P363R440P957L214k167o821r609q192
$$ 13031 15401 12486 4966 -4586 -12563 -15457 -12743 -5380 4060 12017 15231 13064 6243 -3366 -11558
2659a1558l710J840O876R187Q467L998j458o511r172q260m498R45O051R004Q570
$$ -11558 -15268 -13428 -6552 2635 11102 15100 13642 7131 -2041 -10301 -14799 -13854 -7803 1201 9771
2674I771M748o39n529q783q952m696m1N297Q648Q735N438k2m883q290q838n684
$$ 9771 14519 13880 8351 -432 -9384 -14080 -14121 -8824 -176 8559 13997 13975 9092 802 -8036 -13720
2690a3720m96M480Q280Q769O032Q50m248p807q888o200j269L662P847R131O036
$$ -13720 -14216 -9736 -1456 7313 13345 14195 9947 2140 -6748 -12948 -14217 -10555 -2708 6423 12459
2705A2459J774l447p227r118o534k273L060P184Q890O926K346k437p080q822p030
$$ 12459 14233 10786 3559 -5559 -12093 -14366 -11306 -4122 4768 11694 14040 11603 4523 -4299 -11329
2720a1329k684K141O792Q647P254L097j719o533q881p066l400J465N798Q797P339
$$ -11329 -14013 -11872 -5080 3567 10821 13918 12199 5666 -3215 -10281 -13681 -12216 -6418 2379 9718
2735I718L895j026n890q534p492l876M96N380Q178P959M400j86n180q052q052
$$ 9718 13613 12587 6697 -1837 -9329 -13205 -12709 -7329 849 8808 13208 13022 7842 -210 -8262
2750h262m674j82M826P978Q028M932K61m123p927q052n029q96M108P575Q093N457
$$ -8262 -12936 -13118 -8292 -314 7714 12646 12907 8784 857 -7195 -12224 -13120 -9012 -1437 6656 12113
2766A2113J043l786p333q137n785j314L523P090P871O060J703l000o826q169n891
$$ 12113 13156 9370 2037 -6100 -11885 -13199 -9676 -2586 5285 11345 13048 10048 3222 -4947 -10838
2781a0838k307K623O821P976O283K534k411o468p885o476k789J970O225P991O359
$$ -10838 -13145 -10522 -3701 4275 10558 13092 10681 4213 -3672 -10148 -12937 -10967 -4742 3249 9608
2796I608L087j536o071p775o657l318J284N918P523O683L751p83n473p744o819
$$ 9608 12695 11159 5088 -2687 -9344 -12662 -11378 -5460 2063 8746 12497 11714 6241 -1503 -8322
2811h322l991O62N091P465O922M178o6m758p540o972m429k69M430P437P128M547
$$ -8322 -12313 -11651 -6560 905 7827 12005 11939 7181 -359 -7331 -11760 -12029 -7599 -162 6966 11513
2827A1513O41m283p196p025m806j109M013O928P368M881J181l622o765p137n254
$$ 11513 12154 7871 675 -6350 -11156 -12265 -8252 -1324 6044 10925 12106 8484 1719 -5418 -10672
2842a0672j649L308O743P047N588J757k976o133p406n534k174K592O045P394N773
$$ -10672 -12321 -9013 -2270 4777 10365 12122 9146 3013 -4393 -9927 -12101 -9509 -3464 3930 9703
2857I703K199k021o040p078n945k867K018N684P046O253K808j482n444p203n907
$$ 9703 11902 9881 3841 -3237 -9182 -12049 -10031 -4347 2699 8952 11760 10278 4834 -2369 -8276
2872h276l390J170N229P095O198L488j028m850o977o376l698O49M783O847O298
$$ -8276 -11666 -10496 -5267 1828 8026 11514 10486 5636 -1341 -7717 -11415 -10766 -5983 864 7162
2887G162L969j89m480o821o670l929j56M257O576O581M454L52l718o602o645m827
$$ 7162 11131 10942 6462 -359 -7029 -10958 -11114 -6857 -281 6300 10754 11106 7388 786 -5859 -10686
2903a0686n34L726O329O503M788Q93l149o060o725m937j380L182N918O508N119
$$ -10686 -11220 -7494 -1165 5338 10126 11019 7870 1810 -4915 -9852 -11232 -8050 -2132 4376 9495
2918I495J798k904n828o375n462j857K491N545O495N554K180k310n278o417n539
$$ 9495 11293 8389 2561 -3814 -9276 -11133 -8642 -3097 3398 8952 11132 8822 3544 -2873 -8412
2933h412k561J784N254O329N682K851j514n000o311n859l007J341M644O370N872
$$ -8412 -10973 -9189 -3935 2394 8076 10927 9413 4413 -1898 -7757 -10764 -9423 -4779 1591 7463
2948G463L080o95m635o306n881l483Q05M127O050O184L617l76l992n974o112l960
$$ 7463 10543 9848 5213 -1093 -6974 -10457 -9652 -5525 525 6709 10326 9950 5958 -16 -6128 -10088
2964a0088KL693O055O063M132L37l666n739o164m270o53L446N494O290M507O38
$$ -10088 -10086 -6393 -338 5725 9857 10194 6528 789 -5375 -9645 -10298 -6852 -1358 4932 9439 10077
2980A0077k921n465o061m728j135K637N556N994N001J324k671n126o103m938j587
$$ 10077 7156 1691 -4370 -9098 -10233 -7596 -2040 3954 8955 10279 7608 2482 -3621 -8559 -10146
2995a0146K267M852N986N295J798j898m869o036m993k213J613M828N824N377K252
$$ -10146 -7879 -3027 2959 8254 10052 8154 3285 -2751 -7744 -9957 -8344 -3516 2308 7685 9937
3010I937j567m212n982n359k733J128M271N938N440K828r44l934n829n571l097
$$ 9937 8370 4158 -1824 -7183 -9916 -8788 -4517 1421 6861 9689 8745 4811 -1018 -6589 -9686
3025i686P52L895N609N629L000r0l646n452n772l380J56L267N415N861L581p1
$$ -9686 -8934 -5039 570 6199 9199 9109 5463 11 -5761 -9141 -8985 -5718 -303 5558 9139 9068
3041I068l086n147n759l991k44K788N109N800M109N17k744m746n945l951r88K417
$$ 9068 5982 835 -4924 -8915 -9159 -6371 -1262 4538 8647 9164 6420 1674 -4271 -8222 -9210 -6793
3057f793M960N603M353R13k131m573n688m442j427J987M491N768M738J489j821
$$ -6793 -1833 3770 8123 9036 6905 2332 -3356 -7798 -9225 -7238 -2747 3021 7759 9248 7427
3072G427m388n667m593j763J273M284N506M852J994j128m018n640m689k278J024
$$ 7427 3039 -2628 -7221 -8984 -7711 -3427 2079 6931 8925 7797 3779 -1861 -6550 -8828 -7804
3087g804L551N650M867K525p55l448n512n117k637N08L363N311N102K769o5l276
$$ -7804 -4253 1397 6264 8789 8034 4586 -926 -6043 -8680 -8172 -4809 502 5604 8373 8308 5032
3103E032n207n136l094K05K776N318M944L374K67l018m666n448l336n31K573M838
$$ 5032 -175 -5311 -8405 -8200 -5424 -106 4838 8212 8479 5461 795 -4653 -7989 -8520 -5947 -1109
3119a109N165L755N20k206m650n260l636q82K006M508N172L776J303j946m335
$$ -1109 4056 7811 8331 6125 1475 -3785 -7421 -8303 -6297 -1789 3383 7159 8462 6516 2181
3134B181n437l717j416J612M268N241L984J650j361m037n384m174j727J397L776
$$ 2181 -3256 -6973 -8389 -6777 -2509 2732 6716 8366 7005 2968 -2416 -6590 -8317 -6920 -3144
3149c144N085M437J697r72l678m990m479j991Q15L422N048M271K477n62l483m581
$$ -3144 1941 6378 8075 7103 3425 -1565 -6044 -8035 -7220 -3798 1250 5521 7998 7436 3953 -628
3165f28m621k707O05L135M735M755K579k35l005m911m627k649j64K858M779M525
$$ -628 -5249 -7956 -7351 -4216 519 5274 7853 7618 4613 -298 -4925 -7574 -7738 -4880 -101 4424
3181D424K792K63k333m648m657l112m85K421M594M595L097Q58k210m429m626l361
$$ 4424 7216 7479 5146 498 -4159 -7271 -7756 -5335 -741 3854 6951 7809 5599 1170 -3456 -6817
3197f817q86J935M175M664L468J296j952m050m622l527j250J480L953M716L754
$$ -6817 -7703 -5768 -1593 3071 6539 7835 5883 1833 -2789 -6316 -7566 -6086 -2133 2583 6337
3212F337J259j284l728m651l781j670J245L503M606L857J862j140l165m572m138
$$ 6337 7596 6312 2584 -2067 -5848 -7518 -6273 -2770 1836 5693 7555 6415 3250 -1322 -5460
3227e460j953O49L269M711L981K002n12l041m442l908k447L25K846M374M311K311
$$ -5460 -7413 -6764 -3495 1216 5197 7199 6687 3646 -796 -4704 -7151 -6826 -3980 394 4705 7016
3243G016j24k836m109m447k328kK516L988M344K574K78k293m121m165k885l73
$$ 7016 6892 4056 -53 -4500 -6828 -6830 -4314 -326 4018 6592 6870 4577 456 -3709 -6594 -6967
3259f967K035M221M295K715O69j985l965m013l061o80J550L969M188L002J032
$$ -6967 -4932 -711 3584 6299 6968 4983 1018 -2995 -6056 -6736 -5186 -1217 2971 5973 7005
3274G005j646l737m364k976j365J600L462M242L219J349j185l344m084l550j559
$$ 7005 5359 1622 -2742 -5718 -7083 -5483 -2021 2221 5440 6789 5604 2260 -1824 -5374 -6933
3289f933J097L175M230L419J782q01l111m212l515j770O16L078M003L524K100
$$ -6933 -5836 -2661 1569 4988 6770 5969 2858 -1354 -4869 -6639 -6023 -2945 1058 4582 6682
3304F682n61k957l996l489k060J98K684M048L638K075k8k541l761l806k265j08
$$ 6682 6121 3164 -832 -4321 -6381 -6183 -3499 549 4187 6262 6234 3693 -68 -3874 -6139 -6247
3320f247K342L663L827K373M71k294l886l568k619m47K015L711L687K714O60j840
$$ -6247 -3905 -242 3585 5958 6429 4135 249 -3319 -5938 -6385 -4370 -659 3028 5742 6402 4562
3336D562l459l943k599r15J713L569L715K735R75j532l160m087k817j065J333
$$ 4562 1103 -2840 -5439 -6354 -4641 -1072 2643 5378 6353 4821 1661 -2426 -5243 -6308 -4975
3351d975L104L774L153J192r64l241l877k964j274P48L064L746L194J435o68k844
$$ -4975 -1871 1903 5056 6248 5284 2043 -1834 -4798 -6072 -5324 -2260 1486 4680 6115 5447 2603
3367B603l752l217j742O88K562L624L391J805n24k463l537l445j812K53K465L595
$$ 2603 -1149 -4366 -6108 -5420 -2858 766 4157 5962 5438 2975 -562 -4007 -5819 -5566 -3101 494
3383D94L166K106l60j875l473l488k197J33K058L119L486K116J99j655l199l594
$$ 494 3660 5766 5406 3531 58 -3430 -5627 -5494 -3436 -317 3169 5285 5484 3829 630 -2964
3399b964k285n10J875L132L564K457N82j686l234l371k617p19J566K923L574K695
$$ -2964 -5249 -5759 -3884 -752 2812 5269 5851 4165 931 -2440 -5057 -5776 -4210 -1287 2287 4982
3415D982Q00j274l245l264k626j055J201K807L470K754J057r84k738l326k833
$$ 4982 5782 4508 1263 -2001 -4627 -5682 -4481 -1674 1796 4550 5607 4623 1885 -1441 -4274
3430d274j284Q32K619L336L042J329p85k620l210k906j530N12K461L203L042J535
$$ -4274 -5558 -4726 -2107 1229 4271 5600 4815 2195 -1015 -3921 -5451 -4939 -2478 725 3767 5302
3446E302l57k214l385k751j942L57K205L022L145J841k01k077k843l226k060M6
$$ 5302 4945 2731 -654 -3405 -5347 -4990 -2785 237 3382 5223 5022 2945 102 -3124 -5184 -5138
3462e138J771L117L030K164J73j720k801l377k024l51J621K914L006K427J64j328
$$ -5138 -3367 -250 2780 4944 5117 3397 596 -2781 -4805 -5156 -3535 -621 2385 4812 4976 3648
3478C648k582l379k030p79J398K697L097K246P16j192k550l046k495j033J100
$$ 3648 1066 -2313 -4343 -5122 -3724 -1027 2070 4316 5032 3840 1290 -1756 -4251 -5284 -4184
3493d184K564L000K752Q49p88k323l011k596j307Q90K296L011K519J282p76j990
$$ -4184 -1620 1380 4132 4981 4193 1870 -1141 -3737 -5044 -4154 -1858 1153 3672 4954 4178 2188
3509B188k874l093r28L11J939L063K722J498l02k000k754l044j366J55J831L013
$$ 2188 -686 -3779 -4707 -4396 -2457 606 3328 4826 4524 2524 -230 -3274 -4640 -4485 -2654 359
3525C59K596J961m21j729k757k709j880J35J307K792L129J751J62j587k682k792
$$ 359 2955 4916 4495 2766 9 -2700 -4580 -4445 -3138 -346 2783 4534 4696 3109 427 -2365
3541b365j973k11J273K584K598K279M29j346k273k873k128o59J088K396L092K054
$$ -2365 -4338 -4549 -3276 -692 1906 4185 4614 3268 995 -1878 -4006 -4665 -3577 -1181 1911 3965
3557C965M99r69k057k936k198q74P84K180K706K459J024q22k025k986k163j069
$$ 3965 4464 3495 1438 -1498 -3696 -4570 -3786 -1606 1100 3559 4583 3761 1736 -1250 -3413 -4482
3573d482O80J937K665K345J355m66k032k700k523j141L28J788K878K329J318j70
$$ -4482 -3802 -1865 800 3145 4500 4034 2002 -698 -3221 -4362 -4034 -2246 632 2961 4279 4109
3589D109j736k587k703j151m7J648K566K519J367J46j428k531k584j580j91J379
$$ 4109 2373 -214 -2917 -4068 -4115 -2467 99 2618 3985 4131 2703 172 -2412 -3992 -4183 -2804
3605b804K543K485J693K03j309k402k581j583m56J272K282K653J675N57j244k234
$$ -2804 -261 2224 3917 4120 2811 409 -2172 -3755 -4211 -2939 -657 1996 3671 4228 2984 750
3621G50k469j982m04Q52K246K526J996N25o67k016k639k097r00R37J903K692K099
$$ 750 -1719 -3701 -4105 -3253 -1007 1519 3515 4040 3373 1357 -1282 -3379 -4279 -3342 -1439 1253 3352
3638C352O10m80j905k647k040r21N59J771K356K254J094m31j609k411k427j122
$$ 3352 3962 3482 1577 -1070 -3110 -4031 -3472 -1701 655 2909 4003 3572 1963 -448 -2875 -3997
3654c997K80J568K550K315J131j05j623k308k429j190K02J406K048K453J474k19
$$ -3997 -3717 -2149 401 2716 3847 3742 2119 -189 -2618 -3808 -3606 -2200 -152 2301 3775 3556
3670C556j025k349k269j502j51J136K288K255J679J54j136j999k533j620k47J036
$$ 3556 2531 182 -2087 -3589 -3740 -2604 -316 1939 3618 3772 2636 637 -1896 -3516 -3763 -2727
3686b727J950K350J764N47j147j871k229j721p82Q51K005K133J917Q28q63j925
$$ -2727 -777 1573 3337 3884 2737 866 -1363 -3084 -3866 -3015 -1010 1123 3040 3868 3005 1080
3702A080k103j736q64N35J614K422J830P61k57j779k299j872r92L21J596K250
$$ 1080 -1023 -2759 -3623 -3088 -1474 948 2778 3539 3282 1503 -796 -2668 -3660 -3339 -1743 507
3718E07K232O76j99j397k317j861j230K94J515J998J987J261Lj437k073j929j442
$$ 507 2739 3415 3216 1819 -498 -2359 -3589 -3295 -1780 218 2205 3466 3469 2032 -41 -1970 -3412
3735c412MJ326K220J773J293K39j191k083j993j439j23R89J906K130J481M01j130
$$ -3412 -3408 -2082 138 1911 3204 3443 2252 169 -1824 -3263 -3386 -2397 -491 1639 3120 3521 2391
3752B391j766k178j306o22Q57J827K253J374O83p33j902j913j892l49N86J538
$$ 2391 625 -1553 -2859 -3481 -2624 -797 1456 2830 3513 2780 878 -1035 -2927 -3276 -2690 -1152
3768a152K096J695O24n09j519k141j585q19K91J651K033J795Q91n25j283k052
$$ -1152 944 2639 3263 2754 1235 -906 -2491 -3310 -3019 -1368 665 2460 3351 2826 1543 -509
3784e09j820r28L38J233K184J776R56j53j208k128j844q88l7J196J914J709J210
$$ -509 -2329 -3257 -2919 -1686 498 2274 3230 3077 1869 -259 -2103 -2991 -3028 -1832 82 1791 3001
3801C001K87j332j804j815j281k84J100J752K027J420K7q29j760k208r64l73O68
$$ 3001 3288 1956 152 -1663 -2944 -3228 -2128 -376 1651 3071 3098 2269 509 -1699 -2663 -3036 -2368
3818b368J641K050J396M93q50j680j822j568m65P93J572J805J708N71p68j540
$$ -2368 -727 1323 2719 3212 2362 682 -1140 -2708 -3173 -2380 -808 997 2705 3276 2508 968
3834I68j727j511q40L13J615J848J826P58p15j199j871j513q92M9J616J834J519
$$ 968 -759 -2270 -3110 -2797 -1182 666 2492 3250 2535 1336 -535 -2048 -2940 -2891 -1275 559 2078
3851B078Q74k10j223j820j681r49J57J267J832J558J089k48r28j802j706r82O4
$$ 2078 2952 2742 1519 -301 -1982 -2931 -2774 -1507 325 1883 2972 2724 1796 -6 -1712 -2694 -2630
3868b630R06J701J623J194J17r58j621j740j366j03J031J497J643J451L20j109
$$ -2630 -1724 -23 1600 2794 2911 1953 332 -1408 -2774 -2877 -1846 -349 1294 2745 3065 1956
3884A956j439j522j615l20O51J606J759J418M18n71j366j841j307p46M31J699
$$ 1956 517 -1005 -2620 -2940 -2289 -683 1076 2494 2912 2341 975 -866 -2173 -2919 -2488 -789
3900g89J501J346R33o69j180j903j319o99L56J190J897J414Q69l86j257j718j458
$$ -789 712 2058 2991 2322 1142 -761 -2080 -2779 -2423 -1233 664 2078 2947 2561 1304 -414 -1872
3917a872q19L58Q32J767J614Q41k01j123j416j710q19l6J042J441J730R78J76
$$ -1872 -2691 -2333 -1501 266 1880 2721 2520 1397 -19 -1729 -2548 -2584 -1542 -101 1629 2607 2783
3934B783j166j561j521j142j21J098J484J603R18K71q48j420j550j260l42Q36
$$ 2783 1617 56 -1465 -2607 -2728 -1630 -146 1457 2375 2646 1798 378 -1172 -2432 -2774 -1938
3950a938J187J753J263K64n83j364j503j424k71O99R80J985J042M78o49j130j469
$$ -1938 -751 1002 2265 2529 1946 582 -921 -2345 -2616 -1917 -937 1048 2090 2568 1919 789 -680
3967f80j490m23N19J039J671J311N36k85j167j653j305n84L25J034J451J548N46
$$ -680 -2170 -2593 -2074 -1035 636 1947 2483 2198 1031 -622 -1927 -2511 -2186 -1152 299 1847 2393
3984B393m9j103j476j384p16P9Q44J585J546O43q1j046j235j429j109K33R09J250
$$ 2393 2344 1241 -235 -1619 -2335 -2256 -1412 173 1719 2362 2281 1235 0 -1429 -2538 -2305 -1396 -146
4002a46J393J268j83p29j257j598j138p0P32J335J399J166K59n94j480j353j120
$$ -146 1247 2515 2332 1603 346 -1252 -2390 -2460 -1728 -393 1006 2172 2431 1837 357 -996 -2116
4019b116l05M98J289J681R21M35o51r03j566j127n06L69J212J382J157N63j70
$$ -2116 -2421 -1923 -634 1047 1968 2403 1752 849 -717 -1844 -2350 -1981 -769 613 1770 2333 2163
4036B163j238j511j026p44L71R28J485J443K82r7q62j572j247o56J78R28J434
$$ 2163 925 -586 -1612 -2356 -1985 -1057 428 1871 2153 2056 1194 -378 -1625 -2281 -2103 -1175 259
4053B59J123Q24l8p81j444j363p45k17J072J367J237R82j04q26j022j580p24j57
$$ 259 1382 2206 2168 1387 -57 -1420 -2165 -2382 -1310 57 1294 2276 2172 1346 324 -1256 -1980 -2137
4071b137O65J020J506J003J74n93j201j544q47l98O21J133J437J170L10n14j052
$$ -2137 -1472 -452 1054 2057 2231 1638 437 -1107 -1954 -2352 -1731 -598 839 2009 2319 1805 753
4088G53j422j096o29O49J189J082J349M54m21j198j151j273o28L87R19J383J244
$$ 753 -669 -1765 -2394 -1745 -556 526 1875 2329 1908 710 -441 -1714 -2342 -1955 -1036 347 1591
4105A591N40k57q99j324r53q16J10R30J310J253O43l8p94j366j228o50j72Q24
$$ 1591 2131 1874 975 -349 -1302 -2118 -2008 -1078 232 1485 2128 2090 1296 -70 -1298 -1948 -2120 -1296
4123a296J294J338P20j46m75j334j266p63r5N32J201J362P69J88o10j215j136
$$ -1296 -2 1336 2056 1910 1435 101 -1165 -1928 -2023 -1491 -290 1072 1841 2029 1419 204 -932
4140i32q70l61Q28R97J260P74O00p80j047j174q87n86N51J025J231J222K23j74
$$ -932 -1802 -2163 -1335 -338 922 1696 2296 1516 469 -705 -1592 -2178 -1627 -602 629 1851 2074 1900
4158A900j240j220j023m93K99R72J208J062O03l14q50j197j158n32K29P50J167
$$ 1900 660 -560 -1583 -2076 -1777 -805 403 1465 2068 1754 904 -293 -1451 -1983 -1754 -1004 163
4175A63J150N87m8p87j154j296n89j0Q55J224J023Q67J4p81j139j231n52j97P00
$$ 163 1313 1900 1852 1065 -89 -1385 -1974 -1984 -1129 95 1118 1985 1999 1218 79 -1152 -1704 -1901 -1201
4194a201J090J078R07R0n96j148j176r64ON22J200J095P43J97m04r63j103j043
$$ -1201 -111 967 1874 1964 1368 220 -956 -1920 -1914 -1392 -192 903 1646 1843 1439 476 -627 -1670
4212a670l65L10J220J164Q94L21m10j024r15j136m13M19P83J198J098M94m80o49
$$ -1670 -2035 -1725 -505 659 1553 1874 1464 440 -475 -1611 -2024 -1605 -822 376 1474 1968 1488 839
4230H39j127q88q46M13O36J293J057M03j0r29j002r97p80K98N22J171J036P38
$$ 839 -288 -1176 -2022 -1609 -973 320 1377 1780 1770 841 -161 -1158 -1938 -1640 -1118 53 1089 1827
4248A827j9p15j108r85p79l2O71Q78J198Q10O6n42j003j205o51k55M54J173R06
$$ 1827 1808 1093 -15 -1000 -1779 -1811 -1140 -262 936 1746 1812 1270 267 -938 -1589 -1844 -1390 -217 689
4267F89P65L38l49j095j079p44m37N79Q17R37R72L81k44j087q95j021l92L46R91
$$ 689 1454 1792 1443 348 -731 -1475 -1912 -1333 -516 421 1393 1774 1530 443 -452 -1473 -1865 -1519 -528
4286e28R20Q62N97l34p24j046r14p36K06Q72R60J106L97M1p79j158r17m75J3P46
$$ -528 392 1254 1851 1517 793 -253 -1167 -1903 -1697 -825 135 1241 1638 1679 900 -258 -1175 -1650 -1637 -891
4306h91R94J014N92p8o75r85r33o26j95O95J014J038P32j17l71q95j097p55k44
$$ -891 103 1117 1709 1631 956 -29 -962 -1588 -1783 -1088 -74 964 1696 1579 1208 313 -784 -1539 -1783
4325a783N08R99R15Q47J47l53r48q64q77l22N17R06Q40R70J31j80q93r65r54k65
$$ -1783 -1275 -276 639 1486 1633 1280 332 -532 -1409 -1731 -1214 -308 532 1502 1633 1453 560 -405 -1359 -1624
4345a624R6J110Q76Q90L88j11r86r38r25m66K01O56J291Q71M02l34m95j138r38
$$ -1624 -1528 -418 458 1348 1736 1625 639 -299 -1224 -1690 -1489 -833 458 1329 1731 1397 902 -236 -1174
4364a174m19J18N22R37J028N14j82l43r81r95o36K17K59Q94J194M32N3m74p34
$$ -1174 -1593 -1475 -953 -16 1012 1526 1344 1001 20 -975 -1611 -1394 -1135 -241 953 1385 1438 964 230
4383B30j191k69m38M86Q98J212M64J53m23o01j140o80l84M31O97J079P61K44l65
$$ 230 -961 -1230 -1668 -1182 -284 928 1392 1545 1122 521 -619 -1299 -1683 -1252 -555 524 1285 1529 1164
4402A164n55j053p63l91J89R29Q15P08M94j78p16r68q40k07JO18J072Q09L51j78
$$ 1164 609 -444 -1207 -1598 -1409 -480 335 1043 1537 1359 643 -325 -1165 -1372 -1371 -753 319 1128 1479 1301
4422A301m39r07q92m79O5M05R60Q76M65pk88j127r07n03k1M64R47Q88N16N7k26
$$ 1301 862 -45 -937 -1416 -1351 -946 14 890 1355 1348 1060 -67 -974 -1477 -1498 -1034 -87 801 1317 1374 1148
4443A148r35j000p17q3M95Q81J050O15Rl56o70r51p73j06K09O52J075O87M66l64
$$ 1148 213 -787 -1504 -1587 -1092 -211 839 1454 1463 1107 437 -514 -1287 -1393 -1184 -532 543 1230 1696 1332
4463A332q75q91q48n7Q0Q70P26P44N00l13n90r90o41l48LM20J173P38M72m1o99
$$ 1332 457 -434 -1282 -1339 -1259 -389 337 1081 1581 1268 678 -312 -953 -1301 -1298 -878 295 1033 1505 1464 765
4484G65p87q40o59K87L26Q52Q93M92O7l95j082p67l36k04N28Q30O98N00K40m66
$$ 765 -22 -862 -1521 -1234 -908 -56 837 1329 1396 1001 -81 -848 -1184 -1388 -860 -30 668 1168 1408 942
4504I42p02j008n63j8L34P05J001O74N6k67p19j126o10k20O03M25R02P86O2n0
$$ 942 240 -768 -1331 -1349 -1015 -310 691 1365 1421 1154 435 -691 -1301 -1521 -918 -493 409 1195 1257 1207
4524A207p87r26n52j63pP43P09R12K78k13n98j025o64l42N9Q03O28R07M03j01
$$ 1207 420 -506 -1058 -1221 -1228 -485 224 1136 1414 1201 603 -422 -1086 -1428 -1369 -566 62 969 1372 1271
4544A271m66q67r99k28j66P56P78O41O94k5m95r09p35m91r4N55N79R12M89J82
$$ 1271 805 -62 -1061 -1289 -1455 -699 79 720 1414 1389 894 -15 -750 -1241 -1335 -780 -201 711 1200 1382
4564A382n07n89j097l50r3K29R20P34M00L82o00n57o82o41j38pR24P11O08M43
$$ 1382 875 286 -811 -1161 -1254 -1025 -105 629 1029 1411 811 254 -428 -1069 -1207 -1214 -290 421 1029 1472
4584A472k73n81r32q21j74R0R38N61R16N0j88m84p01p69n02M8N92Q87P07M27o5
$$ 1472 1199 618 -314 -1135 -1309 -1219 -281 280 1196 1246 1058 574 -127 -896 -1398 -1350 -758 129 836 1263 1198
4605A198l76r60n76n14P7M75Q03P00L65K23n80r01n02p70Q7L71N95P85N78J67
$$ 1198 822 -138 -714 -1228 -1151 -676 127 827 1192 1415 835 -66 -568 -1338 -1251 -880 -285 500 1078 1245
4625A245n50m74q09o35Q7K36O78P16O30J34k28p27q15n16l51L92O58O32N88L47
$$ 1245 695 221 -588 -1223 -1136 -900 -222 494 1124 1258 1030 303 -512 -1028 -1379 -987 -329 303 891 1238
4645A238j81p99n63q43j51K29P60N65P88J85j39n21r93l65n45J66N15R39O02K00
$$ 1238 1057 258 -305 -1148 -1299 -1070 -310 255 1043 1228 1089 568 -425 -790 -1335 -1169 -654 285 887 1087
4665A087J37n66q95n08m63j48O71O49Q03M00N6o37m70p07n44k54N92P31N37P84
$$ 1087 1224 658 -237 -745 -1208 -1356 -685 -36 767 1167 1223 586 116 -591 -1135 -1389 -797 -66 471 1255
4685A255j74k23p27o24o94L7P1Q16P86N06J58k41o22p49n99k42L30N62M65R02
$$ 1255 1081 858 131 -493 -1187 -1150 -1079 -263 523 1029 1187 946 324 -425 -1024 -1266 -936 -374 91 993
4705I93J72k01l58q36p46l35K40N71O80P13K35r6m48n61p99n78K60M63P89Q35
$$ 993 1165 964 606 -230 -976 -1311 -1071 -500 180 893 1128 1032 584 23 -776 -1354 -1094 -631 158 993
4725I93K57j44n54o51n94l40j24L67Q29N96M48l7k20o66o63m39j31J09R24N97
$$ 993 1250 1106 552 -99 -693 -1033 -1157 -790 39 635 1083 1046 826 160 -503 -942 -1073 -964 -40 557
4745E57N81qn38k31q75o37j25M04M39Q22N53K42k32n99p21n62k23K47M99Q55N93
$$ 557 1138 1130 592 361 -514 -1151 -1276 -872 -433 389 942 1184 952 353 -368 -930 -1153 -906 -407 448 1041
4766A041J50r1p68o93n88n2n9N89N49O43K66Om14o37q46k30k5O04N37P89L57p
$$ 1041 1191 1100 332 -361 -949 -1001 -1060 -471 78 721 987 993 579 -58 -904 -1134 -1159 -555 -18 771 1128 1121
4788A121o39n36o28l88O0K68P99N40M30K61n54o48n61n98m3L02P05O43N55m3k84
$$ 1121 482 -54 -682 -1070 -1010 -742 57 597 1027 1288 734 86 -475 -1073 -1116 -814 -109 534 1089 1046 762
4809G62n63n89n96k75N66L85Q11N45J01j93o50o28n08k48J18N42P55O35K56k54
$$ 762 199 -390 -986 -1261 -695 -310 501 1046 1147 954 304 -324 -832 -1080 -962 -420 335 970 1226 972
4829I72m90p19n96k45Q1N49O90O07M3P1l35p75n66l87m9M86O74P95M11j91m04
$$ 972 482 -237 -833 -1078 -997 -448 242 849 892 963 628 -147 -713 -1100 -1149 -663 11 806 1217 1026 622
4850F22n58o53n19N2K80P09M95N75J67k90r04m64m22k63L10P44O61L23L02l66
$$ 622 64 -589 -1108 -1056 -776 -67 428 1003 1170 880 -24 -488 -910 -1173 -863 -119 542 865 1167 801
4870H01n02o97m16m51K32P76O57M77K45j49n00p36o69j35J20N16P33M91L64k35
$$ 801 299 -398 -814 -1265 -1033 -257 400 877 1122 973 473 -263 -932 -1067 -947 -431 302 793 1157 922
4890I22l28p58o99k33J71N69M49P22K08j3m16o95o29m78o1P39N09O50N54j35k97
$$ 922 594 -164 -863 -1096 -925 -356 93 815 1023 1010 594 -101 -730 -1208 -1269 -530 -21 629 1183 1048 751
4911G51o42q89k62n2L41O58N91M50J14k43q19n18l79m6J88N23O32O61n3k46n78
$$ 751 109 -780 -1042 -1094 -753 -95 496 946 1060 817 -2 -520 -899 -945 -757 -234 398 1059 1006 760 182
4932A82m30o27j91L25M04P23L62M91n31j23q51n88j69N1N96O92P03K30l07m20
$$ 182 -248 -875 -1066 -741 -337 386 748 1239 708 585 -266 -854 -1023 -972 -376 316 1019 1249 942 522
4952E22p15p05P2k21N46P24N64L34j32n29o05n91l65N9L14P82O22L24%n22m22
$$ 522 -193 -898 -826 -1047 -501 223 787 1121 989 460 -145 -736 -1101 -1042 -728 54 676 1000 1000 478 56
4973E6p64m15J24K79O13O72M94Q9n50o09n65m70QK22N74P36M58K03l29o75m76
$$ 56 -708 -1123 -999 -720 -107 565 1059 1148 598 -11 -576 -1046 -1038 -816 -242 494 952 1155 826 151 -325
4994c25n15j36J60N68N90N61J65k00n35n34o28k94J83L96Q79M38K77qo79m86p35
$$ -325 -840 -976 -816 -248 342 903 1068 868 333 -201 -829 -1123 -940 -544 335 773 1050 1042 363 -123 -858
5015h58k95J47M91P20M18M20n6k50o94p07l56p8L26N84R26R2M09n98m84r03k06
$$ -858 -1153 -1006 -515 205 623 1043 987 737 43 -664 -1020 -1098 -772 -188 738 830 1239 641 157 -746 -952
5036i52m8K98N20P37M16J02m85m12n27p66k8L54M85P55M72L5k7o99o24m85p8J50
$$ -952 -1000 -702 -182 555 971 1073 588 176 -351 -1117 -1145 -791 -306 449 921 956 929 230 -394 -879 -957 -807
5058h07N27P50M38J23o7o47o38n06j12m3M61O91P24K35q7o43o04o22k34J50N06
$$ -807 -280 470 908 1031 964 317 -321 -827 -939 -982 -521 170 894 1129 1042 399 -205 -827 -1061 -911 -405
5079d05M97O60L00j35j55p47p97k77P0L33M62P86M94l6l14o09p23m27L2O9P64
$$ -405 92 752 1052 917 762 15 -782 -1059 -989 -656 -194 592 1086 1050 736 127 -596 -1023 -991 -922 -158
5100a58P55L56ok56m46o44n41p2K06P37M72N13J37p7p14n07m92m62J18O84N26
$$ -158 597 953 947 691 245 -399 -940 -1012 -806 -69 403 916 1053 976 262 -245 -737 -1199 -1081 -397 129
5121A29O01L63l59j68r52k62m48K55K87Q92L73L08j69m32o47o03k23j07N36P20
$$ 129 730 1093 734 566 -386 -648 -1096 -841 -554 338 711 1019 850 418 -229 -832 -1055 -1162 -626 94
5141I4N75M49j49k95q33n35l70N3K54Q28O20K67L47p23m95o41n74J00K94O08O93
$$ 94 669 1118 969 674 -159 -694 -1064 -1011 -757 71 691 958 1305 582 87 -554 -1128 -1028 -734 -126 567
5162E67L23K16l84n68o40n55k9K54O29O25L90L46k79n52p06n63j84Q3M36R61L80
$$ 567 890 1106 722 154 -486 -1041 -1070 -816 -187 438 828 1174 895 343 -363 -926 -1110 -1027 -591 370 750
5183G50M61k30n55o94n14l69J27O15N12Q50J5L1o46o58m72k95J00L78Q77K90N32
$$ 750 1211 981 426 -268 -782 -1151 -1024 -409 103 953 968 999 353 -305 -777 -1072 -972 -594 283 573 1105
5204A105r7m57o16m62n81J6L41Q00M54M64J71k51r28o35l80j4L71N64O27N89R0
$$ 1105 1008 551 -65 -527 -1108 -1092 -751 49 503 967 1138 887 -41 -676 -1056 -1070 -699 -135 492 1081 1171
5225A171l23p20m70o70j24K21N77Q82L82N0n2n89o97o67j25l7J011N31N16L53
$$ 1171 848 128 -342 -1012 -1136 -915 -338 544 926 976 924 335 -362 -1029 -1154 -1191 -180 351 867 1220
5245A220k17m91q47n87p9l8M96Q56N65K43k40m05o47o86k77J93L24P80N64K53
$$ 1220 1003 512 -335 -922 -1001 -1039 -543 313 878 1121 881 476 -171 -857 -1134 -941 -617 163 727 980
5265I80ql10q03n18n53K46K99O25O63K51L36m99n91n01m54k56M01N48Q50M40l1
$$ 980 972 662 -141 -659 -1212 -966 -667 -42 621 872 1208 709 118 -383 -837 -1093 -692 -144 706 1146 1115
5286A115l17n76q08l50j17P0P27O87N64J91j94o70p56o68j33L15N29P89O81p4
$$ 1115 798 222 -586 -936 -1053 -983 -256 431 995 1186 992 322 -434 -1102 -1235 -920 -391 398 1079 1005
5306A005k49j48r13o17l07K46N51N25P10K28j14m78p02n51l69J48M71N81O10M57
$$ 1005 756 608 -305 -922 -1229 -983 -432 93 803 1031 917 439 -263 -814 -1183 -1035 -564 17 627 1084
5326A084j6l60q27o54k33J50K5Q44O22L64J82n13n90o70l52l65O36O14P09L44
$$ 1084 1068 708 -119 -773 -1006 -856 -831 13 635 999 1181 668 78 -592 -944 -1309 -673 -59 650 994
5346I94K32m64o90o26m09k29L44N42Q02L19M20m68n99n81o11j90K80O48O98N40
$$ 994 1226 762 72 -554 -963 -1192 -848 -306 496 815 1235 767 168 -413 -1024 -1214 -934 -286 412 952
5366I52J81k75m66p42o06j21L76K42N98O50M26m10k26p84p55p4l1N96M29P53L89
$$ 952 1133 858 392 -350 -956 -1077 -701 -459 139 789 1215 805 579 -205 -960 -1034 -1065 -469 -40 713 1102
5387A102j27k88o70p61m61qN47Q36N56L40k10l32o15o17l89r5L95P80O37N53j05
$$ 1102 975 687 17 -744 -1205 -1213 -666 170 726 1066 856 524 -91 -708 -1097 -1192 -797 -17 620 1173 1068
5408A068m42l73q91l42j97O44M69O02N37J33l09p43o35m15j86K36N84O72M94K30
$$ 1068 626 253 -638 -980 -1177 -533 -64 538 1075 1208 899 156 -479 -894 -1080 -844 -260 412 906 1136
5428A136k90n70o09m84k28J11M61P60O05L38k25m85p92n79k53J68N42M10P55L01
$$ 1136 846 276 -333 -817 -1045 -934 -473 287 892 1230 1005 520 -272 -851 -1104 -936 -394 16 771 1072
5448A072j00m84o83n14m21J17L56P23O83L45j97l83m99p61l85mL30Q17O15L39
$$ 1072 972 488 -195 -709 -1130 -1013 -657 66 749 1094 897 514 15 -746 -1131 -1135 -805 12 627 966
5468I66J81n16o35p08m50J02L00O39Q67L02J4l63n13n86m62k28J35O70Q66L78
$$ 966 1147 631 -4 -712 -1162 -1060 -760 -121 746 1048 1062 699 186 -400 -862 -1090 -955 -285 581 959
5488I59J40j53q09n71m80j95J74O36P88M31J86l38l94p42m94j88n6O03P55M33
$$ 959 1099 946 137 -434 -914 -1109 -935 -299 489 920 1106 768 374 -368 -862 -1050 -1106 -503 252 685
5508F85N18k01n77o01o99r0j04N13P43N92J96J13o06m79n87n26J52K67O77M03
$$ 685 1203 1002 425 -176 -875 -965 -1069 -556 187 779 975 1088 482 3 -584 -1110 -958 -691 -14 389
5528C89P36j94l33o88m74n13ML33L75R08M86J77l28q59n88k89k99J77Q47O10N87
$$ 389 1125 931 598 -90 -564 -1077 -1073 -740 -365 543 1029 1206 878 19 -569 -858 -1157 -980 -133 477 1064
5549A064O1l79m64n92p21l8L18M60O62M70L35k73n67o73m26l10J47M42P29N94
$$ 1064 1125 746 282 -310 -1031 -1069 -751 -291 371 841 1176 903 336 -337 -763 -1073 -926 -484 245 839
5569H39K10p4m05p57n93n40L77N18O16N61K45L9m74p85n88k04j52O39N70O59K12
$$ 839 1049 975 570 -187 -780 -1320 -943 -425 191 752 997 1036 562 -223 -811 -1015 -1167 -528 42 701 913
5590I13O8l05o99p03k45j46M64P14M87N63o8k82o81o65m90m1L59O54Q22K67J1
$$ 913 981 676 -23 -726 -971 -1117 -653 61 548 1111 1043 761 80 -585 -1075 -1116 -757 -103 719 986 997
5611I97k33m72p40q01J73L13M54O65M81K53k55n43o30o01l03K71N47Q15L62K24
$$ 997 764 292 -448 -1249 -1076 -763 -309 356 837 1090 835 292 -338 -939 -1242 -971 -424 391 753 977
5631I77j49m31o60o57l6l0N14P33M94K16m9k38p64p28l83Q6M48O06Q15L21l7m30
$$ 977 828 397 -263 -920 -956 -986 -472 261 755 971 922 684 -80 -808 -1191 -1105 -657 -51 764 1085 1048 618
5653F18n76p57l89R0L37N25O75M40O0l49o02o94m32j71N46O04O08P01j7n30o36
$$ 618 42 -715 -1104 -1014 -677 -152 523 963 1023 674 72 -622 -1054 -1225 -679 -75 533 1234 1217 687 51
5674E1m04p33M0K60N62Q60K29J60q2o91n17o98j03Q7O28P01O07P3k88k50q53m55
$$ 51 -353 -1086 -1046 -786 -224 636 865 1025 943 252 -265 -963 -1066 -979 -351 350 957 1030 742 492 -361 -816
5696h16k46J06N37O61O02M6J61m64o91o73k97p8O24O22O69J99m7k85o59o79l88
$$ -816 -1062 -956 -419 242 844 890 1051 587 -104 -777 -1074 -1152 -528 94 763 962 915 630 -29 -708 -1096
5717a096J54L29O41N84M64ol48n82p04n09O5L82O21N69N71j95j15p28p21k92k25
$$ -1096 -942 -613 28 612 1076 1070 722 140 -564 -1073 -1008 -626 -5 564 1135 940 825 97 -624 -916 -1141
5738a141M05L70P01O55K8j86m41p74n15k68L38Q11K99N47M15m59n17m46n55k11
$$ -1141 -736 -366 335 990 1018 832 391 -383 -898 -1166 -828 -17 282 829 1244 785 268 -178 -733 -944
5758i44J52L00P01N26M28k84n60m96n72q2r9M10N69O79J25O3o03l61o64n01L28
$$ -944 -792 -492 209 735 1163 879 319 -177 -749 -831 -930 -520 49 728 853 916 313 -48 -712 -1213 -885
5779h85L37N35O43K77L0l16o58o26k53Q7K18N79N87M44P8k95p77l04o07k00L33
$$ -885 -548 -13 630 907 937 621 -37 -663 -916 -829 -611 -32 555 999 1077 782 5 -299 -906 -1106 -773
5800g73O78M49M66J62j95o94k42o65k58K29M54P81M08M39m61m96p00m61j64K84
$$ -773 -95 354 820 982 787 93 -149 -814 -1072 -843 -389 392 800 1239 778 282 -418 -879 -1043 -759
5820g59M38O43N81J64j74l32o45o80l72L66L00P28L68L99j98n19m74n84k89m1
$$ -759 -321 322 903 1067 893 561 -84 -764 -1136 -770 -470 258 626 1025 827 308 -166 -750 -1039 -1080
5840a080N50O56N79M89k50l74n00o33l73l4M70L90Q94K80k53j68n01o83m89kM73
$$ -1080 -530 126 705 1194 944 570 70 -563 -936 -970 -500 -110 784 1064 811 643 142 -541 -1030 -1032 -559
5861e59L73O15O15j11j82o18o91k64j03J41M45O78M34J29k56n08m70l14k07O2
$$ -559 -186 429 1044 933 751 133 -558 -822 -925 -784 -339 339 773 902 646 138 -332 -646 -853 -791
5881g91M81P60M43n8l2n45o80n38m9J42M50O90L97K84q6m49p85m44L5n6L17N86
$$ -791 -310 450 893 835 803 258 -422 -960 -1009 -867 -417 273 670 954 868 419 -366 -810 -775 -831 -514 72
5903G2N52L10j07l22m94p75j79J1L00P66M81K94K5m49m78n34n66K0M84M74O66
$$ 72 624 934 827 505 11 -764 -943 -932 -632 134 615 909 934 485 7 -527 -1093 -1073 -589 -115 551
5924E51N46j00m42m09p67Ok70J07O80N82M91K8l04o79m90l38M5r8O17O91L95L3
$$ 551 1097 997 555 146 -621 -615 -885 -778 -98 484 975 1003 699 20 -470 -808 -763 -861 -244 447 842 875
5946H75j36n74l80o33j9J84J60O03O15K77j68l56p18n90p6kM85M42P25J19J02
$$ 875 739 165 -215 -848 -867 -683 -523 80 695 972 804 448 -270 -860 -936 -938 -453 -11 714 833 935
5967I35n43n64l73m60M0M34O72L87M12J05o08n99m25k40j00L57N50N76L35R9j69
$$ 935 392 -172 -545 -1005 -965 -531 141 528 940 1045 437 -162 -587 -827 -927 -570 -20 556 891 990 821
5988H21o50p20k84O2J51Q00L29M18R6n20r4o96n99n5J04N23O47M17J63j84m67
$$ 821 171 -549 -833 -771 -620 180 509 927 1023 503 409 -287 -886 -941 -837 -314 333 750 913 729 262
6009B62m86m99k43K59K85Q60L30J15j3l47r43l41j33Q1L09P04M22K61R8q39k66
$$ 262 -224 -723 -966 -707 -422 438 768 883 870 523 -420 -761 -894 -813 -504 200 622 883 981 142 -124
6030a24m27l78J65M16M50L43N23j1m44p43l71m35N2M45N20O87L01j13k12n14o08
$$ -124 -551 -929 -764 -348 102 445 968 957 513 -230 -601 -1036 -984 -539 -19 668 969 856 644 130 -478
6051d78m62j39N41N19M76M68O4m69k14p92m12m6K78M94O43L37N5J7m91p39l85
$$ -478 -940 -1079 -538 -19 457 925 989 520 306 -486 -898 -944 -666 -172 471 808 863 880 389 -350 -735
6072g35j98J40M73M96N07K65j55m88m97o28j04K72K47N71N06L67k62m06n00m39
$$ -735 -933 -793 -320 176 683 948 793 305 -192 -820 -924 -652 -405 166 672 1039 777 371 -129 -568
6092e68l41P3N90N43L10K59j80k76l11q15%k52N03N36M25N58k37k40m80p33r1
$$ -568 -909 -836 -246 297 607 866 686 410 99 -716 -716 -968 -465 71 496 1054 817 577 97 -636 -727
6113g27j84M30M17N20L10J36j90o10o52k45O4K79L92M60L75J97k55p88k31l57
$$ -727 -911 -481 -64 456 766 902 712 102 -550 -795 -731 -452 -60 400 775 972 717 -71 -302 -659
6133f59j29J29M79M38M61J34l18j81n44m06k69K02L32N15M41K60j15k85o97m33
$$ -659 -788 -659 -180 258 719 853 535 354 -190 -596 -865 -663 -331 184 625 885 770 485 -212 -645
6153f45l73L56L40K98N64L82J5m06n16l43n42l0N99L49M11L24N4m83l73n31j95
$$ -645 -1018 -662 -322 -24 540 922 937 531 15 -328 -870 -900 -301 48 459 783 837 354 -19 -550 -745
6174g45j76L64O21L84K96j44k9n44n34l17L4K24N42N38K87L9l34m36n11k83k42
$$ -745 -921 -557 64 448 744 600 571 27 -507 -824 -790 -566 -24 514 801 840 506 70 -441 -724 -966
6195i66J41P55M89J62J82n6m78m47m12j06N2M85L57L85K42k5p08l02n22l25M40
$$ -966 -825 -70 419 581 763 707 229 -218 -630 -736 -684 -199 158 543 785 760 52 -250 -772 -1097 -657
6216f57L97L02N24L87j85m43n32m11n5j41N14N37K82K42r7k43l41n16o32L43J30
$$ -657 -260 42 566 953 768 325 -207 -618 -673 -814 -300 237 519 761 664 421 80 -436 -1068 -725 -595
6237e95N38L74M30M1k23n78m35k35j53K30O01M79K39J02k25n11m71m66J18M52
$$ -595 -57 317 747 788 565 -13 -448 -683 -836 -606 -5 474 713 815 590 79 -392 -858 -740 -288
6257b88K15N18J24P7J44p53l21k57l59L58L50N98J47J48k55l40l59n98R5J82L57
$$ -288 -73 445 569 646 790 37 -284 -541 -900 -542 -192 406 553 701 446 106 -253 -851 -756 -574 -217
6278b17N17L22J16j30k17m98l83j12k6K64M35M79K30q8l58m82l34l57K24J45M56
$$ -217 300 622 738 608 391 -107 -490 -602 -628 -364 71 550 780 692 334 -148 -482 -839 -615 -470 -14
6299a4O77J35p2l66m35m83k83J74L42K59M91L35k5j02p10m37r8N7J14K65N18M10
$$ -14 663 798 726 360 -75 -558 -841 -667 -325 -66 425 760 735 633 -77 -514 -612 -555 -441 -176 342 752
6321G52o0r9n97l25k79k21L41L37M26K71J5K7m46m86k56j44K98K84L18N59k4j72
$$ 752 692 593 -4 -329 -608 -829 -488 -151 275 546 561 588 142 -344 -600 -744 -446 -162 156 715 691 519
6343E19l45l44l46k87J32L00N31N59J6J2n62m76k76l57L57J10O65L66J35j07j08
$$ 519 174 -170 -516 -803 -671 -371 160 719 735 747 185 -291 -567 -924 -567 -457 208 574 709 602 494
6364D94o05m68m3j62L96M55M80J43n1k24m12o44o0K0L74L89L67K28J5j50n19m25
$$ 494 -111 -579 -622 -784 -388 67 547 690 639 415 3 -641 -701 -681 -307 82 449 677 692 542 23 -402
6386d02j26k1R7M05M72K71J17l14m57l06l86l5J64J95M98L94J90k69l11m23n06
$$ -402 -528 -549 -452 -47 425 696 813 499 42 -264 -650 -685 -521 -326 172 566 756 487 176 -247 -753
6407g53q4K91K46O27J30J85l0m96k00n25j19R5K82L18N79J36m3l37m63k87q4k10
$$ -753 -837 -546 -300 327 457 642 612 116 -84 -609 -728 -633 -351 -33 546 682 639 302 -161 -448 -532 -742
6429g42M04L39M67K28O1k89m11n11k11RJ9M71N82J58O4j68l07n47j91j38J40N46
$$ -742 -338 1 468 696 757 468 57 -454 -665 -656 -637 -166 416 574 638 470 163 -384 -575 -713 -573 -27
6451b7K89M58p3j33m52m88k07P0PN77K34L88k19j49j88m46l56J05J34L52M34J48
$$ -27 262 720 647 514 62 -426 -633 -563 -556 21 255 643 424 275 87 -359 -715 -610 -476 -124 310 458
6473D58J23j9m23m35j34j0r1L94K89N06rj35k56n02k28k35O0N28J26P18l5k56
$$ 458 581 562 139 -296 -430 -440 -531 -137 152 658 649 514 258 -244 -472 -707 -647 -119 7 725 690 434
6495D34q7n26l63p8j2K43M69L83L29k92k07m48m36Q0K1K15L89K51N3J06k54k91
$$ 434 347 -179 -542 -620 -632 -389 80 463 792 500 293 -155 -591 -511 -490 -275 114 365 418 524 270 -21
6517b1l42r0k69M05M04K03J37K69l79k34n71L0j38O2L92M95Q1P3j5l20l27m39
$$ -21 -363 -453 -722 -317 87 290 427 696 317 83 -488 -458 -596 -534 -142 353 434 507 492 172 -155 -594
6539e94M1J69J43M36L27kL4n29j57l66j54J46K00N68P4L64k11k60k99l37l37K43
$$ -594 -553 -384 -241 195 522 520 554 25 -132 -498 -652 -506 -306 262 336 700 489 229 -70 -407 -744 -501
6561e01K41K88M41K27j55l41j62n62R9k52M59L38L93Q5q4k48l26m16q7p4K41M35
$$ -501 -260 28 469 696 541 200 38 -524 -425 -677 -218 120 513 598 514 266 -60 -476 -563 -637 -396 39
6583C9K93L37l0m17j97m06k76J37PN68J79K69L5k73j88l61l10N8J11M86L24K84
$$ 39 332 669 639 222 25 -381 -657 -520 -513 55 234 503 538 265 77 -284 -594 -536 -425 61 385 669
6605F69k00q2j43m60k87J0L00J87J75N41r3k43j72m30k84J6n1M40K45L50J3r3
$$ 669 469 387 244 -216 -503 -493 -193 -6 169 710 617 374 202 -228 -512 -496 -547 -107 138 488 501 408
6627D08k20m26k50j1j0L71O03k1R1J31n43k06m15k1M5J79K97L64L29j20k63m82
$$ 408 188 -238 -488 -499 -509 -138 465 444 535 666 123 -83 -498 -519 -474 -295 2 366 695 575 312 -170
6649a70k26q3j39L65J85L93K50j00j60n28k71j78K42J72K91L66J38l4j48qo32
$$ -170 -396 -479 -618 -253 -68 325 575 475 315 -213 -484 -662 -420 -248 43 409 547 513 365 357 -275
6670b75k47J46m6O46JJ96L9j10m35k44j93m4K45K39L31L22O5j86m04k38l49K7
$$ -275 -522 -376 -422 224 225 421 460 350 -85 -329 -522 -566 -321 -82 249 571 636 450 46 -192 -541 -514
6692e14J07K77L26L04L1n3l74k14k81l44L59L14J38L99K8j39k39k83l46nR4K44
$$ -514 -407 -130 196 500 531 478 104 -110 -391 -735 -376 -62 76 475 503 364 125 -158 -504 -509 -415 -171
6714a71K05L33N3K9l56k72k48o0J25J99Q9M12K16j68l07n2l24o5j84L10L17L17
$$ -171 34 367 420 449 93 -179 -427 -487 -362 -163 -74 338 554 386 79 27 -297 -362 -546 -236 81 398
6736C98O9k3o5l60l76n9K7K07L33L03K41m07J25m44j40l24J04R9K23J25N21N3
$$ 398 467 444 379 19 -357 -416 -389 -182 151 454 695 288 413 -31 -171 -495 -391 -292 -69 56 577 630
6758F30k43l29m26m5q3J31L05K80J67P2K4l56l38r2j38J16J25N38m0J26N5m51
$$ 630 387 58 -368 -413 -496 -365 -60 220 387 459 483 127 -211 -303 -441 -325 -200 338 298 424 479 28
6780B8k18l18N0J37K97K46K88K8k78j76k12l17j51K09L61K65L6J09O0k49l32k22
$$ 28 -190 -508 -458 -321 -24 222 510 538 260 84 -128 -445 -596 -387 -26 239 275 384 444 195 -137 -359
6802c59J38j43K98k7M53p0K23j86m39k41q8j3K24L69K03j19K38k17m31k39j6p0
$$ -359 -221 -364 -66 -93 360 290 513 327 -112 -353 -441 -454 -230 139 342 223 461 244 -187 -426 -442 -512
6824e12J91N48J81j51L20l78k76j59k50Q9J18L35L56M4M3k73q2k52j84m5r7L75
$$ -512 -321 227 408 257 577 199 -77 -236 -486 -397 -279 56 412 456 499 226 144 -108 -292 -337 -434 -59
6846e9K98K41j6k14k74l56nj88J89K61L11L43n7k23j92j12l84M0J57J82J51J29
$$ -59 239 480 464 250 -24 -380 -385 -573 -384 -123 188 531 474 251 59 -53 -437 -397 -240 -58 93 222
6868B22M6K17m11j91k86m6K8K56J71K77J98l4l13j98k95k09K37O1K53L99J87l34
$$ 222 268 485 74 -117 -403 -449 -421 -165 6 283 481 447 134 -64 -359 -568 -331 -270 -17 382 569 235
6890B35J02m47Om30J45J60N21m4K60j63k30k98k04j02O8J31L33L50Q5p2j59k68
$$ 235 337 -110 -104 -534 -389 -229 292 248 508 345 115 -183 -387 -489 -421 -290 43 393 478 406 247 -21
6912b1k86j19M7J57K69M22k7J5m48j17K5l86N3J65L18M00l0J29j69m74k19j60
$$ -21 -307 -426 -379 -222 47 469 442 457 9 -108 -83 -469 -416 -251 67 467 437 566 397 -77 -296 -456
6934d56l4J82K60K75K69o5j56k08l78p4j10K04J53K10K84Mk1l28k22k22jj0M60
$$ -456 -490 -308 -48 227 496 431 275 67 -311 -385 -495 -291 -138 72 356 360 339 11 -211 -433 -434 -444 16
6957A6J40L02n3j87j71j91k28r4J64J44L52K43j05J86n15j61j23k00N8L16K97
$$ 16 156 458 405 218 47 -144 -372 -466 -302 -158 194 437 332 518 3 -158 -281 -481 -423 -107 190
6978A90J57M1O7k43k17j63k26j3K41K95J67N8J3k71r3j52j84J13J11K16O7K54
$$ 190 347 388 455 212 -5 -168 -394 -407 -166 129 296 354 367 96 3 -149 -333 -220 -109 107 174 428
7000D28N2k69k05k31k21m5K06M07l3M59k46k63l3l94l3%J35L32K42J89j73J5j45
$$ 428 480 211 6 -225 -446 -491 -285 122 89 548 302 39 6 -388 -421 -421 -286 46 288 477 304 319 174
7023A74m60j01r2K18K21M03M8J2j74k4n44m7p3L12L0L26J94k3M4k71l72j97J44
$$ 174 -286 -387 -479 -261 -40 363 411 423 249 225 -319 -366 -439 -127 -97 229 423 400 444 173 -199 -396 -252
7046b52R8j8M08J93j86M8j81l19j54J06k96L94L71J76K32k02j62j47m35j14R2
$$ -252 -154 -172 236 429 243 291 110 -209 -363 -257 -553 -159 212 388 620 418 256 109 -326 -440 -348
7067c48L39P1K13K21m2m00J22n96J20j87J90M57L51j19R1l25l47n6j45J05MK51
$$ -348 -9 62 275 496 454 54 176 -420 -300 -487 -297 160 511 392 483 158 -189 -245 -390 -285 -281 -30
7089c0K80N7k9O6n13j56j9j8J42K79J28J45J8j18m9o38n6k7M22J77J79K34q4j05
$$ -30 250 307 278 344 -169 -325 -344 -362 -220 59 187 332 350 232 183 -455 -511 -538 -116 61 240 474 390 285
7113B85l28l33j05J19K17O1L17N8N9J59m28m84p5J29PL02L17K24m0j58j71j76
$$ 285 -43 -376 -481 -362 -145 -84 233 291 350 509 81 -403 -478 -349 -342 -40 277 501 461 303 132 -44
7135d4m16O0J46K69J89K79j7q6l55o6m42m0J29K70K56K33J04k33k62q7l55J15
$$ -44 -460 -400 -254 15 204 483 466 380 25 -41 -483 -523 -394 -124 132 365 469 236 -26 -113 -468 -353
7157c53k7L08K54K90m5j60j76l39j41j10J13J56L11L16lj03kl82k24j28N5K25
$$ -353 -380 -72 182 472 427 267 91 -248 -389 -499 -386 -230 81 397 394 291 289 -93 -317 -445 -390 -165
7179a65K45K96q0K85l53k28m04o1p8L55L64J42O0j73Q1k63k46j37q3L1N17J23
$$ -165 80 376 296 581 228 0 -404 -465 -543 -188 176 318 378 205 286 23 -223 -360 -443 -412 105 228
7201B28M0J78j00l40j99k08lK97O6M09J24O1j86l67l26j81J86L8J45N13l4K35
$$ 228 268 446 346 6 -193 -401 -404 -107 -41 368 492 553 367 0 -326 -507 -321 -283 -138 375 341 576
7223E76k45k17l13l58J42O5J43M93LJ08J7n10j16j08k58J26K85L35K10jo5q0m56
$$ 576 331 114 -199 -557 -415 -350 -207 286 289 397 414 -96 -212 -320 -578 -452 -167 168 378 377 312 232 -224
7246b24l53L8J06L69K40L6L15J5l62k46l31k23J60K28L43J49J9J75j52k95k74
$$ -224 -577 -539 -433 -64 176 212 527 542 180 -66 -397 -620 -460 -232 111 260 279 454 302 7 -267
7267b67j89r2J33L96N09L0Qj19m76l44j43K78N7K5M78J75J80m64l35n3l22O2J48
$$ -267 -456 -548 -415 -19 490 520 528 409 -67 -411 -554 -276 -219 -194 284 459 639 175 -160 -213 -535 -473 -325
7290c25K93L19K48M7m82l18m5j78j19K29K51J90L08J01j57k84l32k74J9K02K95
$$ -325 -32 287 535 582 100 -218 -263 -441 -560 -331 -80 110 418 519 362 78 -254 -528 -509 -307 -12
7311a2K87K58M5k82j29k68l64j55K15K85K58L7J23K27k99l75k37j52J72K77J29
$$ -12 275 533 578 296 167 -101 -465 -620 -405 -120 138 175 298 525 226 -149 -386 -538 -366 -89 40
7332D0L73M3j38m5n55j46q8J22J0M56L50K13j80k94l35k38k45J56J52N38J53J88
$$ 40 413 456 318 273 -282 -428 -516 -394 -384 72 422 635 455 161 -174 -412 -657 -501 -349 189 342 530
7354E30j94j9l26l36j53O1K18N2N01QK11q5l92l71k88m2K67K39M04K17j64l4k07
$$ 530 336 317 -9 -345 -498 -437 -219 -167 334 342 553 468 76 -295 -583 -625 -358 -119 285 502 338 304 97
7377I7l08l27J26K13J39L65K28k47J92n74q4l42j36L89K07J97K27J53l7l19k66
$$ 97 -211 -538 -412 -199 -60 305 533 286 478 -96 -180 -522 -658 -269 -62 135 362 515 478 159 -107
7398a07l67N5Q3J87K79K82J6k7k16m54j70L6p4L77K11M29J6J4m21k54l18k22L5
$$ -107 -474 -419 -336 -149 130 412 428 401 185 -269 -439 -403 -477 -100 111 540 556 570 149 -105 -423 -645 -610
7421f10K20N04R0M02k08r5l57j76k20o9J01M55K78K55m0l60K9n62k2j01K35L14
$$ -610 -390 114 204 606 398 303 -54 -230 -450 -519 -418 37 315 570 530 170 199 -363 -385 -486 -251 63
7443F3K50K76p8j82j80m54k9j83J26K92L55K04m3k82o1k39l50K7K07K38J90K74
$$ 63 313 589 511 329 149 -305 -334 -517 -391 -99 256 460 417 135 74 -165 -515 -488 -281 -43 147 421
7465D21K69k41l85m43j11k4K25O2M25K21J53k6l18k23n31Q7n7K20L26L76L2l8
$$ 421 690 449 64 -379 -490 -514 -289 -227 198 419 572 546 228 5 -526 -439 -496 -276 50 426 458 420
7487D20j51l20k79l42J62L30L88J68L23k49l12k36l10j76J17Q6N69K92o2J54k61
$$ 420 269 -51 -330 -672 -510 -180 208 376 699 450 138 -98 -408 -584 -467 -381 188 480 418 572 311
7508C11l04m63k7L8Q5M46L09R5K02m08k55k06m63J16J73L36M23K00J1l48j87l21
$$ 311 7 -456 -483 -445 -360 86 395 490 692 284 29 -177 -640 -524 -351 -15 408 608 619 271 84 -237
7530b37k25j08K64K91N8M69m8j8m45l49j29k3J19L47M29J31L1j46k68l67k11j13
$$ -237 -462 -570 -306 -15 43 512 464 446 1 -348 -477 -500 -381 -34 395 526 557 411 143 -224 -435 -548
7552e48M9L60K90M07J69k92k12m75j34m5M6Q1N09K31L71k79l72l24k22k35J76
$$ -548 -499 -139 151 558 727 435 223 -252 -386 -431 -385 -304 205 436 807 528 156 -168 -390 -625 -449
7573d49K48L61L69J36k05k00m66ml65j32M88K54L75J48N6k27l11m18k41K0K10
$$ -449 -201 160 529 665 460 260 -206 -210 -575 -707 -219 35 410 558 614 387 76 -342 -583 -563 -353
7594c53L00M65K06Q6k67k98m26j71k06J37L66N20K88n9m3m31j96m26j41J23L24
$$ -353 -53 412 618 704 437 139 -287 -458 -664 -527 -161 359 647 588 545 114 -82 -508 -649 -526 -202
7615b02M04K97K09l65k31k82m69L4J77K46L74L07K25l93j43m18k27r0j45M86M00
$$ -202 202 499 708 343 112 -170 -639 -605 -428 -182 192 499 724 331 188 -230 -457 -547 -692 -206 194
7636A94K30n5K72m34m37k63k06L05L04J85L76J27p8k63l56k42j80j11L21K64M34
$$ 194 424 369 641 207 -230 -493 -699 -394 -90 95 471 598 520 257 -99 -341 -521 -632 -311 -47 387
7657C87J00j4p7n21l04j37QK48J84M81K72m0k65k21m65l57J66J26M83L52J69J26
$$ 387 487 473 396 -125 -429 -566 -558 -310 -126 355 627 587 322 101 -364 -721 -555 -429 54 406 575 701
7679G01k76l23m13k93m9K06M32J46N49J9q7n01j12n99N0J64K54L89L68l7r9l58
$$ 701 425 102 -311 -604 -653 -447 -15 131 680 699 612 111 -1 -600 -550 -386 -132 257 625 588 489 131
7701A31l41k18p0J11K55L27L92R9j68k04m77k60j46P4K42L24M47J21j26l87r4
$$ 131 -210 -428 -498 -387 -132 195 587 686 518 314 -163 -423 -569 -495 -253 71 518 639 513 126 32
7722C2m26k53J50L27K46L22O1M7j73k86l92j16k20K63L56N12J70j43n2k16o79
$$ 32 -394 -647 -497 -170 76 398 459 506 333 47 -345 -461 -681 -418 -62 450 620 477 425 209 -470
7743d70p1M1K7L84L59L80j14j73l33k62l19q5K80J34M13M08j42m1j72l84m88J55
$$ -470 -541 -500 -473 -89 270 650 536 363 30 -232 -551 -636 -356 -222 191 599 457 416 244 -140 -628 -473
7765d73M3J74L59M98J99l26m05k19j76l31L7L47N13K42m9K28l92k03o64p9J12
$$ -473 -430 -256 103 601 800 474 69 -150 -326 -657 -620 -273 240 482 433 661 269 66 -598 -677 -565
7786e65K49M66K49K77j44l43m63j48j25n8K57M55L50J02J08k10n76m39j48J47
$$ -565 -316 150 399 676 532 189 -274 -422 -547 -605 -348 107 457 559 667 457 -119 -558 -706 -559
7806e59L32K53J80J97J26m0m65k64l30o1Q7M80M98J11Q6k37o4n20m18m5jM53O33
$$ -559 -227 26 206 403 529 489 24 -240 -570 -631 -544 -64 434 545 631 394 330 -190 -608 -653 -654 -201 432
7829D32P9Q0j20l82k74m40K3J73K36N05K07L74l25l72l08j82m39J54L92L80K25
$$ 432 511 591 471 89 -185 -625 -602 -429 -193 312 519 893 568 196 -112 -294 -733 -579 -187 193 418
7850D18K93j27m14l47l28m0j03L61L51L52K38n4k86l30m12k28L8L09M51L4M14
$$ 418 711 584 170 -177 -505 -545 -648 -287 64 416 654 600 314 -16 -428 -656 -618 -309 142 176 590
7871E90m6j55l23l83k74m1K69L82L53J34J27k12k67m49l22QJ35K72N99K38L1p9
$$ 590 544 389 66 -317 -591 -632 -363 19 372 506 633 421 154 -295 -617 -609 -474 -202 397 635 666 587
7893E87n69k59l00o0K37J52L65L64L74m53k47m43l02k28J47M05L01K36L19k10
$$ 587 18 -241 -541 -601 -364 -212 153 517 891 438 191 -252 -554 -782 -635 -230 71 307 626 416
7913D16k30m12m28M7K25J40N15K41O1N9k41m49l34k83q5K32O19K32J59m5O8m97
$$ 416 186 -226 -654 -607 -382 -242 273 514 575 634 393 -56 -390 -673 -758 -526 93 325 484 439 507 10
7935A0k73j66j96K17K28N05L36Ok7m66n30l12K09J2K87M90K31J9j35m08l85l09
$$ 10 -263 -429 -625 -408 -180 325 661 667 640 174 -356 -668 -459 -447 -160 330 561 580 445 37 -348 -657
7957f57R7p6M60N16J88k2j61j57l87k97m3P4J10M57L16J82j65j17n80k62k65K69
$$ -657 -560 -636 -176 340 528 506 345 188 -199 -496 -539 -465 -355 102 418 600 435 318 -262 -524 -789 -520
7979e20N88l0L21K67jl30n91q5p8j61L81L04K57K35p7k51l36m24l2J20J02M75
$$ -520 68 38 359 626 625 295 -296 -381 -459 -620 -239 65 322 557 480 229 -107 -531 -563 -443 -341 134
8001A34K38K50j5j25m18l62k30j13J19M58L02L81l3n7m36m82k62k8K79K80N48
$$ 134 372 622 607 482 64 -298 -528 -641 -522 -64 238 619 586 529 93 -389 -651 -679 -400 -120 428
8022D28K10j8n4m17l53l60J24OL97L60K47J41j57l13n03j24j12j21L33N06O8J52
$$ 428 638 620 566 149 -204 -564 -440 -434 -37 323 570 711 554 241 -262 -386 -498 -619 -286 220 288 440
8044D40J46l19m32l72J05k27L72N20L16Q7j07j78n07k59n9OJ92M28K65K73l45
$$ 440 586 267 -165 -537 -432 -659 -287 233 549 636 529 351 -156 -415 -474 -468 -276 152 417 690 345
8065C45o6m12k87j75q9K66M13J24N23m7j20m28l25k59q9K95K29L60K45M0l95q2
$$ 345 279 -133 -420 -595 -684 -418 -5 119 642 595 475 47 -278 -537 -626 -331 -102 258 503 543 148 66
8087F6m06j70l7K43K17K68K97Q8j09n33N3n59j2QK92M76L18R5L8k84n74l31n7
$$ 66 -340 -510 -547 -304 -87 181 478 566 457 -76 -23 -582 -594 -586 -294 182 500 595 633 349 -225 -556 -613
8110f13K56P5M32L64l6j10l2k66l68l36K16K12J79M50L86m08j02j95m97q9q1J83
$$ -613 -357 -282 150 514 478 368 336 70 -298 -634 -418 -206 -27 423 809 401 299 104 -393 -482 -563 -380
8132c80L67M49J63m9j83k56m80k48k5J23N54L96J8L3j07m88j73k74q1J13M10M03
$$ -380 -13 436 599 550 367 111 -369 -617 -642 -519 35 431 449 482 375 -113 -286 -560 -641 -528 -118 285
8154B85K49K92k61m31k68m37J16J21K39N32J08J64k12k56m77n0l20n6M67K75N02
$$ 285 534 826 565 134 -134 -571 -455 -334 -95 437 545 709 497 241 -236 -286 -606 -662 -195 80 582
8175E82o7l9j78l90k64j99Q5K36M70J14K38L8j07o65k31l17
$$ 582 515 476 298 -92 -356 -555 -470 -234 236 350 588 626 519 -146 -377 -694
8191f94
$$ Imaginary data points
##PAGE= N=2
##DATA TABLE= (X++(I..I)), XYDATA
0@%%%%%%%%%nOrJ6j7K5l2L8m7N6o8Q1r7J15j36J61j88K20k57K96l39L87m44N07
$$ 0 0 0 0 0 0 0 0 0 0 -5 1 -8 8 -9 16 -16 22 -25 31 -37 44 -53 62 -74 87 -101 119 -138 158 -181 206 -238 269
33B69n74O48p30Q22r21J030j150J281j427J582j753J942k145K370k614K880l176
$$ 269 -305 343 -387 435 -486 544 -606 675 -752 830 -923 1019 -1126 1244 -1370 1510 -1666
50a666L497l852M247m683N173n723O347p058P881q849R999j1400J3149j5402J8433
$$ -1666 1831 -2021 2226 -2457 2716 -3007 3340 -3718 4163 -4686 5313 -6087 7062 -8340 10093
65A0093k2751K9454m1379O9104k57047j48166L47275J74214K02415O5284q7183
$$ 10093 -12658 16796 -24583 44521 -212526 -360692 -13417 160797 363212 428496 341313
76C41313k57971k25067k08777r4173Q6394K63019K44901J82458Q0137n8328k18868
$$ 341313 83342 -141725 -350502 -444675 -358281 -95262 149639 332097 412234 353906 135038
87A35038k52902k08567r1933O3571K13828K46196J98295R3698m3173j84727k44580
$$ 135038 -117864 -326431 -418364 -354793 -140965 105231 303526 397224 354051 169324 -75256
98g5256k19191j10287M8605J89274K33297K01598J14039k4181j68864k32710k08852
$$ -75256 -294447 -404734 -356129 -166855 66442 268040 382079 357898 189034 -43676 -252528
109b52528j23993J2270J63304K36676K05564J15168k151j34335k26412k22770
$$ -252528 -376521 -364251 -200947 35729 241293 356461 354310 219975 -6437 -229207
119b29207j29525N365J35582K12655K07716J34010J9900j13502k17365k25615
$$ -229207 -358732 -353367 -217785 -5130 202586 336596 356496 242994 25629 -199986
129a99986j37105j1454J09629K00227K13645J40502L0497q5529j96018k33380
$$ -199986 -337091 -348545 -238916 -38689 174956 315458 345955 260426 64408 -168972
139a68972j51238j8782Q7442J73138K18136J63827L9047p7036j71108k24432j71468
$$ -168972 -320210 -338992 -251550 -78412 139724 303551 342598 265562 94454 -129978 -301446
150c01446l4645P8884J50409K04683J85000O2319p3196j57229k03313j83811o9082
$$ -301446 -336091 -257207 -106798 97885 282885 345204 272008 114779 -88534 -272345 -341427
161c41427O8626J52392J90469J78447Q6013m6668j48603j99122j83398q7226M3339
$$ -341427 -272801 -120409 70060 248507 334520 287852 139249 -59873 -243271 -330497 -287158
172b87158J40323J90174J82168R6521k8655j30752j89986j88652j03149K5482
$$ -287158 -146835 43339 225507 322028 293373 162621 -27365 -216017 -319166 -293684
182b93684J24519J80244J87082J14697j2194j20404j79565j87225j19081N630
$$ -293684 -169165 11079 198161 312858 300664 180260 695 -186530 -305611 -299981
192b99981J13048J70809J83441J30327J0189j09137j74099j81855j28848j9357
$$ -299981 -186933 -16124 167317 297644 307833 198696 24597 -157258 -286106 -305463
202c05463R6525J68859J83297J34728K8402q8563j65671j82760j36905l6791P7648
$$ -305463 -208938 -40079 143218 277946 306348 217785 52114 -130646 -267551 -304342 -226694
213b26694J59977J84164J42114M4286p0736j55320j82184j43763n2285N9519J49676
$$ -226694 -66717 117447 259561 303847 233111 77791 -104393 -248156 -300441 -240922 -91246
224i1246J82289J47538N9508n0280j44689j82832j49338o3856M0915J35647J81861
$$ -91246 91043 238581 298089 247809 103120 -79712 -229050 -292906 -251991 -116344 65517
235F5517J53604P0331l2471j28724j81322j57199p3985K5560J18373J77561J62732
$$ 65517 219121 289452 256981 128257 -53065 -210264 -284249 -258689 -140316 37245 199977
246A99977Q1845j9471j13319j73820j63833q6978J1196J04903J69993J67539R3792
$$ 199977 281822 262351 149032 -24788 -188621 -275599 -264403 -159500 10493 178032 271824
257B71824m903r8985j66692j68343r8308j933R0109J61826J70990J04694Q077
$$ 271824 266921 167936 1244 -167099 -265407 -267340 -177231 -15405 155585 260279 268356
268B68356q3363j56471j72469j11021j3930P7469J50425J71913J17220K1511p1437
$$ 268356 184993 28522 -143947 -254968 -268898 -191429 -41004 130909 248129 269640 198203
279A98203j45241j71351j22759k8577O5214J39693J70013J27955L6815n8716j35536
$$ 198203 52962 -118389 -241148 -269725 -204511 -64818 105195 233150 269965 211249 75713
290G5713j68957j31542m3331N1303J29516J67466J36357N0521m5111j24689j64977
$$ 75713 -93244 -224786 -268117 -216814 -87298 80168 216525 267046 221935 97246 -67731
301f7731j39425n7913L8263J19184J62363J42787O5603l1361j14963j59545j44403
$$ -67731 -207156 -265069 -226806 -107622 54741 197528 263131 231770 116807 -42738 -187141
312a87141p2385K3221J09484J57254J45952P9236j5148j04258j55437j46905q4607
$$ -187141 -259526 -236305 -126821 30433 176385 255621 240473 136215 -19222 -166127 -250734
323b50734P274R8144J53092J48152Q9645O08r2043j50713j49429r3791p699Q5021
$$ -250734 -243460 -145316 7776 155928 245573 246181 154138 3425 -146004 -239795 -247494 -162473
335a62473J47613J50470R8749J4538p8731j44509j51036j02292k1701P1433J41301
$$ -162473 -14860 135610 234359 248897 170166 25657 -125379 -227671 -249372 -177939 -36638
346c6638J51784J06207K8269o4980j37583j51519j09619l4590N7030J33799J52529
$$ -36638 115146 221353 249622 184642 47059 -104460 -214079 -248669 -191639 -57840 94689
357I4689J12610L9940m9846j28908j52777j15499m5619M2562J23836J52659J19122
$$ 94689 207299 247239 197393 68485 -84292 -199791 -245410 -202848 -79012 73647 192769
368A92769N0428l5941j17928j52094j22529n5553K9454J12213J50802J25716O0709
$$ 192769 243197 207256 89328 -62766 -185295 -240848 -211394 -99181 51621 177337 238046
379B38046k3062j06319j48718j28832o6238J6650J00632J46936J31031P1019j0000
$$ 238046 214984 108665 -40053 -168885 -235123 -218473 -117841 29095 160126 231145 221145
390B21145r4251j44262j33996p6065M390Q8001J41458J35379Q1182K013q1823
$$ 221145 126894 -17368 -151364 -227429 -223039 -135038 6420 141799 222981 224994 143171
401A43171j38143j37747q6357p184P6631J34247J37599R0741J4500p0050j30633
$$ 143171 5028 -132719 -219076 -226260 -149629 -15382 122217 212958 227458 157408 26775
412B6775j39775r5774j9208O5582J26282J38299R9483K6375n8389j22749j39395
$$ 26775 -113000 -208774 -227982 -162400 -36118 102181 201664 228039 169650 46901 -92494
423i2494j04152l1432N4014J18455J36927J07694L8592m7157j15084j37511j10867
$$ -92494 -196646 -228078 -174064 -55609 81318 189012 227604 180447 65363 -72148 -183015
434a83015m3616M2862J10783J34392J12573N1149l5092j07538j34945j15499n5077
$$ -183015 -226631 -183769 -72986 61406 173979 225128 190036 82498 -52447 -167946 -223023
445b23023K9910J02813J32791J16793O0821k2728r8453j31543j18810o5926J6910
$$ -223023 -193113 -90300 42491 159284 220105 197377 98924 -32619 -151429 -217355 -200445
456b00445R3679J29505J20285P1168j0227q9645j28303j20635p4559L544Q3016
$$ -200445 -106766 22739 143024 214192 203965 114320 -13983 -134618 -209177 -205633 -122617
467a22617J25747J22642Q0078K945p9474j24576j22518q1902r470P2252J21928
$$ -122617 3130 125772 205850 208795 129321 4745 -117773 -199675 -209145 -136893 -14965
478a4965J23495Q6539J5693o6953j20414j23721q8376k1638N9465J16407J26037
$$ -14965 108530 195069 210762 143809 23395 -100326 -188702 -210340 -150875 -34468 91569
489I1569R3116K6629n5654j14350j24258r3087l2679M6165J09414J27019R8685
$$ 91569 184685 211314 155660 41310 -82948 -176035 -208714 -162549 -53135 73884 172569
500A72569L6747m2703j06421j26112r9459m0509L5445R9953J25259J05000M6219
$$ 172569 209316 166613 60192 -65920 -165379 -205888 -170443 -70490 54769 159769 205988
511B05988l1324r7649j23755j04968n1211K4039R2804J23763J08244N4848j9953
$$ 205988 174664 77015 -46740 -151708 -202919 -178880 -86076 37687 145931 200779 180826
522A80826q7838j21292j09297n9516J2925Q2596J19968J12796O4001q725p8887
$$ 180826 92988 -28304 -137601 -197117 -184192 -101596 18372 131168 195169 186444 107557
533A07557j17564j13121o7634K855P2831J14822J15675P2487J377o8465j11403
$$ 107557 -10007 -123128 -190762 -187907 -115076 -254 115421 187908 189285 120820 9417
544I417j16036p8119o818O5272J09401J15630Q0565J1836n9544j05169j15443
$$ 9417 -106619 -184738 -191556 -126284 -16883 98747 179312 191148 131604 26435 -89008
555h9008q5547j8740N5294J03497J16414Q8251K2361n0920r9097j14113r2336
$$ -89008 -174555 -193295 -138001 -34504 81910 170161 192522 141602 42505 -71608 -163944
566a63944k9376M5956R7498J13675R3575L4571m0035r3422j13363r7066l9969
$$ -163944 -193320 -147364 -49866 63809 157384 191955 151920 58498 -54865 -151931 -191900
577a91900L5946R0977J11871R8096M4301k9969q6045j10344j00821n0520K4366
$$ -191900 -155954 -64977 46894 144990 189291 159322 73277 -37067 -137888 -188408 -164042
588a64042Q3953J10050J01390N3479j8693p8749j07717j03450n8712J3172P4871
$$ -164042 -80089 29961 131351 184830 166137 87388 -20329 -123779 -182491 -169319 -94448
599i4448J06686J04548O2716p799p1268j04637j04891o6787J998O7025J03593
$$ -94448 12238 116786 179502 171703 100435 -4202 -109093 -175880 -173882 -106857 -3264
610c264J05394O9354L466o1817j01429j06388p2830q688N7421R9583J06748P5166
$$ -3264 102130 171484 174950 113133 11704 -94684 -167514 -176202 -118781 -19198 87550 162716
622A62716J3738n2157r6944j07734p8005j7656M6848R3851J08087Q1072K2137
$$ 162716 176454 124297 27353 -80381 -158386 -176042 -129194 -35343 72744 153816 175953
633A75953m2253r0446j08439q3919k5980L7818Q6839J07533Q6533L1031l3090
$$ 175953 133700 43254 -65185 -149104 -175084 -137266 -50427 57106 143639 174670 141580
644A41580q4172j07300q8363l4473K7933Q0024J06337R1372L8398k3615p6006
$$ 141580 57408 -49892 -138255 -172728 -144795 -64771 41566 132938 171336 147721 71715
655G1715j05479r3520m2480J9456P2270J03721R5461M6600j5310o8208j01349
$$ 71715 -33764 -127284 -169764 -150308 -78038 25683 121144 167744 152434 84226 -17123
666a7123r7627n1048J1181O4777R9241R8556N5205o350o1315r7130r9131n9352
$$ -17123 -114750 -165798 -154617 -89840 9401 107957 163162 156812 95497 -1633 -100764 -160116
678a60116J813N7299R4996R9696O2997K945n3128r2623j00721o6529o926M9393
$$ -160116 -158303 -101004 -6008 93688 156685 159630 106502 13879 -86842 -153371 -160297 -110904
690a10904Q9557J00587P0071J1858m5924q6757j00201p3418j6672M1933Q4566
$$ -110904 -21347 79240 149311 161169 115245 28488 -71713 -145131 -161803 -119870 -35304
701c5304R9931P5938K0922l7660q1726r8955p8179k6245L3218P9142R8760Q0358
$$ -35304 64627 140565 161487 123827 42101 -56854 -135033 -161278 -128060 -48918 49842 130200
713A30200K9934k8575p6326r7543q2493l4666K4554P3290R6940Q4049L8288j9855
$$ 130200 160134 131559 55233 -42310 -124803 -159469 -134915 -61625 35315 119364 157652 137797
725A37797o9898r5849q5652m2306J5421O6672R4989Q6589M5715j0632o3014r3688
$$ 137797 67899 -27950 -113602 -155908 -140487 -73815 21174 107763 153478 142846 79832 -13856
737a3856q7962m8967O004N9161R2426Q9215N1892j557n5283r0750r0056n4897
$$ -13856 -101818 -150785 -144781 -85620 6806 96021 147913 146356 91073 323 -89733 -144630
749a44630k826N0955Q9007R0964N7571P099m6722q6569r1929o0814j0907M2681
$$ -144630 -147456 -96501 -7494 83470 141041 148140 101418 14849 -77080 -137894 -148801 -106120
$$ [...]
8191a30
##END NTUPLES=NMR FID
##END=
