##TITLE=1H_Pr AmC6-d
 200.13Hz, DMSO.
 8 sc
 
16.3.2026
##JCAMPDX= 6.0         $$ Bruker NMR JCAMP-DX V2.0
##DATA TYPE= NMR FID
##DATA CLASS= NTUPLES
##ORIGIN= UXNMR, Bruker Analytische Messtechnik GmbH
##OWNER= pz
$$ XWIN-NMR		Version 3.5
$$ Mon Mar 16 14:04:41 2026 Russian Standard Time (UT+4h)  she@DPX200
##.OBSERVE FREQUENCY= 200.1313
##.OBSERVE NUCLEUS= ^1H
##.DELAY= (6, 6)
##.ACQUISITION MODE= SIMULTANEOUS
##.ACQUISITION SCHEME= undefined
##.AVERAGES= 8
##.DIGITISER RES= 18
##SPECTROMETER/DATA SYSTEM= spect
##.PULSE SEQUENCE= zg30
##.SOLVENT NAME= DMSO
##.SHIFT REFERENCE= (INTERNAL, DMSO, 0, 14.3821)
##AUDIT TRAIL= $$ (NUMBER, WHEN, WHO, WHERE, WHAT)
$$ ##TITLE= Audit trail, XWIN-NMR		Version 3.5
$$ ##JCAMPDX= 5.01
$$ ##ORIGIN= Bruker BioSpin GmbH
$$ ##OWNER= she
$$ F:/spectra/data/she/nmr/H-C/1/audita.txt
$$ ##AUDIT TRAIL=  $$ (NUMBER, WHEN, WHO, WHERE, WHAT)
(   1,<2026-03-16 14:03:15.40 +0400>,<she>,<DPX200>,
      <created by zg, POWCHK disabled, PULCHK disabled
       configuration hash MD5:
       00 E9 B6 7A A2 85 ED C7 34 08 36 98 17 FE 4E 26
       data hash MD5: 16K
       A4 99 8A B0 3A AE E5 4A 57 26 2E 1F DA D6 67 73>)
$$ ##END=
$$ 
$$ hash MD5
$$ B6 F6 EF EA A2 AF B5 AA 5B 5D F5 BA 8F 91 A2 87
##$RELAX= 
##$RELAX= 
##$RELAX= 
##$RELAX= 
##$RELAX= 
##$RELAX= 
$$ Bruker specific parameters
$$ --------------------------
##$DU= <F:/spectra>
##$EXPNO= 1
##$NAME= <H-C>
##$PROCNO= 1
##$TYPE= <nmr>
##$USER= <she>
##$AMP= (0..31)
100 100 100 100 100 100 100 100 100 100 100 100 100 100 100 100 100 100 
100 100 100 100 100 100 100 100 100 100 100 100 100 100 
##$AQSEQ= 0
##$AQ_mod= 1
##$AUNM= <au_zg>
##$AUTOPOS= <>
##$BF1= 200.13
##$BF2= 200.13
##$BF3= 200.13
##$BF4= 200.13
##$BF5= 200.13
##$BF6= 200.13
##$BF7= 200.13
##$BF8= 200.13
##$BYTORDA= 1
##$CFDGTYP= 0
##$CFRGTYP= 5
##$CHEMSTR= <none>
##$CNST= (0..31)
1 1 145 1 1 1 1 1 1 1 1 1 1 1 1 1 1 1 1 1 1 1 1 1 1 1 1 1 1 1 1 1 
##$CPDPRG= <>
##$CPDPRG1= <>
##$CPDPRG2= <>
##$CPDPRG3= <>
##$CPDPRG4= <mlev>
##$CPDPRG5= <mlev>
##$CPDPRG6= <mlev>
##$CPDPRG7= <mlev>
##$CPDPRG8= <mlev>
##$CPDPRGB= <>
##$CPDPRGT= <>
##$D= (0..31)
0 0.7 0 0 0 0 0 0 0 0 0 0.03 0 0 0 0 0 0 0 0 0 0 0 0 0 0 0 0 0 0 0 0 
##$DATE= 1773655394
##$DBL= (0..7)
120 120 120 120 120 120 120 120 
##$DBP= (0..7)
150 150 150 150 150 150 150 150 
##$DBP07= 0
##$DBPNAM0= <>
##$DBPNAM1= <>
##$DBPNAM2= <>
##$DBPNAM3= <>
##$DBPNAM4= <>
##$DBPNAM5= <>
##$DBPNAM6= <>
##$DBPNAM7= <>
##$DBPOAL= (0..7)
0.5 0.5 0.5 0.5 0.5 0.5 0.5 0.5 
##$DBPOFFS= (0..7)
0 0 0 0 0 0 0 0 
##$DE= 6
##$DECBNUC= <off>
##$DECIM= 32
##$DECNUC= <off>
##$DECSTAT= 4
##$DIGMOD= 1
##$DIGTYP= 9
##$DL= (0..7)
0 120 120 120 120 120 120 120 
##$DP= (0..7)
150 150 150 150 150 150 150 150 
##$DP07= 0
##$DPNAME0= <>
##$DPNAME1= <>
##$DPNAME2= <>
##$DPNAME3= <>
##$DPNAME4= <>
##$DPNAME5= <>
##$DPNAME6= <>
##$DPNAME7= <>
##$DPOAL= (0..7)
0.5 0.5 0.5 0.5 0.5 0.5 0.5 0.5 
##$DPOFFS= (0..7)
0 0 0 0 0 0 0 0 
##$DQDMODE= 0
##$DR= 18
##$DS= 0
##$DSLIST= <SSSSSSSSSSSSSSS>
$$ [...]
##$SUBNAM0= <"">
##$SUBNAM1= <"">
##$SUBNAM2= <"">
##$SUBNAM3= <"">
##$SUBNAM4= <"">
##$SUBNAM5= <"">
##$SUBNAM6= <"">
##$SUBNAM7= <"">
##$SUBNAM8= <"">
##$SUBNAM9= <"">
##$SW= 18.0517328524113
##$SWIBOX= (0..15)
0 0 2 0 0 0 0 0 0 0 0 0 0 0 0 0 
##$SW_h= 3612.71676300578
##$TD= 16384
##$TD0= 1
##$TE= 0
##$TE2= 300
##$TE3= 300
##$TEG= 300
##$TL= (0..7)
0 120 120 120 120 120 120 120 
##$TP= (0..7)
150 150 150 150 150 150 150 150 
##$TP07= 0
##$TPNAME0= <>
##$TPNAME1= <>
##$TPNAME2= <>
##$TPNAME3= <>
##$TPNAME4= <>
##$TPNAME5= <>
##$TPNAME6= <>
##$TPNAME7= <>
##$TPOAL= (0..7)
0.5 0.5 0.5 0.5 0.5 0.5 0.5 0.5 
##$TPOFFS= (0..7)
0 0 0 0 0 0 0 0 
##$TUNHIN= 0
##$TUNHOUT= 0
##$TUNXOUT= 0
##$USERA1= <user>
##$USERA2= <user>
##$USERA3= <user>
##$USERA4= <user>
##$USERA5= <user>
##$V9= 5
##$VALIST= <valist>
##$VCLIST= <CCCCCCCCCCCCCCC>
##$VD= 0
##$VDLIST= <DDDDDDDDDDDDDDD>
##$VPLIST= <PPPPPPPPPPPPPPP>
##$VTLIST= <TTTTTTTTTTTTTTT>
##$WBST= 1024
##$WBSW= 4
##$XGAIN= (0..3)
0 0 0 0 
##$XL= 0
##$YL= 0
##$YMAX_a= 98552
##$YMIN_a= -157415
##$ZGOPTNS= <>
##$ZL1= 120
##$ZL2= 120
##$ZL3= 120
##$ZL4= 120
##$ABSF1= 10
##$ABSF2= 0
##$ABSG= 5
##$ABSL= 3
##$ALPHA= 0
##$AQORDER= 0
##$ASSFAC= 0
##$ASSFACI= 0
##$ASSFACX= 0
##$ASSWID= 0
##$AUNMP= <proc_1d>
##$AZFE= 0.1
##$AZFW= 0.1
##$BCFW= 1
##$BC_mod= 2
##$BYTORDP= 1
##$COROFFS= 0
##$CY= -3
##$DATMOD= 1
##$DC= 2
##$DFILT= <>
##$DTYPP= 0
##$F1P= 0
##$F2P= 0
##$FCOR= 0.5
##$FTSIZE= 0
##$FT_mod= 4
##$GAMMA= 1
##$GB= 0.15
##$INTBC= 1
##$INTSCL= 1
##$ISEN= 128
##$LB= 0.25
##$LEV0= 0
##$LPBIN= 0
##$MAXI= 10000
##$MC2= 0
##$MEAN= 0
##$ME_mod= 0
##$MI= 1.114404
##$NCOEF= 0
##$NC_proc= 0
##$NLEV= 6
##$NOISF1= 3.799351
##$NOISF2= 2.8
##$NSP= 1
##$NTH_PI= 0
##$NZP= 0
##$OFFSET= 14.38212
##$PC= 1
##$PHC0= -3970.161
##$PHC1= 0.1923003
##$PH_mod= 1
##$PKNL= yes
##$PPARMOD= 0
##$PSCAL= 0
##$PSIGN= 0
##$REVERSE= no
##$SF= 200.129724274929
##$SI= 16384
##$SIGF1= 3
##$SIGF2= 2
##$SINO= 400
##$SIOLD= 16384
##$SREGLST= <1H.CDCl3>
##$SSB= 0
##$STSI= 0
##$STSR= 0
##$SW_p= 3205.1282051282
##$SYMM= 0
##$S_DEV= 0
##$TDeff= 0
##$TDoff= 0
##$TI= <>
##$TILT= no
##$TM1= 0
##$TM2= 0
##$TOPLEV= 0
##$USERP1= <user>
##$USERP2= <user>
##$USERP3= <user>
##$USERP4= <user>
##$USERP5= <user>
##$WDW= 1
##$XDIM= 8192
##$YMAX_p= 0
##$YMIN_p= 0
$$ End of Bruker specific parameters
$$ ---------------------------------
##NTUPLES= NMR FID
##VAR_NAME=  TIME,          FID/REAL,        FID/IMAG
##SYMBOL=    X,             R,               I
##VAR_TYPE=  INDEPENDENT,   DEPENDENT,       DEPENDENT
##VAR_FORM=  AFFN,          ASDF,            ASDF
##VAR_DIM=   8192,          8192,            8192
##UNITS=     SECONDS,       ARBITRARY UNITS, ARBITRARY UNITS
##FACTOR=    0.0002768,     1,               1
##FIRST=     0,             0,               0
##LAST=      2.2672688,     0,               0
##MIN=       0,             -157415,         0
##MAX=       2.2672688,     98552,           0
$$ Real data points
##PAGE= N=1
##DATA TABLE= (X++(R..R)), XYDATA
0 0 0 0 0 0 0 0 0 0 0 0 0 0 0 8 -8 8 -8 8 -16 16 -24 24 -32 32 -40 48 -56 64 -72 82 -96 112 -126 142 -160
35 -160 176 -200 224 -252 280 -312 347 -384 426 -472 521 -575 634 -701 771 -849 934 -1030
53 -1030 1136 -1256 1392 -1544 1720 -1924 2165 -2452 2805 -3250 3827 -4617 5754 -7557 10852
68 10852 -18799 78962 25117 -128097 46322 77485 -50718 -41783 56280 -32238 -62477 71745
80 71745 74474 -80096 -35637 96730 28308 -74609 5155 44454 -29744 -14793 45853 -22854
92 -22854 -53512 50591 58021 -58632 -40483 56240 16120 -45462 11302 21533 -47445 -14132
104 -14132 58592 -4719 -63606 13191 46540 -28847 -27438 33145 -4541 -46528 16912 34230
116 34230 -41690 -32489 43784 12297 -49456 761 41431 -17421 -32033 24637 10868 -37385
128 -37385 721 36965 -15588 -36120 20997 26355 -22514 -11505 22130 -2614 -17920 14943
140 14943 12289 -21112 -2804 23580 -6303 -18009 21779 18789 -24110 -7301 31249 3039
152 3039 -24870 9692 19748 -18387 -7793 31372 2966 -31365 11214 36096 -15210 -27915
164 -27915 23418 20256 -25445 -7576 25132 -5334 -19707 20331 14780 -29910 -6359 36494
176 36494 -453 -35297 6712 25488 -15623 -14089 20598 -1598 -25935 13164 24887 -23519
188 -23519 -21762 25746 9702 -29155 -1942 21106 -13290 -16485 20308 4489 -27629 4922
200 4922 27263 -15824 -25138 19671 13205 -25174 -2885 22752 -11777 -19840 22837 13347 -29902
213 -29902 -5140 30727 -5192 -27009 14473 18470 -22172 -7570 26437 -3512 -25284 14751
225 14751 21192 -21484 -11358 26743 1928 -25240 9504 21090 -17622 -11625 24922 3287
237 3287 -24485 8854 22988 -16113 -14670 22659 5071 -24594 6032 23463 -14524 -16813 22037
250 22037 9233 -23867 1561 22907 -11156 -17753 18967 10003 -23227 -536 23731 -8755
262 -8755 -20307 16499 13694 -21261 -5004 22232 -4575 -19979 12539 13471 -19479 -6116 21926
275 21926 -2979 -21301 11011 16792 -17558 -10298 19923 858 -20390 7175 16210 -14720 -9735
288 -9735 19735 1915 -21316 6043 18941 -13417 -14035 17802 6313 -19552 2259 18194 -10262
301 -10262 -13903 16327 7295 -19709 347 19757 -7655 -16384 13808 10563 -17586 -3210 18395
314 18395 -4333 -15928 11317 11372 -15725 -4584 17629 -2873 -16765 9588 13058 -14556 -6945
327 -6945 17537 417 -17016 6416 13709 -12357 -8429 15941 1611 -16920 5678 15445 -11623
340 -11623 -11276 15665 5216 -17232 1560 15958 -7887 -11880 13128 6102 -16090 448 16185
353 16185 -6985 -13697 12241 9125 -15167 -2912 15631 -3814 -13774 9406 9325 -13519 -3474
366 -3474 15403 -2631 -14351 8366 10877 -12903 -5952 14885 -118 -14510 6235 11918 -10965
379 -10965 -7211 13813 1244 -14611 4811 12838 -10041 -8825 13830 3654 -15298 1992 14083
392 14083 -7467 -10757 11611 5723 -13662 401 13674 -6365 -11596 10896 7375 -13726 -2129
405 -2129 14286 -3198 -12158 8080 8003 -11759 -2820 13086 -2994 -12238 8260 9528 -11799 -4965
419 -4965 13361 -628 -12864 5896 10126 -10200 -5590 13159 605 -13532 4606 11681 -9039
432 -9039 -7943 11990 3017 -12675 2769 11717 -7748 -8839 11243 4505 -12901 576 12366
445 12366 -5322 -9540 9384 5230 -11949 -232 12444 -4858 -10928 8931 7681 -11243 -2968
458 -2968 11692 -2318 -10269 6918 6920 -10578 -2636 12281 -1909 -11735 6002 8897 -9379 -4812
472 -4812 10857 -448 -10739 5521 8892 -9666 -5730 11836 1245 -12355 3009 10597 -7035
485 -7035 -7197 10000 2836 -11365 1571 10512 -5938 -8312 8845 4718 -9998 -68 9755 -4493
499 -4493 -8068 7902 4886 -9982 -907 10530 -2804 -8707 6547 5729 -8999 -1597 10331 -2221
513 -2221 -9436 6223 7617 -8466 -3942 9682 -106 -8999 4431 7334 -7463 -4035 9647 602
527 602 -9804 3095 8197 -6205 -5075 8488 1315 -9247 2891 8762 -6318 -6892 8407 3620
541 3620 -9333 90 8466 -4046 -6452 7219 3425 -9436 -580 9343 -2971 -8322 5210 5182
555 5182 -7086 -1511 7331 -2940 -7167 6051 5073 -8696 -2647 9438 -517 -8668 3389 5894
569 5894 -6567 -2954 8181 -669 -8650 4076 7784 -6640 -5611 7744 2154 -7816 1643 6851
583 6851 -4749 -4387 7485 1872 -8328 1355 8096 -3902 -5847 6560 3421 -7159 574 7665
597 7665 -3445 -6102 6436 4376 -7401 -951 8101 -1764 -6643 4777 4748 -6543 -1696 7664
611 7664 -965 -6927 3946 5382 -5862 -2682 7052 -291 -7087 3046 5701 -5424 -3519 6777
625 6777 615 -7253 1981 5884 -5062 -4570 6315 1653 -7191 829 6148 -3875 -4920 5326
639 5326 1884 -6843 461 6395 -3411 -5520 5071 3041 -6451 -699 6031 -2499 -5178 4923 3344
654 3344 -6606 -1124 6961 -1517 -6483 3606 4647 -5104 -1870 6208 -734 -6025 3384 5111 -5130
669 -5130 -3006 6418 1110 -5798 1900 5194 -3696 -2855 5715 988 -5907 1743 5885 -3285 -3930 5060
685 5060 2027 -5348 802 5293 -3000 -3919 5109 2414 -5804 -117 5691 -2179 -4631 3994 2686
700 2686 -5335 -423 5732 -1872 -5237 3642 3525 -5202 -1791 5293 -933 -5156 2942 3777 -4929 -2365
716 -2365 5359 -181 -5784 1701 4356 -3714 -2832 4625 433 -5273 1390 4492 -3437 -3424 4506 1560
732 1560 -4890 517 4350 -2636 -3327 4073 1527 -4896 480 4922 -2183 -3859 3755 2299 -4554
747 -4554 -269 4777 -1642 -3896 3632 2888 -4483 -885 5079 -842 -4397 2799 3534 -3793 -1484 4790
763 4790 -116 -4422 2155 3766 -3418 -2130 4450 605 -4338 1367 3879 -2812 -2641 3810 954
778 954 -4220 815 3875 -2396 -2866 3544 1327 -4245 101 3860 -1904 -3147 3092 1676 -3993 -149
794 -149 3893 -1768 -3624 2834 2249 -3898 -854 4071 -969 -3706 2362 2493 -3740 -1238 4168 -396
810 -396 -4033 1907 3245 -3090 -1960 3657 244 -3778 1383 3292 -2655 -2122 3609 802 -3793 656
826 656 3346 -1972 -2287 3105 1037 -3430 604 3370 -1914 -2668 2985 1566 -3427 12 3549 -1235
842 -1235 -2753 2643 1725 -3399 -374 3712 -978 -3173 2321 2428 -3066 -1066 3426 -437 -3239 1788
858 1788 2603 -2815 -1387 3452 85 -3513 1162 2810 -2352 -1856 3040 571 -3214 823 2824 -2106
874 -2106 -2135 2743 804 -3175 397 2938 -1595 -2253 2466 1047 -3097 91 2918 -1390 -2428 2427
890 2427 1526 -2981 -310 3068 -996 -2714 2103 1887 -2773 -640 3145 -480 -2949 1573 2172 -2520
906 -2520 -1197 2953 5 -2839 1207 2373 -2155 -1513 2656 315 -2779 854 2464 -1740 -1567 2514
922 2514 545 -2787 511 2485 -1575 -1798 2348 908 -2623 290 2518 -1376 -2096 2197 1239 -2617
938 -2617 -79 2688 -909 -2183 1846 1398 -2496 -405 2699 -622 -2452 1597 1858 -2277 -968 2473
954 2473 -204 -2468 1161 1908 -1940 -1142 2441 172 -2534 662 2066 -1557 -1314 2056 419 -2178
970 -2178 616 1976 -1575 -1455 2116 633 -2299 281 2177 -1133 -1539 1834 750 -2273 133 2266
986 2266 -1024 -1945 1822 1334 -2152 -437 2174 -584 -1995 1356 1437 -1893 -597 2250 -247 -2172
1002 -2172 900 1642 -1576 -932 1910 104 -1909 781 1632 -1513 -1107 1901 327 -1968 433 1810
1018 1810 -1089 -1167 1637 421 -1905 308 1794 -1057 -1365 1705 815 -1928 -11 1864 -800 -1489
1034 -1489 1449 915 -1856 -179 2029 -611 -1847 1231 1340 -1731 -673 1863 -131 -1765 907
1049 907 1378 -1482 -818 1718 36 -1834 628 1562 -1083 -951 1511 239 -1633 444 1402 -1122
1065 -1122 -942 1584 408 -1679 322 1575 -935 -1207 1387 538 -1654 205 1689 -769 -1358 1286
1081 1286 758 -1708 -222 1719 -474 -1430 1117 1012 -1522 -477 1581 -272 -1553 857 1212 -1240
1097 -1240 -632 1522 -12 -1512 587 1199 -1045 -731 1421 215 -1387 451 1242 -962 -846 1268
1113 1268 320 -1355 305 1294 -828 -881 1231 357 -1459 164 1395 -721 -1130 1164 650 -1402 -107
1130 -107 1405 -569 -1297 993 879 -1343 -350 1487 -147 -1356 687 995 -1119 -525 1292 -17
1146 -17 -1281 601 1088 -969 -704 1150 94 -1224 397 1053 -814 -633 1142 115 -1279 332
1162 332 1091 -795 -737 1114 350 -1266 170 1148 -755 -952 1034 496 -1259 -20 1253 -460 -1060
1179 -1060 836 647 -1156 -227 1278 -204 -1070 699 843 -934 -425 1078 -84 -1034 548 885 -809
1196 -809 -478 1050 80 -1017 357 850 -672 -460 979 123 -990 354 889 -702 -682 881 253
1213 253 -994 201 913 -590 -733 931 389 -1129 -37 1098 -388 -895 745 612 -941 -187 987
1230 987 -261 -975 590 755 -822 -379 967 16 -907 368 648 -699 -384 850 18 -889 323
1247 323 712 -634 -478 757 84 -846 259 764 -603 -531 830 191 -951 161 859 -500 -635 792
1265 792 347 -898 37 957 -383 -764 700 527 -846 -86 980 -182 -811 536 616 -739 -278 855
1283 855 -24 -741 429 619 -619 -328 743 18 -745 289 606 -494 -348 693 14 -739 235 586
1301 586 -561 -437 723 136 -755 158 664 -509 -554 661 232 -815 60 832 -322 -677 613 398
1319 398 -753 -158 811 -192 -667 495 498 -683 -259 711 -53 -693 334 517 -510 -249 617 -6 -657
1338 -657 244 473 -499 -281 642 40 -616 255 530 -472 -355 606 76 -655 237 609 -378 -409 614 227
1358 227 -659 60 722 -260 -485 583 333 -618 -52 704 -212 -595 409 452 -534 -134 645 -52 -597 274
1378 274 415 -461 -236 567 7 -520 226 410 -422 -278 462 -3 -509 218 427 -401 -282 513 44 -593
1398 -593 192 485 -368 -357 560 179 -578 80 569 -321 -483 458 302 -552 -41 580 -128 -508 316 331 -515
1419 -515 -166 547 -62 -485 243 355 -399 -234 452 -18 -471 204 363 -344 -190 446 -16 -467 195 382
1439 382 -340 -265 476 114 -455 180 448 -304 -301 481 134 -496 84 547 -229 -385 413 226 -485 -40 510
1460 510 -150 -411 319 302 -451 -161 467 -95 -487 206 328 -323 -193 384 -26 -395 155 268 -322 -156
1480 -156 401 19 -359 160 332 -314 -198 391 15 -388 180 390 -273 -238 401 98 -446 38 415 -233
1500 -233 -322 347 208 -401 -18 406 -158 -411 248 267 -324 -99 361 -70 -372 165 243 -315 -168 352 28
1521 28 -303 189 276 -245 -158 315 -2 -316 170 320 -234 -144 364 51 -322 118 339 -221 -187 344 98 -370
1543 -370 50 330 -240 -303 309 150 -363 -4 405 -113 -366 219 198 -354 -105 329 -58 -285 197 265 -254
1564 -254 -131 292 -12 -292 115 207 -214 -108 266 -11 -265 138 220 -215 -101 298 30 -277 143 257 -254
1585 -254 -219 293 33 -295 68 295 -159 -250 239 93 -352 -24 304 -88 -263 208 161 -258 -78 278 -62
1606 -62 -214 153 176 -204 -55 297 -9 -243 124 199 -151 -88 260 -5 -210 121 179 -194 -101 220 4 -222
1628 -222 95 245 -186 -160 225 20 -277 28 257 -170 -203 233 123 -279 -9 263 -106 -275 167 189 -206
1649 -206 -45 248 -15 -216 119 161 -183 -73 212 -11 -183 133 153 -155 -78 198 -15 -189 121 164 -147
1670 -147 -88 183 -56 -236 71 162 -177 -133 229 64 -247 25 196 -124 -156 193 95 -218 15 276 -71 -196
1692 -196 148 101 -165 -69 213 -17 -147 109 121 -145 -70 187 -10 -180 105 146 -120 -23 153 17 -168 57
1714 57 128 -121 -62 178 18 -182 92 129 -142 -130 175 4 -213 43 210 -96 -161 201 74 -210 0 209
1736 209 -72 -155 162 122 -156 -31 180 -9 -159 74 127 -82 -61 137 -23 -111 93 100 -160 -43 146 -1
1758 -1 -150 46 111 -123 -89 134 -30 -150 85 137 -130 -72 146 26 -173 0 155 -83 -120 161 81 -129 44
1781 44 197 -68 -135 107 125 -126 -20 189 -31 -134 86 102 -98 -24 115 6 -110 79 76 -97 -51 120 -15
1804 -15 -138 49 102 -123 -65 104 -24 -131 69 89 -104 -61 116 38 -143 43 109 -75 -93 86 75 -96 20
1827 20 160 -22 -106 109 91 -128 -10 155 -18 -107 98 101 -102 -44 78 -11 -86 34 54 -90 -38 83 -27 -100
1851 -100 18 73 -83 -42 75 20 -100 36 70 -106 -48 109 30 -89 48 162 -68 -61 116 60 -129 13 120
1874 120 -28 -73 89 64 -80 17 113 -21 -109 38 49 -83 -48 86 3 -101 19 44 -56 -43 73 2 -82 35
1898 35 65 -62 -72 53 -1 -76 19 90 -74 -26 140 2 -86 20 114 -45 -68 147 81 -91 1 110 -5 -57 57
1923 57 38 -44 -14 60 -25 -105 49 80 -70 -75 92 13 -77 -15 50 -55 -52 52 -4 -72 25 66 -44 -38 72 7 -79 3
1951 3 53 -6 25 95 33 -74 36 88 -29 -50 99 68 -57 -3 86 -2 -66 22 30 -80 -18 69 17 -104 12 51 -100
1978 -100 -35 51 31 -55 26 25 -26 -30 26 -2 -47 23 41 -35 -5 82 10 -46 17 82 -15 -31 73 18 -52 9 67 -24 -58 91
2008 91 54 -84 5 81 -10 -70 14 40 -48 -33 57 -42 -77 10 9 -61 -28 65 38 -49 8 46 -23 -37 3 35 -28 34 55 -31
2038 -31 -35 60 1 -34 28 79 -14 -26 50 11 -27 -3 56 -52 -23 48 25 -76 11 55 -32 -68 27 34 -71 -48 37 -17 -30 -11
2068 -11 11 -9 -49 47 5 -29 5 24 -17 -21 21 18 -25 -1 24 -11 -6 48 23 -15 -10 21 -5 -24 36 9 -25 5 37 -23 -62 27
2100 27 -17 -50 -22 53 -12 -63 19 35 -41 -53 13 31 -30 -6 19 -44 -19 17 2 -31 23 66 -2 -20 59 32 -16 -32 1 2 -7
2131 -7 35 12 -55 -14 37 -35 -24 38 38 -43 -4 32 6 -15 4 -2 -62 -10 69 -5 -51 19 40 -37 -1 48 2 -25 0 44 -17 -1
2163 -1 14 20 -19 36 46 -29 -26 35 25 -39 19 19 -25 -15 13 -22 -57 15 2 -24 -18 -3 -5 -51 -22 31 -40 -41 17 23 -31 -23 29 -7 -36
2198 -36 -22 56 -33 6 27 3 -22 14 24 -5 -15 37 55 -10 42 46 -7 6 31 16 5 -8 46 6 -7 2 15 1 9 -7 -41 -29
2230 -29 34 4 -15 8 29 9 -13 10 11 -38 -14 20 15 -37 -24 13 -6 -37 43 44 -29 9 41 8 -18 45 31 -16 4 23 17 -15
2262 -15 34 41 -19 7 19 5 -12 7 21 1 -33 11 -5 -19 -2 -4 -40 1 21 -11 -1 34 32 21 15 15 -7 -14 16 37 -20 -1 51
2295 51 16 -13 9 20 16 13 34 31 1 -10 -2 5 -25 10 -8 -18 -8 -3 6 -44 -42 15 -5 -8 -12 -21 -27 -1 -7 -36 9 35 -30 -32 24 29 -5 -32
2333 -32 42 32 -34 17 42 -22 -19 43 11 -31 3 30 7 -22 29 24 9 -28 9 7 -20 15 19 -44 -7 1 -2 3 -32 -7 -23 -11 7 -10
2367 -10 -7 11 -1 -28 16 4 -27 1 48 15 -2 54 55 1 -19 18 51 13 -3 32 -1 4 17 29 -15 -36 -13 -9 -17 21 8 -3 -38
2400 -38 -2 18 -3 -24 -14 -2 -20 9 1 -17 32 19 -8 0 20 0 -24 8 45 0 -10 15 11 -35 6 44 17 -9 3 39 19 0
2432 0 1 11 -2 3 58 -1 -43 13 27 -34 -19 -9 16 -15 8 13 6 7 12 6 4 -1 -26 -2 14 -6 25 -6 21 48 -9 -11 34 18 25 35
2468 35 22 16 -15 23 38 -13 20 34 14 -8 5 28 -10 -9 -13 -24 -16 18 -4 -34 -25 15 -5 -11 -42 23 -2 -6 15 -5 -1 53 23 18 4
2503 4 26 4 -14 30 36 19 34 28 27 14 -5 13 -16 -19 29 -12 2 -12 14 5 -40 18 22 -7 -6 10 -15 -38 3 11 -30 -3 28 0 -20
2538 -20 4 9 -5 15 27 16 16 18 29 27 7 26 5 29 -14 37 38 -18 32 35 13 12 25 12 -9 31 -2 -27 5 -4 2 -35 -5 4 -36
2573 -36 -14 8 22 5 -1 -10 -16 -21 21 1 13 -5 24 16 17 18 22 -11 4 0 12 -18 38 38 -3 13 24 11 -11 41 -9 9 2 16 -22 -5
2609 -5 -7 -21 -32 -28 -6 -14 -18 2 -14 -17 13 10 -14 -22 -2 11 18 -20 11 10 14 -12 19 3 0 32 6 -7 21 21 -13 12 -1 -24 4 6 10 7
2647 7 -22 -6 -3 -5 -1 -21 -5 -15 12 -31 -20 -20 -16 -12 -49 -13 10 -14 30 -9 -6 -25 -11 -28 -7 25 6 -9 1 31 24 20 27 46 11 17
2683 17 18 15 0 -16 10 13 13 9 19 20 -16 0 11 -12 -34 -18 -30 -40 20 -10 2 -13 14 6 -9 -1 -8 -4 -6 21 23 18 19 16 18 25 2 25 31
2722 31 26 22 -18 11 -17 36 -1 10 10 31 18 11 12 -9 7 -24 -11 -11 -9 20 -5 -22 8 -38 1 5 11 -4 -27 6 -10 -6 25 7 35
2757 35 4 6 28 -4 25 17 28 22 -7 -10 19 17 11 -11 -21 30 -14 5 -4 24 -16 3 -24 -14 -28 -10 5 -19 -26 5 -23 -10 -24 -6
2791 -6 11 -8 5 18 -10 -6 20 -11 20 37 31 2 16 6 19 -13 -7 50 -18 -11 37 18 -5 -17 34 8 26 9 11 34 -13 -20 7 -11
2825 -11 -31 6 -33 -30 -5 8 -24 -7 -11 0 -4 -10 10 -2 -2 -5 40 -7 9 29 37 31 13 2 13 2 24 4 4 -13 15 -17 22 -23 12
2860 12 12 12 -18 -21 -26 8 -14 1 -2 -9 8 -28 -20 -9 7 -16 0 -1 19 -32 2 17 -9 -12 -20 38 18 0 34 10 -5 -5 2 0 7 -6 26
2897 26 19 -12 -13 16 -16 8 -26 0 4 -16 0 -11 -7 4 -14 -19 -7 -2 7 -38 -14 6 5 -27 -4 -6 5 23 -20 25 17 1 -6 11 22 46
2933 46 12 12 7 0 1 -10 24 -1 19 14 4 -18 -14 -22 -43 -19 12 1 -4 -8 14 -31 -3 1 -26 -44 -19 -1 -47 -15 -11 7 -17 -3 35 22
2969 22 -1 25 25 23 -2 30 -1 31 -3 0 7 -14 30 24 -13 4 -5 -19 -4 -18 15 -1 -18 -6 14 -40 2 10 -13 -4 -2 -6 -16 5 3 9
3005 9 -18 10 13 -2 -8 -10 -20 -7 -4 17 -7 30 22 -13 26 40 30 7 15 22 -2 19 22 -6 10 -4 22 -16 -5 -42 8 6 16 -14 -15 15
3041 15 -16 16 0 -26 14 11 -24 15 -5 2 -1 -8 -15 6 6 0 23 18 -5 -3 20 10 20 26 -2 14 10 7 31 -20 -33 -18 30 5 2 -33 -10
3078 -10 12 -21 -8 -2 -10 -18 -9 -22 14 -23 -4 -11 0 -10 -16 -33 1 11 14 3 31 3 11 -20 3 -11 -1 24 5 15 2 -1 15 -12 3
3113 3 -5 -37 15 21 -21 -17 -2 -43 -8 17 -29 -7 -22 7 -7 -34 5 26 -14 -18 4 -9 7 10 -3 -27 12 -5 -10 19 8 42 10 17
3147 17 20 28 13 1 4 16 -6 -2 2 3 29 -14 16 -5 -13 -22 -23 -2 -9 -10 -23 9 -8 -1 -10 -20 -27 -25 8 16 3 3 -1 19 -6 -2 -19 18 31 20
3187 20 35 17 14 17 -20 11 -6 15 10 9 25 2 -16 -2 1 -16 -20 -16 -5 -20 -3 26 -12 -3 11 8 -5 -29 -14 1 -16 11 3 -5 7 7
3223 7 39 3 -11 11 14 5 12 15 -35 32 26 -17 20 29 20 -12 16 -20 -2 -4 2 17 -6 -28 -18 -3 -37 -18 -2 -2 4 -15 -24 -14 -4 0 -3 -1
3261 -1 2 27 19 11 37 0 7 20 30 19 4 -5 12 25 17 10 8 -24 -3 6 4 7 10 0 5 -22 1 -49 -6 24 -30 -14 5 -34 -16 -24 -28 -31 11
3300 11 -11 -9 15 -8 -6 16 9 23 27 10 16 -2 10 -24 29 1 19 -13 1 7 27 -18 -8 -15 23 35 8 -5 4 -11 -6 3 -17 -2 -27
3335 -27 -21 -10 3 -6 -29 -6 3 5 6 -3 -16 0 -1 19 11 -9 22 7 -20 14 7 24 45 20 4 11 23 2 9 7 12 9 0 -30 16 10 15 -11 -29
3374 -29 -4 0 -35 -29 7 2 -8 3 -8 -2 -7 10 -13 -18 -8 -9 -1 2 8 11 24 0 5 11 20 10 21 25 33 4 -8 -3 18 -1 -4 40 -2 -9 15 16
3414 16 -28 -20 9 -39 1 7 -31 26 -26 -9 -20 -15 -5 7 14 -20 4 -16 19 7 -5 27 14 10 17 6 26 19 41 31 -23 -15 4 -15
3448 -15 -4 5 14 4 -2 -10 -13 -24 -19 -5 -18 -18 -33 6 3 -17 -1 -31 -3 -14 -17 -5 -1 -11 -28 20 2 26 33 7 -4 8 -1 18 15 28 9
3485 9 45 2 53 33 1 10 -6 27 -19 -10 -6 -7 -15 3 -3 -13 -21 -32 -26 -38 -1 -16 -42 3 -9 -24 -3 1 -10 1 -15 1 -10 -16 16 31
3521 31 2 14 15 5 9 5 38 2 10 12 26 7 13 21 3 37 2 -3 -2 11 -1 -20 -3 -24 -44 -7 12 -29 6 6 -13 -13 -7 -14 -23 5 -27
3558 -27 7 8 16 17 5 13 -2 -2 6 -1 15 2 5 -7 1 44 3 13 -13 17 11 3 3 -1 0 -13 -12 -4 -2 -55 -31 -2 7 -26 -7 7 -41 -15 -16 4
3598 4 -7 -6 7 11 -20 26 -11 26 10 9 46 19 41 5 12 6 11 -8 2 14 19 19 -1 -14 11 11 -20 -8 -17 -7 -3 -23 14 -10 -17 -26 -36
3635 -36 7 -3 -16 -26 -3 -12 0 -7 -4 -3 0 20 6 1 -4 -17 13 -11 -11 -6 4 19 14 37 -9 0 14 -7 -20 11 -33 -6 -8 -6 -5 -22 1
3672 1 -3 7 -21 -6 -5 14 -14 -37 10 12 -38 -37 -4 -6 13 9 -27 8 13 18 17 -14 3 5 0 34 22 24 1 28 8 7 4 32 6 6 -37 0
3710 0 6 -8 -11 -18 -9 -18 11 7 -9 -23 -18 -7 -5 -8 5 -1 -20 10 -6 -9 -8 2 6 -10 2 11 26 0 13 12 7 -6 23 0 -9 40 -3 12 -14
3749 -14 32 1 14 -20 -29 -5 -31 -9 -20 -25 5 -26 -23 -28 15 0 -26 -11 -20 -1 -21 19 -6 -4 -18 27 3 -28 17 19 -45 16 6 16
3783 16 26 44 4 56 27 6 16 -24 -9 6 11 -8 19 24 -21 -18 -2 -8 -18 -8 3 -17 -17 -37 -8 -12 -12 -10 -14 15 -6 -15 -9 -28 11 -12
3819 -12 -10 11 23 26 30 6 7 6 5 -19 -1 39 5 1 -13 8 6 16 -3 -16 9 -16 -8 -1 0 -2 -7 9 -18 -3 1 20 6 -6 -19 6 -18
3856 -18 -8 -11 2 -10 7 20 19 24 26 -28 -6 -11 24 -8 25 -1 -5 14 4 -20 9 2 11 -3 -42 -31 -34 -11 25 -14 -15 -33 -22 -8 13
3891 13 -31 -12 -39 -22 4 -23 17 -2 -16 -7 8 40 7 12 45 16 36 5 12 15 -9 -13 26 23 1 7 10 -10 -17 13 -27 18 -14 5 -5
3926 -5 -20 -14 -21 10 -36 -36 1 -19 -9 -20 -39 3 10 4 6 -1 32 9 25 27 2 15 25 17 28 30 5 0 28 21 -12 3 10 0 22 1 15
3963 15 -15 -13 17 -16 -15 1 33 10 6 -43 15 -3 -14 -29 -30 5 -5 -8 4 11 4 3 -4 26 11 11 4 33 -1 0 22 15 34 10 -8 31 10
4000 10 13 12 -20 -19 9 5 -21 28 16 -21 0 -7 -35 17 -5 -8 -7 11 -24 -15 12 -4 -14 -4 -14 32 10 13 -4 -2 12 11 1 -9 -32 4
4036 4 11 4 10 -8 4 18 -14 20 -9 -9 4 7 3 -2 12 -2 4 -2 11 -4 -24 -27 -28 -5 -22 -17 -18 4 -24 -6 -6 -3 -21 -28 47 11 2 12 6 11
4076 11 38 -2 -1 32 28 18 23 16 5 17 -23 7 -2 16 6 7 4 24 -8 -4 4 -4 -20 -42 1 -13 -16 -5 4 -27 -15 -3 -16 6 25 13
4112 13 -21 -11 23 3 -1 15 -1 18 31 9 41 11 26 12 4 1 7 1 30 -7 10 -5 2 -1 -13 25 -29 -18 1 5 -15 -3 -25 -14
4146 -14 -5 -44 -13 -1 14 -6 18 8 1 23 31 10 -6 47 4 8 -3 1 2 1 1 8 21 3 -12 24 -18 16 18 20 -5 -6 10 6 -4 -20 -18
4183 -18 -25 2 -12 -14 -2 -4 -12 -6 8 -16 9 -10 -3 23 18 -9 20 34 6 -13 38 31 17 12 27 33 2 -3 -2 46 -6 7 11 -13 -9 0 11 -5
4221 -5 -15 -23 -29 -40 -3 -3 -37 -8 -31 1 -5 2 -13 -24 -24 -36 -4 -12 19 -4 14 5 6 -2 16 6 -9 14 17 18 13 16 15 6 -13 10 2 -9 -7 -40
4261 -40 -7 23 -8 -7 4 -44 -44 -16 -2 -1 -17 -8 -34 -16 -5 9 -34 7 8 -27 19 -4 -4 18 24 9 10 -7 0 26 -13 10 -4 42 23
4296 23 38 9 16 -16 -10 30 6 -14 6 -12 -4 -29 -9 -13 4 0 -25 5 -8 7 -4 -9 5 14 -8 -7 -27 6 20 8 -7 27 -7 1 11
4331 11 2 -23 2 -5 20 -7 -5 -3 -7 3 5 -17 8 24 -14 -41 0 -3 -1 6 -12 6 -18 -2 -32 0 5 18 -36 -8 9 -15 1 8 3 6 17
4368 17 -16 23 11 13 -12 20 34 30 22 -9 2 9 35 -7 2 26 -21 19 2 20 2 -10 -19 -31 12 -6 -1 6 -27 -20 -9 -2 -26 -13 2
4403 2 -14 -30 -25 9 1 -6 -19 -32 14 11 18 1 8 9 16 5 10 -11 16 31 25 16 19 -31 -24 7 -21 -12 10 -5 -16 -27 4 -12 -24 6 4 20
4441 20 3 1 -9 4 -6 -32 14 3 -11 -14 13 -6 12 49 18 14 -1 37 45 12 -4 27 18 20 29 18 -9 13 -9 26 9 -16 -24 0
4475 0 6 -18 -15 -6 -3 -4 2 -6 -48 -1 -29 -10 -3 -17 13 -5 -3 13 -5 -10 19 19 11 37 2 3 5 -2 25 6 21 10 29 17 9 -20 20 35 -4
4514 -4 -1 6 -17 -8 -30 -3 -3 -15 -26 -24 -23 -2 16 -22 -29 -17 -36 -11 1 27 4 -22 -2 15 10 -6 7 -2 -12 16 13 22 -2 19 -10 14
4550 14 35 29 20 -3 4 8 -3 1 7 18 -25 8 -12 11 -11 -23 7 -3 -19 -6 -31 0 22 -24 -25 -24 -6 -9 13 -23 -23 4 13 14 24 36
4586 36 12 1 22 6 -7 -2 24 -6 11 12 -12 15 -10 -13 1 10 8 -4 10 27 -22 10 31 -17 6 24 -20 -30 3 -2 5 2 -28 5
4620 5 12 0 33 8 -14 16 35 10 -5 -9 23 4 27 12 2 14 0 2 17 -2 18 -20 -7 3 9 -22 -8 -17 -20 -19 -6 -48 6 -13
4654 -13 -25 6 -4 -32 29 3 0 21 -26 8 23 28 7 27 13 15 35 -8 2 26 9 -4 9 1 10 8 -32 -1 12 18 28 2 -8 -16
4688 -16 -23 15 -31 11 -9 -37 2 -9 -7 -13 -14 -1 -9 19 24 3 16 12 -6 13 -22 7 -16 10 5 28 27 41 -2 14 20 26 2 3 7 18 16
4725 16 -8 18 -16 -15 -11 -5 -10 -29 -3 -6 -10 13 -26 -25 -22 4 -14 26 -11 -11 -9 37 -1 -12 -10 17 -13 -12 23 21 22 6 -2 19 32 25 8 -3
4763 -3 16 21 23 -7 -9 18 1 8 17 -32 -16 -4 -37 -19 5 -30 5 -31 8 -19 -9 -23 -17 -7 -4 3 30 14 9 5 15 37 2 -1 13 12 -8
4800 -8 9 6 2 23 1 -8 19 -23 26 -16 -12 -2 -13 -3 -5 2 8 -3 -26 -6 -31 -48 -38 -8 -27 -27 -4 11 -27 35 -9 19 -14 20 -4
4835 -4 -20 0 -16 26 -16 26 18 3 1 9 6 27 22 19 -39 -9 20 12 -2 -5 -37 -17 -26 5 0 -39 -15 -27 -22 4 -3 -19 -16 -21 -18 -31 -11 -16 1
4874 1 13 7 -13 12 5 -31 19 27 9 -1 23 8 17 35 14 6 11 10 6 -15 -6 22 4 11 -15 -6 -7 -5 -10 -26 -1 -18 1 -29 -22 11 -14 -25
4912 -25 -27 -23 -23 -10 15 18 -1 -14 9 -16 22 -8 6 8 43 -4 13 25 4 -2 -4 14 -21 23 9 11 -14 -2 -15 -18 -9 -25 -14 9 5 -14
4948 -14 -14 -31 -5 -2 -37 -42 -5 -9 -30 -20 -10 -19 7 -5 31 -2 -2 1 54 21 5 3 -27 7 5 16 -1 3 22 -12 -1 10 -5 -7 -15 -14 5
4985 5 -17 -11 0 0 -8 28 -26 -19 -14 -1 13 -18 -23 10 14 20 13 0 -11 18 1 3 -4 19 12 -22 -5 23 -2 -12 38 -18 21 1 0 -14 -1
5022 -1 -20 7 9 -1 24 -4 -3 -6 0 -27 -7 10 4 -44 -32 -22 -24 -31 11 -13 -57 1 5 4 8 7 2 27 16 6 8 -4 12 1 15 11 -16 4
5060 4 6 36 2 -7 2 8 -19 -29 -31 1 8 -10 -15 -25 13 -22 -16 -8 -1 4 -2 -30 3 -7 -22 12 -33 31 22 10 0 30 42 10 28 5 27
5097 27 17 27 2 8 28 -1 47 8 23 -29 -7 3 -5 -27 1 -13 -6 10 -39 -28 -16 -18 -3 -12 -29 7 2 -12 -17 -12 -4 5 -13 -47 -29
5132 -29 22 26 5 0 -14 -1 12 -5 1 30 20 -16 17 13 -2 -30 12 -5 -5 9 -25 -12 19 -13 -8 -38 -17 13 17 -32 -4 -10 -11 4 -41
5167 -41 -1 4 -14 8 1 -11 -30 20 19 -3 -13 30 1 35 43 19 -10 -1 -21 6 -3 5 8 2 2 -26 -8 -6 -4 2 -11 -26 -27 -9 -8 -1 -20 -8
5205 -8 3 -19 2 -17 6 6 8 -17 -29 -8 -5 43 -6 -5 15 15 12 23 12 36 19 5 -2 30 22 20 17 23 -15 13 -23 -3 -27 -2 -3 -32 -17
5242 -17 -25 -34 0 20 6 -6 -27 -32 10 -12 -8 -20 -4 23 4 16 26 13 -10 38 40 23 7 -13 23 37 14 26 5 45 22 21 29 -3
5276 -3 14 39 6 25 -6 6 -23 -20 -2 -10 -6 -14 6 -1 -5 -24 7 -37 -1 12 -44 8 -9 6 -6 10 18 -6 -5 22 17 11 18 8 47 3
5312 3 9 10 -7 16 5 32 38 -1 -9 5 -21 -6 -9 29 -27 -24 -2 25 -29 4 -5 -1 -3 12 -8 -4 -7 8 21 19 13 -20 19 3 22 6 9 19
5350 19 14 -4 12 8 10 28 2 18 -22 4 -26 5 0 24 -13 5 -26 -33 -13 -5 0 -11 -5 -23 -45 6 -25 -8 0 8 28 2 9 -20 6 -8
5386 -8 9 12 21 -19 8 -1 19 13 31 11 23 14 -13 7 -4 5 -4 19 35 18 16 -26 -12 -10 12 -18 -24 21 -63 8 15 -1 -6 -1 1 -19 -12 -16 20
5425 20 6 -11 3 6 -7 5 31 16 15 8 21 8 16 12 11 15 16 47 10 22 -13 28 8 -5 17 -8 -16 -18 3 -9 15 12 0 -15 2 -22
5461 -22 19 -19 3 7 21 5 -13 -4 -10 2 10 31 2 17 8 31 22 10 31 3 20 3 -2 15 16 31 21 23 16 14 2 8 23 -6 -12 -19 -3
5498 -3 -7 -17 -7 -22 -9 -14 -11 5 18 15 -3 11 -9 -3 18 24 -22 -7 -4 9 2 29 0 9 30 5 -5 8 23 44 10 7 -26 6 -4 -20
5534 -20 31 1 -14 -10 -37 -9 -21 -31 16 -3 4 -18 0 5 0 -27 2 -12 23 -1 -10 6 29 -1 10 -11 21 21 16 18 -21 11 13 27 2
5569 2 -8 -6 -10 24 2 -6 -14 20 -2 -23 20 -18 -35 -10 -37 -19 -29 -19 -27 -21 -16 -4 -4 2 9 -19 1 -11 10 2 7 -17 -22 10 10 19 -6 6
5607 6 15 10 14 1 30 -16 -5 -4 10 -11 10 9 -5 -7 -15 -18 2 -30 -8 -6 -2 -13 -29 -9 -22 -3 3 6 12 -29 -9 3 9 11 5 -9 19 9 10
5646 10 4 14 10 -21 28 5 -9 0 4 10 -1 -15 0 4 -10 -25 -14 -1 -19 15 -5 -1 -16 -5 4 1 -16 -15 -7 -23 -5 -16 2 -4 -2 12 -15
5683 -15 6 -19 13 0 38 3 13 17 -7 19 11 -4 24 21 -4 26 -3 -11 13 -5 -4 -31 0 -28 6 12 -31 -15 -24 0 -5 3 -10 -15 -5
5718 -5 2 4 -29 23 22 -4 -3 7 27 -3 -11 8 11 -10 14 28 20 13 -4 1 0 18 -1 13 -15 6 1 20 4 10 -8 3 -19 7 21 8 -4
5755 -4 -23 -20 -24 2 -28 -1 -13 -32 15 -17 19 0 10 7 17 27 20 -8 10 6 7 19 37 -1 5 10 26 13 1 -17 -6 9 10 1 0 -22
5791 -22 -24 0 -18 -8 -13 11 4 10 3 -4 -6 -34 -23 -2 -34 -11 9 -20 16 8 -2 3 13 38 0 26 -16 -16 4 1 -4 3 21 -21 1 5 -9
5828 -9 32 25 1 14 -5 -5 -9 10 -6 -27 -5 -60 15 -2 -35 -6 -9 -21 6 19 -21 -20 -13 3 30 -7 5 8 22 9 2 13 -8 -2 16
5863 16 5 20 1 50 16 5 11 -2 -13 23 -21 24 -5 5 22 -9 -43 -9 5 -26 -12 -3 -1 13 4 28 2 7 -22 2 -5 -22 23
5896 23 -4 5 -1 15 19 46 13 -2 34 16 11 9 15 8 14 -8 30 25 18 -4 -45 13 -3 -11 -33 -4 8 -4 19 23 -25 9 6 -4 -26 -24 16
5933 16 -20 -3 4 -14 -17 5 10 -1 7 11 22 5 15 4 45 12 -10 21 -11 6 15 4 6 19 28 23 4 -17 29 31 2 -1 6 6 6 -12 -5 -14
5971 -14 -16 -17 -15 -11 15 -16 -9 -23 38 -28 -7 19 -4 -7 25 -4 5 1 -8 20 8 32 12 15 41 0 -2 -6 1 -24 -5 4 4 7 10 -10 0 3 -2 8
6011 8 -15 -12 17 18 -21 17 2 -12 -16 -5 1 11 8 15 11 41 28 -12 12 18 24 -11 10 6 -7 22 2 32 10 8 12 -1 22 10 12 -8 -6 -17
6049 -17 -17 -27 -26 -3 19 -29 -12 -10 -9 -27 2 18 8 -24 -25 -3 -3 57 17 4 16 31 42 31 -5 18 -13 -6 41 0 11 -5 8 4
6083 4 -13 9 -10 15 -11 17 -13 -32 4 -5 1 9 -3 -42 -14 -34 1 -21 -20 -50 -27 22 -17 -5 1 6 31 12 -4 4 24 16 7 6 11 -12
6119 -12 27 -13 2 20 0 8 -34 -1 -12 -12 6 -22 -2 -20 -15 -1 -3 -18 -34 -16 -10 -29 -6 -5 4 5 9 9 20 -5 7 22 24 15 29 -6
6155 -6 22 27 -2 28 3 31 40 6 18 36 31 23 -10 4 3 -3 -1 -11 -2 -5 11 -18 -13 10 -1 -17 17 3 5 -4 -5 -8 -17 -9 -14 23 -16 11 16 -7
6195 -7 13 46 16 -8 -21 30 -9 12 -15 -3 -2 49 25 5 9 19 2 -3 29 -2 -3 13 5 23 -16 -32 -13 -22 -31 -2 -8 -19 -8 5 -1
6230 -1 20 23 20 5 -16 24 11 21 -15 4 -1 4 33 38 10 18 -2 19 15 -1 19 7 12 -2 3 0 -5 2 -24 0 2 13 20 -20 -21 13 0 -39
6268 -39 -18 -15 11 -24 -7 -14 -6 5 -14 3 9 2 18 -12 14 4 -9 14 4 25 17 -4 24 9 21 9 -5 2 20 -30 -8 -5 -1 -23 13
6303 13 0 -24 4 -24 14 -7 -14 -42 7 -28 -14 11 7 -9 8 14 31 2 36 5 -17 28 14 40 20 4 39 32 8 4 24 -14 -6
6336 -6 16 0 18 8 10 0 -6 -15 24 -39 -23 14 -12 -10 -3 -9 16 -24 -11 0 -16 -24 -2 14 -7 -3 -14 -2 20 32 41 0 28 -20 7
6371 7 29 10 30 27 13 20 32 -14 5 -5 -4 8 -23 12 -22 -2 24 4 -11 -7 -43 3 -1 -25 -7 -31 8 -14 -10 -12 26 -2 -4 10 -8
6406 -8 25 22 19 20 7 -8 12 24 0 29 18 11 7 17 -1 24 1 4 -17 8 -11 -11 -12 -12 -9 32 -6 -25 -12 4 11 2 -14 -23 7 6 -18 -35
6444 -35 -19 20 2 -7 28 24 21 -1 17 -1 27 16 -2 3 -4 27 12 11 14 34 -26 -9 22 -4 15 5 -17 -9 -1 -28 10 -46 -10 -7 -41
6479 -41 -27 -8 -20 -13 -5 -11 -8 2 21 22 -2 29 27 21 21 0 19 4 7 -8 28 0 12 5 14 11 3 6 12 -7 3 -5 -4 -9 -16 0 -14 8 -31 -24
6519 -24 -8 -25 15 18 -9 -20 2 17 5 -9 1 7 18 20 -11 16 3 4 7 54 14 17 16 11 28 4 6 16 25 5 18 9 10 7 -1 -2 -11 -15 -3
6558 -3 -8 18 -10 -3 -8 -19 0 11 -8 1 18 -1 -8 -8 31 14 -6 -7 7 41 34 -4 -4 18 21 -3 11 32 -3 20 14 9 24 -26 -4 -19 20
6595 20 36 1 10 -7 -7 19 -13 -23 -8 -5 -16 -29 -7 7 8 -35 -18 -13 -15 6 11 -4 -2 -18 23 13 -1 12 11 4 10 16 7 27 8 2 27
6632 27 0 2 -5 10 11 13 8 -46 8 -10 -1 -22 -23 -8 -16 -5 -26 1 -27 0 10 20 1 29 4 16 9 5 25 3 -14 1 25 25 12 -8
6668 -8 16 18 9 13 35 -10 26 -11 18 10 11 13 -5 13 13 15 -15 -21 -17 16 -13 -27 -3 1 27 -13 6 21 -1 12 -6 2 -4 -15 6 -27 -11
6705 -11 12 -7 10 12 26 1 37 0 4 -6 -14 0 34 9 10 8 35 16 -6 -18 -21 -2 -13 -22 -17 -8 0 -18 -25 -18 -8 8 18 -2 -23 11
6741 11 -3 -3 3 21 12 8 -6 25 -14 9 12 40 24 11 -3 11 -5 -3 25 10 10 -2 -22 -6 -13 3 -2 -13 -3 27 -11 -36 -10 -23 -4
6776 -4 -18 -6 -11 7 -14 5 -10 -13 2 21 14 20 25 9 -3 21 5 0 5 -5 12 21 12 14 13 8 1 22 24 -21 17 4 7 -15 -25 -7 -6 -1 -16
6815 -16 -26 -19 26 -33 -3 -19 -35 -8 -9 -11 20 38 -11 -23 2 3 13 8 2 38 3 2 -3 2 -3 5 21 15 23 35 10 7 6 3 -11 -9 -17 8 10 -6
6855 -6 10 -3 -13 -12 -5 -15 -10 -17 -9 -14 -15 -27 -17 -9 -10 44 0 16 27 -27 43 -9 -9 2 21 12 16 16 -2 17 -14 8 31 3 -18 -32 -20
6892 -20 -13 -21 -5 -4 -3 -16 -4 -1 -7 -6 2 6 0 -21 -10 -5 34 -2 17 -20 -7 -1 -12 -4 29 21 -8 31 14 12 5 11 -22 3 32 14 15 18 14 -6
6932 -6 -12 -6 13 -27 -14 -26 -13 -14 -4 -39 5 -24 -10 -11 20 -16 -1 -47 -13 -4 -8 7 19 26 6 13 2 2 12 35 -24 31 23 30 16 7 7
6969 7 0 13 16 13 -2 -3 0 -7 28 21 -6 -38 -16 -3 -2 -27 -7 -22 -7 6 9 -7 12 4 -1 4 -20 -1 10 23 6 29 5 -22 13 -7 6
7006 6 32 27 15 2 2 25 -25 -13 13 -19 2 -15 -1 17 2 -17 -3 9 -3 -6 -11 2 -25 -12 -14 -21 19 -1 -3 -2 -27 -14 19 28 23 -2
7042 -2 -17 16 25 8 4 16 25 3 21 2 23 3 1 28 17 -4 2 14 -4 -1 -4 -1 -15 -24 6 3 -14 -15 -25 6 -27 -11 -14 -25 -14 -33 5
7079 5 14 -16 -13 10 -10 22 -11 5 14 4 15 -8 3 15 0 -7 23 9 2 26 17 -8 13 15 -21 -20 15 -11 -20 -13 -17 -20 -12 -32 -7 -23 18
7116 18 -17 -14 1 -13 9 -5 -6 -23 25 16 7 -19 -11 13 1 11 6 -3 42 -6 33 17 4 -6 -11 8 -9 -1 11 28 -18 -39 -21 -1 5
7151 5 -23 -8 -18 6 -2 -6 5 -21 -4 14 -17 23 -3 14 -13 16 26 -4 -5 -34 25 -10 -8 23 5 24 -4 1 4 18 21 -6 -29 -4
7185 -4 -19 -4 -25 2 -8 -21 7 7 -21 -19 -8 -54 -8 -35 -33 -37 -4 -41 -2 7 13 -2 -13 -16 3 26 1 -3 4 23 7 -15 2 39 6
7220 6 -16 -16 -2 -10 -14 -4 3 4 -2 3 2 -17 -1 7 -26 -66 -9 -44 -9 -18 -10 19 -7 -25 -2 -29 -6 -6 3 4 7 8 -9 3 11 34 6 33 10
7259 10 22 4 38 -11 16 27 6 38 29 20 13 -5 -8 8 1 10 4 1 0 -5 -8 -17 -28 -4 -39 -5 -14 -9 -20 -16 1 -12 -3 -11 11 22 8 20 16
7298 16 13 7 5 4 28 -30 32 4 3 14 26 11 -1 2 -25 19 1 20 6 -10 7 -7 14 -4 -33 -5 -17 -33 -46 -6 -3 -3 -17 -21 -10
7333 -10 -18 9 -7 13 -2 -8 0 4 10 13 -7 22 10 16 5 41 24 -14 4 -8 3 22 3 -7 -13 -18 14 -12 -1 -12 -1 -20 -63 -8 6
7368 6 -30 -7 1 -7 -22 -24 8 -9 -15 -6 7 4 -16 29 -20 6 -2 0 -7 35 46 -7 -15 -7 39 20 13 25 -5 20 15 -12 18 -13 25 -2 0 4
7406 4 -38 -1 0 6 -22 -21 4 -9 -2 4 -2 11 -2 -11 22 -16 -10 9 7 6 -15 19 8 23 0 23 -3 -3 -6 -9 -12 23 8 -26 0 21 13 -10
7444 -10 13 -42 -9 -1 -16 6 -19 30 2 -4 -3 14 -15 -5 8 -1 -6 -19 -8 -1 4 -7 24 9 10 5 29 -10 1 6 10 21 15 31 3 -10
7480 -10 13 16 7 1 -23 -4 4 -18 -10 -18 -15 -15 -10 5 -9 -27 0 -35 -37 -9 -9 -32 -12 7 -10 -19 -21 0 19 19 14 28 8 13 1 10 1 11 16 1
7520 1 -3 -3 -14 -13 -13 -16 5 3 -2 -6 -16 -15 -13 -8 -21 32 -14 -1 3 -9 -28 -1 -37 5 17 25 7 1 24 -3 7 9 1 -23 -4 32 16 11 23
7559 23 -2 20 4 25 2 7 2 10 4 8 13 -5 -5 3 -18 14 -11 -10 -18 12 -6 11 -42 -18 -23 2 4 -15 -9 -11 1 -25 -12 -10 2 -23 -6 -4
7597 -4 5 25 8 -15 3 -36 5 32 1 0 -2 -4 -3 28 -8 -13 -19 -5 -21 -9 -28 -22 18 2 -25 -16 -42 -19 10 -12 13 3 -20 -9 -15 -2
7633 -2 0 7 5 2 -3 2 -15 23 15 15 12 11 45 7 17 -4 8 -2 29 51 -9 26 -14 -23 -22 14 15 -41 -14 -2 3 7 1 1 4 1 -20 -36 -25 -29 -1
7674 -1 11 4 9 -2 7 10 5 15 19 6 38 7 15 -3 -1 35 46 49 -17 10 2 2 -5 7 -17 9 -11 -20 20 -15 -19 -27 -14 -38 -14 -26 -3 -10 38
7713 38 -22 5 -7 -20 -11 21 4 21 7 -10 27 8 26 -5 -8 4 19 3 47 18 20 28 9 -5 8 -17 12 16 3 -8 2 -17 4
7746 4 -13 -5 -1 -31 -3 -9 -15 -14 -1 -22 1 -8 -7 18 -5 -8 -3 9 12 18 1 19 13 1 34 -3 3 21 16 19 19 0 19 5 -13 8 3 -3 13 -13
7786 -13 -11 -25 -32 7 -15 9 -8 -13 3 8 -3 -37 -18 -42 7 -5 -3 -7 -17 1 8 17 2 -21 -20 -2 -21 24 23 1 -23 1 30 16 6
7821 6 3 6 6 26 -10 -33 -19 10 -29 -17 -19 -18 18 11 5 -15 -19 -6 -26 -5 -28 5 -22 -1 -6 -13 14 2 4 6 18 27 3 -1 48 21 17 4
7859 4 -24 25 17 8 0 -3 11 4 21 4 -8 -43 7 1 -1 -37 9 -42 -14 -27 -21 -24 18 1 -19 -5 -12 16 -15 -6 6 16 -3 26 -4 45
7895 45 5 -9 12 7 19 4 25 34 14 40 13 30 -11 0 8 2 -21 -3 -13 11 -8 -15 -10 -10 -24 -27 -17 -7 20 -13 -27 -3 19 -15
7929 -15 -10 -31 13 14 35 2 0 24 -6 21 31 16 15 -2 -15 -9 7 1 9 11 -21 -29 -2 -12 19 32 24 -12 -13 0 -6 -28 -42 -17 2 0 3
7966 3 7 -17 -19 -15 -6 -22 -5 -8 -4 -8 4 2 9 -5 12 10 19 -7 9 7 -17 29 44 3 -22 -21 11 8 -13 -18 6 -19 -3 -5 -24 20 -18 -12 -8 -39
8006 -39 4 -13 -9 -39 -5 -21 -2 -17 6 3 18 20 -5 6 -10 55 -5 30 8 -4 4 47 30 4 -13 17 7 7 12 -9 6 16 13 2
8040 2 -12 -32 -16 -25 -17 -9 14 6 -19 -18 17 -5 17 -15 29 -40 2 20 8 1 18 12 -36 6 11 3 -1 10 -2 5 7 20 35 -23 1 -5 -1 10
8078 10 9 10 -5 2 -1 -4 -11 0 6 3 -34 -28 -14 4 2 -13 -4 -3 -8 7 23 -13 48 12 -1 -8 -7 25 30 24 27 25 -1 16 23 58 17 19 44 29 -13
8119 -13 -1 -1 -12 21 11 -12 -2 7 0 2 -3 -13 -18 -2 8 0 17 15 -4 -7 9 4 10 26 -10 13 40 16 -4 -4 17 49 13 35 -3 19
8155 19 0 32 29 15 2 9 -8 -3 6 22 -2 8 12 26 -10 -3 -24 1 10 -3 -13 -14 12 -6 -9 -2 -2 8 2 -3 -4 -16 -13 4 18 -29
8191b9
$$ Imaginary data points
##PAGE= N=2
##DATA TABLE= (X++(I..I)), XYDATA
0 0 0 0 0 0 0 0 0 0 0 0 0 0 0 0 0 0 0 0 0 0 8 -8 8 -8 8 -8 8 -12 16 -16 16 -20 24 -24 29 -32 36 -40 44 -48 53 -60
42 -60 68 -75 80 -90 98 -107 119 -130 145 -160 176 -193 215 -240 267 -300 339 -387 447 -524 626
63 626 -767 974 -1305 1888 -3139 6821 -38629 -157415 12612 98552 -50099 -63216 55093
76 55093 4732 -57172 56538 72924 -76724 -53996 92815 35916 -84031 -6898 65287
87 65287 -13298 -25937 42689 -1440 -47803 40838 60055 -53689 -47172 63237 34334 -46811
99 -46811 2013 37454 -27365 -15821 55455 4102 -63907 8493 56898 -19974 -35556 34072
111 34072 13994 -38523 12468 41088 -31763 -36904 40281 19371 -50498 -7989 44743 -10554
123 -10554 -38346 20355 20171 -33632 -7624 34332 -12852 -41739 14624 27935 -25859 -22404 20091
136 20091 2203 -22069 7674 13588 -21009 -10580 19881 -4812 -24241 11552 16613 -24643
148 -24643 -13498 28902 6249 -27935 3514 22418 -14986 -15196 23826 4236 -32494 4573
160 4573 35673 -11409 -30123 22180 26822 -23030 -12810 26756 2096 -21913 14156 18959 -23751
173 -23751 -8373 36455 5440 -34438 5818 33082 -9582 -18901 19254 6924 -23037 8495
185 8495 26950 -17640 -22387 26871 17777 -26705 -5229 25845 -6120 -19900 16326 9954 -24845
198 -24845 335 28556 -9999 -26291 18491 19587 -23506 -9397 22978 -5960 -22997 16625
210 16625 16008 -27741 -10090 30404 -651 -30298 9073 22220 -19646 -14154 23948 1055 -27318
223 -27318 8560 23077 -19107 -16986 24483 6701 -26624 3706 23359 -14369 -17285 21114
235 21114 7062 -25550 2979 24726 -12117 -18597 20364 10432 -24038 433 24330 -10687
247 -10687 -20562 18969 13802 -22802 -3168 24611 -5887 -20274 15798 14531 -21232 -5002 24376
260 24376 -3852 -22175 13162 17558 -19064 -9279 22557 587 -21158 9103 17245 -16309 -10088
273 -10088 20953 1373 -22170 7241 19750 -14217 -13413 19427 5765 -20767 2876 18225
285 18225 -11624 -13531 17460 6010 -20795 2318 20653 -9992 -17056 15606 10026 -19439 -2282
298 -2282 19147 -6491 -16394 13517 10652 -18629 -3734 19966 -4181 -18474 11001 13753 -16076
311 -16076 -7121 18142 -823 -17713 7905 13967 -13742 -7942 17221 940 -17588 6216 14931
324 14931 -12605 -10343 16397 3895 -17416 3352 15898 -9532 -11394 14306 4904 -16904 2070
337 2070 16653 -8627 -13443 14056 8485 -16863 -1982 16840 -4843 -14151 10864 9371 -14758
350 -14758 -2804 16432 -3906 -15420 9700 11610 -13915 -5967 15941 -307 -14939 6700
362 6700 11637 -11914 -6688 14707 493 -15004 5822 13076 -10794 -8645 14043 2782 -15191
375 -15191 3210 13533 -8658 -9628 12782 4403 -14571 1689 13844 -7670 -11100 12211 6525
388 6525 -14749 -749 15023 -4940 -12841 9589 8334 -12885 -2575 14086 -3341 -12817 8804
401 8804 9568 -12761 -5001 14194 -560 -13429 5966 10410 -10081 -5525 12578 -268 -13102
414 -13102 5646 11122 -10152 -7300 12993 2313 -13416 3197 11567 -8368 -8067 11949 3234
427 3234 -13515 2218 12946 -7000 -10136 10571 5473 -12632 -62 12584 -5202 -10332 9816
440 9816 6757 -12424 -2143 12833 -3017 -11145 7684 7720 -10734 -2713 12457 -2481 -12055 6964
454 6964 9515 -10198 -5250 11911 512 -11136 4679 8690 -9032 -4947 11679 418 -12141
467 -12141 4211 10666 -7803 -7072 10218 2099 -11081 3061 10104 -7625 -7353 11041 3532 -12486
481 -12486 698 11552 -5236 -9113 8736 5140 -10849 -657 11072 -4053 -9871 7319 6508
494 6508 -9719 -2436 10120 -2212 -9089 6280 6449 -9390 -3181 10319 -1066 -9845 4817
507 4817 7441 -7895 -3787 9765 -493 -10255 4242 8720 -7423 -5779 9376 2003 -9519
520 -9519 2255 8254 -6142 -5738 8915 2548 -9707 1516 9360 -4649 -6772 7509 3304 -8908
534 -8908 1060 9514 -4409 -7726 7778 5511 -9047 -1842 9098 -2013 -7394 6023 5291 -8319
548 -8319 -1896 9681 -1311 -9103 4209 6933 -6165 -3271 7470 -693 -7448 4478 6109 -7711
562 -7711 -4080 9212 1103 -9234 1940 7336 -5262 -4788 7199 801 -8929 2274 8267 -5587
576 -5587 -6967 7191 3770 -8236 -613 7143 -3555 -5945 6193 3152 -8113 -311 8278 -2866
590 -2866 -7327 5139 4578 -7102 -1483 7615 -1998 -6982 5063 5300 -7134 -2758 7944 -265
604 -265 -7330 3605 6038 -5588 -3167 7327 419 -7317 2732 6608 -4623 -3759 6914 1480
618 1480 -7061 1833 6593 -4181 -4497 6535 2434 -6863 954 6931 -3497 -5325 5802 3188
632 3188 -6862 -342 6971 -2262 -5585 4759 3464 -6308 -834 6672 -2054 -6144 4353 4318 -5979
647 -5979 -2104 6103 -1210 -6013 3535 4099 -6057 -2413 6797 -401 -7103 2314 5346 -4795 -3632
662 -3632 5530 419 -6364 2019 5603 -4499 -4364 5643 1839 -6411 319 5574 -2850 -4034 4835
677 4835 1939 -5985 339 6008 -2534 -4927 4401 3190 -5137 -479 5512 -1891 -4648 4278 3425
692 3425 -5322 -966 6204 -744 -5068 3284 3816 -4676 -1488 5838 -472 -5285 3124 4751 -4345
707 -4345 -2599 5378 411 -5347 2057 4685 -3863 -3003 5367 1212 -5703 873 5037 -2869 -3726 4231
723 4231 1628 -5050 456 4909 -2642 -4253 3866 2317 -4943 -587 4635 -1729 -4043 3216 2212
738 2212 -4831 -781 4771 -1501 -4596 2957 3119 -4330 -1453 4603 -897 -4613 2589 3404 -4122 -1862
754 -1862 4922 53 -4865 1820 3979 -3460 -2560 4441 787 -4582 1270 4230 -2817 -2987 4058 1440
770 1440 -4396 544 4416 -1962 -3161 3542 1906 -4079 -14 4200 -1555 -3275 3218 2332 -3840
785 -3840 -503 4183 -1033 -3573 2556 2491 -3537 -829 4132 -748 -3810 2318 2905 -3554 -1626 4042
801 4042 -72 -3928 1747 3158 -3137 -1995 3910 283 -4259 1097 3678 -2567 -2696 3377 1047
816 1047 -3926 406 3448 -2202 -2826 3184 1508 -3782 -99 3558 -1460 -3010 2477 1624 -3341 -205
832 -205 3537 -1241 -3088 2490 2104 -3390 -873 3525 -617 -3134 2046 2352 -3017 -1048 3590 -367
848 -367 -3532 1695 2939 -2640 -1700 3454 392 -3425 1140 2988 -2380 -2004 3310 856 -3424 661
864 661 3280 -1809 -2443 2727 1192 -3193 197 3184 -1400 -2464 2490 1481 -3109 -293 3090 -1027
880 -1027 -2618 2156 1704 -2825 -471 3014 -853 -2796 1887 1967 -2760 -886 3143 -355 -2983 1503
896 1503 2238 -2585 -1363 3013 129 -3084 1097 2595 -2146 -1800 2703 518 -3039 619 2709 -1641
912 -1641 -1956 2472 920 -2826 204 2588 -1366 -2046 2257 1152 -2682 26 2672 -1127 -2242 2001
928 2001 1357 -2527 -242 2697 -810 -2356 1800 1640 -2508 -689 2684 -408 -2447 1476 1892 -2209
944 -2209 -925 2651 -176 -2661 1149 2244 -1922 -1374 2473 380 -2558 617 2170 -1657 -1526 2290
960 2290 706 -2518 276 2341 -1165 -1780 1781 841 -2147 149 2142 -1063 -1714 1839 1037 -2318
976 -2318 -255 2261 -722 -1862 1570 1217 -2106 -333 2292 -669 -2221 1419 1658 -1993 -907 2273
992 2273 -59 -2160 913 1680 -1689 -1040 2139 214 -2211 644 1985 -1303 -1383 1726 524 -1982
1008 -1982 355 1822 -1124 -1352 1729 714 -2026 -3 1894 -800 -1458 1437 890 -1754 -45 1857
1024 1857 -735 -1640 1367 1061 -1808 -349 1949 -392 -1711 1107 1195 -1747 -583 2015 -196 -1897
1040 -1897 991 1650 -1521 -1052 1793 215 -1856 542 1667 -1150 -1095 1642 442 -1867 224 1687
1056 1687 -909 -1249 1395 627 -1549 97 1512 -842 -1265 1320 627 -1623 10 1727 -604 -1388
1072 -1388 1171 845 -1590 -218 1671 -490 -1518 1087 1096 -1519 -543 1710 -157 -1616 800 1255
1088 1255 -1339 -723 1634 120 -1589 544 1352 -1113 -935 1430 360 -1493 312 1374 -859 -1020
1104 -1020 1245 423 -1433 174 1402 -657 -1032 1153 575 -1392 -27 1351 -565 -1087 1095 690
1120 690 -1339 -127 1425 -484 -1323 909 905 -1256 -331 1491 -214 -1392 771 1097 -1241 -630 1477
1137 1477 125 -1391 476 1199 -903 -811 1196 249 -1325 306 1237 -783 -835 1099 367 -1233 94
1154 94 1106 -655 -814 1031 406 -1185 73 1170 -595 -984 923 544 -1192 -50 1214 -450
1170 -450 -1052 891 696 -1220 -327 1234 -215 -1176 676 838 -994 -446 1181 -35 -1205 452 1006
1187 1006 -819 -605 1063 163 -1083 282 916 -716 -708 961 321 -1022 128 934 -556 -730 806
1204 806 298 -1008 155 1017 -484 -759 789 431 -981 -36 973 -384 -814 803 601 -1008 -186
1221 -186 1117 -215 -1046 547 766 -822 -335 1032 -11 -1027 437 880 -754 -587 910 262 -928
1238 -928 200 793 -586 -603 751 193 -902 187 848 -466 -609 738 261 -869 66 818 -491
1255 -491 -668 789 353 -909 -44 917 -376 -808 647 496 -850 -131 960 -203 -897 531 594 -823
1273 -823 -306 889 -15 -844 388 727 -667 -455 767 101 -813 244 736 -481 -477 734 207 -791
1291 -791 99 674 -429 -507 651 237 -692 143 733 -414 -536 662 315 -754 30 757 -311 -624
1309 -624 587 381 -781 -110 823 -234 -721 520 567 -711 -292 748 -68 -785 345 606 -545 -318
1327 -318 729 93 -733 189 579 -452 -419 583 98 -631 164 579 -428 -445 525 149 -659 94 610
1346 610 -342 -416 563 220 -665 20 629 -285 -515 528 349 -644 -63 677 -176 -601 422 440 -612 -171
1366 -171 689 -37 -627 298 478 -515 -283 601 49 -583 189 506 -387 -350 517 116 -526 129 496 -306
1386 -306 -319 492 153 -521 95 502 -308 -347 450 185 -532 62 528 -308 -452 451 265 -578 -39 594 -192
1407 -192 -541 360 363 -523 -187 598 -55 -552 268 462 -438 -277 472 40 -522 130 446 -313 -282 433 86
1428 86 -504 58 389 -290 -288 431 132 -455 110 458 -308 -337 391 159 -472 62 505 -240 -363 405 209
1449 209 -469 -28 533 -172 -460 370 355 -468 -156 491 -58 -485 210 367 -406 -179 497 48 -487 131
1469 131 361 -292 -252 381 97 -381 110 355 -257 -230 361 79 -370 69 353 -237 -261 328 77 -441 52
1490 52 376 -248 -316 370 196 -420 -41 412 -164 -411 285 246 -383 -95 429 0 -446 209 298 -340 -204
1511 -204 330 48 -364 131 331 -244 -205 326 42 -323 83 329 -177 -179 292 92 -325 80 308 -220 -216 316
1533 316 102 -335 57 327 -198 -309 263 139 -352 0 372 -133 -331 279 228 -386 -110 396 -45 -320
1553 -320 201 289 -281 -177 319 -11 -369 108 276 -216 -181 298 71 -303 69 223 -198 -139 250 38 -273
1574 -273 81 249 -214 -200 260 68 -303 63 290 -173 -241 257 98 -312 -13 315 -133 -245 220 181 -313
1595 -313 -79 315 -49 -321 144 207 -240 -110 273 14 -293 73 189 -199 -141 240 34 -251 83 229 -148
1616 -148 -165 212 44 -244 71 179 -188 -140 246 39 -254 -3 219 -137 -174 259 102 -281 -2 253 -124
1637 -124 -255 186 153 -231 -26 274 -21 -242 144 206 -236 -114 249 -7 -215 78 196 -133 -142 186 0
1658 0 -211 41 186 -131 -98 166 44 -213 41 189 -106 -91 189 25 -203 53 195 -139 -204 174 106 -228
1680 -228 -19 243 -102 -195 160 132 -231 -12 226 -40 -212 116 168 -141 -78 193 -3 -213 22 174 -140
1701 -140 -104 191 -5 -179 25 126 -112 -118 132 69 -178 41 132 -107 -103 141 51 -204 46 177 -66 -136 165
1724 165 38 -220 -19 199 -74 -165 172 118 -166 -71 192 -51 -192 91 125 -149 -78 140 22 -191 35 127
1746 127 -89 -83 126 14 -132 73 117 -91 -96 133 39 -159 26 123 -66 -79 151 29 -151 24 150 -98 -94
1769 -94 129 72 -171 -17 166 -76 -134 120 61 -146 -28 155 -44 -155 44 93 -162 -44 172 19 -160 38
1791 38 122 -81 -87 92 4 -161 -3 68 -94 -39 104 14 -156 24 98 -83 -36 106 38 -99 32 92 -103 -104 155
1816 155 20 -136 17 154 -39 -102 88 64 -111 -80 111 -19 -118 79 87 -130 -66 126 -5 -159 34 87 -70
1839 -70 -56 94 8 -109 41 71 -58 -72 108 43 -89 46 94 -66 -68 61 48 -101 16 110 -54 -84 110 21
1863 21 -135 29 134 -41 -103 81 49 -103 -35 88 -28 -154 56 90 -94 -43 150 12 -111 49 99 -53
1885 -53 -70 89 36 -68 7 48 -44 -61 51 -4 -93 9 76 -58 -68 49 35 -89 -2 67 -51 -65 81 45 -101
1910 -101 27 88 -64 -85 77 62 -71 -29 126 -22 -123 52 52 -89 -35 43 1 -65 32 87 -68 -89 93 -2 -93
1935 -93 -5 43 -31 -29 24 9 -75 38 55 -64 -66 82 37 -80 13 87 -39 -66 47 -3 -65 -4 86 -68 -70 59 25 -92
1963 -92 -56 79 -32 -97 40 66 -62 -35 57 -21 -69 19 99 -37 -17 46 33 -45 -22 56 -35 -44 35 57 -36 13 65 -64
1991 -64 -40 53 12 -75 18 69 1 -50 32 18 -67 -12 30 1 -51 71 67 -95 -15 57 -36 -78 -4 59 -85 -46 50 33 -72
2020 -72 9 62 -36 -41 46 47 -43 14 50 -34 -41 47 27 -30 6 41 17 -30 39 3 -39 -23 51 -36 -46 22 25 -35 23 53 -33 -47
2052 -47 16 28 -46 -22 86 12 -74 46 66 -73 -62 58 4 -77 25 35 -14 -43 31 23 -53 6 82 -15 -21 38 0 -20 -3
2081 -3 54 11 -67 31 -5 -14 1 39 -39 -79 27 15 -66 -7 43 -11 -28 14 31 -72 15 39 -13 -47 31 91 -30 -30 36 19
2111 19 -38 -5 37 -12 -23 11 9 -40 28 48 -5 -53 17 30 -35 -22 27 -30 -50 10 -8 -53 -13 30 -4 -56 15 45 -44 -15 63
2142 63 -4 -35 39 24 -49 -23 22 0 -21 19 62 -18 -66 58 9 -73 -7 42 13 -30 30 -3 -17 -4 31 -23 -36 12 32 -20
2172 -20 -38 27 13 -28 8 8 -19 1 17 -20 -13 32 30 6 -14 37 -42 -39 31 23 -11 2 53 34 -27 22 36 -20 -41 33 40 -31 1
2205 1 57 -4 -22 -11 32 -40 -31 27 -8 -27 -1 36 -34 -8 -26 -6 -23 7 25 15 10 8 0 -23 25 35 6 -2 26 -14 -39 28 3
2238 3 -34 -36 -7 -2 -32 10 26 -19 -34 15 5 -35 -2 50 -5 -35 11 25 -15 3 14 -3 -17 13 4 -17 -32 27 -19 -25 -5 -7 -36
2271 -36 28 35 2 -32 -8 6 -31 -1 42 1 -40 0 19 -61 -27 48 -22 -40 43 29 -20 -11 5 17 -7 6 7 -14 -22 18 56 -16
2303 -16 -25 14 9 -6 3 3 -32 -15 11 5 -13 1 5 7 -9 13 17 -7 35 -12 -54 -14 16 -2 -4 30 15 -8 -14 47 7 -18 2 11 -22 -6
2339 -6 39 34 -38 14 33 -12 -4 -7 0 7 -14 15 -20 -32 9 -8 -17 -31 47 11 -3 12 34 19 -42 -2 26 -4 12 16 17 16 21 -9 -37 -7
2375 -7 6 13 -19 -16 -30 -13 -10 14 -19 -12 -11 -2 -26 -7 45 -19 -41 29 22 -32 1 9 21 -22 -2 14 3 -10 -13 5 -32 -11 31 4 -11
2410 -11 -18 -15 -5 27 21 -7 -28 -7 19 -19 20 11 0 0 -2 -13 -41 15 24 -37 -30 1 -9 -6 -43 0 16 -29 8 3 -24 -13 28 13 -29
2445 -29 2 14 2 -14 -17 10 -24 -10 22 -13 -38 -15 29 -9 7 -2 12 16 -13 -15 -20 -17 47 -23 -7 5 28 -15 -9 10 -17 -31 17 -7
2479 -7 -4 -32 -10 -10 -21 -9 8 -11 28 29 18 -1 12 24 -8 -4 14 3 -26 8 -1 -17 -22 24 -5 -14 24 -6 -8 -28 28 -8 -20 -11 -9 -18
2515 -18 -17 -29 -12 -5 -5 -3 -24 -19 8 24 -19 18 42 -16 5 22 6 -3 -27 -4 3 6 6 -12 7 0 0 22 -2 5 2 -14 -16 3 -20 -35 10
2552 10 5 13 13 14 23 -9 -15 33 -38 -27 12 9 -3 -3 -13 11 -4 -4 7 -10 -13 4 18 2 36 -1 42 -4 8 12 -9 -32 16 19 4 25
2588 25 20 21 -19 4 -4 -23 -10 11 14 -32 -15 -16 -34 -6 20 28 10 7 -10 7 24 31 -21 -27 19 3 -8 8 16 -21 -5 3 -6 -23 14 19 -4
2625 -4 -7 -31 -8 -18 -17 7 -20 -29 2 52 7 9 22 9 -43 25 13 -25 12 26 11 -3 -11 -8 21 -12 -10 21 -17 3 14 6 -16 4 -17
2660 -17 -25 -4 18 2 3 24 14 -22 25 1 12 -7 3 6 -10 6 13 -2 1 14 8 6 -4 31 -10 0 -2 -20 -3 -15 -35 -5 -25 6
2694 6 16 4 -3 11 15 -13 2 -2 -6 25 6 -1 1 -11 10 -11 -18 14 3 -7 -22 37 -6 -16 5 -30 -37 4 29 12 22 -7 -7 -17 -12 -10
2730 -10 -30 22 34 6 -15 -11 6 -6 0 -3 5 1 -24 -11 -2 21 13 3 -3 -14 8 26 -17 -3 -7 -10 0 -12 -13 14 -14 -4 17 9 10 -12 -19
2767 -19 -15 0 -10 -22 2 24 -22 -30 -1 14 -16 7 25 28 -16 8 32 -16 -2 17 -33 -27 11 -8 -21 19 -4 15 -8 2 15 12 4
2800 4 -11 15 25 34 -12 -15 -21 4 -37 -11 -14 -5 -23 -17 -18 -21 -5 -14 3 -5 -3 -5 -8 -16 -10 3 23 -10 14 24 -4 -3 6 -9 12 21 -12 -34 -14 10
2840 10 17 2 1 7 -1 -7 21 22 44 -16 -5 4 12 6 0 -16 -29 6 -29 -34 28 -9 -6 3 12 1 6 -8 8 -17 -23 12 18 -5 -14 14 1 -1 13 0
2880 0 -20 26 2 9 -13 1 2 -24 -15 -10 0 -20 31 13 -29 -16 23 4 -5 3 -4 -28 1 2 -18 9 27 2 10 5 -17 -2 -15 44 32 -31
2916 -31 -11 -5 15 -25 28 11 2 6 6 23 -2 8 -29 -5 -1 -13 -18 -16 -28 16 -22 -3 12 5 -2 -15 -29 2 -1 -9 -5 -12 -3 6 -1 12 19 -1 22
2955 22 8 22 2 -6 13 2 -1 -9 17 21 -2 -16 5 7 -8 -10 9 -15 17 17 -12 11 7 -17 11 -9 -35 -1 3 -17 -36 6 8 5 -23 11
2991 11 -9 0 -12 -1 10 -14 -4 35 -29 -19 -12 -6 -5 -41 -9 21 -3 -27 12 49 -7 -21 9 -15 -1 12 -7 25 14 24 7 8 37
3024 37 -10 -38 -9 -2 -19 4 -6 15 -4 -20 16 20 1 6 10 -32 0 -7 18 -25 8 -14 -51 -11 12 -3 -14 0 27 -15 -8 -4 -13 13
3058 13 28 -14 -28 3 7 -12 15 -16 0 -10 -7 -2 -5 -7 -11 11 2 -18 4 -11 3 6 7 -13 -7 6 29 13 4 10 23 -33 24 16 -7 -7 12
3095 12 -10 -2 6 -17 -9 -21 3 -21 -13 -4 -28 -9 12 28 -4 -12 -22 -3 0 -7 -15 -11 1 0 -7 5 5 13 -20 -4 -4 10 16 10 18 6 13 -16 0 -19
3135 -19 23 11 -9 -12 20 28 -16 -33 -13 -8 -7 -14 -17 -20 7 6 4 -13 -20 20 -3 -14 -3 -9 -15 -19 10 28 -18 9 -16 18 7 -16 11 10 -4
3172 -4 -13 -3 -11 8 0 1 -7 -14 -17 -14 16 -8 -6 -8 5 -14 10 11 7 -26 -4 13 -24 30 -1 1 1 3 14 3 -5 11 7 -20 4 7 -4 1 -13 18
3212 18 12 13 26 -12 -5 -10 -21 26 3 11 11 -10 2 24 1 29 -8 -3 -11 8 -24 -9 12 2 22 -48 -13 1 -3 -23 21 -27 3 -10 12
3247 12 0 -11 10 -14 -30 13 31 8 -17 31 14 -32 23 -2 6 -5 7 -17 16 -22 -21 -20 -18 -20 21 30 7 -2 -19 -22 -31 -11 -10 8 11 21
3283 21 -10 3 -20 33 40 20 -23 -18 -10 7 19 19 7 -8 24 -10 30 -6 3 11 21 -15 -2 6 11 0 -11 4 -1 -29 0 -3 -9 -30 -20 -26
3319 -26 -25 10 -20 -3 -10 5 3 6 1 14 17 -42 -20 -14 2 2 13 0 2 -6 -8 26 6 12 10 -24 13 -5 -9 -21 -12 1 -20 1 -6 -31 17 22 -12
3358 -12 -5 -5 14 0 -23 1 22 -7 -22 16 0 -24 22 8 7 -19 4 -13 -12 -4 1 7 25 5 8 45 25 -5 -2 3 10 -4 -4 -14 6 6 -22
3395 -22 -5 -33 -8 13 37 -11 13 16 -6 2 16 6 13 15 -29 -22 14 20 24 -3 -21 9 4 -12 2 -2 3 9 14 10 8 -12 16 0 -21 21 -8
3432 -8 -9 -14 9 -13 -13 5 9 -11 0 -15 -5 -5 8 -20 21 3 -19 0 3 -4 0 -5 9 -14 3 12 -13 27 3 -13 -18 -6 9 -15 8 -8
3468 -8 7 8 31 -8 -11 -7 -7 -17 12 -1 -5 -7 -3 -14 -28 -9 -4 -9 -12 -6 2 -23 12 23 -17 25 20 16 -6 -1 1 12 16 -13 20 17 21 1 0 -1 -18
3509 -18 -6 -1 3 8 9 5 9 6 -15 19 -1 -10 0 32 -1 4 7 18 -34 0 18 -10 -6 -7 -10 -10 -7 12 1 -5 2 -14 15 42 -11 4 6 0 25 -3
3549 -3 10 15 -5 28 2 -6 17 -25 6 -16 42 18 -18 16 18 16 -18 15 -29 -20 34 -21 -15 -20 -2 28 -6 22 -5 -6 2 -10 3 7 -18 -16
3585 -16 -25 -1 1 -2 -10 5 -28 5 -4 -16 10 -5 19 -23 12 -13 23 -20 3 28 -22 18 -4 31 25 -10 -12 7 -11 -10 -5 -6 -2 30 -23 3
3621 3 -4 -3 -15 -22 4 -25 -27 20 0 2 4 -15 10 -4 5 0 8 21 5 13 17 4 9 -14 12 25 3 -27 12 0 -14 1 -19 14 -18 9 4
3658 4 -2 27 0 3 16 -23 6 -6 -38 15 4 -11 9 -14 -14 15 -17 19 12 -7 -7 9 20 -1 -20 -41 -2 8 16 -10 6 -10 -1 21
3692 21 11 -15 12 1 16 -16 -3 -3 -10 -4 -2 -3 -7 -25 -17 -4 3 24 -12 19 10 4 -24 -14 -27 5 1 5 6 7 -27 -45 18 -7 9 -4 32
3729 32 -15 -8 8 11 7 -4 -5 18 12 5 24 8 -14 -13 -10 1 6 -2 0 -34 -34 -4 -4 -25 -27 1 -29 -6 -11 19 17 22 12 15 -6 -18 3 17 1
3768 1 -23 -8 -14 -4 -7 -3 -6 -44 -22 -20 4 1 -17 7 -17 8 -15 0 2 30 -8 5 -22 2 -9 -25 -23 18 14 -18 2 -18 7 -11 -14 6
3804 6 -11 17 11 -5 3 12 5 -3 12 1 5 -32 4 21 -18 4 -17 -13 15 6 -29 -9 15 1 -9 12 -5 7 25 -25 11 14 15 -6 0 12
3840 12 13 -20 3 -9 3 7 -13 -15 5 12 10 21 15 -8 6 3 -12 -7 10 16 15 15 17 12 7 7 1 -29 0 -26 -13 -19 -36 -10 -33 0 -5 6 2 -24
3880 -24 -2 -6 4 6 -7 -19 -5 -7 -8 -39 6 -6 6 -7 4 4 10 -27 -12 0 -22 15 12 3 1 -17 4 11 -7 -7 -8 5 -7 -11 -15 8 1 3
3918 3 -2 9 16 -18 -10 -3 -21 -28 4 14 21 -16 -13 -18 3 6 27 6 0 -12 -17 9 -1 -19 8 9 -4 -18 -9 -16 -7 -17 11 19 35 -5 -14 9 28
3957 28 13 2 -2 2 2 -16 -9 4 -7 -2 -7 7 10 -11 12 -15 0 -1 -11 13 18 41 -17 24 10 -40 0 0 7 14 -26 21 9 -25 2 -25
3993 -25 -6 13 0 3 18 -2 -12 -8 4 8 3 5 5 11 -24 6 -21 -25 -37 -12 -6 11 31 -6 7 -15 -1 6 5 17 -3 -16 15 0 -21 19
4029 19 12 -10 22 -18 3 3 -1 0 -35 0 -20 -7 -20 -24 -20 9 6 -13 10 -27 -7 2 10 2 -6 -10 -14 14 -6 -2 3 15 27 -3 -8 3 16 -2
4067 -2 5 13 15 4 24 -22 -9 -10 -5 10 -24 -30 -13 -19 15 0 -24 -1 3 -6 9 1 18 7 -3 -1 -12 39 4 -23 27 11 8 -2 17 21 4
4104 4 -5 11 39 -39 -8 9 -3 7 0 0 -27 7 -10 -10 18 7 1 -4 17 4 -8 9 -20 25 -25 -3 -2 12 13 14 1 -17 -14 10 -13 -26
4140 -26 3 -7 -8 16 1 7 2 -9 1 -25 13 7 13 9 -12 -18 -10 5 -2 -31 5 2 -17 -1 11 -38 17 -23 9 -14 -5 -9 -21 -28 -1 20 1
4177 1 -5 31 13 -1 8 -6 -5 13 29 0 3 23 20 22 4 22 13 -2 41 40 4 -23 -16 -8 3 1 -10 3 12 5 -14 6 -32 14 31 6 4 -13
4215 -13 0 11 -7 22 18 -25 7 2 9 -7 -1 8 25 -7 -10 -32 -5 -11 10 25 3 4 11 -12 0 13 -24 -9 20 25 20 -12 12 -7 -16 4
4251 4 -3 26 0 -27 -10 -13 -23 4 21 -9 7 0 7 0 -8 1 -6 16 2 4 27 21 47 24 1 20 -25 22 -9 11 11 0 0 22 11 -17 -27
4288 -27 -25 24 -4 -1 -1 2 8 -6 -9 -10 -13 10 -17 -32 -1 -25 -3 8 5 -2 -8 -23 -2 -7 17 7 17 -1 -15 -11 29 -2 26 58 -16 7 4
4325 4 -19 10 -26 -1 14 -5 19 16 6 -10 -21 15 5 35 17 -16 -3 5 5 -23 0 14 -30 5 -2 6 3 -7 -7 -7 15 30 10 11 7 -14
4361 -14 8 8 14 -12 -19 2 -2 -24 15 -18 -8 -10 -26 -22 -2 -3 -8 -9 2 -27 -9 6 -9 -22 -5 12 -6 6 -14 -7 0 38 -11 -14 26 17 -13
4398 -13 16 -18 11 -8 16 -21 -33 17 7 22 24 11 5 -7 32 11 4 0 9 -25 -8 23 -9 1 6 7 -3 -31 -15 6 3 26 44 21
4432 21 -2 3 -3 3 0 3 1 4 -15 2 11 16 -22 3 -28 12 14 -9 -20 2 7 -2 11 7 -11 14 -9 6 -9 -2 0 -4 -25 12 -16 -5 -26 -8
4470 -8 6 -27 -30 12 34 2 23 5 -1 -23 16 -8 -1 -9 20 23 4 7 -15 11 -8 5 -2 11 -13 -23 5 20 -17 -22 -1 8 9 19 2 -11
4506 -11 1 -6 -7 24 -17 0 -10 -3 13 -26 0 -1 5 18 -9 -8 -8 -18 10 -13 -10 -8 2 18 -3 9 18 1 -12 -23 -10 6 44 43 2 -9
4542 -9 -11 -19 -26 6 22 -26 -25 3 13 -20 4 15 -25 23 -23 21 12 2 18 43 8 3 5 20 0 -22 25 -3 -9 -18 22 17 -18 3 15 17
4578 17 21 -6 16 -18 17 -1 4 5 1 -12 -19 -13 9 -30 22 5 6 4 -19 4 6 -2 20 8 2 -14 -17 22 7 -3 -6 15 38 17 -13 8 -1
4615 -1 -36 19 -19 -17 23 -22 -11 -8 8 -16 -25 0 -24 -2 10 18 -25 -19 -3 6 -1 -9 -5 7 7 4 12 -7 -22 -5 3 -11 -15 -10 1 4 0 10 11 -9
4655 -9 -15 8 -7 -11 21 -14 -18 -17 -4 -54 -23 7 -8 -42 11 13 35 -20 -8 -22 -15 24 6 -6 -11 -30 -18 -17 8 5 -27 9 -7 26 5
4690 5 3 5 -18 -5 -20 -9 -24 4 7 2 -24 26 18 11 1 -4 -38 -9 7 11 2 14 32 -5 26 -5 34 -9 -2 9 -6 -26 -9 -6 2 23 -2
4727 -2 22 11 -14 -12 2 -20 -2 -18 -2 18 -7 8 -5 4 -13 16 1 12 13 -18 -5 -2 -9 11 2 2 14 1 7 -10 -18 4 11 3 -10 -28
4763 -28 4 -5 -9 17 17 17 -4 26 13 -1 -13 -4 -17 -17 -10 -3 4 0 5 14 -7 10 2 2 -1 8 18 17 -7 -1 3 -18 1 7 -1 1 -5 -25 -7 18 -16 -22
4805 -22 9 11 10 -9 -10 -24 -29 -5 -3 24 13 6 3 -13 15 -12 -12 -1 -27 19 14 9 1 0 2 0 27 0 -4 8 13 -4 23 -14 -30 -31 -5 9 -31
4844 -31 9 -8 5 -19 14 -22 13 0 -17 0 -16 -18 0 8 -37 4 -11 32 21 1 12 -12 37 10 5 3 46 1 23 20 -17 -18 7
4877 7 7 -12 15 7 -26 0 11 18 -15 -11 23 -8 -10 5 9 0 -9 -14 7 6 7 -9 16 10 15 11 6 -12 22 -12 -1 -15 11 -3 -9 -14 6 5 29 2
4917 2 -10 8 -8 -6 13 31 14 13 -28 -21 -1 -18 -45 4 9 7 1 -1 4 1 -36 11 -14 -15 14 -6 30 19 27 -2 18 -5 -5 -26 -6 0 -21
4954 -21 -5 19 19 22 7 16 6 1 8 -29 23 -22 -44 7 -4 -17 9 15 -23 0 11 -8 24 -11 -17 3 -13 -15 -22 11 -10 -16 21 15 24 17 13
4991 13 4 28 -19 6 14 19 -11 -19 -13 2 -15 -27 -17 -13 -25 -23 17 1 -7 26 2 3 4 -14 5 -19 18 -10 -23 5 5 5 -3 -20 9 14 4
5028 4 33 37 -8 18 23 6 40 -25 6 7 -1 15 -14 -14 23 15 11 -16 -3 4 2 10 -12 -14 22 -5 -29 9 -3 18 -20 -16 -15 -7 3 9 4 -32 -17
5067 -17 1 21 -4 -6 10 8 1 8 -5 17 -7 -8 7 -6 12 -14 6 25 -32 26 -7 -10 -12 4 -20 4 27 -14 -19 -6 21 -17 -35 9
5101 9 7 0 7 -7 -11 -23 4 -12 22 1 -17 21 11 14 17 15 17 9 -6 -8 -1 27 27 -15 4 7 -1 -19 -4 3 -16 17 17 -4 17 1 -14 -20 -25 -12
5141 -12 -23 8 -17 -14 -16 -4 -23 -11 -16 -21 2 8 10 28 18 -17 15 9 -13 26 15 24 8 2 15 1 28 15 1 -10 12 20 18 1 -5 -5 10
5178 10 -18 -7 -18 -25 2 6 7 19 1 9 -25 -11 -33 7 -13 1 24 -25 12 29 20 9 -14 -18 15 7 11 -16 15 9 31 39 -7 16 21 2
5214 2 1 33 10 -8 -2 2 -5 7 -1 -26 -7 -15 19 1 -19 45 -6 -15 -16 -2 11 1 31 -4 -28 -11 -29 -1 -7 14 24 4 -3 3 -4 0 5 22
5252 22 20 10 -1 -18 22 16 -1 2 15 -9 2 15 -19 -4 10 14 4 -26 -22 4 -10 -36 31 5 15 5 3 4 -2 8 -12 17 7 24
5286 24 28 16 -9 7 10 0 -15 10 21 -8 16 -24 -10 6 9 -54 1 22 -10 -29 -6 -17 4 -15 4 0 -13 -7 -25 0 -15 -18 -20 6
5320 6 7 17 -24 7 0 -4 0 18 3 14 29 -18 18 -28 -1 -14 2 17 22 -7 9 10 -17 10 13 2 -14 -21 16 -15 1 -8 -15 -6 -1 -11 -14
5357 -14 8 -7 7 -12 -19 -15 -9 0 -16 15 19 5 8 28 19 19 -4 -7 -15 2 -8 -16 6 11 -31 20 -4 -5 7 -3 16 30 -1 20 -14 20 0
5394 0 6 -10 28 -16 4 19 16 1 -11 3 -11 20 29 14 8 5 -6 9 34 -4 -18 11 4 -2 -4 25 -3 -3 19 19 19 -19 -3 -8 -12 -1 16
5431 16 -6 17 -7 -5 12 -16 -6 19 -14 -7 -12 -40 14 19 21 -2 0 -31 8 -7 15 -4 12 19 -6 -6 13 17 0 1 11 -10 0 -19 -12 -6
5467 -6 40 -5 -11 -7 34 1 -2 3 32 -15 -4 -24 -13 -25 -23 -12 -16 1 -25 5 11 6 -10 -13 -8 27 19 12 13 19 -11 -24 20 0 -16 3 -12 7
5505 7 -5 -10 9 8 2 -19 16 19 8 14 -11 -13 -20 16 -11 -10 -13 16 13 -1 19 -12 12 -4 -9 11 -37 1 1 -2 0 12 16 46 8 13 12 -15 0
5544 0 16 12 -9 16 5 -26 12 17 -8 18 -15 -7 -31 1 12 -1 9 27 -18 5 17 4 2 -33 46 -3 1 -18 6 -4 13 8 7 0 3
5579 3 0 2 10 5 31 24 -13 -9 23 13 32 37 28 -5 -6 -2 -20 32 -41 26 -2 -10 9 9 -23 2 4 0 -23 10 0 -17 20 -44 13 -8 -21 -45
5617 -45 34 0 2 -3 -18 -4 4 3 21 6 -40 -8 -1 13 -3 -2 9 -1 -15 19 19 16 7 1 -8 9 23 -2 -14 -9 -1 -27 -23 2 29 1 -16
5654 -16 1 5 40 -4 1 -5 7 -15 -14 14 2 4 19 -8 15 -9 8 14 20 14 10 15 9 -3 2 16 -16 -14 10 -14 6 14 -25 -23 18 18 1 -16
5692 -16 -5 -7 0 23 2 -25 -10 -2 21 -19 -15 -15 -14 -11 22 -7 -11 18 18 9 13 -8 24 23 22 24 -11 -3 -7 29 9 -6 -43 -10 -12 -14 -27 -18 5 -4
5732 -4 -15 -30 0 -11 24 -4 3 -28 -8 -18 -4 -10 -6 -11 7 20 -27 -18 -1 -10 15 -4 38 -23 14 9 -19 14 -3 -14 -14 7 -2 9 36
5767 36 -2 6 -18 -12 3 10 -13 8 -14 11 30 9 -19 8 30 -17 -40 -10 14 -4 23 2 6 12 -5 3 11 -22 15 -16 -20 -7 -7 -23 -4
5802 -4 18 -12 -6 -17 22 35 -8 -11 -9 2 1 -8 24 -29 -21 11 24 4 5 0 4 -13 16 6 3 2 0 15 0 32 31 12 21 15 13 -9 34 12 6
5841 6 36 -16 -17 19 7 -11 18 -23 29 -8 -1 -6 3 -10 28 5 -4 -6 14 -5 -30 -29 -3 -11 9 -31 -3 -19 -9 -31 -10 -9 -23 16 2
5876 2 8 14 -6 13 13 22 -3 13 17 18 11 24 -3 -17 15 -14 -15 19 26 2 -8 3 -3 6 -2 22 -16 -22 18 7 -16 -26 1 -10 -10 0 -3 -4 -8
5915 -8 -14 -5 -1 16 -9 -6 0 19 -3 3 -6 -23 14 -11 15 11 -6 12 7 -2 -14 7 -4 -16 -11 -13 20 -38 -1 16 16 -10 -3 -10 -10 -7 -1 9 14 -8
5955 -8 -23 26 24 23 19 13 -11 18 -3 -2 3 36 12 -7 13 12 -12 14 12 -3 -11 14 -11 42 10 13 0 6 8 -19 -4 -10 17 -25 5 -8 -9 -8
5993 -8 1 -30 -20 4 -9 -6 11 1 32 1 -6 34 40 -4 -10 8 14 20 22 8 23 31 -1 5 0 21 15 -3 18 4 21 28 -25 12 19 18 7 -12
6031 -12 -12 25 -1 -13 7 -23 -15 -22 0 9 24 12 -22 0 4 -1 0 27 -4 29 14 8 20 17 -6 13 24 15 15 17 5 -4 25 -6 2 -16 -10 -4
6069 -4 12 -8 18 11 -10 -26 -6 -12 -12 -6 -18 26 23 -18 -4 -1 5 -5 33 -5 24 -3 -2 -9 17 -7 10 -6 12 9 11 20 12 10 -15 -4 1 -9
6107 -9 -6 5 0 -1 3 -13 6 -4 6 -4 1 24 5 30 -10 -16 -9 14 -9 -3 -2 9 19 -21 -45 7 13 9 -7 -1 -10 7 12 -15 -2 16 46 -2
6145 -2 9 -9 10 -21 2 36 -2 4 3 -7 -22 -18 -7 22 -8 -8 -4 -4 12 -40 8 -4 24 -19 -5 18 0 18 1 -20 9 -6 -10 -8 -8
6180 -8 -6 -14 11 5 -17 5 -24 23 11 2 30 19 5 -23 -8 -13 13 -12 7 2 -5 -8 -21 8 -3 -8 -37 -7 -13 -20 10 -3 0 -3 5 13 20 11 -20
6219 -20 14 10 -19 0 12 -4 -7 -12 16 3 12 -4 34 -10 -3 35 6 10 -6 -2 19 5 1 -22 6 -13 -25 -2 -14 5 -1 9 13 -3 28
6254 28 -4 -6 3 28 2 -11 -14 23 23 40 -3 25 10 3 41 16 44 18 3 -10 13 -21 1 3 4 6 33 21 -14 6 -19 13 19 -12 19
6289 19 20 11 7 -5 27 -22 -1 1 -7 -4 -4 2 11 -18 14 29 -8 4 -13 10 13 6 10 6 8 -10 16 6 10 2 7 16 -46 -9 2 -22 -6 10 -23
6328 -23 28 -17 -3 -21 10 9 -12 -4 -19 -2 18 19 -2 7 9 -4 -10 39 26 -27 14 20 -5 2 27 -2 1 30 13 3 12 3 4 4 21 -11 -10
6365 -10 16 -7 15 -8 -5 20 -4 1 -7 -7 4 6 -8 -19 -1 5 12 -19 5 6 9 -10 -12 8 29 3 15 1 24 -20 -2 -2 -17 -12 23 -17
6401 -17 -7 -14 12 -5 -10 -1 -6 0 -10 1 12 -25 8 8 2 1 -13 -3 -13 -37 -2 -4 -1 17 -21 21 -4 20 -13 -13 -15 -5 24 9 -1 33
6437 33 17 -5 34 -10 6 11 30 -10 -3 -6 -8 -1 9 -34 28 -27 2 -10 -6 11 9 12 -28 -1 5 11 1 3 -1 0 -12 -16 -15 9 -16 5 -12 8
6475 8 3 2 -14 12 -5 7 6 21 -3 -11 15 -10 -2 1 4 1 26 -29 10 -2 15 -13 -29 -25 -5 -22 0 0 -4 20 -2 -31 -4 -11 1 1 1 -10
6513 -10 10 31 -13 -17 12 -18 18 17 9 -16 6 21 7 -8 10 12 -7 6 35 -6 -29 6 -17 -13 -20 -11 12 4 8 -4 -8 -14 -8 -5 17 -11 -10
6550 -10 26 -27 -11 -5 -27 -15 34 15 6 -13 -14 -9 -12 35 2 -21 46 16 0 -7 3 -7 -26 7 0 29 -22 -7 -9 -26 -26 16 -8 -11 4
6585 4 24 -18 5 4 -19 16 -1 -35 -19 16 -2 -13 -15 28 18 -4 -17 29 40 2 -31 24 19 -5 -7 -10 -11 -21 16 -7 -25 -12 5 16
6619 16 -9 -12 -13 -2 3 -16 -52 -12 -31 27 3 2 1 -11 -14 10 11 -5 -22 -8 -14 -1 8 11 10 -13 0 6 -4 15 9 -18 18 1 35 -2 30
6656 30 -8 -11 23 15 -25 -7 -10 -25 18 4 -20 -12 -5 -23 8 -13 2 0 -26 -16 9 3 17 2 0 3 -22 13 0 -23 19 8 33 -15 -8
6691 -8 16 17 -21 9 -27 1 9 21 6 19 9 10 -7 -6 -16 -5 -27 -2 17 7 2 -7 -16 -10 5 -16 -12 2 10 -16 -32 2 9 -16 4 7 -1
6728 -1 12 -2 1 8 2 -3 -5 19 -14 -25 19 -3 8 5 12 -22 0 2 -11 20 7 -3 -35 -32 0 -4 -2 9 -6 -19 -8 -14 9 -26 -35 7 -2 -9
6766 -9 4 17 -3 19 11 11 -13 18 -3 -3 23 14 27 -8 14 14 3 -13 16 13 -18 -8 -30 -9 -18 -14 -9 4 1 -20 23 13 20 -17 17 15 7
6803 7 26 -14 17 12 -9 8 -35 23 10 6 6 33 1 13 18 0 4 8 20 8 20 -2 -1 20 22 5 -23 15 4 -5 -7 -11 -30 -11 -9 4 6
6840 6 0 -23 4 10 -9 2 10 4 -19 -6 -25 22 -10 10 26 5 -6 35 5 -10 14 -10 -15 15 -18 39 25 1 6 -9 -11 12 4 1 2 9
6876 9 -10 8 13 -17 2 -1 9 5 16 -15 1 10 18 9 1 -17 28 -14 17 8 3 -9 -25 5 3 -3 23 17 -14 7 -13 17 -17 10 24 -4 4
6913 4 27 7 1 -21 21 -4 8 -4 -23 14 -20 7 6 14 5 41 2 -9 7 2 -3 -2 -10 27 23 -6 -8 10 -14 5 1 27 30 -6 12 -7 24
6950 24 11 27 -11 -2 14 -21 -23 3 -6 18 -6 -7 3 -1 -15 -25 -26 7 2 -4 -6 22 -12 -4 -12 18 40 49 7 24 2 8 30 8 -8 -3 8
6987 8 10 13 13 11 11 16 8 6 12 -7 -1 4 23 16 4 12 -11 -5 22 -8 2 21 -11 2 3 -9 11 11 -14 -1 -35 26 -24 -24 -5 -6 -2 4 26 24 16 12
7029 12 0 8 3 11 9 17 22 12 9 -7 9 -37 19 9 2 -21 4 -10 5 13 -13 8 18 7 12 -18 6 -32 4 17 -15 -4 2 29 20 10
7065 10 -7 4 19 11 20 2 -16 24 5 -16 15 15 7 0 17 -15 19 -5 11 12 -5 -1 7 22 14 3 -12 1 -3 22 9 -1 -25 -17 -5 -10
7101 -10 -17 -20 -6 14 -5 6 9 -2 4 5 0 23 -6 -16 -10 27 -3 1 6 13 3 19 -10 -1 8 -16 8 -4 32 5 36 -23 4 15 4 -2 -7
7138 -7 3 17 -11 -10 -2 -28 12 -7 10 -1 21 0 11 2 -11 10 7 -11 12 26 27 23 23 21 -11 -5 -2 22 16 5 -11 5 -25 24 -31 10
7174 10 -5 21 9 -2 19 -8 9 1 -32 21 13 0 13 -24 -2 7 12 2 -4 17 4 -11 4 23 -16 52 6 -9 22 -12 43 23 -28
7207 -28 0 6 31 20 -15 1 22 8 -8 21 -4 -6 -12 0 -3 -23 -23 18 27 5 -9 -5 -20 6 9 33 20 -9 5 15 -4 22 5 17
7241 17 -15 -1 37 0 15 31 3 9 -11 -7 -8 -2 9 -2 25 8 8 14 -3 0 2 -9 -14 -15 1 -20 -5 -17 -8 1 -12 1 17 1 -25 13
7277 13 21 0 2 34 22 29 -16 -5 -1 -6 -11 6 1 2 -1 1 3 31 -5 -8 11 -27 -23 11 12 -5 17 -7 -10 -2 13 -8 -15 -13 12 -5 -28 -29 -4 -12
7317 -12 -26 -56 -13 3 -6 23 4 -10 21 -4 17 10 13 12 2 16 -10 18 -6 -5 2 -8 -16 -14 -20 26 -5 5 9 -22 -8 9 9 -20 18 -4
7353 -4 11 26 -1 21 17 10 -18 -23 -3 11 -10 10 -4 1 2 18 -7 22 21 25 -16 18 10 27 2 27 11 -11 4 11 10 -18 12 2 3 -1 9
7390 9 -19 -21 -20 -12 -3 15 38 12 13 19 8 -18 -6 -14 11 16 23 22 -19 -8 13 -18 0 15 4 24 21 8 -15 0 1 1 -7 3 -2 11 -6 2 6
7429 6 -11 -1 4 23 4 -23 -15 0 -24 25 11 -6 7 2 6 23 -31 -4 22 7 25 21 -10 -13 1 26 -14 7 27 -10 28 12 4 6 5
7464 5 -29 -9 35 -22 -1 31 -1 -11 -7 -9 -5 22 18 -23 -8 -22 -7 -2 -16 12 8 -4 2 12 15 -9 15 -10 28 -4 14 -9 8 0 -7 20
7500 20 17 15 17 18 8 -11 3 16 -18 -4 1 19 -16 14 5 0 -24 14 20 3 17 -1 2 9 -19 -14 -16 11 -17 0 13 4 1 -16 -15 10 15 -6
7538 -6 8 16 15 10 13 10 9 3 12 -2 15 13 -22 21 5 -21 12 6 -14 -1 11 7 -5 25 -17 5 2 6 -31 5 5 -14 -2 -5 11 -13 28 14
7576 14 -4 -3 -12 13 9 -54 -22 -5 7 -13 -1 15 34 23 9 31 21 6 7 -6 -12 15 -3 -15 -10 -8 4 -32 6 -1 1 12 -19 -6 -20
7611 -20 20 13 -7 -2 14 -18 -3 12 26 -10 4 13 25 9 -2 21 -3 -12 -13 -17 -10 17 7 -13 8 31 -21 -11 20 3 7 -4 11 -11
7645 -11 -12 -4 14 -9 3 6 -31 -4 -14 15 13 9 43 5 14 -7 9 9 -20 30 27 16 25 4 18 -6 10 12 26 -3 5 39 4 22 -8 -28
7681 -28 -5 6 -27 -9 28 2 -3 21 18 -8 0 11 -23 9 -12 -11 -2 -11 4 12 -28 31 -7 2 11 12 29 -16 -13 23 11 -7 -1 13 -10 14
7717 14 14 16 3 -10 16 -25 -17 4 -19 -13 0 16 -27 -5 19 -17 7 -13 3 -16 -20 8 -23 8 -9 -20 -4 -8 -6 15 0 -4 10 1 -11
7752 -11 25 26 -2 12 -8 -13 0 25 11 5 -7 -1 -1 -5 2 -9 -15 12 -7 -14 -2 -16 -8 -1 -16 0 -11 -14 18 -14 -3 -2 -9 -8 3 10 33 3
7790 3 24 4 -23 -4 -10 14 10 -12 14 -33 -1 28 -3 18 -1 21 -7 -3 -17 18 -22 -9 1 -4 4 -41 -2 -3 12 -5 3 0 -8 22 13 9
7826 9 14 -5 8 -15 4 -7 5 -5 4 26 7 22 19 13 -5 8 19 5 -2 23 42 11 19 4 5 -4 -10 5 -26 11 -28 9 -33 12 -25
7861 -25 -1 15 -9 -6 -19 25 34 10 -26 -6 2 0 -14 11 16 8 -7 -5 12 -23 -4 11 31 -15 4 -2 -15 0 0 -6 -5 -21 9 -18 -23 -26 19
7898 19 -14 -3 13 -7 1 -2 4 -7 -14 10 -7 -20 21 4 0 -20 3 -18 -7 4 25 22 9 -3 -17 15 -9 9 17 -1 42 -13 15 -19
7932 -19 -34 14 4 9 6 -10 -13 -3 18 0 -30 -13 -11 29 3 7 10 27 1 -16 -12 5 10 23 15 6 7 6 4 16 30 14 -3 28 24 -12 16
7969 16 22 -26 -15 -5 -10 1 -15 10 -6 -20 3 -29 -10 -26 -26 -41 20 -21 -16 -14 -20 5 -1 -13 14 -8 -19 -5 -2 -27 -1 1 14 0 0
8004 0 21 14 17 -1 -3 -17 13 -1 14 21 3 -2 -1 -7 -3 14 11 6 -4 20 -24 6 -18 -23 -8 -9 -6 20 0 -11 -6 18 4 13 -3 1 -15 4 -24
8043 -24 6 -3 42 -4 14 -26 5 -6 0 -3 21 -4 -14 16 32 2 -19 -6 -3 -5 1 -3 5 -9 -4 4 -7 -6 -27 7 -7 5 -5 -8 -1 -1 17
8080 17 0 -29 -5 -4 -11 3 19 5 25 28 -6 -3 -15 14 21 7 16 3 -4 22 -10 14 -4 -9 -16 -12 -16 -6 -13 7 -1 -6 7 -1 -9 9 -19 -3
8118 -3 10 -10 -19 -26 13 -6 -4 -20 17 -4 5 15 16 28 -12 -17 2 24 -21 19 7 -15 11 -6 -14 11 6 30 -33 1 -1 -16 -1 -12 28
8153 28 -47 -3 0 -17 -3 -24 0 -7 14 -1 -10 -5 0 13 -21 7 6 15 -29 13 -5 -7 23 29 7 -2 -20 13 9 0 11 17 6 26 -17 -17 14
8190 14 1
8191A
##END NTUPLES=NMR FID
##END=
