##TITLE=1H_Pr AmC6-M
 200.13Hz, CDCl3.
 8 sc
 
16.3.2026
##JCAMPDX= 6.0         $$ Bruker NMR JCAMP-DX V2.0
##DATA TYPE= NMR FID
##DATA CLASS= NTUPLES
##ORIGIN= UXNMR, Bruker Analytische Messtechnik GmbH
##OWNER= pz
$$ XWIN-NMR		Version 3.5
$$ Mon Mar 16 13:57:22 2026 Russian Standard Time (UT+4h)  she@DPX200
##.OBSERVE FREQUENCY= 200.1313
##.OBSERVE NUCLEUS= ^1H
##.DELAY= (6, 6)
##.ACQUISITION MODE= SIMULTANEOUS
##.ACQUISITION SCHEME= undefined
##.AVERAGES= 8
##.DIGITISER RES= 18
##SPECTROMETER/DATA SYSTEM= spect
##.PULSE SEQUENCE= zg30
##.SOLVENT NAME= CDCl3
##.SHIFT REFERENCE= (INTERNAL, CDCl3, 0, 14.3821)
##AUDIT TRAIL= $$ (NUMBER, WHEN, WHO, WHERE, WHAT)
$$ ##TITLE= Audit trail, XWIN-NMR		Version 3.5
$$ ##JCAMPDX= 5.01
$$ ##ORIGIN= Bruker BioSpin GmbH
$$ ##OWNER= she
$$ F:/spectra/data/she/nmr/H-C/1/audita.txt
$$ ##AUDIT TRAIL=  $$ (NUMBER, WHEN, WHO, WHERE, WHAT)
(   1,<2026-03-16 13:55:42.39 +0400>,<she>,<DPX200>,
      <created by zg, POWCHK disabled, PULCHK disabled
       configuration hash MD5:
       00 E9 B6 7A A2 85 ED C7 34 08 36 98 17 FE 4E 26
       data hash MD5: 16K
       47 54 A9 0B 47 EF AD C7 4E 6D 66 1E 0F 35 E0 35>)
$$ ##END=
$$ 
$$ hash MD5
$$ EA D0 6D CF 9F 72 45 9D 75 DC 5E FF FE 02 43 98
##$RELAX= 
##$RELAX= 
##$RELAX= 
##$RELAX= 
##$RELAX= 
##$RELAX= 
$$ Bruker specific parameters
$$ --------------------------
##$DU= <F:/spectra>
##$EXPNO= 1
##$NAME= <H-C>
##$PROCNO= 1
##$TYPE= <nmr>
##$USER= <she>
##$AMP= (0..31)
100 100 100 100 100 100 100 100 100 100 100 100 100 100 100 100 100 100 
100 100 100 100 100 100 100 100 100 100 100 100 100 100 
##$AQSEQ= 0
##$AQ_mod= 1
##$AUNM= <au_zg>
##$AUTOPOS= <>
##$BF1= 200.13
##$BF2= 200.13
##$BF3= 200.13
##$BF4= 200.13
##$BF5= 200.13
##$BF6= 200.13
##$BF7= 200.13
##$BF8= 200.13
##$BYTORDA= 1
##$CFDGTYP= 0
##$CFRGTYP= 5
##$CHEMSTR= <none>
##$CNST= (0..31)
1 1 145 1 1 1 1 1 1 1 1 1 1 1 1 1 1 1 1 1 1 1 1 1 1 1 1 1 1 1 1 1 
##$CPDPRG= <>
##$CPDPRG1= <>
##$CPDPRG2= <>
##$CPDPRG3= <>
##$CPDPRG4= <mlev>
##$CPDPRG5= <mlev>
##$CPDPRG6= <mlev>
##$CPDPRG7= <mlev>
##$CPDPRG8= <mlev>
##$CPDPRGB= <>
##$CPDPRGT= <>
##$D= (0..31)
0 0.7 0 0 0 0 0 0 0 0 0 0.03 0 0 0 0 0 0 0 0 0 0 0 0 0 0 0 0 0 0 0 0 
##$DATE= 1773654941
##$DBL= (0..7)
120 120 120 120 120 120 120 120 
##$DBP= (0..7)
150 150 150 150 150 150 150 150 
##$DBP07= 0
##$DBPNAM0= <>
##$DBPNAM1= <>
##$DBPNAM2= <>
##$DBPNAM3= <>
##$DBPNAM4= <>
##$DBPNAM5= <>
##$DBPNAM6= <>
##$DBPNAM7= <>
##$DBPOAL= (0..7)
0.5 0.5 0.5 0.5 0.5 0.5 0.5 0.5 
##$DBPOFFS= (0..7)
0 0 0 0 0 0 0 0 
##$DE= 6
##$DECBNUC= <off>
##$DECIM= 32
##$DECNUC= <off>
##$DECSTAT= 4
##$DIGMOD= 1
##$DIGTYP= 9
##$DL= (0..7)
0 120 120 120 120 120 120 120 
##$DP= (0..7)
150 150 150 150 150 150 150 150 
##$DP07= 0
##$DPNAME0= <>
##$DPNAME1= <>
##$DPNAME2= <>
##$DPNAME3= <>
##$DPNAME4= <>
##$DPNAME5= <>
##$DPNAME6= <>
##$DPNAME7= <>
##$DPOAL= (0..7)
0.5 0.5 0.5 0.5 0.5 0.5 0.5 0.5 
##$DPOFFS= (0..7)
0 0 0 0 0 0 0 0 
##$DQDMODE= 0
##$DR= 18
##$DS= 0
##$DSLIST= <SSSSSSSSSSSSSSS>
$$ [...]
##$SUBNAM0= <"">
##$SUBNAM1= <"">
##$SUBNAM2= <"">
##$SUBNAM3= <"">
##$SUBNAM4= <"">
##$SUBNAM5= <"">
##$SUBNAM6= <"">
##$SUBNAM7= <"">
##$SUBNAM8= <"">
##$SUBNAM9= <"">
##$SW= 18.0517328524113
##$SWIBOX= (0..15)
0 0 2 0 0 0 0 0 0 0 0 0 0 0 0 0 
##$SW_h= 3612.71676300578
##$TD= 16384
##$TD0= 1
##$TE= 0
##$TE2= 300
##$TE3= 300
##$TEG= 300
##$TL= (0..7)
0 120 120 120 120 120 120 120 
##$TP= (0..7)
150 150 150 150 150 150 150 150 
##$TP07= 0
##$TPNAME0= <>
##$TPNAME1= <>
##$TPNAME2= <>
##$TPNAME3= <>
##$TPNAME4= <>
##$TPNAME5= <>
##$TPNAME6= <>
##$TPNAME7= <>
##$TPOAL= (0..7)
0.5 0.5 0.5 0.5 0.5 0.5 0.5 0.5 
##$TPOFFS= (0..7)
0 0 0 0 0 0 0 0 
##$TUNHIN= 0
##$TUNHOUT= 0
##$TUNXOUT= 0
##$USERA1= <user>
##$USERA2= <user>
##$USERA3= <user>
##$USERA4= <user>
##$USERA5= <user>
##$V9= 5
##$VALIST= <valist>
##$VCLIST= <CCCCCCCCCCCCCCC>
##$VD= 0
##$VDLIST= <DDDDDDDDDDDDDDD>
##$VPLIST= <PPPPPPPPPPPPPPP>
##$VTLIST= <TTTTTTTTTTTTTTT>
##$WBST= 1024
##$WBSW= 4
##$XGAIN= (0..3)
0 0 0 0 
##$XL= 0
##$YL= 0
##$YMAX_a= 208981
##$YMIN_a= -317647
##$ZGOPTNS= <>
##$ZL1= 120
##$ZL2= 120
##$ZL3= 120
##$ZL4= 120
##$ABSF1= 10
##$ABSF2= 0
##$ABSG= 5
##$ABSL= 3
##$ALPHA= 0
##$AQORDER= 0
##$ASSFAC= 0
##$ASSFACI= 0
##$ASSFACX= 0
##$ASSWID= 0
##$AUNMP= <proc_1d>
##$AZFE= 0.1
##$AZFW= 0.1
##$BCFW= 1
##$BC_mod= 2
##$BYTORDP= 1
##$COROFFS= 0
##$CY= -3
##$DATMOD= 1
##$DC= 2
##$DFILT= <>
##$DTYPP= 0
##$F1P= 0
##$F2P= 0
##$FCOR= 0.5
##$FTSIZE= 0
##$FT_mod= 4
##$GAMMA= 1
##$GB= 0.15
##$INTBC= 1
##$INTSCL= 1
##$ISEN= 128
##$LB= 0.25
##$LEV0= 0
##$LPBIN= 0
##$MAXI= 10000
##$MC2= 0
##$MEAN= 0
##$ME_mod= 0
##$MI= 1.114404
##$NCOEF= 0
##$NC_proc= 0
##$NLEV= 6
##$NOISF1= 3.799351
##$NOISF2= 2.8
##$NSP= 1
##$NTH_PI= 0
##$NZP= 0
##$OFFSET= 14.38212
##$PC= 1
##$PHC0= -3967.903
##$PHC1= 0.1923003
##$PH_mod= 1
##$PKNL= yes
##$PPARMOD= 0
##$PSCAL= 0
##$PSIGN= 0
##$REVERSE= no
##$SF= 200.129724274929
##$SI= 16384
##$SIGF1= 3
##$SIGF2= 2
##$SINO= 400
##$SIOLD= 16384
##$SREGLST= <1H.CDCl3>
##$SSB= 0
##$STSI= 0
##$STSR= 0
##$SW_p= 3205.1282051282
##$SYMM= 0
##$S_DEV= 0
##$TDeff= 0
##$TDoff= 0
##$TI= <>
##$TILT= no
##$TM1= 0
##$TM2= 0
##$TOPLEV= 0
##$USERP1= <user>
##$USERP2= <user>
##$USERP3= <user>
##$USERP4= <user>
##$USERP5= <user>
##$WDW= 1
##$XDIM= 8192
##$YMAX_p= 0
##$YMIN_p= 0
$$ End of Bruker specific parameters
$$ ---------------------------------
##NTUPLES= NMR FID
##VAR_NAME=  TIME,          FID/REAL,        FID/IMAG
##SYMBOL=    X,             R,               I
##VAR_TYPE=  INDEPENDENT,   DEPENDENT,       DEPENDENT
##VAR_FORM=  AFFN,          ASDF,            ASDF
##VAR_DIM=   8192,          8192,            8192
##UNITS=     SECONDS,       ARBITRARY UNITS, ARBITRARY UNITS
##FACTOR=    0.0002768,     1,               1
##FIRST=     0,             0,               0
##LAST=      2.2672688,     0,               0
##MIN=       0,             -317647,         0
##MAX=       2.2672688,     208981,          0
$$ Real data points
##PAGE= N=1
##DATA TABLE= (X++(R..R)), XYDATA
$$ [...]
1522B205j81m191Q8L667r30k547K575J950l189j885K109R75m73J98r4N1P3j937
$$ 2205 2024 -2167 -2079 1588 658 -1889 686 2636 -553 -2438 -329 646 173 371 277 328 401 -1536
1540a536m46L809Q02m180L27L755k854l606M682L229m724j462L882j278l284K653
$$ -1536 -1982 1827 2629 -1551 -1224 2531 -323 -3929 753 3982 -742 -2204 1678 400 -2884 -231
1556b31K467j907m47M76j825M97K338j613n95L532j464n083K710M542l885k199
$$ -231 2236 329 -118 358 -1467 -970 1368 -245 -840 2692 1228 -3855 -1145 3397 -488 -2687
1572b687N540j79o421J384N134k371k328L523J86l615N70J703q06J080J218k705
$$ -2687 2853 2674 -3747 -2363 2771 400 -1928 1595 1781 -1834 -1264 439 -367 713 1931 -774
1588g74o20K761j725k379M354J999n310q50M580j545l763L691L157l892j909K750
$$ -774 -1394 1367 -358 -2737 1617 3616 -1694 -2544 2036 491 -3272 419 3576 -316 -2225 525
1604E25k42j619J557J072q18j51p94j226J769J593k058l14K614j452l456K239
$$ 525 283 -1336 221 1293 475 324 -470 -1696 73 1666 -392 -706 1908 456 -3000 -761
1620g61L151k231j561K436N1k727K29K221L27q47m26j21L93l16r58J358J963j832
$$ -761 2390 159 -1402 1034 1085 -1642 -1413 808 1135 288 -138 -259 134 -182 -1140 218 2181 349
1638C49k315J898J274k409M5L008m67k829M73J508o82k84R13J22j52n85j161P66
$$ 349 -1966 -68 1206 -1203 -1158 1850 1383 -1446 -973 535 -147 -431 482 604 452 -133 -1294 -528
1656e28K012j095j652K053P95l332k34L775m46l046J539J913k500j117K476N44
$$ -528 1484 389 -1263 790 1585 -1747 -1981 1794 1348 -1698 -159 1754 -746 -1863 613 1157
1672A157j436L03K68p61L67K65q10J100J166k261j121K691J78k847J256K911k303
$$ 1157 -279 24 292 -469 -102 163 -647 453 1619 -642 -1763 928 1106 -1741 -485 2426 123
1689A23k536K629J388k533k6K331o53j779O29P76l39K33k9m93O23O9j484M55K064
$$ 123 -2413 216 1604 -929 -955 1376 723 -1056 -427 349 10 243 214 -279 344 413 -1071 -616 1448
1708A448r55j990J541J393k237p34K525L30k268J49J717o06j191O87J029m01q51
$$ 1448 493 -1497 44 1437 -800 -1534 991 1321 -947 -798 919 313 -878 -191 838 437 -414
1725d14p2O44K76p08k71J009K99j377l15J486J39j413K05J381m21j368M27J343
$$ -414 -486 158 434 -274 -545 464 763 -614 -929 557 696 -717 -512 869 448 -920 -493 850
1743H50m15j118M32J046n37j139N83J185n90j191P20R68q24q65R70P32q74n96
$$ 850 435 -683 -251 795 258 -881 -298 887 297 -894 -174 794 -30 -895 75 807 -67 -663
1761f63P23M94n83m72N08O21m54q46M92R63o35j049Q74R76j119q88J331O57j440
$$ -663 60 554 -29 -501 7 628 174 -672 -180 783 148 -901 -27 949 -170 -1058 273 930 -510
1780e10k88J356L1j199J43R90j34p34N4O10M0n14k63O01L59p54m74R23M44j111
$$ -510 -798 558 589 -610 -467 523 389 -345 -291 319 359 -155 -418 183 542 -212 -686 237 681 -430
1800d30l05J259R7j332J43J324l40j167M92J019n71q43N71P04n34o10M45M88k91
$$ -430 -735 524 621 -711 -568 756 416 -751 -259 760 189 -654 -83 621 87 -523 -78 410 119
1819A19n40J70O19j33p26J88Q25k28r12L54R74m96r32O86Q33q24p20R00N33r29
$$ 119 -421 -251 368 235 -491 -303 522 294 -618 -264 710 214 -718 -32 801 -23 -743 157 690 -239
1839b39m02Q89K50p64j98O18K06n64j89N00K95m73l52N27M41o48m01O77M15q35
$$ -239 -641 248 498 -266 -464 154 360 -204 -393 107 402 -71 -423 104 545 -103 -504 173 588 -247
1859b47l25R04J93r45j06R56m9r02J09Q76k27p11K42O66k47n38J88N29j14n38
$$ -247 -572 332 525 -420 -526 430 381 -521 -412 464 237 -474 -232 434 187 -351 -163 366 252 -286
1879b86J13M96m5o02L3O51j08p08J25P84k52p49L02Q50m77p36N89N96n99m51O31
$$ -286 -173 323 278 -324 -291 360 252 -456 -331 453 201 -548 -246 604 127 -609 -20 576 -23 -474 157
1900A57L27o20k34N13J62l94j57K71K16k73l72K69N62l76n47N09N27o58n19Q90
$$ 157 484 -136 -370 143 305 -89 -246 25 241 -32 -404 -135 427 51 -496 13 540 -118 -637 253
1920B53L56r13j38Q73j10p28J84O00k09m58J08L09j0k56o5L04K38m95l25O85K19
$$ 253 609 -304 -442 431 321 -407 -223 377 168 -290 -182 127 117 -139 -204 100 338 -157 -482 203 422
1941D22p17m3Q10k05q03K78P87m35m88M34K79m34k41K94K60p0l08LL72r7n21K92
$$ 422 -295 -338 472 267 -536 -258 529 94 -394 40 319 -115 -356 -62 198 128 -180 -177 195 98 -423 -131
1963a31O61l30o84M55M98n99k99P03J71o29j34L84K2j83JJ73J77k50m46K97N78
$$ -131 530 200 -484 -29 469 -130 -429 274 445 -184 -318 66 88 -95 -94 79 256 6 -440 -143 435
1984D35l60m60N88K85q46j67R25l3o88K39M28m26l15L66J94r1m7j70j1K96k12
$$ 435 75 -385 203 488 -358 -525 400 367 -321 -82 346 -80 -395 -29 165 74 27 -143 -154 142 -70
2005g0k99O02L77q65k51Q74j06q08N70P24p49n74O17J78m90J80L96k58j61k6j24
$$ -70 -369 233 610 -255 -506 368 262 -546 24 748 -1 -575 42 220 -270 -90 306 48 -113 -139 -263
2026b63K74L20l44k48N74j29q51M91Q81o03o10P50J30r24J50Q41j75m74K23L1
$$ -263 11 331 -13 -261 313 184 -667 -176 705 102 -508 242 372 -552 -402 439 264 -210 13 44
2046D4k79J26J37k0K90m4o52J38O45l76l94P98J44j002j5Q20k17n16N06K88o11
$$ 44 -235 -109 28 8 298 254 -398 -260 385 9 -385 413 557 -445 -460 360 143 -373 133 421 -190
2067a90j83L21Q3M8Q9k05qJ81l60j65P31J96p94l1O71m44n32P17M48o43k53M17
$$ -190 -373 -52 31 79 168 -37 -45 136 -224 -389 342 538 -256 -287 384 -60 -592 125 573 -70 -323 94
2089I4r8l12K84K69j06ok86j67M25J49m10J69N27n47o05O29M93o54p5O74l02o95
$$ 94 -4 -316 -32 237 131 125 -161 -328 97 246 -164 5 532 -15 -620 9 502 -152 -227 447 145 -550
2111e50L33M48j53q1J20j58m7N1k00K30M92l31n78M79K58o86O0Q82k23q49L26
$$ -550 -217 231 78 -3 117 -41 -88 -37 -237 -7 485 154 -424 55 313 -373 -313 569 346 -503 -177
2132a77M63m42j69N61P0m01n6K7M0K21m1j81K61P8n98l9P49o6o47L66M39o80l20
$$ -177 286 -156 -325 236 306 -95 -151 -124 -84 137 96 -85 176 254 -344 -383 366 300 -347 19 458 -222 -542
2155e42O90K16m87J0K88j93k17J38J46J77m6l63pL80j60l74M92L46o18l72O21
$$ -542 148 364 -123 -113 175 -18 -235 -97 49 226 180 -183 -190 190 30 -344 148 494 -124 -496 125
2176A25R5n47J63N37k41m40J75K45p3p6L1J14M2k62j94M03K62m56j60N16o9o50
$$ 125 220 -327 -164 373 132 -308 -133 112 39 -37 -6 108 150 -112 -306 97 359 -97 -257 259 190 -460
2198d60K89N62k96l96K79K65l72j18K79J95j59k00pK51Kl02Q4M50k10n25K52M78
$$ -460 -171 391 95 -301 -22 243 -129 -247 32 227 68 -132 -139 112 114 -188 -104 346 136 -389 -137 341
2220C41l44l43M68K24n20j66M64P7k63n7K11P0k07j63K15K53j91l12K53K90m37
$$ 341 -3 -346 122 346 -174 -340 124 201 -62 -119 92 162 -45 -208 7 260 69 -243 10 300 -137
2241a37k30N45J59n81n7N01k8m39J15L93j08l06N7K33Jk27k9K81O4l83o1M47r
$$ -137 -367 178 337 -244 -301 200 172 -267 -152 241 133 -173 -116 117 118 -109 -138 143 207 -176 -237 210 201
2264B01m57Q5M45j47m34J78M19k27l16K10K86k10k65J49L32j57l11J72K79j65
$$ 201 -256 -171 274 127 -307 -129 290 63 -253 -43 243 33 -232 -83 249 92 -219 -47 232 67
2284F7l46K10L72k87l55L27L15l22k57L11K69l42k35L61J71k83k35L58J97l66
$$ 67 -279 -69 303 16 -339 -12 303 -19 -276 35 304 -38 -273 88 259 -24 -259 99 296 -70
2304g0k03L91J48l64j92M16J51m24j25M13J27m27o5L92N5l87o5M39J5l99k2L85
$$ -70 -273 118 266 -98 -290 126 277 -147 -272 141 268 -159 -224 168 223 -164 -229 210 225 -174 -196 189
2326A89Kl82mM02k5m02M2L95o6m30J08M20j13m23J67L88j41l97J60L92j99l80
$$ 189 191 -191 -195 207 182 -220 -178 217 151 -279 -171 249 136 -287 -120 268 127 -270 -110 282 83 -297
2348b97K34L36j85m04K62L41k53l57K92L19k93l01L03K95l03k77L27K42l10k45
$$ -297 -63 273 88 -316 -54 287 34 -323 -31 288 -5 -306 -3 292 -11 -288 39 281 -29 -274
2368b74L27K44l21k63L59K18m06j94M23J26l54j84M26J38m21r3L94J02l92n5L63
$$ -274 53 297 -24 -287 72 290 -116 -310 113 239 -115 -299 127 265 -156 -249 145 247 -145 -200 163
2389A63Q2l72q7L75P0m01o2M05O3m22p3M66L1n03M5N09q1m96J47M45k11l78K15
$$ 163 245 -127 -214 161 231 -170 -232 173 236 -186 -259 207 238 -265 -220 289 208 -288 -141 304 93 -285 -70
2412g0L48j80l44J54K86j05l08Q7L61o3m69J49M86k27m36K77M34l69l99M11L19
$$ -70 278 98 -246 -92 194 89 -219 -132 229 166 -303 -154 332 105 -331 -54 380 11 -388 23 342
2433C42l72k29M00R1l18j57K79J72j78k46J61K87k08l98L92L92m52l30M77K06
$$ 342 -30 -259 141 232 -86 -243 36 208 30 -216 -55 232 24 -374 18 410 -42 -372 105 311
2453C11n32n9N44J8m86j0L90l9k54J1K33R2l08k09L15K22l36j88N34Q7o84JO83
$$ 311 -221 -280 264 282 -204 -214 176 137 -117 -106 127 219 -89 -298 17 239 -97 -285 249 336 -348 -347 336
2476C36j01n02K31L48l19l14K60K65j01j47n1J29P8l35k6N20P3o32j3O21k67n14
$$ 336 235 -267 -36 312 -7 -321 -61 204 103 -44 -95 34 112 -223 -249 271 344 -288 -301 320 53 -461
2498d61M77N47n65l55M21J35l65K6L14l9j37j71l9K77J42l51k5N76l29o42M85
$$ -461 16 563 -2 -357 64 199 -166 -140 174 135 -2 -173 -212 65 207 -144 -169 407 78 -564 -79
2519g9O45n71l86P33op44P0O67j34l32J82K0j44ol5J24L40j63n74K20N11m75l19
$$ -79 566 -5 -391 342 336 -408 -338 329 195 -137 45 65 -79 -85 -120 4 344 181 -393 -173 338 -137 -456
2542d56Q33J73r26k9P22k16m84M99L77n24k54K22L7O2Q7j82J05J68m24k77O92
$$ -456 377 550 -376 -405 317 101 -383 116 493 -31 -285 -63 -26 36 123 -59 46 214 -210 -487 205
2563B05L20p38k1O68l70p14O01O43n59k87M14q1l75J58K26Q6j3k21k60L04J90
$$ 205 525 -213 -234 434 64 -650 -49 594 35 -252 162 81 -294 -136 90 176 163 -58 -318 -14 176
2584A76m48J47P04m09p74M58N49n20j98P36l8p44N7M04o1o7J56p3m3rk99J17N98
$$ 176 -272 -125 579 170 -604 -146 403 -117 -315 421 383 -361 -304 100 39 -28 128 55 12 3 -296 -179 419
2607D19j24o73L89M13p34k37R27J63q47J02N16l83l30M51K50k37p2q8j06K55M4
$$ 419 295 -378 11 424 -310 -547 380 543 -304 -202 314 -69 -399 52 302 65 -7 -95 -201 54 98
2628I8k79K75L87o74l78P75J63p27K31P37m97p28N55M08m38n8L88j47k63O4j5
$$ 98 -181 94 481 -193 -571 204 367 -360 -129 608 111 -617 -62 346 -92 -150 238 91 -172 -108 -123
2649a23J71K79k95k99L70Q4n69J63P84l30p17M52M09n80j71O59P0n45OK12q3j5
$$ -123 48 327 32 -267 103 187 -382 -219 565 235 -482 -30 379 -201 -372 287 357 -188 -182 30 -53 -68
2671f8P9J8J63n9m39N1O10k27m71M27L40o45k69O69J63n53P0M15k23l32J78K39
$$ -68 11 29 192 133 -306 -255 355 128 -343 84 424 -221 -490 179 342 -211 -141 274 51 -281 -103 136
2693A36nq6j46O8J80k03k58M63K68n74j93N69mn64J90N58k50m56K24K54k01j10
$$ 136 131 45 -101 -33 147 -56 -314 149 417 -157 -350 219 215 -349 -159 399 149 -307 -83 171 -30 -140
2715a40J34J04pk13q5K85J46l72m5N03j35n53K05N67l03m33L37K73l75j73L17
$$ -140 -6 98 91 -122 -207 78 224 -148 -193 310 175 -378 -173 394 91 -342 -5 268 -107 -280 37
2736C7K00k46j18Q3J65r4k17J09L33j16m41J80M52l00m03M62K90m98k07M41J50
$$ 37 237 -9 -127 -44 121 27 -190 -81 252 136 -305 -125 327 27 -376 86 376 -122 -329 112 262
2757B62m24pL27Rk75o2K14J30k11j47K39J86k96k62M15K08m45j16M56N0m62qM52
$$ 262 -162 -169 158 167 -108 -170 44 174 -37 -184 55 241 -55 -317 98 306 -139 -255 201 251 -211 -219 233
2780B33m1l66J3L28m3l03M4L23k0l30J3L28k6l38PM26j06l83O5L96j17l64J82
$$ 233 192 -174 -161 167 124 -179 -135 188 168 -162 -149 179 153 -185 -178 248 142 -241 -176 220 103 -261 -79
2803g9L13j51l26J59L51j86k98J62L10j98k98J88L17k19l21K59K63k51k51K61
$$ -79 234 83 -243 -84 267 81 -217 -55 255 57 -241 -53 264 45 -276 -17 246 -5 -256 5
2823EK25k26k27K08K61k52k39K60J91k39k10K53K16l01j85L30J81l32j90L50J56
$$ 5 230 4 -223 -15 246 -6 -245 15 206 -33 -243 10 226 -75 -260 70 251 -81 -271 79 235
2844B35l59r9L45J03l45q2L19J02l59j5K93O6l29m8L08L7l11m5L64J4l79j0M18
$$ 235 -124 -223 122 225 -120 -202 117 219 -140 -155 138 204 -125 -173 135 172 -139 -184 180 194 -185 -195 223
2867B23n3l76N5L65p7l71J34L00r6l11J20K93j03k69R3K74j01l15J31K77j04l60
$$ 223 170 -206 -151 214 137 -234 -100 200 104 -207 -87 206 103 -166 -73 201 100 -215 -84 193 89 -271
2889b71J73L34j41l50J49L46j94l10K48K56k54k03J92K26k09k06K13K31j94l06
$$ -271 -98 236 95 -255 -106 240 46 -264 -16 240 -14 -217 -25 201 -8 -214 -1 230 36 -270
2909b70K59K37k64k25K90K41l52j77L26J79l14j22L25K4k52q8K33J29k32j74K83
$$ -270 -11 226 -38 -263 27 268 -84 -261 65 244 -70 -192 133 157 -95 -183 50 179 -53 -227 56
2930E6J51l50j42M20J04l87q7M34Jm29Q2L75r9k55M8K07n3j88l6K88O2l04r5L13
$$ 56 207 -143 -285 135 239 -148 -235 199 200 -229 -147 228 129 -126 -78 129 76 -112 -148 140 202 -102 -197 116
2954A16Q7m05KM85q4n31J97M54k75l38L49K21l12j31J56J04p6q9K2J71k8k98k0
$$ 116 203 -202 -200 285 201 -330 -133 321 46 -292 57 278 -34 -165 -9 95 19 -70 -48 123 95 -203 -223
2977b23M61l1m96K14M31m12l73N07K92m23j40L52k3l44Q2K52J0j04r9o2K32qk83
$$ -223 238 207 -289 -75 356 -56 -429 78 370 -53 -193 159 136 -208 -126 126 136 32 -67 -129 103 95 -188
3000a88J66M00l60m34M28L26m97j05N87q5n40J35L51j82j20J82J9o7q6j33J45
$$ -188 -22 378 18 -416 12 338 -159 -264 323 238 -302 -167 184 2 -118 64 83 16 -70 -203 -58
3021e8L39k05l50L38K15n55p4O66mn86J53M06l39k84M28J88l00l3K2m9J24k8j19
$$ -58 281 76 -274 64 279 -276 -350 316 312 -274 -121 285 -54 -338 90 278 -22 -55 -33 -82 42 14 -105
3044a05K46J37m89j79O25qn41K63N20n07m59N26K55m42O5L15j93k18P8M1J12J68
$$ -105 141 278 -211 -390 235 227 -314 -51 469 -38 -497 29 284 -158 -93 222 29 -189 -111 -70 42 210
3066B10k09j90K86M0n21K81N96l69n49N25K16o16K5O71j56m68J60J41j83M3J42
$$ 210 1 -189 97 137 -384 -103 493 124 -425 100 316 -300 -275 396 240 -228 -68 73 -110 -67 75
3087G5m9R0j1m04P5N07j75l91M37K77p46j56P93o0n26K40L72m46k31L47R6q2R2
$$ 75 26 116 105 -299 -224 283 108 -283 154 431 -315 -471 322 262 -264 -24 348 -98 -329 18 114 32 124
3110A24j06j44J94j10k54M10L11n42k38N47Lo05L63N99m90m55M24Q2k86J14K64
$$ 124 18 -126 68 -42 -296 114 425 -117 -355 192 195 -410 -47 552 62 -393 31 113 -173 -59 205
3131B05j28j00m4j45J65K60k67j28M26j02n94K67O01l52m05M88J61n96mN10m6
$$ 205 77 -23 -67 -212 -47 213 -54 -182 244 142 -452 -185 416 64 -341 147 308 -288 -292 218 172
3152A72k65J25L1j34M7n1J7K76j1m53R2M13k95l06N30K41o26j36N19o5l89K69
$$ 172 -93 32 63 -71 -24 -75 -58 218 207 -246 -154 259 -36 -342 188 429 -197 -333 186 121 -268 1
3174AK55k36j78J10K4Q1M8k07R4K05k69k94M54K76n19o2M79r3n48K95M46k83k75
$$ 1 256 20 -158 -48 -24 57 105 -102 -8 197 -72 -366 88 364 -155 -217 262 169 -379 -84 362 79 -196
3197a96K61P6k43jJ24N4P2j87j63K56J16l23k9M72j14n24K09M23k60k95L90J73
$$ -196 65 141 -102 -103 21 75 147 -40 -203 53 169 -154 -183 289 175 -349 -140 283 23 -272 118 291
3219B91m18j38L12O8j50J1L6P1m8j81K1L21p9l29J75L12l02k71L85K35m15j54
$$ 291 -127 -265 47 115 -35 -24 12 83 35 -146 -125 196 117 -212 -37 275 -27 -298 87 322 -93 -247
3241b47L89j0k88K5K56l9j66m9J38P2q0j71K19J81l08j74L38J23l75l4L69k9l49
$$ -247 142 132 -156 -131 125 86 -80 -129 9 81 1 -170 49 230 -78 -252 86 209 -166 -200 169 140 -209
3264b09J04K60q4k28Q2K12q3j76RK18K6k23o3K94Kk96K9L09o1k86Q3L07j66k64
$$ -209 -105 155 71 -157 -75 137 54 -122 -113 105 131 -92 -155 139 141 -155 -126 183 122 -164 -81 226 60 -204
3288b04K22J75j52k08R8J92q8k00Q4K52j37k21J30K73j49l01K16K21k08k10K09
$$ -204 18 193 41 -167 -69 123 35 -165 -81 171 34 -187 -57 216 67 -234 -18 203 -5 -215 -6
3309fK21k41j52J88J67k44j12K29Q6j38j61K07J40k11j58K12J44k42j09K38J10
$$ -6 215 -26 -178 10 177 -67 -179 50 136 -2 -163 44 184 -27 -185 27 171 -71 -180 58 168
3330A68k62q9L01M6k84k6K78K8k77rK29Rk21rK49Mk59lK45J0k58k2K77j8k65M7
$$ 168 -94 -183 118 164 -120 -146 132 160 -117 -126 103 112 -109 -118 131 135 -124 -127 118 128 -130 -152 125 107 -158 -111
3356a11K73r3k19O0K65q2k70J08K29j10k08R3K48j18k13P9K33j27k73J88K34j31
$$ -111 162 69 -150 -90 175 93 -177 -69 160 50 -158 -65 183 65 -148 -69 164 37 -236 -48 186 55
3378E5k67J70K18j61j94J82J92k28j47J62J80j66j76J83J83k07j81K24J36j84
$$ 55 -212 -42 176 15 -179 3 195 -33 -180 -18 162 -4 -180 3 186 -21 -202 22 158 -26
3398b6j95K58J32k36j07K58Q4k25q2J81Q3k11l4J60J05j76j26K32P3k28j30K70
$$ -26 -221 37 169 -67 -174 84 168 -57 -139 42 125 -86 -120 40 145 -31 -157 75 148 -80 -210 60
3420F0R9k73m4L03Rl54J16K39p2k20P4J77o6j39j3J95J6k00l2K30N0l30K1L38
$$ 60 159 -114 -158 145 154 -200 -84 155 83 -137 -63 114 48 -91 -104 91 107 -93 -125 105 155 -175 -154 184
3444A84n5l24J18L12k32k44K17J98j65j28J17Q3p8j04R2J13l4k43M9L04r5l09
$$ 184 129 -195 -77 235 3 -241 -24 174 9 -119 -2 81 3 -101 -9 104 70 -173 -124 180 85 -224
3466b24J91L07k86k75L30J97l41m7K52K5k04l5J55N0p5q4LJ60n7k69K04L02k74
$$ -224 -33 274 -12 -287 43 240 -101 -148 104 129 -75 -110 45 95 20 -64 -61 99 42 -227 -23 279 5
3489Ek58L81R1m02k7M11l1l17O0J77j09j01J22O4kq4j19R6K07j75k17L85O7m18
$$ 5 -253 128 219 -183 -210 201 170 -147 -87 90 -19 -120 2 66 64 -20 -139 -43 164 -11 -228 157 224 -194
3513a94n8M61p1l76K06K90k98j99K47J17j26nj0J1N1r2j24K83J40l85p7M19j03
$$ -194 -252 209 138 -238 -32 258 -40 -239 8 125 -1 -6 -16 -5 46 -46 -170 113 253 -132 -209 210 107
3536A07m35L20L93l80l23L95Q4l25P4K61q9j28ko7J04J71k04p3L03r3m35K16M66
$$ 107 -328 -8 385 5 -318 77 161 -164 -90 171 82 -46 -48 -115 -11 160 -44 -117 186 93 -342 -126 340
3559C40l13l01M19J06n37J9M70r2k05J41O3j72j6P4k9J83lk94N1K98k28k83M88
$$ 340 27 -274 145 251 -286 -267 203 111 -94 47 110 -62 -78 -4 -33 150 147 -147 -96 202 -26 -309 179
3582A79J93n74p5N06j44l59L15K89l38j89K12l6m5J33n2l4J60k01k68L74K83m37
$$ 179 372 -202 -277 229 85 -274 41 330 -8 -197 15 -21 -66 67 15 -19 141 -60 -328 46 329 -108
3604a08r6M64j52n09L11M49l58k09L41%l35R3J92j1K1n8k00J36J69k57p0M66n9
$$ -108 -204 260 108 -401 -90 359 1 -208 133 133 -202 -109 83 72 93 35 -165 -29 140 -117 -187 279 220
3627B20n55J91M44l42k56M95Q6m92K2L07j12p1J42j4r6M9j35q0L71Nl53J00L42
$$ 220 -335 -144 300 -42 -298 197 283 -209 -187 120 8 -63 79 65 -31 18 -117 -197 174 179 -174 -74 268
3650B68l51k91N04K00m94lM14k08l61L44K02j84p1M7p4P3N9j56P0K64k55l25L91
$$ 268 -83 -374 130 330 -164 -167 247 39 -322 22 224 40 -31 16 -58 15 74 -82 -12 252 -3 -328 63
3673F3J76m00j9M72j81m11K24L22k54j13K41Qk14K7K6M5Q5j08j39J95R3l22K4
$$ 63 239 -161 -180 292 111 -300 -76 246 -8 -121 120 128 -86 -59 -33 12 97 -11 -150 45 138 -184 -160
3696a60L89m4m29J89L07l14k06L83J37l22n5J88k9r3M1L5N2K0k22qL07r0k96K18
$$ -160 229 185 -244 -55 252 -62 -268 115 252 -70 -125 63 34 -59 -18 17 69 89 -133 -141 166 76 -220 -2
3720bK64l16k16L62J36l51j4L23j09k26N6J97j1j05m1K7J19j01j63J61K24k45
$$ -2 262 -54 -270 92 228 -123 -137 186 77 -149 -93 104 93 -12 -53 -26 93 -8 -171 -10 214 -31
3742c1k01L42J09l59l7L95q1l31J35K08j16j38P3J01j6j10m1J30R2j94n8K50K1
$$ -31 -232 110 219 -140 -177 218 137 -194 -59 149 33 -105 -32 69 53 -57 -98 32 124 -70 -128 122 143
3765A43k88kL27j04k86J28K83j84k29J89J55j49j19J43R1r8q1M6J48o5j87L7K54
$$ 143 -145 -147 180 76 -210 -82 201 17 -212 -23 132 -17 -136 7 98 0 -81 -35 113 48 -139 -102 152
3788A52r1k60J91K08j87k21K53J47k36j21K08J07k20n3J67O7j38j31J84J09j34
$$ 152 61 -199 -8 200 13 -208 45 192 -44 -165 43 150 -70 -123 44 111 -27 -158 26 135 1
3809Aj54J67J72k28j04J81J37k44p0K67L3k77qK21N0k50J6J95j8j67j5K01L4k16
$$ 1 -153 14 186 -42 -146 35 172 -72 -142 125 158 -119 -127 94 144 -106 -90 105 87 -80 -95 106 140 -76
3833g6m1K48kk25PK43n0k29J0K64o0k24K6K44m8k54J30J63p6j81Q4J80r4j73P7
$$ -76 -117 131 129 -96 -89 154 104 -125 -115 149 89 -135 -109 135 87 -167 -37 126 50 -131 -47 133 39 -134 -57
3858e7J99j01k26J30K26j58j40J38J41j45j57J41J48j07j97J73J65j72j38J52
$$ -57 142 41 -185 -55 171 13 -127 11 152 7 -150 -9 139 32 -165 8 173 1 -137 15
3878A5J35j39j58J83J08j68j33K04J34k39q6K33N0k18m0J85M9j95n5J86N7j67
$$ 15 150 11 -147 36 144 -24 -157 47 181 -58 -144 89 139 -79 -119 66 115 -80 -135 51 108 -59
3900e9q3J96J01k20r0K12Q7k67j6L12m0k72M1J86Qk40M7K17j2k01K3J50M2k07
$$ -59 -142 54 155 -65 -155 57 144 -123 -139 173 133 -139 -98 88 96 -144 -97 120 108 -93 -70 80 122 -85
3924h5j7K20J2k79N7K57o0k73J25K20j46k02J80J36j69r3R1J25j04j32O9K03o1
$$ -85 -102 118 130 -149 -92 165 105 -168 -43 177 31 -171 9 145 -24 -117 -26 99 -5 -137 -68 135 74
3947G4k11O0K53j23k94K24K56k85j66K59J18k66l8K49Oj69l8J05O2q2p9R4J44
$$ 74 -137 -77 176 53 -241 -17 239 -46 -212 47 165 -101 -139 110 116 -53 -91 14 76 -6 -85 9 153
3970A53j36k28K01K36k52j66L29N7l41LL08n0k60Q9J73j22j17R1P0M1m1j46J22
$$ 153 17 -211 -10 226 -26 -192 137 194 -147 -144 164 114 -146 -57 116 -6 -123 -32 38 79 38 -108 14
3993A4J40k02j40L43O2l95j0L88j44k95K33K34k61j58K36N3j46LN1L2L3j21j43
$$ 14 154 -48 -188 155 217 -178 -188 200 56 -239 -6 228 -33 -191 45 98 -48 -45 6 38 71 -50 -193
4016a93K65J23l38J2L69j72m11L21L00l05j90L39L8l57J02J94n2m9K1n2M4M4j58
$$ -193 72 195 -143 -131 238 66 -345 -24 276 -29 -219 120 158 -199 -97 97 45 -4 17 -35 9 53 -105
4039a05M6L01j52l80K28L34l76j44M41K3m24L2L27j49j29J79M0j32jk0NJ91j1
$$ -105 -59 242 90 -290 -62 272 -104 -248 193 216 -208 -176 151 2 -127 52 92 -40 -41 -61 -56 135 124
4062A24k85J53K51l70j87M81J16m72O0L87k40l02K97K13k46m5J12j05J1R1q7M9
$$ 124 -161 -8 243 -127 -314 167 283 -189 -129 258 18 -284 13 226 -20 -65 47 -58 -47 44 -43 6
4084FK02k48k46L72J11l77P6M47k41m53L43K85l84o3L65r0k70R4J00j7O3j1j74
$$ 6 208 -40 -286 86 197 -180 -104 343 102 -351 -8 277 -107 -170 195 105 -165 -71 29 12 75 64 -110
4107a10J64Q0l30M4M44j44m28K54K84m48j10N15J5m04P6K32j86o3J90l7%N3j76
$$ -110 54 134 -196 -152 292 148 -280 -26 258 -190 -300 215 230 -174 -98 134 -52 -115 75 38 38 91 -85
4130h5q2K76nl22K78K66m41k10M58J12m43J01L90k68k88K80Q6j46N9K7q1L8J7
$$ -85 -167 109 104 -218 60 326 -115 -325 133 245 -198 -97 293 25 -263 17 103 -43 16 43 -38 0 17
4153A7j55J26K63k72k11L34P0m42J21M99k51l74K80J87l12J2K80o2j52L0k9k3
$$ 17 -138 -12 251 -21 -232 102 172 -270 -149 350 99 -275 5 192 -120 -108 172 110 -42 -12 -41 -64
4175f4J61r1j41K68J1l99P9M26j48l63L08K10m05q7L61K1k95J30J03q6p3L2kJ28
$$ -64 97 6 -135 133 144 -255 -176 250 102 -261 47 257 -148 -235 126 147 -148 -18 85 -1 -74 -42 -44 84
4199H4L1k59L5K47j33k54K74K54l79j44L80J8l25R0K79j34j98J19N1m1J3l2L0
$$ 84 115 -144 -109 138 5 -249 25 279 -100 -244 136 154 -171 -81 198 64 -134 -15 36 -5 8 -24 6
4222FJ06j17j89K08J68k33j45L24K4l73J03L39j59k51J71J54j82o8J23N3m3o0
$$ 6 112 -5 -194 14 182 -51 -196 128 152 -221 -118 221 62 -189 -18 136 -46 -114 9 62 19 -41
4244d1k1J02O2j83k2K43n7k70R3K66j19k45K45J45k51p6J91O4j76k8J06N0q2r5
$$ -41 -62 40 102 -81 -103 140 83 -187 -94 172 53 -192 53 198 -53 -129 62 126 -50 -78 28 78 -4 -99
4268i9M0J69o5j79Q5J74j52j75J94J91k33j16K42M7k21K6J63nj39m1J44%r1p3
$$ -99 -59 110 45 -134 -49 125 -27 -202 -8 183 -50 -166 76 123 -98 -72 91 86 -53 -94 50 50 -41 -114
4292a14J60M3j54o6J95O9k01l4K59l8k53M2K27p5j87O8J79o7j39L2J56n5j24J7
$$ -114 46 89 -65 -131 64 133 -68 -102 157 119 -134 -92 135 60 -127 -59 120 53 -86 -54 102 47 -77 -60
4316f0J37J3j84NK02p0j90J05J83r8j97J35J49j09j66J45J03r3j42J05J58j07
$$ -60 77 90 -94 -89 113 43 -147 -42 141 43 -154 -19 130 21 -145 0 103 10 -132 -27 131 24
4338B4j50J15J32r9j72J31J44j28j71J83J43j65j30J89R5j89r6J56Q7j23r0J48
$$ 24 -126 -11 121 22 -150 -19 125 -3 -174 9 152 -13 -143 46 141 -48 -144 12 99 -24 -114 34
4360C4J12j88o6J42O3j85l4J87M0j76n1J85M2k03QJ94k9j29j7J52K3j69l6J82
$$ 34 146 -42 -108 34 97 -88 -122 65 105 -71 -122 63 105 -98 -90 104 75 -54 -71 81 104 -65 -101 81
4384H1Jj49k4J91j1j99J6K31p1j81M8J91p3j72J01J30p8j58J00J53r7j32L0J52
$$ 81 82 -67 -91 100 89 -110 -94 137 66 -115 -67 124 51 -121 -20 110 32 -126 -26 127 30 -102 -72 80
4408H0m2j51N2J75r0j47P7K16j70j52J76J41j73j34J79J03j88l7J43M7j30n3O9
$$ 80 38 -113 -61 114 24 -123 -46 170 0 -152 24 165 -8 -142 37 140 -48 -85 58 105 -25 -78 -9
4431iJ13r3j42J59J07j25j85K00J34k00p5K00M8k59L8J87l9j44L7Q3L0j01m7J02
$$ -9 104 11 -131 28 135 10 -175 25 159 -41 -116 84 132 -127 -89 98 59 -85 -48 35 65 -36 -83 19
4455A9R5j82n2J76O9k51k3L03o3k71J03K24j42q8Q8J21j25q0L4O3J7o6p1J74L7
$$ 19 114 -68 -120 56 125 -126 -149 154 91 -180 -77 147 5 -83 5 126 1 -79 -45 18 35 -31 -102 72 109
4480A09k09k4L05o8l04J44K37k17j69K45O8j82l6J55k3o7NJO2L1j36k0K19o9k47
$$ 109 -100 -124 181 113 -191 -47 190 -27 -196 49 117 -65 -101 54 31 -36 -31 -30 32 63 -73 -93 126 57 -190
4505a90J85K33k44k26L15J06k76nK80j00k53J28J14n1l6Jk3Q9m2j50J02K25j43
$$ -190 -5 228 -16 -242 73 179 -97 -102 178 78 -175 -47 67 16 -20 -19 -42 47 5 -145 -43 182 39
4528C9k61K95J18l71K8L74j05l18J36K01k01o4J46K1o2J2o2QJ71q6j52K05J33
$$ 39 -222 73 191 -180 -152 222 117 -201 -65 136 -65 -129 17 38 -24 -12 -74 -66 105 19 -133 72 205
4551B05l75l0M04r5l05J93K49l20j59L09L4j86R6Kn5J2J1q9J22J33k39j07L24
$$ 205 -170 -200 204 109 -196 -3 246 -74 -233 76 110 -76 20 22 -33 -21 -10 -99 23 156 -83 -190 134
4574A34m9l59K31L29l28k00L29L0l34J25K66j51j12Q6m3k1J21m6j10K61q0l24
$$ 134 85 -274 -43 286 -42 -242 87 117 -217 -92 174 23 -89 -3 -46 -67 54 8 -102 159 79 -245
4596b45J66L50k74k26L71O7m29M9L83j60j92J94M8k10J7J12m5Q3O6k39J0K31j64
$$ -245 -79 271 -3 -229 142 209 -220 -171 212 52 -140 54 102 -108 -91 21 -24 59 125 -114 -104 127 -37
4619c7j83L52R1l92k7L86j63k49K91J91l50p1K48o0j09J19L4j05J14q4k02K17
$$ -37 -220 132 223 -169 -196 190 27 -222 69 260 -90 -161 87 27 -82 37 71 -34 80 -4 -206 11
4641A1K00k85o6L63j07m19K89K88l39j07L13p0k34R1J95j14l2J00j52N7P8j04
$$ 11 211 -74 -140 223 116 -303 -14 274 -65 -172 141 71 -163 -72 123 9 -23 77 -75 -18 60 -44
4663d4n6K99j02l50J87L04k85j75L96K0l67O9K56j47j26J69K7j01K0m0lJ36j0
$$ -44 -100 199 97 -253 -66 238 -47 -222 174 194 -173 -104 152 5 -121 48 75 -26 -6 -46 -49 87 77
4686G7k06J19J71k27j48L41N6l45L7L30j90k06J89J81k20m2J31o0k8O4o5M9J21
$$ 77 -129 -10 161 -66 -214 127 183 -162 -125 205 15 -191 -2 179 -41 -83 48 -12 -40 24 -41 8 129
4709A29j30j69K41P0k91P4L11j86k94K54J86k74m4K10J1j96K9J01j5Oj7p0J11
$$ 129 -1 -170 71 141 -150 -76 235 49 -245 9 195 -79 -123 87 98 -98 -69 32 17 23 6 -64 47
4732D7Qj76M4K54j38k37J92J91k70j03K87M0k56J6J91r3p5M8J2N5j5r3QJ37o4
$$ 47 55 -121 -77 177 39 -198 -6 185 -85 -188 99 139 -117 -101 90 -3 -78 -30 -18 37 22 -71 -63 74 10
4757A0j46J78Q6j92r7K31P5k64M2K11p9k03J11J40q7m7N7J3Mp8n1J25P0j84m5
$$ 10 -136 42 128 -64 -161 70 145 -119 -77 134 55 -148 -37 103 16 -31 26 39 43 -35 -86 39 109 -75 -120
4782a20K00j0k12N8K37j03k17J19J60j30q5J22O5j07n4O2O9l4j06M0J55o0j48
$$ -120 80 70 -142 -84 153 50 -167 -48 112 -18 -103 19 84 -23 -77 -15 54 20 -86 -46 109 49 -99
4805i9R2J40j07j52J62J05j88o3J54N5j49m6J39K3j02n9J03Q6r8r7J01J09j31
$$ -99 -7 133 26 -126 36 141 -47 -110 44 99 -50 -96 43 66 -36 -95 8 94 -4 -101 0 109 -22
4828b2r8J46J00j77p0J65O4j80k0J67Pj63J7J01K2j16LJ36pj36j4J25L0j20l0
$$ -22 -120 26 126 -51 -121 44 108 -72 -92 75 82 -81 -64 37 59 -57 -54 82 75 -61 -75 50 80 -40 -70
4853g0J43K4j86K2J62oj93N9J62r6j29O5J16n5j26Q2J12p4j17L7J61n6j47P9J38
$$ -70 73 97 -89 -67 95 89 -104 -45 117 21 -108 -43 73 18 -108 -26 86 12 -105 -68 93 37 -110 -31 107
4878A07r8j40J07J55j26j06R9Q8q6j01J34O1j13q3J31J06j18j10J04J20j56o9
$$ 107 9 -131 -24 131 5 -101 -2 86 0 -101 33 94 -19 -102 29 135 17 -93 11 131 -25 -94
4900i4J27R9j85p9K25K4j79m3J48M8j27l6J15J5j13m4J29O0j23p9J71M0j81k6
$$ -94 33 132 -53 -132 93 117 -62 -105 43 91 -36 -72 43 58 -55 -99 30 90 -33 -112 59 99 -82 -108
4924a08J72Rj69J7J86m8j51O3J04l4r6K8R0j0j23K7J37J5k09L6J75j4k00O3J82
$$ -108 64 73 -96 -79 107 59 -92 -29 75 41 -55 -27 63 53 -70 -43 94 109 -100 -64 111 97 -103 -40 142
4949A42j36j38J32J05j60m9J12O1r6m2L3P3nr3K1J15m8j64Q5J88j43j64K03J19
$$ 142 6 -132 0 105 -55 -104 8 69 -27 -69 -36 37 32 -61 -40 75 27 -137 -52 136 -7 -171 32 151
4973A51k05o7K01K3j90K6J16k1m7k1L1O1l1j14N0J56j40j42K52R2k73m8K52j1
$$ 151 -54 -121 80 103 -87 -61 55 34 -13 -34 -3 58 27 -87 -37 119 -21 -163 89 181 -92 -140 112 101
4997A01k63J07J60q3j13P9L3n4J1J8RQ3j04j41J83J07k21n1K97o9k83J33K89k55
$$ 101 -162 -55 105 22 -91 -12 21 -33 -22 -4 5 88 -16 -157 26 133 -88 -139 158 89 -194 -61 228 -27
5021b7j24K26L0j54j5P9j9K7Qj00M8J18j65o4K79k1l17J31K58k67j39K98O2k80
$$ -27 -151 75 105 -49 -64 15 -4 23 31 -69 -21 97 -68 -132 147 126 -191 -60 198 -69 -208 90 152 -128
5045a28kK16j15o0J03N9r7N8o9o1J53M0k36Q9K58k31k06L10J55l55j7L26j63k12
$$ -128 -130 86 -29 -89 14 73 -24 34 -35 -96 57 97 -139 -50 208 -23 -229 81 236 -119 -136 190 27 -185
5069a85J89J13j61jR5p8k7R7r4NK17j43k66K69J45k86l7L70j31l55K53J83k44
$$ -185 4 117 -44 -45 50 -28 -55 42 -52 -47 170 27 -239 30 175 -111 -148 222 91 -264 -11 172 -72
5092g2n0K46m2j95J17po1J48j8j88J52R6k62l8L68m9l52J81K49l19j17L66kk82
$$ -72 -122 124 82 -113 4 -3 -64 84 66 -122 30 126 -136 -174 194 145 -207 -26 223 -96 -213 153 151 -131
5116a31N6J52j48N0N7m8mJ43k05o9K38K1l25J92K44k55k32L50Q5l38J03K68j93
$$ -131 -75 77 -71 -21 36 -12 -16 127 -78 -147 91 112 -213 -21 223 -32 -264 86 171 -167 -64 204 11
5139A1j74J75P1j41P5N6j58J19L5k12P5K88k31j99K99Q3l52N7L86j78k95K34J08
$$ 11 -163 12 83 -58 17 73 -85 34 69 -143 -68 220 -11 -210 89 172 -180 -123 263 85 -210 24 132
5162A32k35rK14n0p9P6j02m6K01o5j74K17J00l42rL53p6l23K41J83k87j23L05
$$ 132 -103 -112 102 52 -27 49 -53 -99 102 37 -137 80 180 -162 -171 182 106 -217 24 207 -80 -203 102
5185A02j4j55P8O7j47M9Jm2Q2J23j93j00K91p9k45K00K11k73j63K92M6k77Q3K03
$$ 102 88 -67 11 78 -69 -20 -19 -61 21 144 -49 -149 142 63 -182 18 229 -44 -207 85 131 -146 -63 140
5209A40j22j14R7j4l9Q2m0l9J52o3j67R4K10k08j21K56M7l35Q9K77j50j52J66
$$ 140 18 -96 1 -13 -52 30 -10 -49 103 40 -127 -33 177 -31 -152 104 151 -184 -95 182 32 -120 46
5232D6M1j28k4Q5J8k9K8j26P7J40j62j19K61L1k85M5K60r4k31J82J47k21m6J53
$$ 46 87 -41 -65 20 38 9 37 -89 -12 128 -34 -153 108 139 -146 -101 159 65 -166 16 163 -58 -104 49
5256D9%n5k9L7J4Mo5j8J36k0j80N8K09j10j95J98J28j97j01K06J4j86P4Q6l2m8
$$ 49 49 -6 -35 2 16 20 -45 -63 73 53 -127 -69 140 30 -165 33 161 -36 -137 69 83 -103 -29 57 25 -23
5282b3nM2N7q6p6R9R3q1j49J34J26j89n6J81N4k08pJ86j2j60L0J23n7r2J9Q8J0
$$ -23 -28 14 71 -15 -91 8 101 20 -129 5 131 -58 -114 67 121 -87 -94 92 80 -80 -50 73 16 -76 -57 31 41
5309D1o1j9P9M0j42l0J64K8j87L2J95r9j55J08P9p3p2N9R9r1r2P4Q8k3j23K0J37
$$ 41 -20 -39 40 80 -62 -92 72 100 -87 -55 140 41 -114 -6 73 0 -72 -13 86 -5 -97 -23 65 42 -81 -61 76
5336G6m3j36N5J36q0j27J15J16j23r6J23Q6j03q0Q1N0l2q6Q6O3p9r7R7J02j08
$$ 76 33 -103 -48 88 8 -119 -4 112 -11 -107 16 102 -1 -81 0 50 18 -68 18 81 2 -95 2 104 -4
5361dq3J17P7j44q2J78Qj07m7J62J6j37k6J04J2r1pJ12L5j59k7J26M6j16n9J57
$$ -4 -87 30 107 -37 -119 59 67 -40 -87 75 91 -46 -72 32 44 -47 -54 58 93 -66 -93 33 79 -37 -96 61
5387F1Rj80N5J65n9j46K4J54j9j41M7J22o1j07Q3O1m0j04M8J19m7j56O4J66r4
$$ 61 70 -110 -55 110 51 -95 -71 83 64 -77 -30 92 31 -76 7 68 28 -76 -28 91 44 -112 -48 118 24
5412B4j31R8J08j09q6R9Q1r4n4P3Q5r6r5R1Q8p3j55J45J10j45q7J22J32j82m8
$$ 24 -107 -9 99 -10 -96 3 84 -10 -64 9 94 -2 -97 -6 82 9 -146 -1 109 -36 -123 -1 131 -51 -99
5437i9J58L6j45NJ02Nj38JJ10L6j02n1Q8O8q7j14J53Q9j84l2K00l5k01M6J86o6
$$ -99 59 95 -50 -45 57 62 -76 -75 35 71 -31 -82 6 74 -13 -127 26 115 -69 -101 99 64 -137 -91 95 29
5463B9j15N9Q7m0o9J4N9K1q1m8J17K7j59l4K22j1k27R1K02j71j15K05M5j51jQ7
$$ 29 -86 -27 60 20 -49 -35 24 45 -36 -84 33 60 -99 -133 89 78 -149 -58 144 -27 -142 63 108 -43 -44 43
5489D3Pl2m3K7ON8j12p8K24o2j70J30J76k09j67K32Q2k27J5J95m1j40O9N0Jk9
$$ 43 50 18 -25 2 8 66 -46 -124 100 38 -132 -2 174 -35 -202 30 112 -115 -100 95 54 -86 -17 33 34 5
5515Epl2P8Rj94J16J92j56j53K21P9k84K5K75j11k12J54R6j56j4R4j7j8L8j13
$$ 5 -2 -34 44 53 -141 -25 167 11 -142 79 158 -126 -101 174 63 -149 5 101 -55 -69 25 8 -10 28 -85
5540h5KJ85r4j19J52J08k96KK90p5k54J90J67k25j06K14K7j56J05j4n8O1k4j10
$$ -85 -83 102 8 -111 41 149 -147 -145 145 70 -184 6 173 -52 -158 56 83 -73 32 18 -40 21 -3 -113
5564a13J14J50k24p5K90o8k85K02K54k98j33K99M1l03J26J59j17o4Q5o9jJ02r4
$$ -113 1 151 -73 -148 142 74 -211 -9 245 -53 -186 113 154 -149 -23 136 19 -45 40 -29 -30 72 -22
5587b2j07K15nk92J52K45j91k02L37L6l61P3L08j46j48J70Qj81J03O4j53J31Q8
$$ -22 -129 86 81 -211 -59 186 -5 -207 130 166 -195 -122 186 40 -108 62 70 -111 -8 56 -97 34 122
5610A22k20J9K24j62j85K90Q5l29J1L28j55k56K59J66k91lJ83j16m5J49n5o7J39
$$ 122 -98 -79 145 -17 -202 88 173 -156 -145 183 28 -228 31 197 -94 -97 86 -30 -75 74 19 -48 91
5633I1p7j95J77K03l19l9L62j45l09K13K75l09o4K77p4k30J23J21j07N4N8j46
$$ 91 14 -181 -4 199 -120 -159 203 58 -251 -38 237 -72 -136 141 67 -163 -40 81 -26 28 86 -60
5655f0L1J45k00l9K65p4k79J70K52k81j09L16Rl14J15J97j82l7J49m8q5Q2m6p7
$$ -60 -29 116 -84 -123 142 68 -211 -41 211 -70 -179 137 146 -168 -53 144 -38 -75 74 26 -59 23 -23 -100
5679a00J50P0k47P0K58k58j56L07Q3l18N0K68j50k15K39R4j95L5P3j23L5Q3j22
$$ -100 50 120 -127 -57 201 -57 -213 94 177 -141 -91 177 27 -188 51 145 -50 -15 58 -65 -30 53 -69
5702f9L9J47j33j38K21O2k76K2L32j42l05K38J79k57l7K43j14j39P8M7m0O1Rj16
$$ -69 -30 117 -16 -154 67 129 -147 -125 207 65 -240 -2 177 -80 -117 126 12 -127 -49 -2 -42 19 28 -88
5726h8J04Q8k26J1L01j45k18J61J65k25q2K68l3j95Q6J12q9l9N2j0L7nj02J1J34
$$ -88 16 104 -122 -111 190 45 -173 -12 153 -72 -154 114 81 -114 -28 84 -5 -44 8 -2 35 30 -72 -61 73
5751G3n1j75J65J42k43p4K52J9k41R2J69j33j10J07P3r6J7PLL0m9n0J07N2j34
$$ 73 22 -153 12 154 -89 -163 89 108 -133 -41 128 -5 -115 -8 65 -31 -14 -7 -4 26 -23 -73 34 86 -48
5776d8m2J54k4j41M7J85q9j40J11Q8j23n0J16l9ql4K5N7nj19K5J17k1j35L0J70
$$ -48 -90 64 40 -101 -54 131 42 -98 13 101 -22 -72 44 5 -3 -37 -12 45 40 -79 -54 63 42 -93 -63 107
5802A07r1j38J45J11j63r2J73N6j69J1R5k7n4%L2O3n3r0O4P9q7o1P3J13j40k7
$$ 107 16 -122 23 134 -29 -121 52 108 -61 -50 45 18 -36 -36 -4 59 6 -84 -20 59 -28 -89 -16 97 -43 -70
5828g0J26J9j43pJ66l8j10PJ03k5j04K0Q7N6j46mJ22L0j35pJ40k7j49L1J25j6
$$ -70 56 75 -68 -75 91 53 -57 -50 53 28 -76 -56 31 87 -59 -63 59 89 -46 -53 87 60 -89 -58 67 51
5854E1j57O2J39r3m4J8P4Jr9K7Q8n1n9J2R2l1j27R1R9m8j42Q2J19p7j11P4N9q7
$$ 51 -106 -44 95 2 -42 -24 50 51 -48 -21 67 16 -43 -31 61 30 -97 -6 93 45 -97 -15 104 27 -84 -10 49 -38
5882c8k6Q3L2p4o0O0P1o6o1O6R9j27n1J04N3j16l2J22K8j12l3J41m3p5mJ08Pq5
$$ -38 -64 19 51 -23 -83 -23 48 -18 -79 -13 86 -41 -92 12 65 -51 -83 39 67 -45 -78 63 20 -55 -59 49 56 -29
5910b9k1O6O2r7l7P9L6j31k3J76j0j53L0J21n8j06Q9O8o3p5N9O0mj17K1R5Jr9
$$ -29 -50 16 78 -19 -56 23 59 -72 -95 81 71 -82 -52 69 11 -95 -6 62 -1 -76 -17 43 39 -78 -57 38 39 -60
5938f0j7J34l2j21L7J75j06j22J14R1j10k8P3L6q2j2K1L2K2q4MR9Jj71J15Q1j17
$$ -60 -77 57 25 -96 -59 116 10 -112 2 93 -17 -45 28 64 -18 -30 -9 23 45 -39 -35 64 65 -106 9 90 -27
5965b7p6J72J2j47m7J57j1q6J4O8k8m6K2QP3m4r5N5J43j42q8J90J8j93RJ94q3
$$ -27 -103 69 81 -66 -113 44 33 -53 -39 29 1 -45 -23 -15 58 14 -81 -26 117 -25 -113 77 95 -98 -89 105 22
5992B2j17Q2J31j24m3P0j0j8J7k7PQ6q3j03J61M9j85j2K52j04k36J48J75j71n9
$$ 22 -95 -13 118 -6 -49 21 11 -7 10 -17 -10 76 -7 -110 51 100 -85 -97 155 51 -185 -37 138 -33 -92
6017i2J78m1r8L4K4nJ3J4r2Q4Q8j76l8K57p2k24J08K15k11j11K25L2k27O3J15
$$ -92 86 45 -53 -19 5 0 13 27 -65 19 107 -69 -107 150 78 -146 -38 177 -34 -145 80 112 -115 -52 63
6042F3j02J0Q6o3j4N8m9q7J35M5k27J23J73j89j47K81M9k62N8K01j64j59K08N1
$$ 63 -39 -29 57 -6 -20 38 -11 -98 37 82 -145 -22 151 -38 -185 96 145 -117 -59 142 -22 -181 27 78
6066G8j38N4M5j03Q7K9j04L4J83j68j59K24R6k94L0K82j30k49K63O4k27L3J67
$$ 78 -60 -6 39 -64 23 52 -52 -18 165 -3 -162 62 158 -136 -106 176 46 -203 60 124 -103 -70 97
6089I7r8o7R5j2o4R5Jj54J42J12k71j4L01j22k43K26J65l13k5K94o5k11J47O6
$$ 97 -1 -68 27 15 -49 46 47 -107 35 147 -124 -138 163 41 -202 24 189 -124 -149 145 80 -131 16 82
6113H2j80N5J20j16K8J61j97j15K85l1k61J62K33l25j00L58m7k96J79J82k40o4
$$ 82 -98 -43 77 -39 -11 150 -47 -162 123 92 -169 -7 226 -99 -199 159 112 -184 -5 177 -63 -127
6135a27J83l8o0J24l0j34J13N0k25J03K35k35j55L19jl12J14L08k37j87K70J5
$$ -127 56 18 -42 82 52 -82 31 81 -144 -41 194 -41 -196 123 122 -190 -76 232 -5 -192 78 93
6157I3k30J32J04j25LJ19j35l2J95r2j80K14J02l32O4L22j95k24K90N6k88M7K15
$$ 93 -137 -5 99 -26 -23 96 -39 -71 124 32 -148 66 168 -164 -100 222 27 -197 93 149 -139 -92 123
6180A23j11j09J40lj19J29k8j20J33P2j96j9K53j33j86J97J67k97l5K42m0j99
$$ 123 12 -97 43 40 -79 50 22 -98 35 107 -89 -108 145 12 -174 23 190 -107 -142 100 60 -139
6202a39J44J20j73jR9p2RQ4r1m2J32j3j84R7K29k30r7K25j4k62J47J92j95q3J61
$$ -139 5 125 -48 -49 50 -22 -13 71 -20 -62 70 57 -127 -30 199 -31 -128 97 83 -179 -32 160 -35 -118 43
6227D3J3j32Q0L1p0O9O1j78O7J16j17r5K15J3k32L7K20j25j61J65J06k01kJ56
$$ 43 56 -76 4 35 -35 34 95 -83 -16 100 -17 -112 103 116 -116 -79 141 16 -145 20 126 -75 -77 79
6251G9q3k8Q0m4j6O1o0n4J31K1j63M0J70j24j61J82Q3j79mJ50k9j25P1N9n3k4
$$ 79 -4 -32 48 4 -12 49 -11 -65 66 87 -76 -36 134 10 -151 31 114 -65 -69 81 52 -73 -2 57 4 -20
6277b0K6l5N4J3q3K6Q2p3q0J23N8j40j1J57m7j49N1J18q0n1O7K8l3m1j8Q0kl6
$$ -20 6 -29 25 38 -45 -19 63 -10 -90 33 91 -49 -60 97 50 -99 -48 70 -10 -61 6 34 1 -40 -58 22 20 -16
6305a6o2R6O8j79J0J48K6j86N3J49j02q1R8O8o8r1Q1J9l4k7K4J8J3o8K9P4j4j27
$$ -16 -78 18 86 -93 -83 65 91 -95 -42 107 5 -76 22 90 22 -69 12 31 -3 -30 -6 12 25 -43 -14 60 46 -81
6333h1P1Q6n6j02P9P1q6m4Q2K2q6J0O1K2q1NN5J5o1l5O4L4o4o1Q7M9r4k9J15J4
$$ -81 -10 76 20 -82 -3 68 -18 -62 20 42 -44 -34 27 49 -32 -27 28 43 -18 -53 11 45 -19 -80 7 56 -38 -67 48 62
6363F2j27K8Q6m2n5J3L8K0k5j2QN6p0m5J09Jj08%J11Mj18N5P9p4o1O5N8l5p8N9
$$ 62 -65 -37 49 7 -48 -35 3 23 -2 -14 -6 50 -20 -65 44 45 -63 -63 48 52 -66 -11 68 -6 -67 -2 56 21 -57 2
6393BJ8k3m8L9M8m6m4M8L2rr7N9Q6p4l4N7M3n4o7R2M2p2k7L5N2n0o3M7O1m0o0
$$ 2 20 -3 -51 -12 36 -10 -54 -6 26 17 -80 -21 65 -9 -43 14 57 3 -64 28 70 -2 -29 6 58 8 -55 -8 53 13 -47
6424d7L9P5p1p9R4N0j23K5Q0l0k8jM0j4j6j5L5J1m3qN2K4o8m9R8L5j34l0J45q
$$ -47 -8 67 -4 -83 11 61 -62 -37 43 13 -15 -16 24 10 -6 -21 14 25 -18 -26 26 50 -18 -67 31 66 -68 -98 47 39
6454C9j02O8N7m8o9O0Lj4qj5K9L6n4lN8Lj10rJ66n9j32J15J00j34l1P9O7j44K7
$$ 39 -63 5 62 14 -55 5 8 -6 -14 -29 0 36 -18 -21 37 40 -70 -79 87 28 -104 11 111 -23 -54 25 92 -52 -25
6483b5P3l7j7J0k2J9N3r1k4J14k3j09N2J56j66m2J59m0j36N9J20p9m9N8Ql2L1
$$ -25 48 11 -6 4 -18 1 54 -37 -61 53 30 -79 -27 129 -37 -79 80 40 -96 -37 83 4 -45 13 21 -11 20
6510B0j0m7R9n5p1N7J07j35j04K08Pj73L7J95j48p0J26np8J9M4k7K0Kp1K1J45
$$ 20 10 -37 62 7 -64 -7 100 -35 -139 69 76 -97 -60 135 -13 -83 43 38 -40 -21 23 -4 16 18 -53 -32 113
6537A13j38q7K00j3j88L7K20j48j34J87K1j68K5J43o3n3J04o3o7J26n9p3R3O9
$$ 113 -25 -112 88 75 -113 -76 144 -4 -138 49 70 -98 -73 70 7 -46 58 -5 -72 54 -5 -78 15 84
6561H4j46j3J89r0j80K23Q9k17k6K02j24r9J35O5j23L5L0r9N7N8p0m9J70n3j93
$$ 84 -62 -75 114 24 -156 67 156 -61 -87 115 -9 -108 27 92 -31 4 34 -65 -8 50 -20 -69 101 48 -145
6586a45J29J70k29m0K54l9k67J66J07j55l6J69q4n6J02j3j15J13L5j78O3J63j55
$$ -145 -16 154 -75 -115 139 100 -167 -1 106 -49 -85 84 0 -56 46 33 -82 31 66 -112 -49 114 -41
6609d1j19K72j5k35P9K05k02r8K30Jj81J04J03j71N5R1j10QJ10r0j26K09P0k73
$$ -41 -160 112 97 -138 -59 146 -56 -154 76 77 -104 0 103 -68 -13 78 -32 -24 86 -4 -130 79 149 -124
6633a24Q5K21j88j81K60M7k52O2J82j71n5K04q1n3M8M3j57R8J19k03K8K29j45
$$ -124 -39 182 -6 -187 73 120 -132 -70 112 -59 -114 90 9 -44 4 47 -110 -12 107 -96 -68 161 16
6656A6j69J65J11k49O3K03q6j95J76P6j67N8J04j10m0J18r8p5J86j1k09J46J26
$$ 16 -153 12 123 -126 -63 140 54 -141 35 111 -56 2 106 -4 -44 74 -24 -99 87 76 -133 13 139
6679A39k10p1K97p2k22J47J21j86n5J94o8r6R1J6p4P4%q5N1J38j68n5J91rk18
$$ 139 -71 -142 155 83 -139 8 129 -57 -112 82 14 -82 9 25 -49 25 25 -60 -9 129 -39 -94 97 88 -130
6704a30Q9J96j81j03K11Mj65L8J38j10k9R1l6p0J08m1o9P7M2j37N7J36r5j46K00
$$ -130 -41 155 -26 -129 82 86 -79 -41 97 -13 -42 49 13 -57 51 10 -59 18 60 -77 -20 116 21 -125 75
6729G5Qj91L1J81j12r1J19K5q4K3P2q5rP5j01QJ49q0j10J34N5j59kJ93q8j74J66
$$ 75 83 -108 -77 104 -8 -99 20 45 -39 -16 56 -29 -38 37 -64 -56 93 13 -97 37 92 -67 -69 124 36 -138 28
6756B8O6j45nJ22j8p2K3J6o8O2kq9Q8N1r3k7J60o6j15O6Q0j10n0J30Rp8PK4nM
$$ 28 94 -51 -56 66 48 -24 -1 15 -53 9 7 -82 6 57 -36 -63 97 31 -84 -18 62 -48 -98 32 41 -37 -30 -6 -11 -7
6786gL9m2OL5o9J8P2k2j05R1N5n1j04J06M1j39M4R7k8q9M9KoLkk8L0J7n0K2N7
$$ -7 32 -10 -4 31 -38 -20 52 30 -75 16 71 20 -84 22 63 -76 -32 65 37 -52 -3 -1 -7 -4 -6 -34 -4 13 -37 -15 42
6817D2o6n5J26J9j13pJ01l1q8N4P1o1k1L4jNk4j3N9mn1j7O4J0m6j8P4j0r9QJ21
$$ 42 -24 -79 47 66 -47 -54 47 16 -72 -18 53 -8 -29 5 4 9 -15 -28 31 27 -24 -41 23 33 -13 -31 43 33 -66 -58 63
6848F3n5o2O6K6n6m4O0J1Nk9jK8nm5J0N6m4m2L7P4o6n5N2M2m8k8P5K7j03K6J1
$$ 63 8 -54 12 38 -18 -62 -2 9 14 -15 -16 12 7 -38 -28 28 -16 -58 -21 53 -13 -68 -16 26 -22 -50 25 52 -51 -25 -14
6879a4L6k5j8L6llm6N5j7j9k9O6K2r5K0N9j2n3M0O5r1mM5k0npJM2K2q5K5M4po8
$$ -14 22 -3 -21 15 12 9 -37 18 1 -18 -47 19 41 -54 -34 25 13 -40 0 65 -26 -30 15 -5 -10 -17 -16 26 48 -37 -12 32 25 -43
6913d3LR5l1p8N4O1o0k4M7J0j4l3K8L1m3l7J4M3J1n6J0P8o9j8M3L9n9o4Q7J3p3
$$ -43 -40 55 24 -54 0 61 1 -23 24 34 20 -13 15 46 3 -34 -20 23 34 -22 -12 66 -3 -21 22 61 2 -62 25 38 -35
6944c5J7K5J3l4KpJ2M1p2L2L1Jp6P1L7p9k1R1k3r1L5P2l2l1K9L8n5nK9k3L3k9
$$ -35 -18 7 20 -14 -12 -19 -7 34 -38 -6 25 26 -50 21 58 -21 -42 49 26 -65 -30 42 10 -21 8 46 -9 -14 15 -8 25 -4
6976do9R2P0j44pJ25Pj42L3Q4n5m4R5j3o8L9L5l3O%m4P4rl1n2Q4Or9Q8O8o2j29
$$ -4 -73 19 89 -55 -62 63 70 -72 -39 45 -10 -54 41 28 -40 -1 34 1 7 7 -37 37 28 -3 -55 29 35 -64 24 92 30 -99
7008i9J34L0j30J1J10n9n1P3km4M3j0n2M6L5o0j1R2l7j20J34M3j53K7J07o7q9
$$ -99 35 65 -65 -54 56 -3 -54 19 17 -27 16 6 -46 0 35 -25 -36 56 19 -101 33 76 -77 -50 57 -10 -99
7035i9J13K6o1J4J9n5M9L8p0rR7n6r9J09O2j25j8J50k9j48Q4J02j34JJ03p7k9
$$ -99 14 40 -21 -7 12 -43 6 44 -26 -35 62 6 -93 16 78 -47 -65 85 56 -92 -8 94 -40 -39 64 -13 -42
7062d2R8m5m7M7L0q9L0J17j49j4J28k7j52J37P5j24o5J47o1o3Q4L8q4K4N8r5J1
$$ -42 56 11 -36 11 41 -48 -18 99 -50 -64 64 37 -115 22 97 -27 -92 55 -6 -69 15 53 -31 -7 51 -44 -33
7089c3R9m4p4R7J6j69R8J40j36j09J77Pj82J00J14j14m9J20m2j03J25Kj08Q9L5
$$ -33 66 22 -52 45 61 -108 -10 130 -6 -115 62 69 -113 -13 101 -13 -62 58 16 -87 38 40 -68 21 56
7114E6j26K4J30q1j07J57K1j66M6J24o6j00J24L8j39M7P9r6j2J08o6p0J29Mj50
$$ 56 -70 -46 84 3 -104 53 74 -92 -46 78 12 -88 36 74 -65 -18 61 -35 -47 61 -5 -75 54 58 -92
7139i2J13J03k19OK07r1j29J22P1j32J4R7o5n0P0j0r7P9K8j11N6J10j22o8J84
$$ -92 21 124 -95 -89 118 27 -102 20 91 -41 -27 70 5 -45 25 15 -82 -3 25 -86 -30 80 -42 -110 74
7164G4k7j66J24J27j70m4J92q5j21R8O2j31L0P1m8m8J16j2j14J06L7j54O0J38
$$ 74 47 -119 5 132 -38 -82 110 25 -96 2 64 -67 -37 34 -14 -62 54 42 -72 34 71 -83 -23 115
7188A15j25j06J79j1j59R3Q6j02n7J19Mj02Q0M2j09M3O3j12J2J43p6r2J07N6j92
$$ 115 -10 -116 63 52 -107 -14 72 -30 -87 32 36 -66 14 56 -53 -10 53 -59 -47 96 20 -72 35 91 -101
7213a01O6J24r9o2J05J1j18O2J00j16j4Q2l2l2L0jp3P8O0j04mJ51j08r5J04N3
$$ -101 -35 89 -10 -72 33 44 -74 -12 88 -28 -42 40 8 -24 6 5 -68 10 70 -34 -38 113 5 -90 14 67
7239F7r9l5J18m9p4R5K7p9L1J3l4J5M6m8m0O6Mr1Q0N5j20KJ16l8q2N5Q3j15J6
$$ 67 -32 -67 51 2 -72 23 50 -29 2 15 -19 -4 42 -6 -46 20 24 -67 13 68 -52 -50 66 28 -54 1 84 -31 -15
7268a5J9Mk4K5k1l5P7k7j6j2P5r8lO5oq4M0J12r4j8O6l5m8J0N0j9%K3l5RN3o2
$$ -15 4 8 -16 9 -12 -47 30 3 -13 -25 50 -48 -51 14 8 -76 -36 76 -18 -36 30 -5 -53 -43 7 -12 -12 11 -24 -15 38 -24
7300b4j3M7J4o8rJ17n4o9O7K3m6j2O8km2%K2k1j4J4j6L1J9n0KM9Jp7QQ3p2j8P3
$$ -24 -37 10 24 -44 -53 64 10 -59 8 31 -15 -27 41 39 -3 -3 19 -2 -16 -2 -18 13 32 -18 -16 33 34 -43 -35 48 -24 -42 31
7333C1j5m3L3K0j2KpJ7qj0kj1J5J7m4J4P4q8j9N7J5p9K2N7k6l9L5Kj8l1L8J1l8
$$ 31 16 -27 6 26 14 16 9 26 18 8 6 -5 10 27 -17 -3 71 -17 -36 21 36 -43 -21 36 10 -29 6 8 -10 -41 -3 8 -30
7366c0K4K3l8J0lk7M5Ro8L7M5m7k0L8L5o5J2M2rrL0Om8NqOK3k3j1%M2Jo4K8L7
$$ -30 -6 17 -21 -11 -14 -41 4 13 -55 -18 27 -20 -40 -2 33 -32 -20 22 13 4 34 40 -8 -3 -11 -5 18 -5 -16 -16 26 27 -37 -9 28
7401B8n6j8N7qjj5J6K5l1lK4j8Rk5jJ3J7k7K8j8j6rN5j1n9M5K6mn3N2J5k7j5J
$$ 28 -28 -46 11 3 2 -13 3 28 -3 -6 18 0 9 -16 -17 -4 13 -14 14 -4 -20 -29 26 15 -44 1 27 23 -30 22 37 10 -5 -4
7435dQL2m3k2N1Ml2lM3l4m5L7K4l8j2L2K3m3k0N8k2j7L1l0J1K9m3J7J0K7o8M4
$$ -4 4 36 -7 -29 22 26 -6 -9 34 0 -45 -8 16 -22 -34 -2 21 -22 -42 16 -6 -23 8 -22 -11 18 -25 -8 2 29 -39 5
7467EK8j5p4Q3J7o0LN6k0m3L9pLJ6k2l6J8k0J4j2O4k0n0K7L9o7K5N5p7K8RM6n1
$$ 5 33 18 -56 27 44 -16 -13 43 23 -20 19 12 15 31 9 -27 -9 -29 -15 -27 37 17 -33 -6 33 -34 -9 46 -31 -3 6 52 1
7500Am6L3MOJ8l4j7P3l5m4M7M3p3nQ1n8m4O1M4n5l0N4l3k7N9k2k9O2jm8M4Lo7
$$ 1 -45 -12 -8 -2 16 -18 -35 38 3 -41 6 49 -24 -29 52 -6 -50 11 55 0 -30 24 -9 -36 23 1 -28 34 33 -15 29 32 -35
7533c5k2R2qj06P6N1o8j7Q3m9l7M4M5o3k3P9o9jN4lp7J06Oj54J10K5l6n9P6Pq3
$$ -35 -57 35 27 -79 -3 48 -20 -37 46 -3 -40 4 49 -14 -37 42 -27 -28 26 23 -54 52 58 -96 14 39 3 -56 20 27 -56
7564e6M1P9j25L3N0l4j7M2K9j03P1kn9J9P4n7l7R8k5r5K6J01o4l8N8K3r2O0P2
$$ -56 -15 64 -61 -28 22 -12 -29 13 42 -61 10 8 -51 -32 42 -15 -52 46 21 -74 -48 53 -11 -49 9 32 -60 0 72
7593G2r9J0N1m4j0Q9o6n7P6K2j06K6R8p2n4Q5K8r7K4J02r5k7R8l5o8O7J3p0K8
$$ 72 -27 -17 34 -10 -20 69 3 -54 22 44 -62 -36 62 -10 -64 21 49 -48 -24 78 -17 -44 54 19 -49 18 31 -39 -11
7622a1Q8r4l2J07l5q1N2P1r1J3P0n3o3O3L7o8pP7m8j3N9n8l4O5L1j03O1M6q6n
$$ -11 77 -17 -49 58 23 -58 -6 65 -26 -13 57 4 -59 4 41 -27 -34 43 -5 -18 41 -17 -51 14 45 -58 3 49 -37 -42
7652d2J17l6r5P8M8r7k0J00m6n2P1j3o9L3P0o8PP3m6p3R6mr3O9O2q6l7J15l0j05
$$ -42 75 39 -56 22 70 -27 -47 53 7 -45 26 13 -56 -23 47 -21 -14 59 13 -60 36 32 -61 8 70 -16 -53 62 32 -73
7682g3O9L8n0J1M1m8j8P3oo2L1J7n2QP1l3n6Q0J9r3LR1q5J0L6Jq1O4Pn2J2Q2n4
$$ -73 -4 34 -16 -5 36 -12 -30 43 37 -25 6 23 -29 -21 50 17 -39 41 60 -33 -30 61 -24 -14 22 23 -58 6 13 -39 -27 55 1
7715An0P4k3o7M7P9j03j6P9Jp9O7K9j16L1Q5l4k7M9l1k5P6rp0L2N4o5k6P6j6q8
$$ 1 -49 25 2 -65 -18 61 -42 -58 21 22 -57 10 39 -77 -46 39 5 -22 27 -4 -29 47 38 -32 0 54 -11 -37 39 23 -65
7746f5O4L1o1K0N0l6j9K3km3qM8%j3N0j0o6P7km9J6O3p8j7L6L8p4ON8n6J6Kj6
$$ -65 -1 30 -31 -11 39 3 -16 7 5 -38 -46 2 2 -11 39 29 -37 40 38 -11 5 68 -10 -27 9 47 -27 -21 37 -19 -3 -1 -17
7779a7lK6k4K4J4nl3jO9l9k9L1%n4M7J0k6l8O2J5n4LK0j2OK3j9qM8l1j2PK5l6
$$ -17 -20 6 -18 6 20 15 -18 -19 50 11 -18 13 13 -41 6 16 -10 -48 14 29 -25 -22 -2 -14 -8 15 -4 -12 36 5 -7 0 25 -11
7813a1%K4J3n4K7Mj8j8K6K2l7QK9k4L3l2j9J6K2rl0J1M7m7J1L4l2l6M2J0l6L3
$$ -11 -11 13 26 -28 -1 3 -15 -33 -7 15 -22 -14 15 -9 24 -8 -27 -11 11 2 -28 -17 30 -17 -6 28 -4 -40 2 12 -24 9
7845Ij5K6j6K0j1k3M0k3J4j6NpL0pk9mMJ2j8lJ4Pk8LM4l6j5L2k5L6k0Kj9L6j8
$$ 9 -6 20 4 24 13 -10 30 7 21 5 10 3 33 26 -3 -7 -3 9 -9 -12 2 9 -19 -16 28 -8 -23 9 -16 20 0 2 -17 19 1
7880Aj4J6MojJ0j5j6RK3rk8N9l4Qj9ROMqmJK8j6jJ0M2o3k5K1Pl0K2nn6K6N1j0
$$ 1 -13 3 7 1 0 10 -5 -21 -12 11 2 -26 33 -1 7 -12 -3 3 7 -1 -5 -4 24 8 7 17 59 -4 -29 -8 -1 -31 -9 -14 -70 -44 7 -3
7918c%lJ7Kj9j8J4K5Qm9K3Qnl4L1Pk8L5mj6J8lJ1j0l1J9J9J0l6j2J4j2J1j0J4
$$ -3 -3 -6 11 13 -6 -24 -10 15 23 -26 -3 5 0 -34 -3 4 -24 11 7 -9 9 6 17 7 -24 -5 14 24 -12 -24 -10 -22 -11 -21 -7
7953gljOJ3KpJ6l5Lk2M9mn1M9rJ2QJk5L2Kk4k3L4Jm0K1Nk1j7L9J7m9K4J6k4L0
$$ -7 -10 -11 -5 8 10 3 19 -16 -13 -35 14 10 -41 8 -1 11 19 20 -5 27 29 5 -18 16 17 -23 -2 3 -18 -35 4 21 -28 -4 12 -12 18
7990A8rlpJ7k0j5M8k8l2N8J8o6%K5J1l6J8J9nPQk8j4M4k0j0N6k8o5M2K3l5KK7
$$ 18 9 6 -1 16 -4 -19 29 1 -31 27 45 -21 -21 4 15 -21 -3 16 11 18 26 -2 -16 28 8 -2 54 26 -39 3 26 -9 -7 20
8024B0Jl9L8rJ2j8QK9q3N1Qj7LJ8l7j2P7m4l8K7K6j8l0M5m0j8O0jl7K6K3l7K1
$$ 20 21 -18 20 11 23 5 13 42 -41 10 18 1 4 22 -15 -27 50 6 -32 -5 21 3 -27 18 -22 -40 20 19 -18 8 31 -6 15
8057A5j7J1k2J7mm9K4N9o3M5L4n2j0L4k4j4J3%lj6L6Pl3P4n0m3N1Rko5M7ol9N6
$$ 15 -2 9 -13 4 0 -49 -25 34 -29 16 50 -2 -12 22 -2 -16 -3 -3 -6 -22 14 21 -12 62 12 -31 20 29 27 -38 9 3 -36 20
8091B0J1l2m9P1k6j6N3J2n9NN2m8OL8n9PN9l7l2K3J6j9k6Q9l9n6L9J8l6j1N0k9
$$ 20 31 -1 -50 21 -5 -21 32 44 -15 -10 42 -6 0 38 -21 -14 45 8 -24 -1 15 -4 -30 59 20 -36 3 21 -15 -26 24 -5
8123ek8M0ll8N1%n1J7N8m9k0K1K7n9K3K7j7m2N0K3m8L9K2o2J8N2m9l2O9ol4K2
$$ -5 -33 7 4 -34 17 17 -34 -17 41 -8 -28 -7 20 -39 -16 11 -6 -48 2 25 -23 16 38 -24 -6 46 -3 -35 34 28 -6 16
8155A6N4r0J8K6j9o8R0j5o0M0M6m2k8O8l5m6N4J8m0J6L2m2k8M4k1j9L1K1m0jN1
$$ 16 70 -20 -2 24 5 -63 27 12 -48 -8 38 -4 -32 36 1 -45 9 27 -13 3 35 -7 -35 9 -12 -31 0 21 -19 -20 31
8186C1m3m5O8K7o9
$$ 31 -12 -57 11 38 -31
8191c1
$$ Imaginary data points
##PAGE= N=2
##DATA TABLE= (X++(I..I)), XYDATA
0@%%%%%%%%%%%%%%%%%%Mj2J6j6J6j6J6k4L2l2L5m3M8n2O0o8P5q3R3j02J13j28
$$ 0 0 0 0 0 0 0 0 0 0 0 0 0 0 0 0 0 0 0 4 -8 8 -8 8 -8 8 -16 16 -16 19 -24 24 -28 32 -36 39 -44 49 -53 60 -68
40f8J42j56J72j88K06k28K52k76L02l33L69m07M49m97N50o13O88p74Q78j007J165
$$ -68 74 -82 90 -98 108 -120 132 -144 158 -175 194 -213 236 -261 289 -324 364 -410 468 -539 626
61F26j369J645k025K582l469N029q246J7174q2566k47028L45272J81356l05826
$$ 626 -743 902 -1123 1459 -2010 3019 -5227 11947 -70619 -317647 27625 208981 -96845
74i6845k940K33443j40373j29246K27293R808k49178R6325K09807j59238j29147
$$ -96845 -99785 133658 -6715 -135961 91332 101140 -148038 -51713 158094 -1144 -130291
85a30291J52103Q721r8643J16666L8024j85348M1259J92609j31484j69029J84317
$$ -130291 21812 30533 -68110 48556 86580 -98768 -57509 135100 3616 -165413 18904
96A8904J10796j81200j4400J48110q7471j07267J54734O8998j58843k1874J07262
$$ 18904 129700 -51500 -65900 82210 -5261 -112528 42206 111204 -47639 -69513 37749
107C7749m5798n0634R7272J0820r2715L6950N7961q5525k4870J04059j0985r1796
$$ 37749 -8049 -58683 38589 49409 -43306 -6356 51605 -33920 -58790 45269 34284 -57512
119e7512N3759O7852r0158m1509J09607J7959j04176J2538Q9477m7497q6232O0075
$$ -57512 -3753 64099 -26059 -67568 42039 59998 -44178 -31640 57837 10340 -75892 -15817
131a5817P7698m9980m4398M8521J2297n4625k383M5806M569j7167l659j8797n330
$$ -15817 61881 11901 -32497 16024 28321 -26304 -28687 17119 21688 4521 862 -17935 -23265
144b3265M1301J1761l6487O546K1460m0771q868O3711j8003p6820N9167Q8550
$$ -23265 18036 29797 -6690 -144 21316 -19455 -28323 35388 17385 -59435 -268 88282
156H8282r1838q5655J05721N7119j04894j0684R3499l6031p0711O6765L1156p9937
$$ 88282 -3556 -89211 16510 73629 -31265 -41949 51550 15519 -55192 11573 42729 -37208
168c7208J9765Q3032n6736o8606O2784K2775n3053L6912L7652q1751j0194J00605
$$ -37208 -17443 65589 8853 -59753 3031 25806 -27247 9665 47317 -34434 -44628 55977
180E5977l0077r4718P3800O9455j06864l2486J15303j4242j02676N9963P9135
$$ 55977 25900 -68818 4982 74437 -32427 -64913 50390 36148 -66528 -6565 72570
191G2570q4826m2575Q5643m868p3712M2605M9012n8640j2015N4740k7675l6622
$$ 72570 -12256 -54831 30812 25944 -47768 -5163 43849 -14791 -26806 27934 259 -36363
203c6363N7929R727o8256K4923N7807o4583l7042R4431J1719j00536K1492Q7849
$$ -36363 21566 31293 -36963 -12040 45767 -18816 -55858 38573 50292 -50244 -28752 59097
215E9097n7048o5803Q2402L6242r3106l855Q7817k4598o7715M3629L8629m7265
$$ 59097 2049 -63754 18648 54890 -38216 -42071 45746 21148 -46567 -2938 35691 -11574
227a1574m415L8438k8113k2933M7455Q21m8358K7780L5114n2971j0610O6323k2600
$$ -11574 -15989 22449 -5664 -28597 18858 19679 -28679 -899 34215 -18756 -29366 36957 14357
240A4357o6887N6999N5553q4916l4974R8964Q450r3736K1866P3210m8018m3884
$$ 14357 -52530 4469 60022 -24894 -59868 39096 47546 -46190 -24324 48886 868 -43016
252d3016O1434J0639o0295K0110M6711l9981k1737M5263r131l5620L7209J2615
$$ -43016 18418 29057 -31238 -11128 35583 -4398 -26135 19128 9997 -25623 11586 24201
264B4201n6199J7013O0461m7399m9271P3479K6648q7876L561Q7002l5323p2190
$$ 24201 -31998 -14985 45476 -1923 -51194 22285 48933 -38943 -35382 51620 16297 -55893
276e5893O0566M7467p3278j7957P1761j0092n6960L0796L2024m0315m022L5467
$$ -55893 4673 52140 -21138 -39095 32666 22574 -34386 -3590 28434 -11881 -15903 19564
288A9564k1008j8266L7346o031m0746L2528L1503n5397j1644O9236j5089p0778
$$ 19564 -1444 -19710 17636 11605 -29141 3387 34890 -20507 -32151 37085 21996 -48782
300d8782M2557N9907o4254l9254P5928J3392p6073J1891O4386l2502m3906M3746
$$ -48782 -6225 53682 -10572 -49826 26102 39494 -36579 -24688 39698 7196 -36710 7036
312G036J9152m3110M405L1965k1108j3226K8206q700k4627K9356J1125m4037R782
$$ 7036 26188 -16922 -12517 19448 -1660 -14886 13320 4620 -20007 9349 20474 -23563 -13781
325a3781M9180l2999m3725N2922K8698o5957q094O9410j4535o2667L4626M7217
$$ -13781 35399 2400 -41325 11597 40295 -25662 -33756 35654 21119 -41548 -6922 40295
337D0295m7414k5975N0370M556m3183J2700K8262k2528q845K3178j0781j4484
$$ 40295 -7119 -33094 17276 21832 -21351 -8651 19611 -2917 -11762 11416 635 -13849
349a3849K5964j910l3369K1664L0874m0307j9732N3759K398n9553J8089N6912
$$ -13849 12115 10205 -23164 -1500 29374 -10933 -30665 23094 25492 -34061 -15972 40940
361D0940l7125m5594N0706K8033n5971p991N2557r925m1745K2309K5544k7575
$$ 40940 3815 -41779 8927 36960 -19011 -27002 25555 15630 -26115 -3806 21738 -5837
373e837p340K4243q808j3101J8798l879k0893K2291J5384l7366k514M6447j5517
$$ -5837 -13177 11066 2258 -10843 7955 4076 -16817 5474 20858 -16508 -19022 27425 11908
386A1908m7495L4877M0031n0355k4498N8484L814n8709J6679N0919l1974l5955
$$ 11908 -35587 -710 39321 -11034 -35532 22952 26766 -31943 -15264 35655 3681 -32274
398c2274L8740J5911l6756L367K6391j5879q701J9595j1729j5101K8736L417l7046
$$ -32274 6466 22377 -14379 -11012 15379 -500 -9201 10394 -1335 -16436 12300 15717 -21329
411b1329J5091L5567l6065k6213N1952J0356n8062R935N4956k9992m5804M2442
$$ -21329 -6238 29329 -6736 -32949 19003 29359 -28703 -18768 36188 6196 -39608 2834
423B834L1117m4288j1781L8219o110k7656J5883J4212j5288J011Q579j3176N63
$$ 2834 33951 -10337 -22118 16101 9991 -17665 -1782 12430 -2858 -1847 6732 -6444 -5881
436e881J6460j2718j0703K7091J504l8374P063L9983j6650l3842K7929K6291l5830
$$ -5881 10579 -2139 -12842 14249 15753 -22621 -15558 24425 7775 -26067 1862 28153 -7677
449g677j9471L6056J0442l0841J378K7483r451k6767R341K2738n592j4058M591
$$ -7677 -27148 8908 19350 -11491 -10113 17370 7919 -18848 -9507 13231 7639 -6419 -1828
462a828P173m746o580o25P177J0319m238j6584K169J6710q498j5881K2465J8379
$$ -1828 5345 599 -5981 -6606 571 10890 6652 -9932 -7763 8947 449 -15432 7033 25412
476B5412l4131j8211L8812Q199m1751P746M5852j9417m3765K3921K8545k7479
$$ 25412 -8719 -26930 11882 20081 -21670 -13924 31928 12511 -31254 -7333 21212 -6267
488f267p374L1118o824k6871J0863J0328j1510R684J0833k0151K80K0719k3759
$$ -6267 -13641 17477 10653 -16218 -5355 4973 -6537 3147 13980 -6171 -5891 14828 -8931
501h931j9267M5994J4970n3271N57M8374k6308m1612M6895L2250n1343j3160M3870
$$ -8931 -28198 17796 32766 -20505 -19948 28426 2118 -39494 7401 39651 -11692 -24852 19018
514A9018j2367l4397K8566K3036k5449l337J2187j9001q45K8125j0445j8173K7883
$$ 19018 6651 -27746 820 23856 -1593 -4930 7257 -11744 -12589 15536 5091 -13082 14801
527A4801M37m4871J3621M6272k6097l0802M2044J2798n4247l148M9566m086k9415
$$ 14801 15238 -29633 -16012 30260 4163 -26639 15405 28203 -26044 -29192 20374 16288 -13127
540a3127J6449J1708k4829n355J7227K110M26M091j0896n431R903o838q146K4626
$$ -13127 3322 15030 -9799 -15154 2073 4183 4609 8700 -2196 -7627 2276 -4562 -12708 11918
554A1918J1405l2521j1509K7780P00k3023J1993K4784j2351k3460L711J3606k95
$$ 11918 23323 -9198 -20707 7073 7773 -15250 -3257 21527 9176 -14284 -10573 3033 2738
567B738n388N402R732q520k1075M545K4146l216j6752J3067J1044k5521j2887
$$ 2738 -2650 2752 12484 3964 -17111 -12566 11580 8364 -8388 4679 15723 -9798 -22685
580b2685K4970J1956j3202j285N007p269l514J673k84J2689Q938k1751j1302K2562
$$ -22685 2285 14241 1039 -246 4761 -2508 -6022 -4349 -4633 8056 16994 -4757 -16059 6503
594F503j188k4401J9958K9469l0481k6630L1271R465l1987R760L3388j6997k5133
$$ 6503 5315 -19086 872 30341 -140 -26770 4501 13966 -18021 -8261 25127 8130 -17003
607a7003J4292O072j1698J1088R897j3957K00N615j9347K476L3236r150l0846
$$ -17003 -2711 3361 -8337 2751 12648 -1309 -1109 4506 -14841 -12365 20871 11721 -19125
620a9125K1861J8855l8967r395M6346R72l7876J3258K3461k8145j3211L1614O068
$$ -19125 2736 21591 -17376 -26771 19575 20547 -17329 -4071 19390 -8755 -21966 9648 15716
633A5716k0432L278O043j0981J904P042o833P929J3978k1668j7974K6234J0069
$$ 15716 -4716 -1438 4605 -6376 -4472 2570 -4263 3666 17644 -4024 -21998 4236 14305
646A4305k6608N926K8247j7940k7424K0897J8668j9871n225K0488k246j8985J63
$$ 14305 -12303 -6377 21870 3930 -23494 -2597 16071 -3800 -9025 11463 9217 -9768 -9605
659i605J0503L756n76m376j246N931m741j2416R799J8235j1100j6401J3079R169
$$ -9605 898 4654 4078 -298 -1544 4387 -354 -12770 -2971 15264 4164 -12237 842 10011
673A0011j7778m295K0493M595j6145m678R063J841o895q79R771N029j2595r824
$$ 10011 -7767 -12062 8431 13026 -3119 -7797 1266 3107 -3788 -4667 5104 10133 -2462 -12286
687a2286J3592R062j6027m040K0677k70k3348J999K0403l812j3677P481Q925q641
$$ -12286 1306 10368 -5659 -9699 10978 10708 -12640 -10641 9762 5950 -7727 -246 8679 38
701C8p441M222O324K005n440m807P754M049j4160k954K0393J626k2621K305K1080
$$ 38 -7403 -3181 3143 5148 -292 -5099 2655 6704 -7456 -10410 9983 11609 -11012 -8707 12373
716A2373r049j8333J4743J5342j5599j0495J3539M729j1333j454Q859K165n159
$$ 12373 3324 -15009 -266 15076 -523 -11018 2521 7250 -4083 -5537 3322 5487 328
729C28n455J502Q798p47j1725L300J4428p400j6276J0787J5638j3309j1929J6009
$$ 328 -5127 -3625 5173 4426 -7299 -3999 10429 3029 -13247 -2460 13178 -131 -12060 3949
743C949P650j7435m436J6282K350j3474j073J1019N39r830j537R247L524r075
$$ 3949 11599 -5836 -10272 6010 8360 -5114 -6187 4832 5371 -4459 -5996 3251 6775 -2300
757b300n186R556N466j1073m766J2725M278j3317l350J3319J919j3235l58J3084
$$ -2300 -7486 2070 7536 -3537 -8303 4422 8700 -4617 -7967 5352 7271 -5964 -6322 6762
771F762p54j2821J126J2452j394j2464J933J2577k721j2672L256J2385l574j1786
$$ 6762 6008 -6813 -5687 6765 5371 -7093 -5160 7417 4696 -7976 -4720 7665 4091 -7695
785g695M263J1335m884j0558N094R919m986r531M672R612m793j0005N082J0322
$$ -7695 -3432 7903 3019 -7539 -2445 7474 2488 -7043 -2371 7241 2448 -7557 -2475 7847
799G847n507j0681N945J0907o894j0811Q228J0222r097r251R890Q307j0322p322
$$ 7847 2340 -8341 -2396 8511 1617 -9194 -966 9256 159 -9092 798 9105 -1217 -8539
813h539J0527O294j0484n352R920M730r375m578Q894M485q658m602Q508M851q552
$$ -8539 1988 8282 -2202 -7554 2366 7096 -2279 -6857 2037 6522 -2136 -6738 1770 6621 -1931
828a931n152R245N380j0165n083J1198M562j2090l750J2739K644j3238j231J3149
$$ -1931 -7083 2162 7542 -2623 -7706 3492 8054 -4036 -7786 4953 7597 -5641 -6872 6277
842F277l15j2584J362J1687j992j0855K289J0038k235r272J968R037j343r194
$$ 6277 5962 -6622 -5260 6427 4435 -6420 -4131 5907 3672 -5600 -3632 5405 4062 -5132
856e132R63R731j018j0266J324J0787j970j1456K743J1849l931j1864N153J1451
$$ -5132 -4169 5562 4544 -5722 -4398 6389 4419 -7037 -4294 7555 3624 -8240 -3087 8364
870H364o327j0891P319J0218q004q890Q600P409q744o139Q436N309p641m786O502
$$ 8364 2037 -8854 -1535 8683 679 -8211 389 7798 -946 -7085 1351 6660 -981 -5767 735
885G35M542n731n014N126O490n168q183N822R172p464r186R975Q817j2414p555
$$ 735 5277 -454 -5468 -342 6148 980 -7203 -1381 7791 327 -8859 1116 9933 -2481 -10036
900a0036J4182M954j4777j389J4389j739j2894K937J0165k920o932K148M544m94
$$ -10036 4146 9100 -5677 -7066 7323 5584 -7310 -4373 5792 2872 -4060 -1912 2632 2138
914B138m077k504N252N702p168o766R944N266j3326k509J6271k25j6832L371J4677
$$ 2138 -1939 -4443 809 6511 -657 -7423 2521 7787 -5539 -8048 8223 7998 -8834 -5463 9214
929I214p217j1544R625Q688q989o032N955L411l314k149J872L916n72p377o84
$$ 9214 1997 -9547 78 8766 -223 -6255 -300 3111 -203 -2352 -480 3436 2864 -4513 -5197
944e197J0197J83j1043L206J1288p311j1701R118J0559q837p116Q519L529q906
$$ -5197 5000 5183 -5860 -2654 8634 1323 -10378 -1260 9299 462 -6654 1865 5394 -3512
958c512k832P944M493n265n425L914N034n843n382R240P085j0504p062R773L562
$$ -3512 -6344 1600 6093 828 -4597 -683 4351 -1492 -6874 2366 9451 -1053 -8115 1658 5220
973E220r691L07J0225j164q610o76M411J850j606k053L142M054p081p764R979
$$ 5220 -4471 -4164 6061 4897 -3713 -4389 22 1872 266 -1787 1355 5409 -1672 -9436 543
988E43R176j1577n267J4359r07j7499M657J6758o162j0871Q342L828j0498m52
$$ 543 9719 -1858 -7125 7234 6327 -11172 -6515 10243 4081 -6790 1552 5380 -5118 -5570
1002e570Q001M9n58O89o265l54P821m593n995J3337M670j9401k206J9193m909
$$ -5570 2431 2480 1922 2611 -3654 -4008 3813 -780 -6775 6562 11232 -8169 -10375 8818 3909
1017C909j5738J4060J2722j8577q770J5969J255j0933O439P368q187l353L129
$$ 3909 -11829 2231 14953 -3624 -12394 3575 4830 -6103 336 7704 -483 -3836 -707
1030g07l145L351Q439p150o625J0370j177j5179Q411J7742j1669j3377J3868M216
$$ -707 -3852 -501 7938 788 -5837 4533 3356 -11823 -3412 14330 2661 -10716 3152 7368
1044G368j7367K298J7966l707j1922M068L348n748O76M951P19J446k109q453J871
$$ 7368 -9999 -7701 10265 6558 -5364 -1296 2052 -3696 -3020 1931 2650 4096 1987 -6466 -4595
1059d595R534m079n686J0419K669j5431k217J3982p5q949N172O394p949o693M549
$$ -4595 4939 860 -4826 5593 8262 -7169 -9386 4596 4521 -4428 744 7138 -811 -7504 -2955
1074b955N650J135k627k647K675M13p693N67J2786L37j2596J550Q595p480o430
$$ -2955 2695 3830 1203 -1444 1231 1644 -6049 -5482 7304 7641 -4955 -3405 5190 -2290 -8720
1089h720J1574O074r203l425L662j492q96K950Q34K040J075q587l932J1445K215
$$ -8720 2854 8928 -275 -3700 -38 -1530 -2426 524 1358 3398 4473 -4114 -8046 3399 5614
1104E614j1306N123J1985j2376j2504J4302Q361j3136qJ2563o520j1423P157O192
$$ 5614 -5692 -569 11416 -960 -13464 838 9199 -3937 -3945 8618 2098 -9325 -2168 4024
1118D024m542J687K513n864K37L641n952J046J2608m407j4585P902J0131j3643
$$ 4024 -518 1169 3682 -2182 -1945 1696 -4256 -3210 9398 4991 -9594 -1692 8439 -5204
1132e204m073J8682j67j8123L870J2109q699o069J1943K814r506k29K966k816
$$ -5204 -9277 9405 9238 -8885 -5015 7094 -1605 -7674 4269 7083 -2423 -2652 314 -2502
1146b502K533L623m679O66N480p314o573J1469N350j2144l32J1949n804j1987
$$ -2502 31 3654 -1025 -359 5121 -2193 -8766 2703 8053 -4091 -4423 7526 1722 -10265
1160a0265Q829R992q281n183P323O93p000M55N521J122k057k296o48K581j23l851
$$ -10265 -1436 8556 275 -4908 2415 3108 -3892 -3437 2084 3206 1149 -1147 -1795 786 663 -3188
1176c188K642O185l950p284L795N765m458l469O064K872o461l405M962L423l618
$$ -3188 -546 5639 1689 -5595 -1800 3965 -493 -3962 2102 4974 -1487 -4892 70 3493 -125
1191a25k630M446K626o285l630P022L695o794j911O821m53p376J699O603j610
$$ -125 -2755 1691 4317 -1968 -5598 1424 5119 -1675 -3586 3235 2782 -4594 -2895 3708 2098
1206B098m183J442J796r80j246n46K239L104l355m893M666M633o970k926R610
$$ 2098 -2085 -643 1153 173 -1073 -1619 620 3724 369 -4524 142 4775 -2195 -5121 4489
1221D489P49j0887J491R941m207p697O546N493p283l198N978R21l601P55J289
$$ 4489 5238 -5649 -4158 5783 1576 -6121 425 5918 -1365 -4563 1415 2336 -1265 -510 779
1236G79m80O83j580k182M131K521o286j370P856j186q902M033Q757o286p049P673
$$ 779 299 982 -598 -2780 1351 3872 -2414 -3784 4072 2886 -6016 -1983 6774 488 -6561 1112
1252A112M452q286j868P884J11o296J015M175j371k295P10J099Q46p18k698R09
$$ 1112 5564 -2722 -4590 3294 3405 -2891 -1876 2299 928 -1367 -657 442 1288 570 -2128 -1219
1268a219M029j773m852L355N029n108m524O487L475p292j862P626K92p482J136
$$ -1219 2810 1037 -3815 -460 4569 -539 -5063 1424 4899 -2393 -4255 3371 3663 -3819 -2683
1283b683O745k190n553K678M148k704l012K087K225j127j863M8K044R24k761j533
$$ -2683 4062 1872 -3681 -1003 3145 441 -2571 -484 1741 614 -1249 -1201 843 1767 -994 -2527
1299b527L996J641n206j097O249R5o907J210P037k803o520M104N410m973l986
$$ -2527 1469 3110 -2096 -3193 3056 3151 -3756 -2546 4491 1688 -4832 -728 4682 -291 -4277
1314d277N168K584m818j363L917O68k705m95J455J057m65k121J85L340n60m365
$$ -4277 891 3475 -1343 -2706 1211 1879 -826 -1321 134 1191 726 -1395 -1210 2130 1570 -2795
1330b795J327N051k584n311L999M870n356l796O198K457o440j066O230k05n431
$$ -2795 -1468 3583 999 -4312 -313 4557 -799 -4595 1603 4060 -2380 -3446 2784 2579 -2852
1345b852J198M288j531l013J218J912m13j340o80J364J678j924k544K897K928
$$ -2852 -1654 2634 1103 -1910 -692 1220 807 -533 -1213 151 1829 -95 -2639 258 3186
1360C186m181k662N464J735o284l93O565r44o251K270N431l269m204L626K821
$$ 3186 -995 -3657 1807 3542 -2742 -3135 3430 2486 -3765 -1495 3936 667 -3537 89 2910
1375B910l325j646K403R87j416r18L71J448M29k359p47L435M74m381M94M989j601
$$ 2910 -415 -2061 342 1329 -87 -1005 -634 814 1243 -1116 -1863 1572 2046 -2335 -1841 3148 1547
1392A547n083K680M600l514l839M226K802m473j986M190J191l532o74K957M84
$$ 1547 -3536 -856 3744 230 -3609 617 3419 -1054 -3040 1150 2341 -1191 -1865 1092 1576
1407A576k605n68K163R83j719j287J552J588j801j916K228K324k505k644K803
$$ 1576 -1029 -1597 566 1549 -170 -1457 95 1683 -118 -2034 194 2518 13 -2631 172
1422A72K506l570k089M435J664m992j050M982M4m764J329M406k139l636K257K287
$$ 172 2678 -892 -2981 1454 3118 -1874 -2924 2058 2102 -2662 -1333 3073 934 -2702 -445 1842
1438A842j905q61J357K24m35n52j079J221K373k092k659L487J787n285m39O492
$$ 1842 -63 -924 433 657 222 -330 -1409 -188 2185 93 -2566 921 2708 -2577 -3016 3476
1454C476q81o292K615N027m501l481N507J939m868k27L158j383j507J720J69l82
$$ 3476 2595 -3697 -1082 3945 -556 -4037 1470 3409 -1459 -1686 1472 89 -1418 302 471 89
1470H9J081j736k030L385J594m407O00N253k990n561M507M343n107j860N552m21
$$ 89 1170 -566 -2596 789 2383 -2024 -1424 3829 839 -4722 -215 4128 -979 -2839 2713 2292
1486B292n491J378L933j471j552J475j51r47J85o82N74K669j032l480J753K703
$$ 2292 -3199 -1821 2112 641 -911 564 413 -534 -349 -1031 -457 2212 1180 -2300 -547 2156
1502B156l311j507M969Q08n031k28L716j126k542K158K296j701k139J35J425P14
$$ 2156 -1155 -2662 2307 3115 -1916 -2144 1572 446 -2096 62 2358 657 -1482 -1347 78 792
1518G92j049l18K195j93l766J07M098l12l054J736K119l116j977K804J561j286
$$ 792 -257 -575 1620 1427 -2339 -2232 1866 1554 -1500 236 2355 -761 -2738 66 1627 341
1534C41l29M9l67J11q89j40L027P14m179m91M050j477l694L992L575m964k530
$$ 341 12 61 -306 -195 -1084 -1224 1803 2517 -1662 -2153 1897 420 -3274 718 4293 -671 -3201
1551c201M345ml497K188K982k516j619J173p69O4K379r43j646K521m99m509K218
$$ -3201 1144 1140 -2357 -169 2813 297 -1322 -149 -918 -854 1525 582 -1064 1457 958 -3551 -1333
1568a333N159l198l526M695Q84o225R02O030j850l815K975J071l810L24K872o49
$$ -1333 3826 628 -2898 1797 2681 -3544 -2642 3388 1538 -2277 698 1769 -2041 -1717 1155 506
1584E06l21J139k149j089K852l63k529L168K208n103j587N071k63m112K731L435
$$ 506 185 1324 -825 -1914 938 575 -1954 1214 3422 -1681 -3268 1803 1540 -2572 159 3594
1600C594m017k677L355Q51k083J107J335j376o97J6n52J421J642j931j127K295
$$ 3594 -423 -3100 255 1106 -977 130 1465 89 -608 -592 -1144 277 1919 -12 -1139 1156
1616A156o52l081J995L477k263k487K260O67k640K69K613Rj548m34K47L56N5n35
$$ 1156 504 -2577 -582 2895 632 -1855 405 1072 -1568 -1299 1314 1323 -225 -659 -412 -56 -1 -536
1634e36Q28J542j652k334J836J907k076n80K746l71l099M62K202n05q09Q73P6
$$ -536 292 1834 182 -2152 -316 1591 -485 -1065 1681 1310 -1789 -1327 875 370 -439 434 510
1651E10o70l27n04P35J755q54j957J488J262k775m78L718o4l541R18K442k096
$$ 510 -160 -487 -991 -256 1499 645 -1312 176 1438 -1337 -1815 1903 1839 -1702 -784 1658 -438
1668d38j463K623Q54k006j72P73n66J23O83n98L97J020j803j231K562P73k819
$$ -438 -1901 722 1576 -430 -602 171 -395 -272 411 -187 210 1230 -573 -1804 758 1531 -1288
1685a288N76K865j888k788K531J982k596o43K438l98k162P48J308m63k23J74m04
$$ -1288 -712 2153 265 -2523 8 1990 -606 -1249 1189 791 -1371 -623 685 222 -1 173 -231
1702b31K67L47j074J93J872p27k156J253J678j876j080K451N30k480q7J982l93
$$ -231 36 383 -691 -498 1374 647 -1509 -256 1422 -454 -1534 917 1447 -1033 -1120 862 469
1719D69j420P13J121n81q83J32P33J77n69l04P97L07j242l50J484K56j493K7J386
$$ 469 -951 -238 883 302 -581 -449 284 461 -108 -412 385 692 -550 -900 584 840 -653 -626 760
1738G60l37j375M60J346l83j236M11J085m37j091N29J219o00j209O46J093q34
$$ 760 423 -952 -492 854 471 -765 -354 731 294 -797 -268 951 351 -858 -212 881 47
1755D7r15R15P50r11o78P81N61o49m55N38N61m29p30M30R27n25r71P15R86j014
$$ 47 -868 47 797 -114 -792 -11 550 -99 -554 -16 545 116 -614 -184 743 218 -753 -38 948 -66
1775f6r43J237P69j382m88J400J45j295N3J093j37q60J04P34n5n18j49N63L12
$$ -66 -1009 228 997 -385 -873 527 672 -623 -570 523 386 -474 -370 364 309 -209 -358 205 517
1794E17o46m64Q23M84j073l43J162K17j340LJ328k03j276M19J132n32r25N76P82
$$ 517 -129 -593 230 714 -359 -702 460 677 -663 -660 668 465 -811 -392 740 208 -717 -141 641
1813F41n46n84M12N54l49n13K23N85j72o80J32P57k04q36K79R17l89r97O33Q94
$$ 641 95 -489 -77 477 128 -385 -162 423 251 -429 -297 460 256 -580 -301 616 227 -770 -137 757
1833G57p34p75Q99O00q81m89Q80L39q42k54P26J83o15j98N32K31m77l64N05M25
$$ 757 23 -752 147 747 -134 -623 257 596 -246 -500 226 409 -206 -404 128 359 -118 -482 23 448
1853D48n56m52P08M45q15l66Q98L02r60j70R75L8r55O6Q99k29p73K32O83k27n86
$$ 448 -108 -560 148 593 -222 -588 310 612 -348 -518 457 495 -460 -394 505 276 -497 -265 418 191 -395
1874c95J78N61j30n35R9N37m4n56L2O31n2p19J06P40j74p70K37Q35m31q11N63
$$ -395 -217 344 214 -321 -222 315 271 -285 -253 378 326 -393 -287 453 279 -491 -254 581 150 -661 -98
1895i8O74o18n41O71M03o64k44N60K32m49j85L46J36k11l20K49M29k98n59M01
$$ -98 576 -42 -583 88 491 -173 -417 143 375 -74 -259 87 223 12 -308 -59 370 72 -487 -86
1915h6O00o10n03P59M31q80l03R29O7p98J41O75k11n53K05L54o8k34p4K33J60
$$ -86 514 -96 -599 160 591 -289 -592 337 404 -394 -253 422 211 -342 -137 217 149 -85 -159 74 234
1936B34m00k80N94L32p50j57Q04q6q29K82Q41l85o20M18L66m23k71L64K64j66
$$ 234 -166 -446 148 480 -270 -427 377 291 -538 -256 585 200 -420 -2 364 -59 -330 34 298 132
1956A32l35L2L11l2m31J73O16l09o83L79O02m90l86O74K09p10j18N17O2k76l0
$$ 132 -203 -171 140 108 -323 -150 466 157 -526 -147 455 -35 -421 253 462 -248 -366 151 213 -63 -93
1977i3J81N4k06k87K31N08k83n32M68L70p63j78R63O6q09J23N40l73l69M66K75
$$ -93 88 142 -64 -351 -120 388 105 -427 41 411 -352 -530 433 499 -310 -187 353 -20 -389 77 352
1998C52k62j24p4k8K14n3k82M01L36p59l32R11J03q55L60P76p02o61P48L71n90
$$ 352 90 -34 -108 -136 78 25 -257 144 480 -279 -611 300 403 -452 -92 684 -18 -679 69 440 -150
2019a50K1M79k91l15J44L0J20L16l50l33M65M3o77L14R21n50p67O50L78q33J8
$$ -150 -129 350 59 -256 -112 -82 38 354 4 -329 136 179 -498 -184 737 187 -580 70 448 -385 -367
2040c67R35k05o94K11K38k64N3K38q5M7m8m87J37O53k32n23O26K52r49j15J012
$$ -367 568 363 -331 -120 118 -146 -93 145 60 107 59 -428 -291 362 130 -393 233 485 -464 -579 433
2061D33p1o98L70L65o16k32N07J27j03Pj12j37J80j38j64N66K14p82j29P05j80
$$ 433 362 -336 34 399 -217 -449 58 185 82 89 -23 -160 20 -118 -282 284 498 -284 -413 292 112
2082A12n69N98N72p61m14N21P8l05J85K78k16j34j26j00L54K42m52J0N22m52o12
$$ 112 -457 141 713 -48 -462 59 137 -168 17 295 79 -55 -181 -281 73 315 -137 -127 395 -57 -669
2103f69O99N84o53k67O49j83o63L10N73k10k41J02j05r4J33l5J32L16k94n55L99
$$ -669 30 614 -39 -306 343 160 -503 -193 380 170 -71 31 -74 -168 -35 -70 62 378 84 -471 -72
2124g2M47n89n5Q10j99q66K43O59l69l12N51M7n09n0K22J3J39k8j85J47J07m59
$$ -72 375 -214 -269 541 342 -524 -281 378 9 -303 248 295 -214 -264 -42 -29 110 82 -103 44 151 -308
2146c08n1P54k7p28K42N20n19m19P65K73o39j19M08j47k19J92J86j8n7k71n2M04
$$ -308 -359 395 368 -360 -118 402 -117 -536 229 502 -137 -256 152 5 -214 -22 164 146 89 -182 -234 170
2168A70l7l79L24L98n73m17O20K58n69L3N32k32n28K52L37q6j39PP3Oj85j03L54
$$ 170 133 -246 78 476 -97 -514 106 364 -205 -172 360 128 -400 -148 189 103 -36 -29 44 50 -135 -238 116
2191A16K74m72k02M86K1n78J86O10k63n41K71L50l40j58L17J59k11j81K9J86N7
$$ 116 390 -82 -284 202 223 -355 -169 441 178 -363 -92 258 -82 -240 77 236 25 -156 -127 59 116
2212A16k60N4L79j55m98J97N74l05m33M17K43m79k18N10J48m04m4K28M2k03j01
$$ 116 -144 -90 289 134 -364 -167 407 102 -331 86 329 -150 -368 142 290 -114 -158 70 112 -91 -192
2233a92K21K16k06l11K83K82l72k12M76J72n24j43N12%m58O3M32q3l63N6K87m
$$ -192 29 245 39 -272 11 293 -79 -291 185 357 -167 -310 202 202 -256 -193 239 156 -207 -151 136 132
2255A32k57j0L04K3l52n6L98O5m63K5M66j49m31J89M11k32l62K03L39k21k72J81
$$ 132 -125 -135 169 192 -160 -216 182 247 -216 -191 275 126 -305 -116 295 63 -299 -96 243 22 -250 -69
2277f9K85j21l28J40L49j76l44J97L88k68l48K91L14l43k76L59K29l31k18L34
$$ -69 216 95 -233 -93 256 80 -264 -67 321 53 -295 -4 310 -33 -309 50 279 -52 -270 64
2297F4J91l10k01L39J80k75k34L20K01l50k36M22J46l99j32M21R5m43l4M01P7
$$ 64 255 -55 -256 83 263 -12 -246 74 275 -75 -311 111 257 -142 -274 147 242 -201 -235 166 243
2318B43m36J1L77ll89lL73N6m44K6M35k4m58N8M26q9l94O5M46j25l99J06M05j57
$$ 243 -193 -182 195 192 -197 -200 173 229 -215 -189 246 222 -236 -178 248 159 -235 -170 276 151 -248 -142 263 106
2342A06l69J26M08j65l96K35L49k09l65K25L55k54l54K82L27l04l04K90L16l22
$$ 106 -263 -137 271 106 -290 -55 294 85 -280 -55 300 46 -308 -26 301 -3 -307 -17 299 -23
2362b3k94L24K56k88k55L16K67l62k31L74K38l83k04L78J63l67k38M63J50m07
$$ -23 -317 7 263 -25 -280 36 303 -59 -290 84 322 -61 -265 113 276 -91 -329 134 284 -123
2382a23j84M38J13m19p8L98P0l59o8L72N7l81o4M04Q9m31o2M22N3m75nN03p9m80
$$ -123 -307 131 244 -175 -253 145 215 -144 -212 160 217 -164 -228 176 265 -166 -228 194 247 -228 -233 270 191 -289
2406b89J11M56j95l67K14L38j98l04J68K62r3k99J37K86j08l79P8M89j50m62K14
$$ -289 -178 278 83 -284 -70 268 70 -234 -66 196 103 -196 -59 227 119 -260 -182 307 157 -305 -91
2427i1M57l35m45M23L47l98k74L76J98l42j31K93J48j88k29J53K56j98l10K93
$$ -91 366 31 -414 9 356 -42 -316 60 258 -84 -215 78 226 38 -191 -38 218 20 -290 3
2447CL50l62l98M62K70m95j36N60M8n36kM21mk91QK61kk81j53L20K44l38k23M30
$$ 3 353 -9 -407 55 325 -170 -306 254 302 -234 -236 185 181 -110 -102 159 157 -124 -277 43 287 -51 -274 156
2471A56J36n98m1O62k4o06J77M53l00l51L25K69j48k18kJ53L8k07n7M12Q1n79
$$ 156 292 -306 -347 315 291 -315 -138 315 15 -336 -11 258 110 -108 -110 43 81 -126 -183 229 310 -269
2493b69q1O34r9n65L51N36n47m31M95K74m04k4L49p0k63k7L5K12J22l34p7M60
$$ -269 -350 284 185 -380 -29 507 -40 -471 24 298 -106 -130 219 149 -114 -141 -106 106 228 -106 -183 277
2515B77k15n87M07P01n27n28O09K19p70O2P70j17n06R6K06j75OQ6N3J63j26m93
$$ 277 62 -525 -118 583 56 -472 137 356 -414 -352 418 301 -205 -109 97 -78 -72 14 67 230 104 -389
2537c89J58N76l27m31O80K41r22j15Q70p0n64L32M25n33l15L63J24m6L8q7q7J77
$$ -389 -231 345 18 -413 267 508 -414 -529 341 271 -293 39 464 -69 -384 -21 103 57 95 8 -79 98
2559I8k72k15O10L36p26k41P05j87o82N68O56o16m44M43J21m12J74L59j17j21
$$ 98 -174 -389 221 557 -169 -410 295 108 -574 -6 650 34 -410 33 154 -258 -84 275 158 37
2579C7j56j97K94K84l43m3N64k98p77M57O89m77l66O62J6p73O3N86m0k34J42q0
$$ 37 -119 -316 -22 262 -81 -124 440 142 -635 -178 511 34 -332 330 346 -427 -364 222 182 -52 90 10
2601A0j21P0j24N4M94j05p04K47N16n07l20Q43J93q92k8O70k36m13M64K72l70
$$ 10 -111 -41 -165 -111 383 278 -426 -179 337 -170 -490 353 546 -346 -374 296 60 -353 111 383 13
2622A3j60K5k3J98J35k67J24K85n27l56P33L23p40j3O95l70p20N82N59m82k42
$$ 13 -147 -122 -145 53 188 -79 45 330 -197 -553 180 503 -237 -250 445 75 -645 -63 496 14 -228
2643b28M06j05k95J07J29Q1J44k39l04K94K37n18L7P43k38q34M08N98n31k47O47
$$ -228 178 73 -222 -115 14 95 239 0 -304 -10 227 -291 -254 489 251 -583 -175 423 -108 -355 292
2664B92J12o26o9L67k1p8P2OL9o7l07Q4N25j17n19L03L70n34l05O85K35o53l2
$$ 292 404 -222 -291 76 55 -23 49 55 94 27 -280 -196 329 212 -307 -4 366 -168 -473 212 447 -206 -238
2687b38M93j84l75K44K59p7j69p5M2K16j44k38L58K45n18k64N76J18n25Q5N61
$$ -238 255 71 -304 -60 199 122 -47 -122 -80 136 -8 -246 112 357 -161 -425 151 269 -256 -171 390
2708C90k27n23K43L58k04j74J61Q4l5k27n1L23J19l45j10M38n0n34J73O02k44
$$ 390 163 -360 -117 241 37 -137 24 108 73 -154 -205 118 237 -108 -218 220 170 -364 -191 411 167
2729A67n50L60L62m22k35M33J52l10j35J54J09p8j41P7K85r9m36J64M64k75l60
$$ 167 -383 -23 339 -83 -318 115 267 -43 -178 -24 85 7 -134 -57 228 129 -307 -143 321 46 -314
2750c14L49L32m59k64M93J57m39o7L82J3l28m5K68P2j91j50J96K03k80k16L80
$$ -314 35 367 -92 -356 137 294 -145 -212 170 183 -145 -190 78 150 -41 -191 5 208 -72 -288 92
2771I2K34m15k26M57J26m72o7M93qm53P4L34n6l02N7L11n1l06J5L22K7l27JL68
$$ 92 326 -89 -315 142 268 -204 -271 222 214 -239 -165 169 113 -189 -132 179 128 -178 -163 159 186 -141 -140 228
2795B28o0l91Q1L70r7l73J38L76j70l51J48L49j67l31J60L18j60l06J73K95k15
$$ 228 168 -223 -142 228 131 -242 -104 272 102 -249 -101 248 81 -250 -90 228 68 -238 -65 230 15
2816A5k69K21K67k22k61K23K90k67k53K45K05k22k26K52K18k27k50K51K54k91
$$ 15 -254 -33 234 12 -249 -26 264 -3 -256 -11 194 -28 -254 -2 216 -11 -261 -10 244 -47
2836d7k10L17J91l24j92L51J41l66q7L65N4l49n8L23P5l51j9L02O5l07m9K98P1
$$ -47 -257 60 251 -73 -265 86 227 -139 -226 139 193 -156 -214 109 184 -167 -186 116 181 -126 -175 123 194
2859A94l46o3L79L5l55l0L68J1m19M7L97p3l70R5L34j02k98J02L03j06k83Q2K80
$$ 194 -152 -215 164 199 -156 -186 182 193 -226 -179 218 145 -225 -130 204 102 -196 -94 209 103 -180 -98 182
2882A82p8k89R4K94p8l65J45L46j66l41J68L62k60k99K53K89k46k27K34J63j86
$$ 182 104 -185 -91 203 125 -240 -95 251 85 -256 -88 274 14 -285 -32 257 11 -216 18 181 -5
2903ek12J98K29k10k54K11L11k67k73K97K45l36k07L22J64k79j13K62J17l04j01
$$ -5 -217 -19 210 0 -254 -43 268 1 -272 25 270 -66 -273 49 213 -66 -179 83 200 -104 -205
2924b05K64J19k15j40K39J69l01j80L62J56l82j41M24K2m33O0M13r6l25N1K48
$$ -205 59 178 -37 -177 62 231 -70 -250 112 268 -114 -255 169 191 -242 -182 231 135 -190 -139 109
2945A09m7k00J4K20O9k99o8L02R1l36l9M32l5n40J66M71k00m00L04K30l18k02
$$ 109 62 -138 -124 96 165 -134 -202 100 191 -145 -184 248 213 -327 -161 310 110 -290 14 244 -74 -276
2967b76K94J44j45p8K5P5L5k44j0M18m6m57R8M49k68m09M41L64n15k27M26N7l31
$$ -276 18 162 17 -61 -36 39 74 -170 -180 238 192 -265 -167 282 14 -395 46 410 -105 -332 94 151 -180
2990a80N7L12o6j83o2L5J85J3k66O0L84k69m29L99M06m80k01N59oo21J07M82j15
$$ -180 -123 189 123 -60 -122 -87 98 111 -155 -95 289 20 -409 -10 396 -84 -285 274 268 -353 -246 236 121
3013A21k62J74N6j35o0j8J50K00j44l47K34K79m40j35O20K4o36Q0N04k82l10L96
$$ 121 -141 33 89 -46 -106 -124 26 226 82 -265 -31 248 -192 -327 293 317 -319 -239 265 -17 -327 69
3035F9K43l71j25J50JN8J5r9J07J68m09j94N78J32n75J01N40m05m95N45L71m67
$$ 69 312 -59 -184 -34 -33 25 40 -59 48 216 -193 -387 191 323 -252 -151 389 -16 -511 34 405 -62
3057f2q0L31j28l08J50J40M0O6j52k25K57J19m16J36N91l39o14M57L63n47m1O30
$$ -62 -142 189 61 -247 -97 43 83 149 -3 -228 29 148 -268 -132 459 120 -494 -37 326 -221 -262 368
3079C68j12o09J72L31k01j5K05j01n3M7k72L4N03j10m46K91L03o20j68P64M7o67
$$ 368 256 -353 -181 150 -51 -66 139 38 -15 32 -240 -206 297 187 -259 32 335 -285 -453 311 358 -309
3101c09J77M57l97l15M60J62k41L4l5j43J26P0k37K85K70m97l02N90J19o07K24
$$ -309 -132 325 -72 -387 73 235 -6 28 -7 -150 -24 46 -191 94 364 -133 -435 155 274 -333 -109
3122a09N85m00n65M59K76l57pL78j76k07N5k3R9K41k14k20L29Ln34K05O55l22
$$ -109 476 76 -489 -30 246 -111 -118 260 84 -123 -68 -91 8 249 35 -185 144 147 -387 -182 473 151
3144A51n25M07K40n23o5N52Kl63J2J41j14L1N3J5J31l7l83P2M57j81l96M33L07
$$ 151 -374 33 273 -250 -315 237 239 -124 -112 29 -85 -54 -1 14 145 108 -275 -203 254 73 -323 110 417
3167D17o39j70N80M3m35J62L26k82k46J78J38k6L6j07k6J58j62k28L54L06n00
$$ 417 -222 -392 188 231 -204 -42 284 2 -244 -66 72 46 82 -25 -51 107 -55 -283 71 377 -123
3188a23j91M91L1n57K35M89k80l88L03J22k37OJ83j5k0j12j09J77J34k26q1L68
$$ -123 -314 177 208 -349 -114 375 95 -293 10 132 -105 -99 84 69 49 -63 -172 5 139 -87 -168 200
3210B00l2n02J45M90k23l45L20K16l93j36L59O8k10kO8J5l2j22N5K40r4k90J03
$$ 200 168 -334 -189 301 78 -267 53 269 -124 -260 99 167 -43 -45 23 38 6 -116 -61 179 85 -205 -102
3233a02L44k79k87L98K15l86j74L99L8l22M7K75o3k11m9J78J02j27j40J74J68
$$ -102 242 -37 -324 74 289 -97 -271 128 166 -156 -109 166 103 -108 -157 21 123 -4 -144 30 198
3254A98k68j77K91J84l31p5L39j1l37M2L29p8k55O9J94q5j54O0J62kj94m7K63
$$ 198 -70 -247 44 228 -103 -178 161 150 -187 -145 184 106 -149 -80 114 29 -125 -65 97 95 -99 -146 117
3277A17nk98M3L28n2l55R7L19j19k61J69K18j94j97J68J88j46j83J14K04j19k18
$$ 117 112 -186 -143 185 133 -222 -125 194 75 -186 -17 201 7 -190 -22 166 20 -163 -49 155 36 -182
3299a82R7K73j09k83J82K22k16j94K32J71k17j68K36J26k16j34K49R4k04j08K10
$$ -182 -85 188 79 -204 -22 200 -16 -210 22 193 -24 -192 44 170 -46 -180 69 163 -41 -149 61
3320F1J12j98j60J92J82k45j46K50J41k78q4K45R8k65p7K83L6k88K1K36Jk24k2
$$ 61 173 -25 -185 7 189 -56 -202 48 189 -89 -173 72 170 -95 -172 111 147 -141 -120 116 117 -107 -129
3343a29K17L0k48J4K22K7k68lK94k8k88M1L08n4k95O2K76j10k49J01K55j08k74
$$ -129 88 118 -130 -116 106 133 -135 -138 156 128 -160 -119 189 135 -160 -98 178 68 -181 -80 175 67 -207
3366b07J38K40j17k12R5K41j23k21J06K44j30k47J74J95j72j88J83J80j56k02
$$ -207 -69 171 54 -158 -63 178 55 -166 -60 184 54 -193 -19 176 4 -184 -1 179 23 -179
3386a79J49J93j48k11J84J80j91j66K04K01k36j37K04J51k44j05K29Q6k38q6K28
$$ -179 -30 163 15 -196 -12 168 -23 -189 15 216 -20 -157 47 198 -46 -151 78 164 -74 -160 68
3407F8P4k21o9J96R8k02j09K21J19k55j05K92P1l03m9L33j2k85JK89o4k24R2J67
$$ 68 142 -79 -148 48 146 -56 -165 56 175 -80 -185 107 178 -125 -174 159 147 -138 -137 152 88 -136 -44 123
3431A23l7j93M1J65L5k02o4K08L9k65mL29l3l58J01L33k02k22J97J97j93j99J77
$$ 123 86 -107 -66 99 134 -68 -132 76 115 -150 -154 175 142 -216 -115 218 16 -206 -9 188 -5 -204 -27
3454b7J56j39o8N6J23n0j79JK95o7k95J24L14k45k78K88K42l21q5K73J9k46k6
$$ -27 129 -10 -78 -22 101 51 -128 -127 168 101 -194 -70 244 -1 -279 9 251 -70 -155 118 137 -109 -135
3477a35K01Lo0q1M3R7m2j85J14L12k63k77L09J52l24n7M13o7l50Q1K47j27j13
$$ -135 66 69 9 -72 -29 68 26 -159 -45 267 4 -273 36 188 -136 -193 220 153 -197 -116 131 4 -109
3500a09J36P4p6n7j05Q3K32j63j99K46J51m07o0M89n3m18J67L06k83j97L04J33
$$ -109 27 101 25 -32 -137 -54 178 15 -184 62 213 -194 -254 235 182 -236 -69 237 -46 -243 61 194
3522A94k10n3O9l3O4m6o3J81J30l60j39L94K2m23K26M13l57l93L83K24l64M7K74
$$ 194 -16 -69 0 -33 31 -15 -78 103 233 -127 -266 128 150 -273 -47 366 9 -384 -1 223 -141 -94 180
3545A80r5j99O4qN2J32q7j84K37K0l81J45M81k67m21L93K24n16k9N39n4m04J56
$$ 180 85 -114 -50 -58 -6 126 39 -145 92 112 -269 -124 357 90 -331 62 286 -230 -259 280 226 -178 -22
3568b2J39j83k4J44l1P4kk74J2L49j11l42L62K38n17j57N23K1m40K20L43l27k58
$$ -22 117 -66 -90 54 23 97 95 -179 -167 182 71 -271 91 329 -188 -345 178 199 -241 -21 322 -5 -263
3591b63K72Q7j05L9Pp2R8r8j89K80K96m26j84M43o1m77K59M64k92l32K78J27l29
$$ -263 9 96 -9 30 37 -35 63 -35 -224 56 352 -74 -258 185 124 -353 -94 370 78 -254 24 151 -178
3614a78N8K94j01r5j0j03O3K05j54j38L76l1n20J31N30k87l11M32J40n00m6M13
$$ -178 -120 174 73 -22 -32 -135 -72 133 -21 -159 217 186 -334 -203 327 40 -271 161 301 -199 -245 168
3636A68m5k33J69M5j60K9Om5K28L3l50nL67k05l44M70K38n27j05M57q5l78K29
$$ 168 123 -110 59 104 -56 -27 -21 -66 162 195 -155 -160 207 2 -342 128 366 -161 -266 191 106 -272 -43
3659d3K95k52j27J30l0j2P9p1mJ98j65k90L03K86l80j26M52q3m86K08M38k79k20
$$ -43 252 0 -127 3 -27 -39 40 -31 -35 163 -2 -292 11 297 -83 -209 243 160 -326 -118 320 41 -179
3682a79K45P8k39qJ24M4K8o8j58J09J51k43m4L76j3m41R9L67k20k71L72J54l66
$$ -179 66 144 -95 -103 21 65 93 25 -133 -24 127 -116 -160 216 203 -238 -139 228 8 -263 109 263 -103
3705a03j20K96qj38O1N9Pj6j47pK83q5k43R9L23k60l00L50K10l46j00L10lk67
$$ -103 -223 73 65 -73 -12 47 54 38 -109 -116 167 82 -161 -62 261 1 -299 51 261 -85 -185 125 122 -145
3729a45P3J94m5j05m9P3P4n6j57J55J89k33k04K92J58l39q0M05o5l41Q5L01j23
$$ -145 -72 122 77 -28 -77 -4 70 14 -143 12 201 -32 -236 56 214 -125 -205 200 135 -206 -121 180 57
3752E7j75Q4J42q2j35QJ76N5j71o5J94O6l06K8L11n2l65J52L06k04k21J88J63
$$ 57 -118 -34 108 26 -109 -101 75 130 -41 -106 88 154 -152 -124 187 135 -230 -78 228 24 -197 -9 154
3775A54j44j38J43R2j10p4M1J42m1j91N0K14q9k28J33K26j44k56K32J85k27j80
$$ 154 10 -128 15 107 -3 -77 -36 106 65 -126 -76 138 49 -179 -46 180 36 -220 12 197 -30 -210
3797b10K65O5j81p4J87P9j94n4J42J09j51j42J91J24j67j71K44J16k55p4K37R2
$$ -210 55 120 -61 -135 52 131 -63 -117 25 134 -17 -159 32 156 -11 -182 62 178 -77 -151 86 178
3819A78l01NK18M1k27JJ76J1k03J3J73K1k16k7K20L1k29jK35l7k27M2K37m8k32
$$ 178 -123 -118 100 141 -86 -85 91 102 -101 -88 85 106 -110 -137 83 114 -115 -116 119 82 -145 -103 134 86 -146
3844a46N6K16m3k30M3K32o4j88P9J91j02k09J00K15j02k25J33J99j21j87J47J95
$$ -146 -90 126 83 -147 -104 128 64 -124 -45 146 44 -165 -65 150 48 -177 -44 155 34 -153 -6 189
3866A89j69k10J77J72j71j33J38J26j09j85J55J52j57j32J74J40j83j51K15J23
$$ 189 20 -190 -13 159 -12 -145 -7 119 10 -175 -20 132 -25 -157 17 157 -26 -177 38 161
3886A61k36r1K28Q3k25l3J83O4j98l8J90J4j39j00K15O0j93q3K29P5k72k7K19
$$ 161 -75 -166 62 145 -80 -113 70 134 -64 -102 88 102 -37 -137 78 138 -55 -138 91 166 -106 -133 86
3909H6M7k90O3K30q9j97P3J86m8j69JJ80j8j57K3J85j2k55L5K84q4k36Q4K78j91
$$ 86 133 -157 -94 136 47 -150 -77 109 61 -108 -107 73 55 -102 -79 106 94 -161 -126 158 74 -162 -78 200 9
3934Ij87J73J57j41j36J35Q7q6j05M9J65o3j84O9J86r0k24J55K54k14k50K73J39
$$ 9 -178 -5 152 11 -125 10 97 11 -94 -45 120 57 -127 -58 128 38 -186 -31 223 9 -241 32 171
3957A71k49o5J97N7j92k0J27J5m8p6M1J46r6j76J76J86k21j97L03R7l40j1L63
$$ 171 -78 -143 54 111 -81 -101 26 41 -7 -83 -42 104 8 -168 8 194 -27 -224 79 176 -164 -175 188
3980A88n7k84R4K06j35j18J06L8K5r7p7Q2J40j57r6K76N1l22o5L81q4l29K00K67
$$ 188 131 -153 -59 147 12 -106 0 38 63 -34 -111 -29 111 -46 -142 134 185 -137 -202 179 95 -234 -34 233
4004B33k48k10K44J00j64rQ3j6J5q3p6K46N7k72p9L46n6l91K33L42k74k97L89
$$ 233 -15 -225 19 119 -45 -54 29 13 28 -55 -131 115 172 -100 -179 167 111 -280 -47 295 21 -276 113
4027A13O0l40M5K86o8j70P7k0j8P6j04k3K63p2l94K01L75k88k60L97J29m86J7
$$ 113 173 -167 -122 164 96 -74 3 -17 -35 41 -63 -86 177 105 -289 -88 287 -1 -261 136 265 -221 -204
4050b04L91j17k00J48R6j54l2L5j4J59K1k55L9K89k68k12M17J99m95q7M42j06
$$ -204 187 70 -130 18 114 -40 -72 -37 -51 108 129 -126 -87 202 -66 -278 139 338 -157 -244 198 92
4072I2l64K65K96l12j59K35n3p1J05l0JJ24j41k68K95K34l81n6M62j75m52K96
$$ 92 -272 -7 289 -23 -182 53 0 -71 34 4 5 129 -12 -280 15 249 -132 -188 274 99 -353 -57
4094e7L69l52j75L78n0l16J04J74o2J8O5j93N4J65k60jL88o4m73K03L59l56k01
$$ -57 312 -40 -215 163 113 -203 -99 75 13 31 96 -97 -43 122 -138 -139 249 185 -288 -85 274 -82 -283
4117b83M79Q8n06P1L06j61j27K37j7j31O7j21m7K48K5k89J24K71l21k80M96J63
$$ -283 196 284 -222 -151 155 -6 -133 104 87 -44 23 -98 -145 103 128 -161 -37 234 -87 -367 129 292
4139B92m55K5L83k10l52L02K29k20k1R0j28J8P9p5M6K08k03l08L16K10m04M9M39
$$ 292 -163 -138 245 35 -317 -15 214 -6 -27 63 -65 -47 32 -43 3 211 8 -300 16 226 -178 -129 310
4162C10k02m17K71K60l19n6L25o7k32M9O8j5J07l7j58J72Q5l37lM44r5l91K19
$$ 310 108 -309 -38 222 -97 -153 172 105 -127 -78 -10 -25 82 45 -113 59 144 -193 -196 248 153 -238 -19
4185a9K72l38j84M20O0l47P0J37q8o6R7J8J4J4j52k9K42m3k69J83K90l54k10L75
$$ -19 253 -85 -269 151 211 -136 -66 71 -17 -83 14 32 46 60 -92 -121 121 78 -191 -8 282 -72 -282 93
4209I3J13l72K4L39j42k41J56J05o9lQm8Q3o5j35J87J81k58j59L24M4l57N3L39
$$ 93 206 -166 -142 197 55 -186 -30 75 6 3 11 -37 46 -19 -154 33 214 -44 -203 121 165 -192 -139 200
4233B00j39k72J56J78j66p1J49Q2j15o6J4J02M0j34p1K26Jk83L3L10j19k56J68
$$ 200 61 -211 -55 123 -43 -114 35 117 2 -64 -50 52 92 -42 -113 113 114 -169 -136 174 55 -201 -33
4256c3K35k61j26K34Q7k00k8J11N3j06m5N9J28q8j53Q8J98j38j89J85J62k03j64
$$ -33 202 -59 -185 49 136 -64 -92 19 72 -34 -79 -20 108 20 -133 -45 153 15 -174 11 173 -30 -194
4279a94K70P3k28m6K13mj53k3J50J7j18l1Q8O0j28o6J77R1k04j01K44L9k50kK62
$$ -194 76 149 -79 -125 88 84 -69 -92 58 75 -43 -74 14 74 -54 -120 57 148 -56 -157 87 126 -124 -126 136
4304A36l2k39O1K14j15j26N3J45j4j52J3J28l2j54L3K07n5k23Q1K22o7k05J21
$$ 136 104 -135 -74 140 25 -101 -48 97 83 -69 -56 72 40 -114 -81 126 71 -152 -71 151 84 -121 0
4327@J42j22j69J34J37j20j31R8J29j04j29J14J66j30j39J25J26j21j66J42J76
$$ 0 142 20 -149 -15 122 2 -129 -31 98 -6 -135 -21 145 15 -124 1 127 6 -160 -18 158
4348A58j69j46J89J00j68r4J63J24k05o7J57P5j56m4J44P5j80p9K00L8k01m6J93
$$ 158 -11 -157 32 132 -36 -130 33 157 -48 -115 42 117 -39 -83 61 136 -44 -123 77 115 -86 -132 61
4371F1K2j38p3J90L3k08J5J83k1j43qJ67j4j63JJ88k3k01K7K21n2j82K7K01q0
$$ 61 83 -55 -128 62 95 -113 -98 85 64 -79 -87 80 66 -97 -96 92 69 -132 -105 116 64 -118 -91 110 30
4396C0j69Q5J57p7j48J03J35p3j72Q7J73j05j10K1K09j12j59N6J83j23j65J70
$$ 30 -139 -54 103 26 -122 -19 116 43 -129 -42 131 26 -84 -63 146 34 -125 -69 114 -9 -174 -4
4418dJ53j86j15J72P9j38r5J91L5j14r8J00J15j06j34J23J45j72r3J70R1j66j02
$$ -4 149 -37 -152 20 99 -39 -134 57 92 -22 -120 -20 95 -11 -145 -22 123 -49 -142 28 119 -47 -149
4441a49K33P4k58mK18l3j41lJ30Kj12l2J34N8j78p6J69J20k47m7K75j5k70N5K34
$$ -149 84 158 -100 -104 114 81 -60 -63 67 69 -43 -75 59 117 -61 -137 32 152 -95 -142 133 118 -152 -97 137
4466A37q1j75J02J20j23q5R6L5Qo7n9J64Rj44p8K96l8k96J08K80k21j93K66J11
$$ 137 56 -119 -17 103 -20 -105 -9 26 34 -33 -92 72 81 -63 -141 155 117 -179 -71 209 -12 -205 61 172
4490A72k39n5J87Rj07M2J3N5l0j26k1J94j7k23P7K38j86k23K70J54k77m4K74q7
$$ 172 -67 -122 65 74 -33 9 22 77 47 -79 -100 94 77 -146 -69 169 -17 -240 30 184 -93 -137 137 50
4514E0k15R1J83r5k4M2o1M7Qj33N5K47j85k12K42J45l08o4L90n5l48J15K41j71
$$ 50 -165 -74 109 14 -10 32 -29 18 26 -107 -52 195 10 -202 40 185 -123 -187 203 148 -200 -85 156 -15
4538a5j16J95J6j41L6m6J0J05Kj41J07J56k99o3L59l6l26J20K88k64k04K91J31
$$ -15 -131 64 80 -61 -25 -71 -61 44 46 -95 12 168 -131 -194 165 129 -197 -77 211 -53 -257 34 165
4561A65k31K9J04r9l5R0n3M6J14j87j12K59K1l19J65L35k79k78L28J19l27Q0K72
$$ 165 -66 -37 67 -32 -67 23 -30 16 130 -57 -169 90 111 -208 -43 292 13 -265 63 182 -145 -65 207
4584B07j11k62J60L2n5P5j8j05J44j2k27O6L73k34k57K93J33l83l9M63j03l38
$$ 207 96 -166 -6 26 -29 46 28 -77 67 55 -172 -106 267 33 -224 69 202 -181 -220 243 140 -198
4606a98K17J15k53J1K04l3l7O4j65n9K50n4k30K56J64m23q3M54p4l78K65K28k99
$$ -198 19 134 -119 -108 96 63 26 90 -75 -134 116 62 -168 88 252 -171 -254 200 126 -252 13 241 -58
4629e8j65K87Kj49J12L5j18N2Oj68J78J76k66p1K95m3l70K40L53l37k13L08L9
$$ -58 -223 64 66 -83 29 64 -54 -2 4 -164 14 190 -76 -147 148 105 -265 -25 328 -9 -222 86 125
4652A25l08J16K29j10j10N8k0m5J62p8j03K20j4l38J40L16k18k16L22Q5l94kL40
$$ 125 -183 -67 162 52 -58 0 -20 -65 97 19 -84 136 122 -216 -76 240 22 -194 128 213 -181 -183 157
4675A57p3k09J57N7j45qN6j5P9K7j79N3K00j90j78L07J34l69m1L76j30k57K03
$$ 157 84 -125 32 89 -56 -64 -8 -23 56 83 -96 -43 157 -33 -211 96 230 -139 -180 196 66 -191 12
4698A2K02k31p8J43k3o9O3jj5R5j35j19K01P1k11m4L13r9k94J64K49k08j42K37
$$ 12 214 -17 -95 48 25 -44 19 18 3 98 -37 -156 45 116 -95 -139 174 75 -219 -55 194 -14 -156 81
4722H1K4k16K8J52m0k8k8j5O3N8j69J2K11m9k50J28K57k65j18K96L6k76OJ93k8
$$ 81 105 -111 -83 69 29 1 -27 -42 21 79 -90 -78 133 84 -166 -38 219 -46 -164 132 168 -108 -102 91 63
4747F3j46M8J27p5n2l%J16j3j69J35J05j88j25K36R3k58oK16m9j90P9J77r2r5
$$ 63 -83 -35 92 17 -35 -38 -38 78 65 -104 31 136 -52 -177 59 152 -106 -112 104 55 -135 -56 121 29 -66
4772f6J5J05n8o1QQ8O0j24r6K19rk01N0K00o1k06R4J78j32j13J34N7q9o9P5Q3
$$ -66 -51 54 -4 -65 -57 31 91 -33 -129 90 81 -120 -70 130 69 -137 -43 135 3 -110 24 81 -8 -77 -2 81
4798H1m8j33M8J25k7j55R5J15p7j63J02J59j54q8J32J21j71q2J59N1j19k4Q9L7
$$ 81 33 -100 -52 73 46 -109 -14 101 24 -139 -37 122 -32 -120 12 133 -38 -120 39 90 -29 -53 36 73
4822G3p3p8R0R6j16p7J21P2j61n6J88L4j91m5J85oj32k6J79oj50nJ62j8j32J5
$$ 73 0 -78 12 108 -8 -85 36 108 -53 -109 79 113 -78 -123 62 56 -76 -102 77 71 -79 -84 78 60 -72 -57
4848e7J12L4j38n5K07k7j83K8J68k5j63O5J15k2j30K8J61q6j09Q2O2l9j46O6J44
$$ -57 55 89 -49 -104 103 76 -107 -79 89 64 -99 -34 81 59 -71 -43 118 32 -77 5 67 28 -118 -52 92
4873I2q3p4K8J38p9j23P5J50j27j33J28J10j03j09J25R0j17j08J34N6q8q8J08
$$ 92 9 -65 -37 101 22 -101 -26 124 -3 -136 -8 102 -1 -110 15 105 -12 -120 14 70 -18 -106 2
4896BJ31j72p6J42Q0j48o3J57M5j70l4J70Lj31L6Q8L1j05m2J14M3j55o3J69M7
$$ 2 133 -39 -115 27 107 -41 -104 53 98 -72 -106 64 67 -64 -28 60 91 -14 -56 58 101 -54 -117 52 99
4921I9j66k4J96j8j84L0J64m3j93Q0J30n2j01O4Q1k2r1k1J38Nj56JJ73Qk22P6
$$ 99 -67 -91 105 87 -97 -67 97 54 -139 -59 71 19 -82 -18 63 41 -50 -71 67 72 -84 -83 90 98 -124 -48
4947d8J90q6j88R0J90j76p4J35M8q3m2M0P6p1n0KJ19k3j84P1K19j57j89J99J23
$$ -48 142 56 -132 -42 148 -28 -102 33 81 -2 -44 -4 72 1 -49 -47 72 49 -135 -64 155 -2 -191 8 131
4972A31j96q1K14M2j86KJ33m3q6N0N3K0k3j02M6J63j36j40J97J21k35q9K64j7
$$ 131 -65 -146 68 110 -76 -74 59 16 -70 -20 33 53 30 -72 -26 137 1 -139 58 179 -56 -145 119 102
4996A02k68J10K17j39j58J07J00p3j0okQ6n7j23J42J00j98p7K71nk91Q9K67j64
$$ 102 -166 -56 161 22 -136 -29 71 -2 -12 -18 -20 66 9 -114 28 128 -70 -147 124 119 -172 -83 184 20
5020B0k00K21O1j68kJ63p8m5J1plQ1p6q2K08K3k96P5K97j80k23K75R0k87j6K54
$$ 20 -180 41 102 -66 -68 95 17 -28 -17 -24 -27 54 -22 -104 104 127 -169 -94 203 23 -200 75 165 -122 -138 116
5046A16o7j42J06P7j61O1qn1J02R2k28qK49j64k11K60K07l36l8K85n0l35K40J99
$$ 116 49 -93 13 90 -71 -10 -18 -69 33 125 -103 -111 138 -26 -237 23 230 -106 -144 141 91 -244 -4 195
5070A95k02p1J23n8j7Q7o1l0J87j07k45K00J98k81m9L40q1l73J34L30k42j30K74
$$ 195 -7 -78 45 -13 -30 57 -4 -34 153 46 -199 1 199 -82 -131 209 128 -245 -111 219 -23 -153 121
5093A21m5k08R3Q4o1L2N6j81M5J78k05p8L43k0l71J29L28k82j95L69P0l63P9J84
$$ 121 76 -132 -39 45 -16 16 72 -109 -64 114 -91 -169 174 154 -217 -88 240 -42 -237 132 202 -161 -82 102
5117A02j14q9J55J7j03R2p9j24K03J05l17P9K83k59k43L56J75l60K0K74j38k49
$$ 102 -12 -101 54 71 -32 60 -19 -143 60 165 -152 -73 210 -49 -292 64 239 -121 -101 173 35 -214
5139b14J71J52j64N8N7j41M0J03j40K3K64j85k60K54J39l03kL80j38l47K38J92
$$ -214 -43 109 -55 3 60 -81 -41 62 -78 -55 209 24 -236 18 157 -146 -148 232 94 -253 -15 177
5161A77k23p2K37j9j38N7k1r7J78k6j53J28J43l00o5M14q0l45J97K42l07j80L32
$$ 177 -46 -118 119 100 -38 19 -2 -99 79 53 -100 28 171 -129 -194 220 140 -205 -8 234 -73 -253 79
5184G9L3k35P9J01r0l2Q0l8J7J07j38j24K50J6k53J27K86k85k27L34Q9l01N4K29
$$ 79 112 -123 -44 57 -33 -65 15 -23 -6 101 -37 -161 89 105 -148 -21 265 -20 -247 87 176 -125 -71 158
5208A58j51j21J33K5m3J1k7m2R2J9j70O6K53j86j88K56O0k96J3L05p5k38J04J50
$$ 158 7 -114 19 44 1 12 -15 -57 35 54 -116 -50 203 17 -171 85 145 -151 -138 167 92 -146 -42 108
5232A08j75l2J08Mk1J3o6K7J17j16j12K21O0k61mK71q6j95J18K04k12j32J95M8
$$ 108 -67 -99 9 13 -8 5 -61 -34 83 -33 -145 76 136 -125 -129 142 56 -139 -21 183 -29 -161 34 82
5256H2j29K9M7k2j7j7m6R0N0j53L1J66q4j87J28J86j90j09K01M7k09L0J54j4j04
$$ 82 -47 -18 29 7 -10 -27 -73 17 67 -86 -55 111 27 -160 -32 154 -36 -145 56 103 -106 -76 78 64 -40
5281d0%P5Qm6m4N7N3n5j14J30J02j61r3J71Q6k32OJ79K3k23L0J86m3j29M5O7K0
$$ -40 -40 35 43 -3 -47 10 63 8 -106 24 126 -35 -128 43 129 -103 -97 82 105 -118 -88 98 55 -74 -29 38 58
5308E8j06l0J13K1j17n2J59K5j69K8J65m4j48O0J59j10j21O9J23o9q9M5J03m2
$$ 58 -48 -78 35 56 -61 -113 46 71 -98 -70 95 51 -97 -37 122 12 -109 -40 83 14 -75 -30 73 31
5332C1j09N8R0m0j53R4J41r2j60J19J36j71o1J05J22j20q3J45K7j01p0J05M6o5
$$ 31 -78 -20 70 30 -123 -29 112 20 -140 -21 115 -56 -117 -12 110 -10 -93 52 79 -22 -92 13 59 -6
5356fo1Q6N5j06p0J28P0j42m8J42O4j67l7J26K7j17l2J35J6j16k9J38K4r5l8R5
$$ -6 -67 19 74 -32 -102 26 96 -46 -94 48 112 -55 -92 34 61 -56 -88 47 63 -53 -82 56 80 -15 -53 42
5382D2J0p1o2J44Oj23jJ61n0j67M2J57n7j30Q6Q5k4j29L0J15l7j11K7J35j4j81
$$ 42 52 -19 -81 63 69 -54 -55 106 56 -111 -69 88 31 -99 -13 72 48 -81 -51 64 27 -84 -57 78 64 -117
5408a17M9J76n5j77J17J07q7j25J04Q4r1p3J21L3p3o9N7Q3n4j05N2J24r5j14J26
$$ -117 -68 108 53 -124 -7 100 13 -112 -8 76 -15 -88 33 66 -7 -76 -19 64 10 -95 -43 81 -14 -128 -2
5433bJ33j86n5J45K6j38NJ36Rj23mO1L4p0j5O6N5j00r9J60O7j63q1K39j1j97L7
$$ -2 131 -55 -110 35 61 -77 -72 64 73 -50 -54 7 41 -29 -44 22 77 -23 -122 38 105 -58 -139 100 89 -108 -71
5460g1J99q3j40P9R3o5o1RP9K0r2l0O7Q7j50l5J74M1k57Q5K26j42j84J87R6j93
$$ -71 128 45 -95 -16 77 12 -49 -40 39 59 -33 -63 4 91 -59 -94 80 121 -136 -51 175 33 -151 36 132 -61
5486f1k6J19K2o6mJ8QL8p3m5J55k4k06J10K01j65j90K20J38k40k3K06n4j70J07
$$ -61 -87 32 54 -12 -16 2 10 48 -25 -70 85 61 -145 -35 166 1 -189 31 169 -71 -94 112 58 -112 -5
5511eQ0q1NKl9N0J3j24O4J66j17j85J53J62k48l0K81o2k51J27J45j38n3J26K3
$$ -5 75 -6 -1 1 -38 12 25 -99 -35 131 14 -171 -18 144 -104 -134 147 85 -166 -39 106 -32 -85 41 64
$$ [...]
8191a3
##END NTUPLES=NMR FID
##END=
