##TITLE=1H_Pr AmC4-T
 200.13MHz, CDCl3,
 8 sc
 
 3.10.2025
##JCAMPDX= 6.0         $$ Bruker NMR JCAMP-DX V2.0
##DATA TYPE= NMR FID
##DATA CLASS= NTUPLES
##ORIGIN= UXNMR, Bruker Analytische Messtechnik GmbH
##OWNER= pz
$$ XWIN-NMR		Version 3.5
$$ Mon Oct  6 15:31:13 2025 Russian Standard Time (UT+4h)  she@DPX200
##.OBSERVE FREQUENCY= 200.1308
##.OBSERVE NUCLEUS= ^1H
##.DELAY= (6, 6)
##.ACQUISITION MODE= SIMULTANEOUS
##.ACQUISITION SCHEME= undefined
##.AVERAGES= 8
##.DIGITISER RES= 18
##SPECTROMETER/DATA SYSTEM= spect
##.PULSE SEQUENCE= zg30
##.SOLVENT NAME= CDCl3
##.SHIFT REFERENCE= (INTERNAL, CDCl3, 0, 14.3821)
##AUDIT TRAIL= $$ (NUMBER, WHEN, WHO, WHERE, WHAT)
$$ ##TITLE= Audit trail, XWIN-NMR		Version 3.5
$$ ##JCAMPDX= 5.01
$$ ##ORIGIN= Bruker BioSpin GmbH
$$ ##OWNER= she
$$ F:/spectra/data/she/nmr/H-C/1/audita.txt
$$ ##AUDIT TRAIL=  $$ (NUMBER, WHEN, WHO, WHERE, WHAT)
(   1,<2025-10-06 15:29:02.28 +0400>,<she>,<DPX200>,
      <created by zg, POWCHK disabled, PULCHK disabled
       configuration hash MD5:
       00 E9 B6 7A A2 85 ED C7 34 08 36 98 17 FE 4E 26
       data hash MD5: 16K
       F9 D9 8B 09 8B 45 5E 6A 69 75 F0 2B A1 33 51 E3>)
$$ ##END=
$$ 
$$ hash MD5
$$ E5 31 08 74 C9 3A DE A5 4E E6 CE 1E A4 D6 0C 13
##$RELAX= 
##$RELAX= 
##$RELAX= 
##$RELAX= 
##$RELAX= 
##$RELAX= 
$$ Bruker specific parameters
$$ --------------------------
##$DU= <F:/spectra>
##$EXPNO= 1
##$NAME= <H-C>
##$PROCNO= 1
##$TYPE= <nmr>
##$USER= <she>
##$AMP= (0..31)
100 100 100 100 100 100 100 100 100 100 100 100 100 100 100 100 100 100 
100 100 100 100 100 100 100 100 100 100 100 100 100 100 
##$AQSEQ= 0
##$AQ_mod= 1
##$AUNM= <au_zg>
##$AUTOPOS= <>
##$BF1= 200.13
##$BF2= 200.13
##$BF3= 200.13
##$BF4= 200.13
##$BF5= 200.13
##$BF6= 200.13
##$BF7= 200.13
##$BF8= 200.13
##$BYTORDA= 1
##$CFDGTYP= 0
##$CFRGTYP= 5
##$CHEMSTR= <none>
##$CNST= (0..31)
1 1 145 1 1 1 1 1 1 1 1 1 1 1 1 1 1 1 1 1 1 1 1 1 1 1 1 1 1 1 1 1 
##$CPDPRG= <>
##$CPDPRG1= <>
##$CPDPRG2= <>
##$CPDPRG3= <>
##$CPDPRG4= <mlev>
##$CPDPRG5= <mlev>
##$CPDPRG6= <mlev>
##$CPDPRG7= <mlev>
##$CPDPRG8= <mlev>
##$CPDPRGB= <>
##$CPDPRGT= <>
##$D= (0..31)
0 0.7 0 0 0 0 0 0 0 0 0 0.03 0 0 0 0 0 0 0 0 0 0 0 0 0 0 0 0 0 0 0 0 
##$DATE= 1759750141
##$DBL= (0..7)
120 120 120 120 120 120 120 120 
##$DBP= (0..7)
150 150 150 150 150 150 150 150 
##$DBP07= 0
##$DBPNAM0= <>
##$DBPNAM1= <>
##$DBPNAM2= <>
##$DBPNAM3= <>
##$DBPNAM4= <>
##$DBPNAM5= <>
##$DBPNAM6= <>
##$DBPNAM7= <>
##$DBPOAL= (0..7)
0.5 0.5 0.5 0.5 0.5 0.5 0.5 0.5 
##$DBPOFFS= (0..7)
0 0 0 0 0 0 0 0 
##$DE= 6
##$DECBNUC= <off>
##$DECIM= 32
##$DECNUC= <off>
##$DECSTAT= 4
##$DIGMOD= 1
##$DIGTYP= 9
##$DL= (0..7)
0 120 120 120 120 120 120 120 
##$DP= (0..7)
150 150 150 150 150 150 150 150 
##$DP07= 0
##$DPNAME0= <>
##$DPNAME1= <>
##$DPNAME2= <>
##$DPNAME3= <>
##$DPNAME4= <>
##$DPNAME5= <>
##$DPNAME6= <>
##$DPNAME7= <>
##$DPOAL= (0..7)
0.5 0.5 0.5 0.5 0.5 0.5 0.5 0.5 
##$DPOFFS= (0..7)
0 0 0 0 0 0 0 0 
##$DQDMODE= 0
##$DR= 18
##$DS= 0
##$DSLIST= <SSSSSSSSSSSSSSS>
$$ [...]
##$SUBNAM0= <"">
##$SUBNAM1= <"">
##$SUBNAM2= <"">
##$SUBNAM3= <"">
##$SUBNAM4= <"">
##$SUBNAM5= <"">
##$SUBNAM6= <"">
##$SUBNAM7= <"">
##$SUBNAM8= <"">
##$SUBNAM9= <"">
##$SW= 18.0517779522481
##$SWIBOX= (0..15)
0 0 2 0 0 0 0 0 0 0 0 0 0 0 0 0 
##$SW_h= 3612.71676300578
##$TD= 16384
##$TD0= 1
##$TE= 0
##$TE2= 300
##$TE3= 300
##$TEG= 300
##$TL= (0..7)
0 120 120 120 120 120 120 120 
##$TP= (0..7)
150 150 150 150 150 150 150 150 
##$TP07= 0
##$TPNAME0= <>
##$TPNAME1= <>
##$TPNAME2= <>
##$TPNAME3= <>
##$TPNAME4= <>
##$TPNAME5= <>
##$TPNAME6= <>
##$TPNAME7= <>
##$TPOAL= (0..7)
0.5 0.5 0.5 0.5 0.5 0.5 0.5 0.5 
##$TPOFFS= (0..7)
0 0 0 0 0 0 0 0 
##$TUNHIN= 0
##$TUNHOUT= 0
##$TUNXOUT= 0
##$USERA1= <user>
##$USERA2= <user>
##$USERA3= <user>
##$USERA4= <user>
##$USERA5= <user>
##$V9= 5
##$VALIST= <valist>
##$VCLIST= <CCCCCCCCCCCCCCC>
##$VD= 0
##$VDLIST= <DDDDDDDDDDDDDDD>
##$VPLIST= <PPPPPPPPPPPPPPP>
##$VTLIST= <TTTTTTTTTTTTTTT>
##$WBST= 1024
##$WBSW= 4
##$XGAIN= (0..3)
0 0 0 0 
##$XL= 0
##$YL= 0
##$YMAX_a= 328127
##$YMIN_a= -236989
##$ZGOPTNS= <>
##$ZL1= 120
##$ZL2= 120
##$ZL3= 120
##$ZL4= 120
##$ABSF1= 10
##$ABSF2= 0
##$ABSG= 5
##$ABSL= 3
##$ALPHA= 0
##$AQORDER= 0
##$ASSFAC= 0
##$ASSFACI= 0
##$ASSFACX= 0
##$ASSWID= 0
##$AUNMP= <proc_1d>
##$AZFE= 0.1
##$AZFW= 0.1
##$BCFW= 1
##$BC_mod= 2
##$BYTORDP= 1
##$COROFFS= 0
##$CY= -3
##$DATMOD= 1
##$DC= 2
##$DFILT= <>
##$DTYPP= 0
##$F1P= 0
##$F2P= 0
##$FCOR= 0.5
##$FTSIZE= 0
##$FT_mod= 4
##$GAMMA= 1
##$GB= 0.15
##$INTBC= 1
##$INTSCL= 1
##$ISEN= 128
##$LB= 0.25
##$LEV0= 0
##$LPBIN= 0
##$MAXI= 10000
##$MC2= 0
##$MEAN= 0
##$ME_mod= 0
##$MI= 1.114404
##$NCOEF= 0
##$NC_proc= 0
##$NLEV= 6
##$NOISF1= 3.799351
##$NOISF2= 2.8
##$NSP= 1
##$NTH_PI= 0
##$NZP= 0
##$OFFSET= 14.38212
##$PC= 1
##$PHC0= -2277.294
##$PHC1= 7.592239
##$PH_mod= 1
##$PKNL= yes
##$PPARMOD= 0
##$PSCAL= 0
##$PSIGN= 0
##$REVERSE= no
##$SF= 200.129724274929
##$SI= 16384
##$SIGF1= 3
##$SIGF2= 2
##$SINO= 400
##$SIOLD= 16384
##$SREGLST= <1H.CDCl3>
##$SSB= 0
##$STSI= 0
##$STSR= 0
##$SW_p= 3205.1282051282
##$SYMM= 0
##$S_DEV= 0
##$TDeff= 0
##$TDoff= 0
##$TI= <>
##$TILT= no
##$TM1= 0
##$TM2= 0
##$TOPLEV= 0
##$USERP1= <user>
##$USERP2= <user>
##$USERP3= <user>
##$USERP4= <user>
##$USERP5= <user>
##$WDW= 1
##$XDIM= 8192
##$YMAX_p= 0
##$YMIN_p= 0
$$ End of Bruker specific parameters
$$ ---------------------------------
##NTUPLES= NMR FID
##VAR_NAME=  TIME,          FID/REAL,        FID/IMAG
##SYMBOL=    X,             R,               I
##VAR_TYPE=  INDEPENDENT,   DEPENDENT,       DEPENDENT
##VAR_FORM=  AFFN,          ASDF,            ASDF
##VAR_DIM=   8192,          8192,            8192
##UNITS=     SECONDS,       ARBITRARY UNITS, ARBITRARY UNITS
##FACTOR=    0.0002768,     1,               1
##FIRST=     0,             0,               0
##LAST=      2.2672688,     0,               0
##MIN=       0,             -236989,         0
##MAX=       2.2672688,     328127,          0
$$ Real data points
##PAGE= N=1
##DATA TABLE= (X++(R..R)), XYDATA
0 0 0 0 0 0 0 0 0 0 0 0 0 0 0 0 8 -8 8 -8 10 -16 16 -16 24 -24 32 -36 40 -48 56 -63 72 -80 92 -102 116 -132
36 -132 147 -164 181 -203 224 -248 276 -303 336 -370 410 -450 495 -547 602 -664 729 -807 892
55 892 -990 1103 -1233 1386 -1569 1791 -2073 2432 -2918 3604 -4643 6396 -9882 19402 -103393
70 -103393 -236989 115420 328127 220533 81573 77315 34660 -70144 -82825 -27767 -124904
81 -124904 -231665 -122121 50140 90802 63662 60687 114845 124259 43410 -11176 -22462 -61630
93 -61630 -82384 -74886 -63883 -53978 -46113 12895 101542 97040 45303 44182 47627 26430 -14479
106 -14479 -58458 -56105 -62533 -97153 -54502 30079 53203 40866 40326 67938 71129 11242 -12799
119 -12799 -42 -52190 -96266 -63747 -18285 17702 25680 4282 20760 63493 64939 16871
131 16871 -28951 -2026 22234 -59835 -97795 -9384 36030 5648 -5513 3917 12976 23320
143 23320 48967 54120 -16946 -64822 -11458 16378 -19160 -31133 -21084 -5014 14192 19126
155 19126 26565 21070 -2313 11567 27589 -1404 -28559 -40484 -28423 9959 11008 -12958 -6831
168 -6831 11084 31250 30969 3122 4419 4207 -34016 -26080 17287 3039 -39150 -29125 31200
181 31200 47400 -11111 -16755 38745 16576 -33839 -9144 18256 -3019 -27665 -17885 11643
193 11643 6383 -6451 15278 11068 -11158 5170 15937 3268 -6190 -17474 -6738 14083 -3459
206 -3459 -21928 -9157 11941 21362 1438 -10063 13786 9005 -12643 3200 4744 -17756 -12593
219 -12593 4323 6704 -6251 -9106 18458 18325 -14246 -2353 18734 -3657 -18040 -6034 6755
232 6755 3800 -13014 -4694 14277 -213 -3983 12134 461 -6554 6258 2761 -9574 -12206
245 -12206 4473 17664 -9366 -19783 13400 11302 -11764 2796 13051 -2621 -11259 -117
257 -117 12181 -4983 -17404 10921 12117 -18657 -6477 16913 7423 -5586 -6022 3900 7979 -5578
271 -5578 -5041 1286 -5586 1079 6175 -5168 -494 4453 -721 5435 2650 -7592 -1515 3037 2714
286 2714 -1235 -9880 1132 9474 -4777 -2273 7681 -2053 -3482 884 512 3027 -1830 -3819 2705
301 2705 -3941 -1946 9337 -1624 -8152 2998 4918 1496 -4605 -5005 7780 2858 -8861 1288
315 1288 1548 -4833 5116 3897 -6467 -1899 5568 5496 -5943 -9028 11013 6974 -16038 -2294 12898
330 12898 -2871 -7012 4021 5143 -3641 -5750 7339 6203 -13130 -2614 13347 -2495 -9211
343 -9211 3048 3995 62 -2796 -764 3672 -2169 -1696 5581 -3258 -4890 5796 1185 -3506 -679
358 -679 -356 3645 317 -5359 3395 3669 -4442 310 1099 -1422 1518 -1900 -854 2623 -2475 787
374 787 3000 -4556 34 3817 -1445 397 -843 -3292 3251 2250 -2844 -250 -413 1763 1832 -4359
390 -4359 1439 3863 -5007 1188 4853 -4916 -1895 5395 463 -4658 -2368 7116 3850 -11521 -1490
405 -1490 12327 -2684 -8466 4043 3074 -3932 -1140 4064 2360 -7039 -1626 9632 -2050 -8037
419 -8037 5636 3733 -5616 -1262 3254 2631 -2991 -4308 4701 2393 -5010 2437 2533 -4637 -515 3151
435 3151 1670 -1517 -4200 2786 4768 -5716 -1933 5234 -1347 -2841 1174 1563 950 -2510 -728
450 -728 3321 -2512 -1748 4547 -1921 -2961 3208 354 -498 606 -2023 601 1265 -144 680 -1778
466 -1778 -685 3730 -1584 -1586 3327 -2888 -1749 5390 -130 -3899 1087 3125 -110 -4686 711 6564
482 6564 -3891 -6867 6149 3576 -4515 -126 1605 -824 -1437 -204 3719 -1280 -5032 3041 2784
497 2784 -3109 953 1880 -1859 -1866 -788 3640 2687 -5147 -1302 4886 -2074 -2596 3261 896 -3330 -2951
514 -2951 3864 5036 -5361 -3573 6352 -861 -4867 3427 2218 -3078 -912 1979 1601 -2729 -922
529 -922 3883 -2157 -4008 4430 1253 -4716 1155 2375 -45 -305 -1876 -371 1776 -207 434 -336
545 -336 -1288 1909 -890 -1629 3572 -982 -3991 2515 1956 -1210 -125 -629 -4 -367 -673 2369 -4
562 -4 -3047 1563 979 -2000 1690 231 -1469 -306 -1302 1165 3145 -2376 -1961 1966 153 -1055 -58
579 -58 1885 1223 -4516 -1511 5802 -747 -4377 2960 604 -4188 790 4537 14 -4350 -316 5231
595 5231 -1951 -4384 4320 1310 -5500 629 3776 -447 -1693 -360 1894 -627 -2732 2032 2046 -3196
611 -3196 28 2165 -996 -492 -562 535 2090 -2105 -1383 2805 -336 -1495 1302 816 -507 -1313 -409
628 -409 2703 -563 -2504 2453 -23 -1989 1926 1006 -1466 -219 -351 754 1217 -1341 294 63
644 63 -1088 1256 -333 -867 1515 -1396 -1657 3353 387 -3101 228 1456 -615 -1211 1004 2753
660 2753 -1763 -3458 3486 1258 -3776 1046 2469 -2094 -1868 1335 1808 -589 -2363 1801 1379 -3332
676 -3332 1107 3025 -2023 -1724 768 785 -129 -1613 327 2277 -2199 -1817 3148 185 -1970 320
692 320 821 356 -1792 -414 3232 -415 -3100 1793 1307 -1859 330 848 -59 -909 -766 1780 263
709 263 -1963 1250 1212 -2424 437 1200 -701 168 -377 -206 865 -823 -100 610 -1049 169 159 -1257
727 -1257 1188 556 -2001 1148 1158 -1196 114 537 -179 -77 -715 1312 798 -2414 714 1932 -1927
744 -1927 -444 1545 -292 -769 -359 1018 1053 -1897 -34 2366 -1423 -1629 1902 605 -1060 -448 561
761 561 1271 -1448 -1370 2623 409 -2502 524 1162 -685 -991 239 1423 -572 -1989 2047 1674 -2704
778 -2704 132 2034 -848 -856 663 687 -134 -1460 925 1649 -2074 -580 2278 -763 -1474 809 130
795 130 322 -389 -191 1218 -741 -1047 1118 -32 -346 524 -662 337 970 -1391 446 1081 -1149 -54
813 -54 572 9 110 -492 249 1015 -1266 -360 1781 -664 -927 1053 407 -499 -278 -84 1153 -588 -1403
832 -1403 1378 575 -1268 91 544 229 -447 -1043 1174 887 -2108 543 1896 -1008 -1159 972 498
849 498 -453 -1181 1249 1042 -2073 5 2278 -1030 -1504 1522 487 -1200 -492 976 1013 -1257 -699
866 -699 2137 -386 -1343 1406 552 -600 -94 -38 629 -222 -1113 729 172 -932 463 378 -499 67 -343
885 -343 -1 869 -1000 65 982 -1035 -645 896 -358 -6 -160 -106 579 -318 -756 920 68 -658 671
904 671 138 -53 478 -671 400 890 -790 -258 442 -596 -71 -318 612 724 -1013 117 1434 -897
922 -897 -938 1294 -9 -1006 376 734 352 -1289 -368 1732 -361 -1227 1367 345 -1472 125 808
939 808 86 -471 -312 1146 -123 -1495 1031 744 -1252 46 873 -282 -119 -402 431 717 -1048 -68
957 -68 922 -758 -555 328 13 -192 -367 105 1082 -861 -1067 950 -84 -1018 575 490 -117 -442 -323
976 -323 723 148 -755 1021 67 -836 477 157 -280 410 -473 226 876 -198 93 152 -406 314 -330
995 -330 -215 1107 -321 -1188 1016 157 -1242 632 773 -319 -795 236 414 -344 -833 1044 96 -1364
1013 -1364 424 1121 -615 -375 287 272 -130 -554 235 539 -986 -398 912 -355 -97 -251 -48 537
1031 537 -555 -361 1380 -453 -1193 406 368 -561 -215 816 411 -850 -362 921 334 -1285 624
1048 624 625 -590 382 738 285 -442 -176 274 186 -392 179 285 -744 224 81 -230 378 -27 -483 224
1068 224 116 -614 269 56 -327 -429 -459 410 124 -866 542 288 -991 89 666 -439 -107 -163 -73 109
1088 109 -301 308 460 -634 -228 329 139 399 -48 -178 457 -398 -394 591 13 -538 160 122 76 -442 -146
1109 -146 614 -70 -975 829 440 -845 174 729 -589 -536 322 763 -128 -858 279 492 -561 73
1127 73 794 -217 -52 273 35 156 -183 -353 377 -191 -225 407 118 -119 -237 -124 486 217 -445 537
1147 537 285 -646 251 534 -171 -383 -64 204 221 -500 134 418 -830 -395 316 -223 14 91 -441 140
1167 140 157 -96 371 -4 -369 50 29 230 -58 -408 553 -24 -589 224 322 -447 -237 174 122 -59 -125 678
1189 678 206 -780 -311 553 -315 -491 549 -3 -113 -82 85 425 -542 -69 429 90 -327 269 72 125
1209 125 -293 89 442 -5 -380 515 377 -508 226 394 -131 -158 -432 325 -72 -718 251 375 -541 -310
1229 -310 206 -331 14 -110 98 -9 -137 -93 349 -33 -55 121 22 75 53 -17 182 -8 -411 329 266 -287
1251 -287 110 -63 80 -235 -48 299 247 -468 84 361 -55 -428 210 65 71 -335 -98 330 -305 -350 209
1272 209 -97 -178 88 26 335 -207 -175 187 -42 -362 198 151 33 -176 -39 242 -93 -184 221 258 -387 18
1294 18 497 -243 -447 21 339 -69 -26 253 469 -246 -142 347 -57 -294 170 -157 82 -44 -175 413 -303
1315 -303 -215 271 165 -228 -428 202 38 -60 -58 -126 95 -350 -116 96 -4 308 -85 -33 158 -49 -221 187
1337 187 -163 -225 278 -105 155 153 -53 132 -193 -229 311 67 -343 181 319 19 11 -249 12 26 -351 203
1359 203 99 -9 31 74 -238 36 211 159 130 -132 -108 1 -114 -346 48 39 -32 58 74 72 -51 -40 258 -53
1383 -53 -142 134 224 -157 -126 195 137 9 -166 298 322 -298 -61 317 131 -41 -24 57 155 2 -253 293 99
1406 99 -24 232 135 -216 89 279 396 -120 -572 224 117 -157 69 259 -234 18 -38 246 -81 -220 87
1427 87 257 -154 500 107 -64 176 -14 85 128 -291 -213 310 124 -352 90 -20 17 117 -279 353 97 -290
1449 -290 -81 61 -287 -242 25 50 69 126 246 11 -57 170 503 -204 -84 215 113 -13 -145 -223 154 -268
1471 -268 -181 439 -325 -300 -114 5 -96 -202 109 466 -172 -204 190 340 -475 -92 86 -196 -172 -250 79 24
1493 24 -389 215 258 -331 -269 200 106 256 82 -338 277 27 -126 123 132 -27 22 -177 -64 40 95 -159 109
1516 109 -101 174 113 -203 -49 -141 171 109 76 160 269 -183 -26 215 145 151 146 -129 -58 -151 96 318 -33 -10
1540 -10 66 250 -250 118 61 299 62 -168 -226 85 -98 -57 439 -212 -277 76 91 242 -16 -105 136 -445 -72
1563 -72 282 -85 -63 9 178 -148 -119 -11 25 -221 -169 158 27 -335 122 -39 136 -106 172 208 251 -22 149
1586 149 179 -47 216 40 66 -157 -20 -25 381 152 -213 56 109 -124 142 150 -175 -192 -181 252 76 -66 142
1609 142 88 97 -193 -41 64 119 159 18 203 123 -13 61 -179 2 46 13 370 -127 -11 8 -91 -258 247 324
1633 324 60 -176 -84 222 -67 -80 -6 44 -335 179 79 -161 99 131 217 18 -32 -102 9 69 -60 231 -20
1656 -20 -111 184 -86 191 -159 -260 108 -164 -197 202 -181 -198 -163 -115 132 -132 -55 90 120 -149 114 65 -233
1679 -233 -110 -104 -125 122 -187 76 177 -110 -177 62 91 52 -122 10 122 1 -145 -122 193 -20 67 -54 -87
1702 -87 158 -227 182 -132 -467 196 203 -294 -283 -113 368 -150 -24 27 139 -80 82 180 -106 -210 195 236
1724 236 83 18 -14 240 -204 -297 106 -5 -207 -98 206 -161 101 -115 182 183 -238 -80 306 -276 -174 39
1746 39 -43 -10 -141 -71 120 -19 -52 163 59 -242 187 -41 262 -131 64 94 -106 -367 -103 -215 -245 166
1768 166 293 250 -106 -29 97 202 -185 -42 148 -259 -58 -42 -114 -213 46 119 206 -131 -49 163 -109 -228 35
1791 35 226 -45 16 -105 179 -66 -251 196 214 -168 -105 17 -176 -108 192 -187 58 -215 64 177 -110 -233
1813 -233 123 48 -129 -180 54 286 -133 -109 290 -116 -307 -119 157 251 -26 32 -37 -95 -289 190 56 -506
1835 -506 171 193 -4 302 -149 -126 -111 -294 -135 290 -271 -73 -6 64 -67 8 -146 97 54 -165 103 9 68
1858 68 243 10 146 -107 -18 -9 -39 -214 127 527 -13 39 168 -48 -34 -292 162 170 -267 227 324 -259 24
1881 24 -79 192 28 -85 -11 376 -35 -359 208 255 -72 -283 -39 202 -181 -123 56 -99 -236 81 533
1902 533 -76 -377 263 190 -42 43 35 -24 -222 -220 133 -250 124 160 -21 194 -155 151 499 -270 -278 -39 73
1925 73 -219 -157 160 43 -141 -196 233 -134 -439 105 260 138 -113 159 188 88 -237 271 240 -253 37 -10
1947 -10 -28 -305 60 262 295 -47 -101 239 49 -264 172 202 -164 276 -59 350 51 -222 220 42 -222 -144
1969 -144 -167 218 154 -76 300 -155 -369 -40 102 -205 -167 394 -137 -364 -107 248 161 -276 23 269 -259
1990 -259 -406 148 50 -214 142 128 350 -107 -168 47 206 47 -89 274 -16 74 -249 56 205 -288 222
2011 222 239 -559 27 249 -84 -188 -163 175 -21 -286 -134 393 -225 -111 120 31 -415 -10 71 125 -28 -111
2033 -111 153 -140 -228 249 86 94 -103 -238 149 231 -372 -290 -5 -99 15 -80 -102 -1 -331 79 234 -275 158
2056 158 264 71 -98 161 168 -31 151 -113 74 38 -209 324 -20 129 -79 -21 -46 85 -223 165 321 -351
2078 -351 -113 330 -359 -161 -213 -59 -207 -394 151 500 -268 -84 362 201 173 312 59 -101 -145 47 192
2099 192 -41 -110 178 -41 -339 94 -37 28 -22 -160 -3 49 -57 -6 281 -3 -85 -23 21 105 -405 43 59
2122 59 15 -133 285 -78 -308 310 -4 -30 -30 111 284 -217 -90 142 -50 -180 0 144 147 -278 18 -295
2144 -295 207 -194 -240 -10 -273 92 75 132 -69 -118 357 616 -404 -313 344 -173 -32 70 53 46 -454 -114
2166 -114 79 -255 -66 133 137 -306 111 92 207 -183 42 -262 156 -20 -49 225 161 -24 90 23 -78 -184
2188 -184 93 -53 -219 -25 526 -118 -167 184 -271 228 -244 16 469 -135 -393 252 -93 -157 -22 -105 80
2209 80 245 52 457 374 -357 -224 61 54 90 -1 -82 -29 -263 -242 163 65 -282 231 -197 5 -193 84 34 -147
2233 -147 -310 371 8 -295 -132 -74 -13 111 -99 -71 -83 -484 210 156 8 152 124 -291 -114 -67 -53 -55 -172
2256 -172 78 210 -145 -258 -25 10 -205 176 23 179 66 -166 442 77 -81 157 -15 248 -180 2
2276 2 104 255 -405 299 99 -103 -38 65 -204 45 37 -306 33 -319 161 434 161 -259 176 -130 -74 -242
2298 -242 -26 308 -144 -586 427 -176 -58 -150 -63 -2 -16 110 311 106 -376 -2 303 -128 -109 -115 79 -149
2320 -149 -175 110 -230 -72 8 161 -41 132 184 57 -254 242 -39 314 55 -260 247 33 -102 -180 44
2341 44 30 -12 -124 45 195 -401 311 173 -234 -162 332 35 -2 -133 46 26 -147 -68 441 -182 -185 54 45 -207
2365 -207 -386 182 284 -42 -251 179 -28 -352 -53 -185 -60 42 -157 88 223 0 -16 180 -53 -312
2385 -312 308 -37 306 -64 -79 24 -173 -114 275 -265 -310 -29 -42 -106 -200 17 -38 -73 -300 96 223 -200 29
2408 29 174 -41 -85 -333 -69 147 -98 -132 322 -168 58 -59 256 183 -269 -135 309 -233 -131 429 -265
2429 -265 88 65 188 214 -231 13 298 26 -200 432 -188 -509 27 -228 110 278 -354 19 214 44 -114
2450 -114 375 -177 -40 -130 -130 -261 -26 -73 -95 19 -72 163 -104 -10 84 65 -16 -404 -193 166 19 -86 155
2473 155 -217 -338 -148 82 79 -97 -237 1 84 -500 -90 147 40 -354 -78 33 127 -28 24 320 -92 -611
2495 -611 206 -98 83 -4 182 -6 -347 24 270 -82 -150 306 298 -162 79 137 -74 -33 -190 141 -22 -219
2517 -219 153 319 161 -171 417 137 -115 -187 -140 332 -258 -235 291 -235 -19 -263 -28 284 299 -166 228
2538 228 -40 -320 252 31 -115 161 -186 -193 103 -133 151 250 -135 -177 410 -249 34 -128 41 66 -262 -414
2560 -414 102 44 -261 57 53 -270 21 -95 447 -106 -374 68 82 -213 268 226 -301 73 51 341 34 -111
2582 -111 -186 300 -382 21 265 -27 -87 155 66 145 -181 11 231 -188 -39 220 290 -41 -142 -112 259 54
2604 54 -444 524 73 -303 239 221 56 19 55 -28 -77 -274 334 -28 -56 43 241 -304 222 187 25 -37 -109 27
2628 27 222 -91 -146 -208 -119 117 -200 -127 194 -70 -424 151 33 -164 79 103 228 39 60 317 19 -194
2650 -194 37 -81 -129 -55 270 47 -202 -201 54 314 -31 -60 108 77 -27 13 63 -241 -36 -58 240 -110 -104 103
2674 103 197 -185 -212 382 103 -280 -70 275 -12 -152 65 132 -413 -153 67 1 43 213 -30 -167 -277 159
2696 159 58 -68 -16 174 211 -66 108 -360 237 245 -378 279 47 -70 18 234 136 121 -66 13 57 -157 145
2719 145 243 -248 -127 -58 263 143 -286 10 199 -143 -252 227 -215 -156 -142 11 -66 -7 -338 343 26 -81
2741 -81 132 -139 -169 -50 136 35 -36 -99 32 -45 -237 23 152 -165 -323 -29 77 -143 -305 77 59 -136
2763 -136 -189 239 -40 -47 159 30 -179 -146 52 183 -95 -314 238 -153 -445 -36 -313 306 -80 -415 89
2784 89 129 -400 71 -57 -113 -22 -18 64 174 -211 264 268 -192 -24 317 -25 -68 91 69 158 -94 -101 20 -180 -187
2809 -187 358 266 -253 -59 9 365 102 -40 59 187 -329 99 139 40 7 -55 -9 -32 -297 261 191 -302 -35
2832 -35 323 -58 -139 -209 16 195 11 -19 253 -239 -448 238 -32 -69 -298 21 116 -60 -72 272 148 -232
2854 -232 -72 190 -209 -144 29 -108 -50 -323 96 349 -249 -72 180 -67 286 -117 191 -68 -274 -42 236
2875 236 140 -281 114 189 -328 145 126 128 -14 -289 201 5 -241 -124 246 68 15 199 -14 331 -299 -250
2897 -250 433 -264 -285 84 82 -4 -150 42 93 -155 116 154 85 -249 91 -63 -125 128 123 224 97 -251 -84
2920 -84 251 -94 -98 141 -115 67 109 148 264 -227 143 144 -191 -204 113 -4 -130 -59 64 114 -129 -404 262
2943 262 133 -265 32 50 11 -207 -126 188 23 -34 223 -77 -14 -57 4 -85 -184 -37 41 62 -263 -190 -87 -83 24
2968 24 -136 57 161 -5 -19 192 -125 -191 0 -20 -442 222 175 -23 86 -122 99 85 121 237 -115 -284
2990 -284 248 -74 -50 -96 -229 34 -108 -306 297 55 -89 -33 345 145 237 -55 -136 263 -88 -123 130 -188
3012 -188 -23 108 34 138 79 -299 423 155 -271 -45 118 -136 -84 68 -89 -150 -205 231 263 -243 193 390
3034 390 -370 55 225 32 -13 156 185 103 39 -179 -120 24 -187 -90 -160 217 -240 -88 204 -128 -314 307
3056 307 108 -241 -47 -45 -19 -175 131 82 241 -182 483 193 -166 325 -24 90 96 -194 261 110 -173 -89
3078 -89 196 -270 -76 -260 87 262 185 -264 182 142 -391 124 239 -237 -233 -78 193 157 56 116 158 -346 208
3101 208 258 -279 144 -1 -130 20 -247 156 244 177 134 243 -266 -348 -277 425 -68 -106 -2 4 -5 -443 -82 367
3125 367 -57 -236 180 181 446 -190 231 105 -413 -135 215 -27 -117 -47 166 174 -158 58 256 39 -181 129
3147 129 -289 -65 32 42 176 136 -124 262 -34 -125 223 201 -129 98 0 -310 -220 55 135 -29 -496 -176 324
3170 324 35 -137 -75 89 34 -86 289 93 -336 218 98 -339 135 205 -216 -57 -319 -207 433 25 -381
3191 -381 -130 -17 -104 -155 -147 115 38 -142 188 430 -407 53 264 -345 -232 29 160 112 -454 -3 125 -332
3213 -332 134 138 -101 -204 79 57 59 -82 -150 56 233 -93 129 86 -15 -286 -32 189 104 -171 66 267 -406
3236 -406 -147 242 167 92 -95 36 110 -334 205 279 103 54 312 -24 -106 -370 -67 16 30 -166 386 245 -34
3259 -34 -119 37 -59 -153 57 301 -265 -296 142 291 -180 -14 138 -178 -120 108 198 176 -367 -23 156 -23 -104
3282 -104 151 -165 -1 145 -166 132 -240 -215 -60 141 -295 342 -144 210 142 245 53 -150 -31 -71 289
3303 289 -101 -95 -170 8 -106 -22 175 429 35 -62 190 -149 -93 81 -6 -5 -65 46 -13 -179 -167 428 -57 3
3327 3 35 -41 -114 -107 25 197 73 -106 -106 5 -93 -34 109 -73 219 -121 207 221 -205 -11 290 99 -5 127
3351 127 236 -25 -3 -103 263 -306 22 -8 -9 -366 -26 -68 -206 168 3 133 21 -70 57 45 -246 194
3373 194 -134 -19 -77 -47 184 -5 11 139 146 -126 -83 58 -46 -61 -64 -60 142 -147 -31 220 -34 62 166 -46
3397 -46 96 -170 60 -117 -114 -77 319 102 -161 -37 154 -74 -77 -144 -252 -92 14 294 268 -76 53 108 -82
3420 -82 92 -204 -134 129 -97 -255 344 65 71 -173 -162 5 94 -284 -40 204 -302 280 93 17 -197 -247 61
3443 61 125 -297 205 6 -246 -20 193 -57 -289 -190 341 -65 -252 -349 552 72 38 193 -113 -292 125 -1
3465 -1 36 21 -171 146 72 -188 -177 279 59 115 -229 157 -104 -150 149 236 -330 238 299 -19 -84 -55 64 -38
3489 -38 -71 112 -9 -79 -21 -64 110 -9 64 12 -80 -117 -163 142 -90 -89 76 254 86 -42 -167 49 -92 -448
3513 -448 241 105 -350 257 100 -252 53 -12 -15 -48 -171 -89 452 -199 -182 45 -91 -128 -84 -5 55 -392 -98
3536 -98 23 -37 -210 16 -46 -182 23 -172 47 71 -24 -22 72 -214 -164 -47 -123 -132 -19 -52 -233 -131 252 19
3560 19 44 -44 164 -73 -61 155 120 15 0 19 289 -134 -29 -139 46 177 -152 142 -173 -171 -84 -150 139 -397
3584 -397 88 237 -53 -102 -30 1 241 -147 -27 151 109 -90 21 -54 -75 -135 88 40 -174 -289 9 142 -449
3607 -449 228 48 -8 41 -134 74 260 -471 -19 -46 -373 -297 -30 -306 -53 73 28 97 -59 -27 106 -238
3629 -238 92 491 101 -284 55 -34 -15 -263 -23 131 -50 -40 -107 68 -100 -51 -183 131 61 51 -139 219
3651 219 -117 -338 148 58 158 27 -299 -15 -114 -74 114 -37 -13 -111 -210 123 -157 -1 179 66 41 -28 -226
3674 -226 -363 45 -96 -102 118 -133 35 171 -102 -165 35 -62 -334 -30 333 65 60 69 -9 -118 0 174 -190
3697 -190 -13 85 -94 -132 42 47 74 -125 65 58 -230 -150 -171 245 226 200 -89 -169 39 -25 -153 16 74 -61 70
3722 70 185 37 -203 -89 107 36 49 51 9 -186 88 325 -85 -68 -61 -206 -82 -470 138 39 25 84 36 -189
3746 -189 -104 -428 -209 -135 -206 135 53 -1 -53 -107 -81 -20 -322 -175 45 1 184 280 -209 -80 -29 253 79 227
3770 227 27 122 134 -79 -88 -148 189 4 -249 37 146 43 30 87 -157 121 300 -96 -56 -240 52 -78 231
3793 231 12 -55 -169 141 -10 -69 104 -106 -4 42 241 -183 128 -105 254 -11 22 -206 -94 -183 -24 -50
3815 -50 -67 38 -161 -110 -280 168 -5 41 -41 116 -128 -232 -127 267 -77 251 -48 -221 -269 -22 -54 103
3837 103 62 -165 101 241 -3 81 134 48 -103 -36 150 -237 -172 204 15 -255 -25 117 -19 -314 58 86
3859 86 -90 -13 -235 -246 -52 -147 11 -92 -87 -319 -28 -27 14 -131 -216 -140 125 -38 -69 -10 -62 -374 -259 -52 -244
3884 -244 33 136 -134 -24 -53 100 -179 128 -115 0 -51 126 191 -35 -30 -9 -45 230 124 124 226 79 -141
3907 -141 40 -57 -148 214 103 -53 168 -43 406 -37 -243 18 -121 98 183 168 -163 -65 -7 124 -196 -192 0
3930 0 30 70 -20 264 -276 -137 245 100 76 -465 43 144 14 -205 -74 160 46 231 153 -18 47 45 19 54
3954 54 -154 -144 -258 -84 -125 -111 -153 -43 -102 -41 -170 241 293 -143 -14 172 100 271 44 86 -116 -32 -66 -145
3978 -145 150 268 63 77 55 82 23 -54 46 11 -66 -218 37 7 78 310 -48 133 -76 -345 164 -47 -91
4001 -91 104 -399 -42 -126 -110 93 118 296 307 -265 -143 99 -47 204 33 108 457 -40 -241 72 51 25 -169
4024 -169 143 98 -415 -7 21 128 -52 28 -44 -12 -66 -144 -45 -58 -104 -214 310 52 21 181 77 186 21 -58
4048 -58 80 -159 -254 171 -81 -60 -90 -225 -88 136 182 -68 -83 -155 -130 130 -133 95 -117 193 -175 -302 -124
4071 -124 94 211 -60 88 23 -152 49 -51 -3 10 -231 -39 49 81 -94 -88 -149 -117 -75 38 -67 280 -55
4094 -55 119 36 -139 99 -194 118 14 -24 197 -1 210 18 -147 -151 -50 -126 -25 -171 64 -98 -56 14 146
4117 146 -2 -243 -210 -132 118 228 -16 27 -68 -40 25 -49 -188 9 152 -121 -36 -90 -61 102 19 13 13 -301 161
4142 161 133 216 -81 -43 9 -252 -31 -280 -132 -8 0 49 -125 208 -385 -168 -252 -3 -90 21 112 -88 217
4165 217 -167 -123 102 15 158 138 -110 52 -67 -81 -57 -77 148 63 89 189 -45 -24 126 82 -161 -175 -24 -303
4189 -303 -198 71 71 -75 -266 123 -18 85 -195 65 22 -355 45 -76 -40 223 -142 -6 -168 -331 -153
4210 -153 -17 284 -13 26 392 -14 -57 28 423 -25 -67 298 -307 121 102 54 -24 200 -35 108 -67 119
4232 119 -77 190 -125 85 -98 76 -282 143 33 -204 163 -121 -150 -10 240 -102 181 20 90 -61 135
4253 135 207 -175 39 40 -122 -192 85 171 31 93 8 -71 -128 -203 109 140 175 -44 -4 -80 5 -37 84 7 -121 14
4279 14 -144 60 -145 285 -286 -16 164 63 2 -26 -204 -79 250 -106 131 -223 46 -139 79 205 -2
4300 -2 88 46 -1 96 151 118 178 -204 -61 -94 122 29 92 -15 52 84 -325 132 64 -118 -173 4 -22 -153 -157 49
4326 49 154 -14 -36 -102 -181 357 24 9 259 133 9 65 406 273 -145 275 -85 122 -88 335 -72 -61
4348 -61 -73 142 183 120 81 -96 -6 3 325 85 -122 38 -308 -185 -74 -254 -149 -57 149 13 36 329 102
4371 102 -89 -4 -127 -157 -155 -387 -13 321 -124 -199 -36 221 178 -15 -10 -134 -42 -292 -211 -186 -154 -102 18 116 -88
4396 -88 167 58 -51 -75 268 199 28 60 -143 99 -376 -50 201 190 -137 14 -24 33 62 167 154 340 105
4419 105 -92 -91 30 46 -9 -66 -8 195 6 -80 -32 -248 -2 -279 0 -16 78 165 81 -141 153 8 292 47
4443 47 -171 -16 79 178 -183 -43 179 193 -117 207 -218 -40 -96 28 128 -229 -44 128 -144 -82 65 -136
4465 -136 9 161 -44 244 36 -216 -102 17 -11 -97 -37 134 63 240 72 151 -104 -193 -99 -14 7 -170 16
4488 16 -147 98 -204 24 -129 -100 97 -262 -65 130 -207 84 -172 89 170 6 14 30 -12 -35 40 -52 -37 -107
4512 -107 104 249 -43 40 -158 187 -199 110 -206 -59 -96 -46 -154 176 -110 -118 72 172 -39 26 -69 138
4534 138 82 -176 54 -99 202 -293 -5 -23 107 -101 19 22 -136 93 -56 33 -106 45 -73 -46 -140 -210 61
4557 61 125 166 363 -309 -168 -234 -107 81 -93 -5 287 13 142 147 -78 172 -79 230 -87 27 -101 230
4579 230 41 68 -97 183 42 97 295 195 -237 -72 94 17 -47 -54 93 -187 -64 174 205 162 9 49 63
4602 63 -150 12 235 165 -150 -84 -33 -18 79 207 -44 78 14 6 120 355 90 1 27 -107 -77 120 220 -104
4626 -104 9 151 109 35 -145 -127 159 -36 184 25 -53 203 228 100 227 92 71 40 -56 102 57 63 46 32
4650 32 54 -46 32 148 -166 -84 121 308 115 39 -65 191 -263 43 331 -82 -14 -136 129 137 -205 -202 70
4673 70 -83 21 -50 -81 -43 41 66 -212 127 212 -38 323 -73 233 -58 -52 143 -197 -145 -107 -256 -92 17 -132
4697 -132 -184 45 58 -68 -52 -62 176 58 -211 11 -134 -202 -117 144 159 -138 112 -14 -164 121 67 -187 -182
4720 -182 -192 -75 -110 -259 -186 259 -43 50 -54 -64 15 259 165 -5 102 -159 88 -19 -61 33 54 9 -232 -153
4744 -153 -198 113 -135 -182 111 -17 90 -93 -66 28 -43 198 -178 126 170 207 -168 -61 45 -163 -17 79 104
4767 104 -136 -68 -453 -60 315 -194 -301 -17 84 10 9 30 43 -29 -134 36 -306 -141 -165 168 -191 90 -38
4790 -38 134 -142 161 17 294 94 102 207 54 68 14 -187 107 19 120 187 10 -221 259 105 -44 -139 -280
4813 -280 -29 -65 -70 -6 266 -181 -41 171 106 -15 110 -3 10 -172 215 -215 -240 -39 -10 -55 192 -42 -5
4836 -5 42 -146 -201 118 -3 116 -19 -75 -185 103 14 103 -247 -46 -52 156 -7 69 -88 38 -102 -80 91 -124
4860 -124 -128 87 -114 -192 120 26 165 -144 -77 25 185 -37 -35 288 -132 -148 -29 78 163 -131 -190 112 77 -240
4884 -240 196 80 -4 33 -62 0 227 -98 11 69 58 75 106 -135 -260 -107 127 177 7 -279 -12 -153 303
4907 303 244 -361 -61 -231 191 -73 -134 135 -26 70 187 20 169 -158 -44 251 162 -74 158 116 79 -48
4929 -48 61 85 -205 -121 -75 327 223 -159 -171 234 -116 16 234 -147 -137 -50 28 44 57 -316 45 14 -111 8
4953 8 165 63 7 238 14 -170 -167 7 303 -342 194 -86 -15 -175 63 89 -11 126 -58 414 -39 -180
4975 -180 66 -107 149 246 147 93 -131 -187 -69 -211 -160 222 27 350 75 -83 436 267 -253 8 -82 -104
4997 -104 -7 -128 76 21 67 -24 -5 44 -3 90 1 -85 -19 70 178 16 57 42 -10 20 -84 -3 129 86 48 -110
5023 -110 -260 47 64 -40 -22 47 -35 -299 66 129 47 23 3 206 6 -354 134 -34 -115 102 13 -13 191 -183
5047 -183 -17 -90 13 -23 -106 177 138 128 173 49 -272 -114 -35 -94 -134 -41 -231 -297 73 -133 25 -112 159 38
5071 38 114 -182 -429 338 185 -46 -46 -3 -36 240 198 202 -146 -11 276 107 -250 -116 8 170 128 23 65 53
5095 53 205 98 20 34 29 -136 -95 -228 202 176 -4 -72 -189 174 32 -162 252 -348 -113 -263 -95 440 -217
5118 -217 -396 259 -7 79 -17 -48 110 31 -179 51 -181 -15 171 142 -234 98 69 70 -221 -160 12 -62 127
5141 127 -285 -264 70 3 18 76 4 3 105 89 -73 -151 10 37 -166 -49 251 -189 83 -178 -199 -2 -22 -184
5165 -184 -126 158 101 216 -180 288 -61 42 -73 128 -17 12 -118 -123 -100 90 7 25 -60 171 84 -192 -137 309
5189 309 -177 -90 -163 -224 -68 31 60 275 342 145 3 -22 -223 135 252 90 -83 309 19 112 62 -126 -161
5212 -161 -29 -35 -146 -200 -4 -234 -57 65 -205 83 -218 14 -81 75 121 182 42 159 132 36 -48 113 -124
5235 -124 -198 76 185 12 39 144 -57 134 29 196 -255 -42 -4 -284 128 -48 -15 233 92 -125 -138 -157
5257 -157 69 -47 126 118 -264 -35 -77 -271 -26 -192 88 -4 -40 -211 -126 67 -98 19 -67 178 -31 44 243
5280 243 -84 4 42 -9 241 -308 24 94 122 15 130 63 -39 -28 -33 145 -132 46 -206 -36 -134 133 -81
5303 -81 155 -94 83 158 -89 -63 -133 -6 13 136 -200 53 -61 112 -156 29 -84 162 -41 -241 -56 -98
5325 -98 478 188 137 108 62 -237 58 -124 -170 55 68 -147 -139 103 70 137 57 -77 -113 11 -116 -183 116 21 113
5350 113 86 -11 -200 -213 -157 -30 101 45 -197 96 -16 32 7 -222 -139 72 44 83 29 98 78 87 106 52 -56 -205
5376 -205 -125 -71 -119 337 -73 -83 152 -8 358 71 25 179 142 -24 -312 111 -154 -201 -38 175 59 -140
5398 -140 -58 185 225 -10 -182 -2 255 56 146 62 108 51 -124 15 -170 -117 141 -238 -123 84 -151 -192 -194
5421 -194 -48 33 41 -41 147 -35 162 -100 -422 -94 165 -32 -76 190 95 -135 120 -176 20 -139 14 -70
5443 -70 -235 -85 -30 147 -29 118 25 -150 -43 -6 81 -177 -84 -132 18 19 345 19 -97 -2 -80 -50 -56 58 -37
5468 -37 125 -227 49 -14 33 -85 62 48 -75 153 -228 82 200 69 -129 -22 2 157 -137 301 -166 -81
5490 -81 -21 88 -29 -141 103 183 -251 30 50 -57 128 -62 -11 -179 -127 -17 34 179 5 -71 131 -265 80
5513 80 233 92 -39 -99 152 -11 6 -70 -169 -253 -198 -107 71 -147 -286 -107 -146 -5 35 -105 -17 6 163 -51
5537 -51 41 -22 176 1 27 -134 41 54 -23 2 -111 13 -78 165 -20 5 -23 -55 -92 -139 -179 -67 29 -162 -275
5562 -275 -31 -89 -28 -64 29 128 -175 34 114 26 -9 -127 44 3 -125 -107 -108 74 -111 -85 1 -140 -71 172 400
5587 400 -151 -3 -52 100 41 18 -101 -7 210 -108 185 -137 107 110 164 -263 345 232 -30 -81 76 97 -171
5610 -171 -19 175 19 -22 151 120 96 123 -185 172 -65 31 257 326 41 106 -34 199 -94 301 -80 -252
5632 -252 220 148 109 -30 -102 84 10 166 -166 -392 -127 -73 -147 -161 -70 210 154 -8 -44 126 -14 -175 17
5655 17 -134 -20 -117 143 -130 17 352 -41 266 -24 -5 358 -60 -128 -166 -117 -32 183 90 -116 81 -260 -65
5678 -65 2 -150 48 29 -73 155 -14 -1 155 165 -187 -116 -141 -61 321 -127 -6 -107 126 -133 -122 -78 -193
5701 -193 -136 164 -40 -140 24 -64 -194 25 -271 -20 59 141 -72 13 -32 -78 314 84 -18 -1 16 381 -194
5724 -194 -32 -97 88 135 -92 -125 -93 -232 -19 67 -125 -170 -15 -143 -36 -79 184 221 149 -214 34 260 -119
5747 -119 87 103 -28 -54 -62 9 -24 149 -198 11 246 -44 -31 123 47 -217 35 -290 -101 -69 -103 -138 -101 -78
5771 -78 18 -12 -92 19 41 -290 2 -41 106 -138 174 118 158 41 -41 -114 -3 25 83 138 32 -91 260 136
5795 136 -221 89 29 93 -130 -123 39 -273 -161 119 21 -125 10 76 91 4 -52 199 -109 -150 -98 -165 -4 -12 -157
5820 -157 135 162 -81 -17 225 55 56 118 -112 -10 18 2 105 -119 73 153 -65 -22 183 -271 -83 -21 287
5843 287 -13 -83 -251 96 -76 -209 -94 -46 -36 -184 -103 316 -229 -145 -152 -151 -116 230 -194 -40 -187 16 141
5866 141 -82 -405 33 18 213 254 57 13 -52 119 -187 -166 68 50 -3 45 -102 117 -18 -29 79 163 -103
5889 -103 -110 -48 -195 141 -362 38 84 -178 -85 161 188 -168 154 -112 160 110 -172 134 -4 59 -66 -46 -69
5912 -69 25 147 66 147 -112 162 157 46 29 -167 94 -9 49 335 91 -308 0 123 -171 313 0 -187 398
5935 398 -189 -197 47 -58 -239 -110 -40 76 -226 -151 -29 173 -108 178 185 -66 -176 13 -47 -114 174 -19 35
5958 35 -111 -67 77 41 34 -131 1 191 -199 107 86 -202 -81 -19 -229 -295 181 -142 -158 -70 -130 24 156 230
5982 230 -2 -252 102 69 185 -203 -178 -11 40 -34 167 -425 261 6 209 168 -48 89 -320 -75 -57 186
6004 186 -62 145 0 -300 -174 63 -80 -126 -441 33 41 50 143 118 -121 -54 121 25 69 76 -209 -74 116 207
6028 207 72 71 -21 141 32 -113 292 -318 -26 -145 204 34 -112 -42 -130 -9 -175 76 197 34 152 72
6050 72 123 71 -136 102 -102 -212 70 147 -123 189 -107 -215 62 -247 -304 74 -268 282 -84 3 -16 -120
6072 -120 -196 -5 204 -124 -85 261 106 74 116 -19 -431 -199 -97 45 69 -156 -26 131 305 -33 -211 -111
6094 -111 -121 115 88 132 211 -163 205 161 -210 -375 -143 -296 49 -113 67 -78 112 -126 -19 189 -123 197
6116 197 -359 -66 95 25 169 79 93 -108 119 -22 33 83 92 90 36 -153 -80 30 91 -31 -49 112 180 134 -194
6141 -194 -202 -175 -46 59 -113 -54 -142 -178 -30 140 -100 -66 -217 3 147 -240 238 277 -35 -107 -11 -209 279
6164 279 -69 16 -156 -125 -156 207 419 82 75 154 -8 1 202 25 -28 -138 -101 -373 -222 -15 257 -155 99
6187 99 197 189 -35 -70 45 -83 -108 -55 -59 -42 -11 130 118 -16 571 -41 10 -154 -12 -102 90 -245 -37 -68 -81
6212 -81 -5 -219 102 9 115 146 162 28 75 69 154 34 -62 85 -229 -95 217 -155 24 -119 18 -253 20
6235 20 -36 18 -193 -194 32 -28 -173 -27 -67 -146 -106 27 -133 -148 -5 121 290 128 38 170 -35 170 243 -353
6259 -353 -27 -249 111 116 157 -44 43 -20 193 -5 -99 -84 81 -123 -287 -75 -283 -119 281 4 -160 106
6281 106 -141 84 -46 -22 -20 -162 -31 -26 165 87 67 -108 -131 173 49 42 -30 9 -113 189 -35 284 337 100
6305 100 -314 -40 133 169 -321 135 117 -273 -44 -184 -175 -126 -170 46 58 32 15 92 -101 10 251 -135 -69 90
6329 90 -30 -27 -71 -161 25 -86 38 239 -88 201 -75 -94 -33 -95 107 -165 336 -110 -323 -295 52 -80 227
6352 227 -173 -157 -79 -164 -24 224 219 -99 106 162 -8 -131 350 42 -194 -175 -81 110 -146 -203 -169 -26 -248
6375 -248 69 16 1 27 61 -28 -301 -302 -138 210 3 -127 5 90 -289 -179 83 -296 27 -73 -11 51 -77
6398 -77 -312 -140 -192 93 -213 18 -56 -77 70 246 165 -175 104 119 -80 -401 -98 5 4 -154 9 -42 -257
6421 -257 46 47 -145 11 -15 219 -10 28 -89 26 86 52 191 4 64 -158 -179 11 -111 -205 196 25 -8
6444 -8 -163 43 -58 15 63 40 -153 270 49 120 -24 333 242 135 75 211 102 264 -223 -42 -184 15 -47
6467 -47 40 67 118 120 -144 173 87 202 33 -178 314 177 -4 -118 -50 191 -132 141 -183 165 -9 11 47
6490 47 10 -9 130 -259 123 77 -189 -20 -96 -133 -153 308 282 -47 -104 -1 -163 -31 -43 39 25 -64 -104 -59 172
6515 172 -118 -167 225 216 -25 -6 -258 -100 -81 -171 133 -20 163 -41 -112 -4 210 222 183 70 -15 -214 -167 -51
6539 -51 37 -14 -178 145 -5 230 -3 169 51 254 -253 -62 -49 -48 94 -148 113 -146 15 -207 -150 130
6561 130 191 -169 -260 70 47 217 -238 -78 -126 -200 -123 271 32 54 -72 -29 -82 -30 259 17 -248 38 -158
6584 -158 -288 -45 -132 -134 229 -155 -191 154 105 -141 -111 -74 -35 97 -53 -12 148 -184 -59 127 -16 266 -97
6607 -97 -34 -4 343 231 56 -133 -205 -123 -350 -135 -41 23 -42 -203 -100 -57 -93 -68 263 41 -101 -153 -37 156
6631 156 28 -45 31 174 -52 71 123 -172 308 15 46 95 47 60 41 152 -86 42 -98 66 -59 27 2
6654 2 79 -210 219 51 9 -330 181 -103 127 -28 119 154 9 -78 -118 18 76 -163 -102 -196 134 73 173 -167
6678 -167 77 129 240 -184 197 252 52 247 29 -75 -123 148 -180 -245 -208 112 -89 231 92 -72 181 344
6700 344 -76 54 -130 -12 83 -59 102 -219 30 -67 242 157 13 -67 -2 60 -139 152 -95 -270 -143 -142 110
6723 110 -45 -37 -52 151 93 219 64 -133 -104 -66 -39 -105 336 33 72 38 73 218 129 -83 303 226 -18 15 -136
6748 -136 71 -64 -41 182 -35 77 -98 -28 -112 -75 167 82 161 -44 152 62 37 148 41 -154 -174 7 -144
6771 -144 -180 145 326 -151 80 64 -47 181 42 -62 190 138 170 37 43 -180 17 226 70 -132 -46 80
6793 80 -50 -105 242 24 -106 -59 -43 -130 -160 96 358 100 27 58 -146 -61 149 -51 -120 -141 31 -161 -75 -184
6817 -184 95 110 -155 -67 -28 -74 74 -33 71 -83 87 110 -182 -95 94 -10 -28 181 7 -55 -64 -194 17
6840 17 -30 17 215 -83 -53 -4 -28 112 87 -212 -200 215 104 217 184 133 32 151 22 -80 136 -21 -213
6863 -213 -212 -53 -111 -131 331 66 27 -158 24 43 4 -40 -80 35 -104 -86 -97 275 -215 -51 127 -55 174 -10
6887 -10 51 90 227 105 -187 66 -216 -84 -54 9 -88 124 124 -112 -121 158 181 48 -139 -243 -92 -12 -169 133
6911 133 61 163 -181 -105 127 9 100 46 124 23 -115 91 -3 -117 312 60 106 -132 23 23 65 -49 135
6934 135 157 41 33 -2 -3 -195 189 -130 -1 230 -16 -194 -206 -167 81 62 -8 22 34 -119 -258 71 50 101 -364
6959 -364 118 138 44 220 -80 191 37 119 -59 66 6 27 -58 98 -185 107 17 -126 -70 246 -8 142 -72
6982 -72 33 20 -161 -167 1 60 46 -59 -101 100 -7 120 -208 110 15 79 -46 85 -163 149 -204 52 -146
7005 -146 67 92 -83 -71 -62 -219 -79 194 31 39 109 -202 17 -145 -253 129 62 -72 -17 41 154 132 21 -63
7029 -63 -103 245 -44 -64 -62 -112 8 -210 -128 164 15 203 65 99 47 -6 -240 -109 -57 286 -179 117 46 -88
7053 -88 50 -174 -298 280 189 -182 -118 168 -69 25 217 -110 -113 -125 101 95 221 135 20 -166 -354 103 359
7076 359 49 -99 61 190 -59 -200 -91 62 179 100 -156 -45 -39 118 11 146 -16 -278 139 -196 -287
7097 -287 -100 -4 -1 -9 -51 38 -1 -77 -125 -90 -67 -171 40 -9 -37 -64 132 -89 7 -12 97 0 -203 130 73 26 -108
7124 -108 255 -182 169 122 -120 -113 -243 -96 -24 87 263 -103 -145 250 6 122 53 33 -54 12 -53 115 -275
7147 -275 32 -147 -77 -379 20 16 -27 -25 64 -92 -133 -220 339 170 -188 161 -177 -113 132 59 73 84 108 -28 199
7172 199 201 -104 160 96 78 -76 266 121 52 -109 -141 -46 72 336 93 45 -25 -127 -165 -112 152 -20 216 165
7196 165 14 -39 -79 -23 151 -58 162 -188 67 210 111 -30 228 -21 41 73 271 78 63 86 -83 -67 58
7219 58 -108 -216 68 -222 -128 -15 47 -326 -309 69 -93 -237 -39 -96 -97 165 -2 -52 74 150 235 -18 -9 358
7243 358 167 -174 -62 343 28 -18 -251 -46 -229 -91 -34 -79 45 85 171 -48 75 181 -182 154 -94 -69
7265 -69 14 -123 -6 -202 -129 -180 -100 -157 308 96 159 -93 -82 159 -280 152 312 118 109 116 -158 -100 -112 -267 -150
7290 -150 151 20 -11 5 32 -139 64 186 -23 -134 83 265 -14 176 0 3 16 107 16 141 -124 -283 154
7313 154 -5 213 -46 227 24 45 -143 -207 -1 180 5 -191 -75 -121 -84 -32 -167 -77 -5 97 -174 -38
7335 -38 192 114 -135 -183 112 116 225 -141 226 107 242 -1 -85 109 -191 -141 116 -145 21 -28 -59 37 120 -6
7359 -6 109 86 -134 -76 -3 18 -166 -200 6 -72 -17 -205 159 85 -260 204 174 -87 13 -52 -43 98 -112 69 -127
7384 -127 103 206 60 155 -44 -180 -144 129 157 -6 -79 90 -11 109 143 -126 -103 -110 80 215 83 116 -10
7407 -10 22 62 -188 119 207 -17 295 74 -163 195 -105 -8 -135 49 85 -104 76 134 47 -42 77 -8 49 -203
7431 -203 -35 -102 -46 -174 32 -82 -61 62 -130 232 -81 21 -211 -230 33 26 256 229 290 -8 -47 193 190 7
7455 7 -66 306 65 252 114 -153 75 -112 121 56 -66 -19 -179 32 81 -110 124 -100 50 11 -44 -174 62
7478 62 -160 6 -62 -53 -98 -23 -72 60 -163 -289 -258 -12 51 -246 -137 -117 30 83 -31 104 273 -106 116 67
7502 67 -58 76 94 105 51 -16 -157 -28 -90 -24 110 23 34 -46 -227 29 -100 161 22 -113 259 -9 -79 -161
7526 -161 275 -158 -21 -36 -13 -190 61 -380 316 140 51 -119 140 91 148 10 -148 1 -192 183 -37 -101
7548 -101 -48 6 25 64 -79 -164 133 135 8 169 114 -27 98 52 81 -16 138 119 4 188 81 -162 -10 67
7572 67 -117 200 -116 281 367 107 -229 214 -32 229 -186 -53 119 -33 -128 218 50 160 -3 31 90 3
7594 3 -147 -186 16 -194 -16 75 76 134 77 -122 -191 -293 -55 -55 67 10 37 -25 37 -79 67 -170 50 -53 260
7619 260 261 -217 13 83 -7 -130 112 -27 -179 0 -185 46 64 -166 163 224 -147 -286 185 37 212 -17
7641 -17 -149 30 71 15 22 -234 -155 236 101 -6 145 -106 22 235 -136 272 1 90 209 -208 11 428
7663 428 67 290 87 -14 -162 -20 -55 111 -44 -216 55 -148 -79 -174 -256 -10 22 -10 -35 -62 52 19 -46
7686 -46 19 26 -75 -29 -226 138 198 -29 212 111 -232 -290 -315 147 -19 -92 54 -93 -119 -83 31 -93 -88 -186 -145
7711 -145 71 113 -5 99 -429 191 -210 84 -17 107 7 -87 -66 -126 -25 -27 -188 -214 38 -56 4 0 229 -124
7735 -124 190 -113 -51 22 -65 170 146 -246 -10 -89 31 56 150 114 -96 -158 -124 53 -6 241 47 86 -262 25
7759 25 241 194 -98 -83 -66 164 -8 74 -62 -110 60 23 -19 326 -162 -171 -97 -40 57 6 -169 -172 138 220 -100 198
7785 198 142 -44 -50 24 67 -25 -141 -130 -253 236 -43 -43 68 -92 -51 -43 177 -106 131 58 163 14 -72 -50 -6
7810 -6 151 -30 -27 30 -11 -45 -56 84 -194 40 -212 -127 -167 95 -326 -37 160 -386 224 -130 42 -9 -13 53 4
7835 4 -256 108 92 -157 7 89 -148 312 -17 132 121 -102 -145 -44 97 -14 119 -104 -31 167 41 -81
7857 -81 -209 -369 89 172 73 154 72 202 -72 -110 55 19 -49 177 -109 -14 -128 55 -35 105 106 -138 -56 -311
7881 -311 -109 -106 70 59 -149 44 130 35 84 -93 174 -5 -96 -15 -262 172 -163 -98 243 115 -17 213 -85
7904 -85 -149 -71 -95 64 -8 -27 79 -32 -180 -231 84 285 -11 -151 176 87 -129 53 226 4 -123 77 -62
7927 -62 244 -77 120 90 108 -99 -3 -112 29 136 16 -153 -2 -150 -20 -32 -36 133 -58 210 -37 222
7949 222 127 75 161 48 50 178 -59 -140 34 -63 -275 151 -14 -66 13 -214 163 -163 -112 14 -189 529 -24
7972 -24 -126 -129 122 37 -13 94 -135 -39 43 189 -9 17 -82 129 -130 39 -222 -125 -182 -72 43 215 58 156
7996 156 253 -114 44 204 1 325 131 42 -41 -40 11 -72 105 -193 21 -157 162 -131 -126 -153 -1 343 -56
8019 -56 5 -83 245 344 -95 22 -29 -53 -86 3 -134 262 46 -40 -25 86 63 -47 72 -104 -115 43 115 62 172
8044 172 -111 -42 -39 -85 -79 -56 35 20 -35 119 -105 135 -66 25 4 -151 90 23 -92 6 82 0 -155 348 31
8069 31 -103 109 170 -53 17 -13 -134 154 -64 54 113 292 143 58 111 50 51 101 -127 244 154 21 -155 171
8093 171 109 180 229 -285 127 54 7 -223 -62 31 77 111 -169 -81 42 161 85 270 128 -46 128 -195 -55
8116 -55 188 15 -325 13 39 76 -61 -122 17 -81 -96 137 110 82 50 200 147 -454 1 56 -107 228 -241 24
8140 24 -317 274 143 -261 -72 -83 17 -212 -40 118 115 -109 185 -71 132 221 -158 60 60 -79 -59 31 111
8163 111 -78 36 303 -152 136 227 -133 -114 -276 84 69 162 5 34 95 -281 184 6 -66 26 61 39 34 -22
8187 -22 96 296 -265 -99
8191i9
$$ Imaginary data points
##PAGE= N=2
##DATA TABLE= (X++(I..I)), XYDATA
0 0 0 0 0 0 0 0 0 0 0 0 8 -8 8 -8 16 -16 24 -24 32 -40 48 -56 64 -80 93 -109 127 -144 168 -192 221 -252
32 -252 285 -324 365 -412 461 -517 579 -646 719 -800 887 -982 1086 -1198 1323 -1459 1609
49 1609 -1771 1952 -2150 2368 -2615 2888 -3198 3549 -3954 4422 -4975 5638 -6451 7473 -8810
64 -8810 10631 -13276 17495 -25298 44680 -202598 -207468 97393 -65482 -120986 3086 163611
76 163611 148886 155447 168439 70027 -103845 -86843 -34444 -87400 -159273 -124420 -32471 52164
88 52164 52793 62486 93798 85236 61499 56071 2167 -61057 -97919 -81494 -35135 -45661 -76132
101 -76132 -13141 59626 78531 74060 61368 58232 34071 -38023 -55134 -23211 -47670 -89794
113 -89794 -71703 -9610 39511 35517 47992 92193 56071 -12002 -3457 5904 -24402 -54885 -76653
126 -76653 -50078 4867 18398 7804 14263 57693 82029 6578 -47814 14047 30022 -41523
138 -41523 -59545 -28798 -15265 -6696 18747 38397 1442 -26922 39145 77186 9362 -40093
150 -40093 -32547 -13560 1729 -10440 -22642 -13725 -12152 9626 40010 27882 11178 6844 -16
163 -16 9110 28 -34926 -35433 -12924 4779 11999 -6124 -1413 26967 14460 9441 33270 5461
177 5461 -43228 -34416 11441 21057 -28364 -34877 27455 25822 -20084 7741 39368 7733 -21373
190 -21373 -11537 9344 207 -19871 -2691 3029 -19455 1066 26037 7830 -6345 -5501 7096
203 7096 22519 -1521 -25627 -5327 11022 1437 -18041 -17849 15054 18191 -9677 5059 20195
216 20195 -6579 -11177 8367 9297 -8827 -22692 -3826 11419 -8675 -3726 21511 6250 -7825
229 -7825 2409 4779 710 -6465 -4923 5005 -8472 -12159 11403 4665 -8637 9532 11735 -6914
243 -6914 -11770 3632 18206 -3461 -23456 5563 14372 -13371 -5664 10587 -771 -5477 3830
256 3830 10212 -1418 -12494 8826 13191 -18977 -11859 16386 3505 -12185 -4866 7024 10458
269 10458 -1636 -4990 5028 -1310 -2295 5102 -6242 -6933 4613 750 2403 2471 -7339 1033 9080
284 9080 1443 -3592 -6045 1718 7942 -7299 -7161 10223 814 -8587 1105 4247 3388 -1886 -5329
299 -5329 4852 3026 -5064 2266 -547 -6162 3900 3500 -2409 -1073 -1496 4079 2787 -5838 3221
314 3221 3978 -8353 1271 7025 -6363 -5285 5431 6358 -3534 -9856 6911 11090 -11255 -5880
328 -5880 11999 -1303 -8589 3358 2914 -3410 -2499 5827 4767 -11279 -2941 15467 -1035 -13361
342 -13361 3788 7079 -2600 -4082 -564 4586 -442 -4204 4597 603 -5830 4435 3148 -4556
356 -4556 -482 434 1425 1835 -4646 117 4389 -2742 -181 2113 -2100 1943 1146 -2946 1248 -144
372 -144 525 2780 -5212 -2010 6801 -326 -3139 470 -1027 3228 1910 -5272 44 2826 -50 -222
388 -222 -2878 1303 4978 -5199 -1911 7503 -2632 -5053 4367 2104 -3462 -1877 3928 3842 -7980
403 -7980 -3362 11284 -487 -9453 4457 4506 -4930 -1111 4287 1375 -6312 -1925 9498 -613
417 -613 -9950 4642 6440 -6099 -2253 4402 2048 -2875 -4421 3478 4176 -5067 -76 4108 -3695
432 -3695 -1244 3801 642 -1304 -3141 1139 4914 -3766 -3049 5606 -797 -3629 3001 1139 -1142
447 -1142 -1684 52 3143 -1810 -2870 5238 -19 -5564 2171 2707 -948 -279 -2259 602 3580 -1133
463 -1133 -1849 -673 586 3682 -1835 -3796 4027 80 -3678 3441 1911 -3443 468 1835 -16
478 -16 -1954 72 4562 -2724 -6348 6019 4797 -6134 -780 3905 -1313 -2313 506 3294 -17
493 -17 -5530 1477 5004 -3158 -1409 2461 -1534 -1506 350 2023 2344 -4210 -2878 4965 -234 -3305
509 -3305 2428 969 -3411 -1653 3132 4031 -4325 -4761 5744 1473 -5871 2773 3410 -4101 -1081 3159
525 3159 1294 -2637 -1503 3557 -238 -4918 3515 3403 -4882 -300 2658 -656 -338 -975 -865 2133
541 2133 676 -562 -430 -1329 2084 923 -2653 1415 592 -3327 2286 2610 -1943 5 -111 -1480
557 -1480 342 562 1950 202 -4046 1196 2798 -1863 -11 1304 -1601 -102 -722 807 3214 -1332
573 -1332 -2957 2087 727 -1150 -27 917 909 -2702 -1769 4921 496 -5329 2205 1816 -3730 708 4221
590 4221 -604 -4120 -118 5065 -634 -5117 3470 2862 -5648 -154 5214 -871 -3384 80 1677
605 1677 526 -2616 964 2523 -2535 -1040 2603 -894 -864 240 -144 1261 -706 -1426 2526 -38
621 -38 -2483 1584 851 -1603 -531 517 1978 -787 -3358 1867 1865 -2727 655 1743 -1694 -448 122
638 122 548 1604 -1131 -1119 192 -515 1148 704 -1571 1121 138 -1972 2265 1144 -3175 160 1662
655 1662 -737 -1244 757 2234 -983 -3010 2520 2028 -4293 -52 3833 -1640 -2178 1668 1555 -1012
671 -1012 -2462 1211 1957 -3037 -469 3224 -1479 -2300 1121 823 -220 -1411 -444 2331 -1209 -1927
687 -1927 2485 607 -2378 209 741 -35 -1076 -652 2277 -76 -3091 1688 2001 -2682 -383 1834
703 1834 -258 -1124 -531 1592 806 -2518 -53 1860 -1333 -358 1440 -809 -356 147 -319 850 -51
720 -51 -450 599 -942 84 1651 -723 159 866 -1553 466 1565 -1367 -167 942 -710 -399 -432
737 -432 846 871 -1927 -63 2125 -1432 -1231 2006 154 -1212 -159 336 773 -1323 -662 2534 -343
754 -343 -2133 1483 752 -1155 -292 655 751 -709 -1584 1776 957 -2505 491 1716 -1089 -955 628
771 628 815 -356 -2200 1435 1827 -2548 -845 2620 -458 -1780 588 957 -74 -1304 385 2010
787 2010 -1320 -1131 1958 -542 -1445 1189 24 -477 1 -29 772 5 -782 976 480 -1352 853 -220
805 -220 -211 980 -776 -428 1105 -899 -650 1026 -96 -193 -410 -478 1207 -601 -735 1656 -456 -1852
823 -1852 783 370 -346 -109 -195 830 -131 -1381 831 981 -1340 -150 775 -177 -302 -738 477 1120
841 1120 -1823 -468 2078 -709 -1376 1355 219 -1093 -749 1002 1305 -1634 -725 2422 -453 -2228
857 -2228 1425 969 -1149 -402 648 792 -556 -879 1813 -28 -1836 1133 900 -1133 -298 239 392
874 392 -228 -862 566 605 -852 89 1053 -451 109 -75 79 823 -759 -540 1216 -381 -1150 694
892 694 279 -271 -49 -339 343 42 -725 654 534 -1081 632 357 -342 338 -335 91 583 -876 -59
911 -59 1039 -147 -269 227 29 315 -732 -457 1369 -538 -1253 1438 418 -1141 -99 606 272 -880
929 -880 -242 1681 -174 -1860 1021 891 -1527 -102 1142 -432 -693 -43 844 -49 -1518 463 1215
946 1215 -1327 -749 1154 103 -296 -195 263 726 -798 -314 1269 -313 -772 604 72 -1 -204 -158
964 -158 773 -645 -1030 864 535 -1038 469 777 -182 -106 -41 336 223 -526 515 724 -915 107 410
983 410 -414 -275 254 -439 512 -106 -481 141 3 34 -96 -294 455 -381 -1062 713 636 -928 60 1095
1003 1095 -772 -691 513 470 -82 -987 504 574 -1255 -54 1182 -722 -630 538 10 222 -309 -132
1021 -132 516 -853 -606 1031 32 -800 85 14 231 -96 -142 943 85 -1137 309 819 -804 -33 678
1040 678 250 -390 -521 718 481 -1353 178 1064 -968 -99 1017 -220 -391 -139 280 167 -423 111
1058 111 665 -395 -355 85 -208 324 -33 -446 460 189 -325 40 175 -394 -128 -214 527 264 -729 154
1078 154 633 -1017 -320 768 -146 -625 219 296 45 -389 86 341 -405 -539 537 -113 -134 -309 -242 423
1098 423 1 -532 562 605 -624 -275 663 18 -192 -140 322 -57 -830 591 654 -878 -254 605 -229 -159
1118 -159 604 579 -151 -743 288 796 -621 -201 830 -361 -406 406 505 -24 -343 -355 377 -28 -188 145
1138 145 253 -183 -228 -40 237 329 -569 50 559 -552 -243 481 -253 -89 -57 -11 179 -438 160 376 -571
1159 -571 -152 514 -270 -235 180 9 289 102 -227 348 71 -332 209 -157 137 93 -145 184 248 -656 76
1180 76 587 -682 -377 262 67 -202 -364 231 276 -604 51 551 -204 -421 319 42 -418 107 125 279 -265
1201 -265 -554 547 126 -595 54 188 -170 -40 -79 186 200 -641 259 371 -392 19 316 -334 58 -223
1221 -223 147 179 -767 -253 460 -390 -300 360 -35 -232 120 51 102 -173 -301 157 -62 -414 231 39 -39 -21
1243 -21 -351 61 224 -453 231 247 -249 -5 53 -104 128 -210 -66 393 -639 -362 341 -229 -209 127 191
1264 191 60 128 -35 286 -143 -439 444 195 -430 54 7 -206 -121 -283 180 108 -270 128 209 -457 -144 310
1286 310 242 66 -285 366 384 -328 -3 291 9 -295 182 209 -136 -66 85 551 -237 -226 250 166 -151 185
1308 185 349 -199 -328 -345 123 87 -289 247 431 -353 87 103 -122 -206 -79 358 -53 -178 -146 299 -23 -136
1330 -136 215 80 -219 109 202 -152 -75 -242 65 211 -259 248 103 118 -22 -354 -100 -19 -262 219 156 -302
1352 -302 11 -141 31 100 -111 -64 427 -1 -154 61 176 106 -53 -152 -54 -244 -61 351 -84 -135 162 -16
1374 -16 -147 -25 236 81 -191 -142 123 231 -281 216 413 -216 -137 -177 -115 -216 -89 -246 254 -25 -315 252
1396 252 -13 -46 -87 -91 295 35 -31 -131 -111 -64 -37 115 247 338 130 81 72 -65 166 47 -347 13 240 -59
1420 -59 -196 170 -110 266 188 104 82 -15 -130 -29 140 -186 55 -73 61 141 -242 128 57 -137 -15 -27 -249
1443 -249 -93 -74 -38 79 -73 62 322 -347 -117 145 -14 29 91 176 85 -240 -126 214 -170 -308 213 -8
1465 -8 -105 -138 -38 167 -202 50 -192 35 -146 -132 121 -187 -290 35 287 -25 -245 79 190 -159 214 19
1487 19 -86 129 -6 306 -58 51 -295 466 43 -166 516 -97 -221 -136 -124 123 -40 53 104 40 -272 189
1509 189 97 -284 66 -126 36 -58 -52 -210 51 -148 -343 -282 152 222 -337 -288 317 -124 -25 220 155 -387 -316
1532 -316 208 -159 22 -96 345 181 -72 -54 100 -341 -189 33 -99 -149 -146 -113 -78 -440 -82 239 -242 -72
1554 -72 -207 133 -91 -248 -135 -106 -14 -294 247 -37 -483 118 117 -220 -119 -246 152 -49 -303 41 43 -203
1576 -203 -17 158 -252 -39 89 163 -8 -94 -174 -182 36 -166 -77 -67 51 -69 -138 -50 19 -289 -66 217 41
1599 41 131 -108 118 1 -207 -59 176 -71 81 156 -163 -6 115 37 17 -179 -28 -42 -93 -402 217 -72
1621 -72 -102 -131 73 -81 72 44 195 95 -587 58 252 -188 -257 -46 198 -128 -106 278 -51 -157 11 273
1643 273 -126 -19 -116 184 -152 176 -39 199 -151 -11 289 215 40 -67 -93 -58 -108 -37 237 162 -390 -150
1665 -150 161 116 -27 -288 -99 -21 -364 92 58 185 -196 192 -218 -55 74 26 -310 -213 211 -82 -187 -4
1687 -4 315 -132 22 123 58 -57 3 -59 -99 -39 -185 69 129 -61 -262 54 8 78 -340 102 503 -13 -289
1710 -289 239 -4 -20 70 -52 204 -431 59 180 99 -200 195 26 -218 282 42 125 108 -285 201 42 -178
1732 -178 35 200 86 -25 -119 47 -126 -68 114 97 -198 -261 -40 338 12 181 -142 473 -175 197 244 -3
1754 -3 -163 162 2 -140 -2 7 106 -66 -85 37 249 -100 88 391 -56 11 -121 -249 239 -124 71 413
1776 413 -79 -20 -57 -42 -225 -57 -223 144 237 -173 45 41 -336 -36 43 167 200 -134 320 -320 -195 72 254
1799 254 4 -143 -14 -130 -199 -11 192 302 36 96 -33 -130 -223 -124 39 165 -256 -146 223 -201 214 134
1821 134 291 -210 18 7 -216 -172 -11 151 94 -482 130 94 -139 54 141 39 -107 -10 327 -84 -278 147
1843 147 207 -242 -145 151 -102 3 -99 -331 262 -15 -174 214 -82 -266 -115 103 96 56 12 28 -16 -321 86
1866 86 121 -398 7 -90 -109 -122 -7 -54 -90 -336 153 -101 226 -114 -131 16 84 -185 78 285 -87 -65 231
1889 231 234 48 227 -56 -122 37 -211 274 -54 -400 261 401 -88 -285 113 20 24 -273 -45 191 -207 -458
1911 -458 362 -115 -452 -18 118 -342 -197 -21 -154 -147 -278 371 56 -285 44 237 201 198 -47 267 69 -336
1933 -336 273 -56 169 260 125 274 -93 -247 82 183 -467 -57 47 -165 38 126 42 356 70 -261 6
1954 6 56 -22 -34 127 -299 -23 122 5 149 -378 -41 482 -231 154 -22 175 39 -114 -79 44 -271 32
1976 32 197 -46 -102 27 -121 -285 33 45 45 24 -49 319 -214 -398 303 109 -308 44 -79 68 65 11 79 210
2000 210 -232 160 206 -43 -42 -8 321 131 -127 -32 342 18 116 139 177 -339 -1 234 102 -179 43 309 -159
2023 -159 -294 241 129 -121 -23 -162 10 321 82 382 374 -48 181 169 7 -24 -205 -322 191 -316 -254 93
2045 93 171 -164 -60 -139 -110 -176 -80 167 4 -99 288 44 -520 348 355 -114 -150 -255 0 -92 -137 248 -278 -96
2069 -96 -52 291 -201 166 -14 -58 169 -86 89 416 233 -135 35 172 -291 -317 -27 170 -170 -110 567 -5
2091 -5 -93 86 222 32 -206 41 132 -79 -46 132 259 -176 217 -25 -128 -99 166 -120 315 15 -252 272
2113 272 212 -43 45 90 157 -16 -262 167 -211 -379 309 132 -250 -79 88 -80 72 -68 162 81 -245 101
2135 101 28 -10 140 45 -165 -14 58 62 308 -166 -216 200 39 191 185 180 -230 -304 13 316 -154 -419 405 46
2159 46 -87 -117 237 163 -86 257 156 -111 -301 253 55 -373 -52 161 -56 40 -195 -111 273 -71 -13 436
2181 436 -216 -152 -87 -157 174 -365 139 199 106 -120 4 360 -141 -176 -26 -65 -230 43 329 85 -272 34
2203 34 -3 -4 112 -195 -50 129 -7 56 95 -136 -175 112 31 174 121 -182 445 -171 -36 185 -33 -235 39
2226 39 214 109 -109 68 345 -16 -195 140 330 -446 269 213 -39 229 8 201 -72 -142 -54 -9 35 -156
2248 -156 236 56 -429 70 214 -125 57 -183 433 -369 -172 276 -20 -12 -127 -243 -32 -113 -102 55 -190
2269 -190 -378 109 -65 57 59 -33 262 49 -111 -115 285 -397 -354 236 -93 -68 15 -131 152 56 4 228 28
2292 28 -192 93 -42 -443 -119 100 -42 103 -379 -88 -12 -368 -204 -86 103 -40 353 24 -156 1 -43
2313 -43 401 -139 -199 59 -46 38 -70 96 289 -47 -423 -1 96 20 -20 108 -270 -150 44 -121 349 13
2335 13 115 235 -644 -424 301 128 -225 -288 -143 -214 -370 -25 331 -33 -88 335 -26 15 -19 157 256 -294
2357 -294 -8 355 250 48 168 194 -191 14 25 -184 43 31 85 134 -431 -182 223 111 -208 -139 -277 -21
2379 -21 -168 -165 588 -68 -176 327 -69 -66 -143 32 316 32 -289 366 119 -211 293 -47 150 1 -92 234
2401 234 119 -254 231 314 -385 -29 -263 -125 94 -115 71 152 -338 -191 315 -69 -342 -30 43 216 -79
2422 -79 42 174 -299 -432 285 -79 -419 -70 160 -194 106 21 544 -87 -211 -59 -237 -308 -34 102 79
2443 79 39 -5 145 270 26 62 32 21 -129 -147 284 178 -89 -18 287 6 -332 -68 211 -113 124 496 95
2466 95 -2 115 166 127 -448 330 137 -112 285 103 -110 58 -234 80 188 -219 -302 125 -274 27 251 1
2488 1 82 -80 -224 184 -268 -157 65 131 -48 -153 74 -82 214 -152 356 -47 -417 -80 162 175 40 219
2510 219 40 155 -282 -5 -87 -264 -47 345 -166 -52 -5 33 24 -139 -208 79 -179 -261 218 127 -218 -105 -22
2533 -22 42 253 -181 118 -16 -202 82 693 -10 -182 251 53 -78 6 -24 330 -460 -10 266 72 60 305
2555 305 -40 232 31 16 296 -61 -89 11 202 -307 149 -130 33 -182 -474 336 76 -445 150 -57 -235
2576 -235 -293 297 274 -246 -260 81 483 -292 -115 258 4 -5 -58 99 120 -165 205 370 32 -148 250 146
2598 146 -243 -119 -58 217 168 -252 443 187 -157 -121 177 -105 12 32 60 48 -241 150 132 0 335 361 -308
2621 -308 -70 218 195 193 -36 -53 120 7 113 116 -4 -142 110 171 169 287 -95 10 260 -236 97 459 41
2644 41 -142 -233 -329 184 -312 88 190 -206 -99 267 -151 -187 -52 103 100 -252 -147 19 -210 -404 40 -53
2666 -53 202 -93 -191 213 -27 -210 -94 359 -237 -114 471 238 -174 -203 192 86 -358 92 437 -47 -228
2687 -228 298 122 -215 17 31 6 -103 -134 411 11 -351 278 -147 0 -52 -58 146 159 -200 -207 124 -153 -132
2710 -132 57 313 -338 -207 -97 109 -51 -164 395 24 -220 69 -11 282 -45 125 -83 -152 37 87 -55
2731 -55 -204 117 -240 -156 204 -174 67 51 -184 328 52 -249 109 -4 206 -100 -88 -31 156 -139 -163 577
2753 577 -316 -98 345 -131 -84 -105 79 -56 -185 -237 178 -91 -109 60 101 49 -28 111 -10 179 -232 -123
2775 -123 497 -101 43 42 77 -250 -235 202 293 -203 -239 119 -295 -184 44 -6 126 -324 28 404 -42 -411
2797 -411 303 108 -235 143 257 67 17 45 -43 83 -232 226 55 -209 -79 -110 -91 51 -169 124 -90 170
2819 170 141 -116 -94 181 140 109 49 -60 243 144 201 -319 360 304 59 69 -4 18 -8 -178 198 -196 -468 181
2843 181 -152 46 -60 75 96 -293 -9 90 441 -134 -178 189 -34 -217 -134 -113 285 -138 -36 332 -210 -254
2865 -254 224 74 -225 -55 93 50 204 -255 499 -410 -498 250 333 -411 56 37 -69 -32 -390 123 246 -143
2887 -143 189 233 298 -3 45 -130 34 -487 33 311 -297 -190 262 142 0 172 123 162 -68 -91 158 292
2909 292 -288 158 358 -192 9 31 127 -71 -138 -140 -59 -153 27 323 29 86 -154 -154 -88 -86 -196 163 -384 -289 186
2934 186 120 -157 -194 304 221 -164 -60 75 56 -213 264 149 -165 -78 99 222 92 -351 -53 96 -284 -72
2956 -72 86 36 -164 -9 -217 282 -337 -67 264 -80 162 304 4 -135 42 -126 165 33 -128 239 280
2977 280 -165 -38 103 35 192 -197 -19 401 -427 165 -206 -243 -29 115 -17 -261 -22 39 80 -380 -145
2998 -145 220 138 -44 138 -39 -175 24 -140 140 -108 -194 244 44 -39 45 135 162 -4 43 -91 118 -354
3020 -354 -44 254 -410 -209 -39 113 -150 -125 282 79 -347 -43 370 -287 -121 354 156 -69 -126 -237 155
3041 155 194 -56 145 -90 -351 -194 11 -45 -203 13 95 217 -119 38 287 -260 -112 287 -62 -85 -332
3062 -332 268 369 -162 -26 217 -348 -85 334 41 -179 31 -156 -126 -205 46 80 -189 -314 -79 -90 239
3083 239 -97 -78 258 59 -359 148 69 -525 -102 225 60 52 -41 134 39 -391 184 392 -145 35 211 -305
3105 -305 -95 133 -61 379 -109 -76 -32 -256 -161 -199 190 299 -11 -9 266 40 -422 76 231 -7 -242 26
3127 26 87 25 -79 -69 166 76 287 393 -144 -37 66 118 38 -123 -34 301 -405 96 75 -203 -218 52 -205
3150 -205 -66 179 -246 -100 35 -310 156 -33 -146 82 -76 74 78 -178 68 288 -292 73 229 -20 -42
3171 -42 81 -200 77 -52 279 -12 -85 -113 204 13 -175 -77 -254 43 61 -409 -55 180 -204 19 146 65
3193 65 94 164 271 -10 -190 236 112 68 -207 205 -9 -106 369 305 112 -215 30 285 -226 -244 235 60
3215 60 -79 -143 236 181 -115 -57 135 -185 -306 317 142 -115 -56 72 49 -181 -206 49 33 -183 -226 180 188 90
3239 90 -65 -8 157 82 3 104 -147 -131 302 -149 -7 26 -178 -44 -45 -338 96 119 -212 154 -51 -283 -5
3262 -5 73 60 169 -400 115 379 -205 -238 273 -15 -195 51 -111 92 -465 282 390 -202 -172 81 -152 -324
3284 -324 89 -151 56 45 -55 324 193 -33 53 351 161 -165 40 -50 -34 -276 -38 182 -126 60 282
3305 282 108 -242 -309 56 432 -162 -139 324 -19 -94 437 352 -176 -253 61 147 -44 -387 317 316 -100 147 455
3328 455 -60 127 -146 -63 230 -204 179 94 -392 -45 -64 -12 172 -251 -81 456 -362 7 363 52 -200
3349 -200 253 -237 -8 -286 -267 240 -164 -48 204 -6 -395 -124 174 7 292 -93 -105 142 -332 4 191
3370 191 -355 58 53 -191 -72 -51 -163 205 -90 -71 1 -293 -279 -79 185 -70 -191 124 78 -193 -265 7 -123
3393 -123 -381 73 -161 -204 -159 -34 28 17 -236 80 27 -170 136 -27 -104 -29 -200 28 241 -129 15 342
3415 342 50 -183 274 5 147 -193 -236 35 100 -150 271 17 68 30 24 303 -168 -122 47 -38 72 56 121
3438 121 -12 84 104 257 -132 31 85 315 -92 188 229 13 24 17 92 -20 -124 82 184 -84 -161 178 -23
3461 -23 -101 118 -198 76 5 279 18 -133 -175 228 251 -23 -17 -31 146 146 50 191 200 -197 94 322 -80 -149 10
3486 10 5 -241 28 13 91 -175 141 -114 -154 -413 -47 -150 183 331 -6 236 -5 -328 109 50 -148 -102 -46
3509 -46 121 -134 -267 194 7 -245 -63 111 160 -84 168 12 -68 -27 44 -49 -26 -60 225 92 146 -250 -115
3532 -115 55 72 111 44 -82 24 51 167 -90 14 -59 59 157 -172 95 198 -277 -129 225 -293 -17 10
3554 10 71 -86 -269 -103 197 -35 83 -34 338 59 -49 71 -73 292 -2 27 115 -400 -90 293 27
3575 27 -128 57 61 303 -1 -11 223 -66 -299 395 207 -110 58 280 132 -368 55 250 106 -54 291
3596 291 19 -95 2 -235 -42 -95 -23 215 -115 -5 79 3 -153 -129 -153 -2 228 -378 -10 271 -208 -349
3618 -349 249 278 119 -71 77 61 21 -56 400 -162 -282 8 -207 -83 -95 73 -87 -68 15 5 137 113 -118
3641 -118 130 69 85 -129 -57 115 -116 52 158 -107 -72 28 0 -61 157 92 233 -68 -131 301 -237 -164 126
3664 126 229 -317 37 98 -146 5 267 53 58 -345 71 -52 188 -194 -90 29 102 172 114 54 26 -264 150
3687 150 -104 -2 -142 -42 23 -67 -140 184 -169 -263 60 -194 -33 215 258 41 -143 -139 -26 -24 -160 -74 -98 -105
3711 -105 105 -251 -97 -108 -50 181 208 -108 -105 -93 -1 94 -202 -197 263 -2 -29 116 99 -278 -62 86 238 -121
3735 -121 -158 -171 144 -97 116 -84 -57 -24 -92 -20 90 -127 43 84 -175 -90 123 -143 54 98 157 -160 224
3758 224 205 202 -172 -28 3 -201 -259 209 132 -102 11 -70 178 -111 -135 98 39 -284 213 198 -30 -12 -171 225
3782 225 -282 68 23 -209 124 25 -105 99 145 -209 -244 158 -350 -305 112 -6 -117 192 29 -47 193 -78
3804 -78 145 -18 5 -215 144 -48 -219 240 -253 -92 -83 -26 161 -341 -184 179 -47 61 -26 7 -119 54
3826 54 209 106 -218 -195 -86 2 113 -117 45 -33 12 101 13 28 -131 118 117 -166 109 288 91 -71 -141 126
3850 126 281 -264 -307 -6 -26 -144 110 -91 57 41 -2 114 30 -74 -133 281 23 -156 -73 4 -141 -76 149
3873 149 37 -294 -93 249 -106 -232 -61 -14 -130 -74 -60 45 -25 57 116 -78 -396 -121 19 137 -60 73
3895 73 -3 -78 -6 -138 29 -140 -129 78 -176 -159 -194 236 118 2 125 297 20 -179 55 -192 135 -149
3917 -149 -20 252 4 -72 -146 258 119 163 187 -30 -199 201 55 -166 -119 18 77 35 -35 204 46 96 -82
3940 -82 2 -66 71 45 -35 29 -116 145 103 165 -112 -169 230 -113 101 -53 44 133 -114 -82 -228 6 -34 137
3964 137 91 -195 -90 -124 -95 3 -51 63 -60 -246 -78 115 -306 125 250 -291 108 -70 -84 -153 92 73 312
3987 312 -52 -253 426 26 257 -34 23 48 -247 -40 -100 -116 141 227 103 -59 101 96 131 27 120 172 -163
4010 -163 60 26 157 58 -48 2 -132 -122 316 162 -171 56 169 41 -183 -265 81 31 -58 4 -269 59 -142
4033 -142 -80 154 -66 -140 -208 -10 -96 31 105 130 -108 -37 0 4 20 -41 -3 13 22 -196 97 -219 154 -270 -22
4058 -22 -55 -7 -170 141 86 -194 -57 176 -238 -337 -184 84 67 161 -177 348 -10 -94 99 -174 -259 138 84
4081 84 -56 212 -1 44 -50 -31 50 -28 81 -65 113 -204 33 95 -327 3 53 -165 -4 -131 -126 2 -124
4104 -124 -31 -67 148 48 8 -86 112 130 -89 13 -99 -94 46 -38 123 -305 -103 60 179 -226 189 -65 138
4127 138 -5 -51 -108 223 -10 -98 89 87 35 -69 119 129 -2 -168 119 44 -290 30 179 44 29 90 3 73
4151 73 339 -13 381 -21 73 -8 -68 -76 27 -348 -30 -133 -1 -109 -257 -149 -170 -31 40 -98 48 -142 14
4174 14 23 -131 -121 -128 32 231 -210 169 -82 -169 65 66 76 -244 -236 -106 -82 -193 153 -269 201 108 -93 56 313
4199 313 83 119 56 -174 -165 -53 123 137 -147 44 126 -221 18 184 30 138 70 -179 -244 56 -227 163 -52
4222 -52 -64 35 -35 -218 -157 268 -7 106 126 -186 103 27 -1 140 250 21 -27 80 -196 205 219 55 73 57
4246 57 -103 153 133 124 -246 -7 193 11 -57 -23 -169 24 -171 -91 -79 -85 204 -33 99 -120 9 -73 -59 -24
4270 -24 61 245 -243 314 135 -13 -185 -154 -13 -134 46 -200 -105 -130 21 113 177 -205 -100 278 -108 82
4292 82 158 -146 5 93 157 -72 105 54 88 -39 -52 84 -95 -111 191 -118 -16 -24 102 226 65 28 -155 -195
4316 -195 53 66 -32 6 -196 -184 -150 55 -222 123 -26 -145 -38 -95 -216 28 -66 76 308 -133 -9 -220
4338 -220 -14 -312 54 -60 -128 -11 -119 259 62 -109 -317 -251 -25 -19 81 -116 16 171 -102 273 -117
4359 -117 251 -196 -178 -305 -112 -92 -115 63 -150 0 51 -22 157 -285 -303 175 -11 345 -123 -317 49 207
4381 207 -141 -66 72 -146 113 32 -224 -46 5 -125 39 56 -206 -25 164 -16 -278 -286 -75 19 -185 -4
4403 -4 -132 53 -268 215 -173 231 215 237 -136 215 -131 -59 66 100 18 -200 -285 -60 -384 -84 -119 188 262
4426 262 -155 -82 80 -131 104 -259 -173 105 -65 -77 107 -186 -41 -60 54 -82 -25 3 275 80 35 92 147
4449 147 24 93 -73 -106 -38 44 -146 -7 17 -5 -25 -89 46 102 215 -142 146 249 -103 -31 -459 -199 46
4472 46 6 -32 197 -46 119 -39 -90 87 -177 -255 88 236 54 112 105 -204 5 6 25 37 -211 281 -39 196
4496 196 116 99 -126 73 -255 226 -110 -358 -26 -236 267 139 -163 -165 -5 -94 188 -81 -269 -25 42 260
4518 260 -30 -147 -23 -5 5 44 175 -51 -133 -198 256 -9 8 56 91 70 -9 253 230 102 14 2 39 193 47
4543 47 -30 -68 -51 407 -308 152 85 104 177 78 248 219 -79 177 -169 116 104 1 350 84 27 -25 173 33
4567 33 -204 62 54 188 -31 -68 135 91 63 -49 121 187 57 63 44 130 -82 189 -195 -69 119 -3 143 -396
4591 -396 -258 -24 -16 -157 226 8 45 67 -129 -263 -36 -76 242 38 135 159 -144 248 -125 -264 212 17
4613 17 -228 38 183 -44 242 -168 -33 91 163 -60 -104 -120 -48 215 -124 73 160 -229 -19 -273 202 189
4635 189 -44 -276 82 29 47 170 4 88 -53 -261 127 31 -65 204 22 -102 -35 -97 -217 -87 -187 164
4657 164 -39 -154 154 -100 -130 71 152 8 -3 -32 -68 151 -17 -39 118 -139 216 101 -27 -148 45 -31
4679 -31 174 109 -121 -18 235 -231 -85 -32 -12 -188 -136 58 6 209 -36 -83 -212 -208 152 -19 53 -12 -78 304
4703 304 120 -310 124 5 51 -250 297 -233 8 -38 25 115 -117 108 167 46 80 -158 13 95 -116 -56 196
4726 196 -93 -9 17 -137 15 152 36 42 85 41 -227 -108 133 -113 -83 -2 209 -125 -71 -71 -27 101 -167 -173 27
4751 27 69 -210 -374 156 -207 60 18 -87 -51 -165 115 300 306 162 -69 15 -39 21 13 194 -77 -227 143 -133
4775 -133 98 -37 -194 -197 -305 4 -15 244 -147 -332 34 -120 -61 -13 -106 226 165 -37 -32 -84 -82 84 169 -127
4799 -127 184 199 -251 59 204 27 -185 124 -95 -175 -51 12 -96 49 -80 -45 400 -26 -184 57 -98
4820 -98 -188 -120 88 211 175 -445 -140 21 -133 91 134 -139 -237 -63 10 -56 96 -146 210 88 48 189 62
4843 62 387 -14 133 -43 131 -127 37 189 49 142 -33 75 -75 87 -302 -239 -21 -181 139 387 -118
4864 -118 64 194 32 56 269 -47 -22 -27 -85 -156 116 128 -115 92 69 85 109 -55 -142 132 -121 -129 68 40 -250
4889 -250 187 108 -44 -227 149 60 67 -42 41 101 -104 3 -79 102 -59 -11 113 17 110 -110 130 -21 168
4912 168 45 -24 -75 -191 86 -25 -96 212 -81 133 32 176 -253 -163 -82 -3 188 -138 154 -100 61 122
4934 122 -82 -112 221 83 68 154 232 -81 14 199 -267 13 2 -55 124 -17 -232 67 35 19 -76 68 195
4957 195 23 74 123 172 -123 141 230 -3 -159 7 -6 44 -54 -80 279 -118 76 200 103 -194 119 160 114 96
4981 96 28 125 -22 65 53 168 40 -246 114 49 -172 -116 93 -35 27 179 271 -26 189 213 -17 -52 92 324
5005 324 233 -121 -91 -56 -48 -188 -66 -74 45 -74 -19 -273 98 -55 150 -80 -173 65 18 -141 156 199 214 -37
5029 -37 259 -9 -48 -21 -309 -83 -249 -108 -127 42 63 -120 -192 26 19 -152 -34 -10 -140 271 26 -175 32
5052 32 -188 -80 111 -48 234 -193 -16 -190 6 110 25 -20 342 61 -259 -208 47 219 64 -181 -220 -420
5074 -420 -47 -4 -152 14 -42 -74 20 114 -159 -129 2 71 66 -124 -166 158 -190 -63 148 -204 26 205 84
5097 84 -110 250 30 -48 -127 -100 58 168 -1 -120 85 -160 -128 112 -262 -11 -124 54 69 83 -337 -108
5119 -108 -88 -282 108 -137 4 -147 -21 17 62 -106 3 -16 -188 -145 15 -135 2 14 -79 168 8 -97
5141 -97 147 -134 -173 173 82 -63 -193 -293 118 -49 54 -100 -76 -83 -38 -177 226 122 96 -1 155 82 56 215
5165 215 -248 20 61 6 -17 36 30 227 -29 -52 7 -180 170 233 -11 -87 -147 90 11 186 -108 -62 -178 3
5189 3 149 -168 -128 5 -30 -224 -27 354 179 100 201 -270 -103 93 75 154 107 121 -48 417 218 -167 -184
5212 -184 283 -184 -179 -128 41 -142 107 -19 -160 -85 -69 262 -137 -174 12 -172 243 1 -402 281 122 240
5234 240 -50 -208 232 -289 159 5 39 -14 -151 73 35 138 -144 159 -44 154 51 54 277 -125 -117 -104 -236
5257 -236 294 182 -225 313 12 32 20 30 -183 98 -105 -143 69 -167 81 -175 -7 136 -116 -161 85 61
5279 61 -110 -50 -3 -96 -146 -337 118 -302 150 200 -125 -188 135 290 -42 94 -101 123 -35 110 23 243 -158
5302 -158 62 -59 2 -210 -53 144 141 168 -11 -29 171 -246 99 20 -32 -144 18 69 265 152 60 74 85 83
5326 83 10 -120 177 8 -19 -79 -2 217 88 79 -254 55 79 43 167 25 113 23 92 -16 192 -27 87 36
5350 36 38 223 -25 260 79 -23 39 -102 -161 -93 -87 17 -36 -105 108 -91 89 138 3 -15 10 207 -116 -1
5374 -1 -94 -28 109 -41 69 127 -42 85 96 298 -152 178 37 283 72 167 201 196 55 103 48 -471 24 -164
5398 -164 127 -179 -118 -313 -5 -51 -2 -295 -390 -101 41 -69 30 -121 118 -53 75 395 -85 -7 71 85 41
5421 41 -18 278 65 -200 171 130 -160 -89 12 -79 -254 -181 -86 59 -195 -4 -160 -23 -33 315 145 -42 -42
5444 -42 104 -76 120 -155 1 -87 -60 260 -55 -84 -32 119 37 -4 -40 -107 130 -292 156 209 -32 -9 -174 134
5468 134 -262 -72 -55 144 171 14 -191 68 80 -270 -141 -295 -78 7 -48 -151 18 214 -186 -282 -147 -38
5490 -38 239 -26 150 -125 -4 148 197 -80 -138 -32 181 107 -61 -100 -22 -60 55 158 257 -173 184 48 220
5513 220 -159 20 -61 110 -19 -97 -157 143 -80 -62 272 42 53 130 -42 255 265 -131 172 -312 130 104 -187
5536 -187 -162 -6 126 -54 -174 -110 120 104 20 -118 3 -20 -125 -2 71 220 -19 -22 -51 -156 -50 109 -375
5559 -375 -150 101 105 -121 -267 143 -47 93 88 139 106 -286 -37 95 200 -70 154 20 161 -22 59 101 -37
5582 -37 193 -1 211 -124 -179 101 382 -78 -342 243 -15 -5 -53 49 -117 -50 -169 -232 -145 -155 -149 40 -308
5605 -308 113 -16 -6 -167 -174 -138 126 149 -79 182 15 -213 0 -273 -204 183 5 88 2 -57 300 160 89
5628 89 -157 -105 222 72 -48 67 393 34 35 -78 -255 21 -205 -50 66 -245 6 -188 21 -105 -69 -155
5650 -155 -190 -12 -39 -51 228 -293 1 148 -175 7 113 -51 77 -146 84 -280 -59 -147 -207 -189 76 86
5672 86 -70 17 -51 129 299 -268 180 52 0 65 -13 -13 -161 -125 -102 -25 266 -86 80 58 -63 -95 -137 22 -90
5697 -90 -21 22 103 71 -143 71 -172 91 -37 -79 177 -70 17 -5 -83 -130 153 128 18 0 73 -78 137 124 289
5722 289 277 39 -19 -28 10 -58 96 -35 -9 67 -105 65 293 21 107 -119 -8 -139 11 47 130 149 -237 -87
5746 -87 -33 -362 197 59 28 280 -8 -46 -154 258 -189 85 -46 -116 -79 -291 6 94 -141 -15 9 -67 5
5769 5 -85 -105 -29 100 -54 113 -65 155 -125 54 -154 -11 -186 -210 -155 132 173 88 107 -161 291 -36 110
5792 110 139 -16 -162 54 247 -202 128 -207 -53 61 29 194 -43 -185 101 -81 -24 -182 -37 5 -82 35
5814 35 81 -70 103 -218 61 -233 -6 -34 38 43 -162 231 83 -221 -54 2 -52 54 80 -62 -207 41 -72
5837 -72 48 106 -13 -229 98 -95 248 246 130 154 111 -169 300 171 -51 -227 20 -21 -213 -221 -80 -124 155
5860 155 19 -15 115 -67 142 -49 -15 93 75 -185 119 -76 141 -285 -118 -237 29 192 -121 78 178
5881 178 4 -63 93 -171 -99 268 223 -73 -121 -106 -29 111 -266 55 -127 -76 106 102 -95 -127 -121 132 112 -223
5905 -223 -48 -119 103 -109 -4 53 -47 64 -30 -89 -49 85 228 98 -18 -263 23 -169 139 -162 -92 -184
5927 -184 -28 -252 231 140 -148 110 -83 -47 255 33 40 -47 -116 -92 -141 -22 -121 60 -127 -234 112 77 194
5950 194 -232 -58 -27 -238 70 -169 -128 -187 -57 -62 109 -278 -115 -121 328 168 -30 197 203 -8 88 -263 -164 -74
5974 -74 42 -283 130 98 -55 -1 -268 -103 -244 26 -24 -39 -105 -18 -34 -163 73 -212 8 108 -150 227 46
5997 46 127 34 -215 -186 -75 47 50 37 -55 -232 169 89 35 125 -134 -49 106 -277 -62 -150 85 -158 51 -85
6021 -85 -48 174 -57 -27 31 -278 -14 12 -76 -175 119 -31 -22 -359 87 127 -118 71 16 39 128 11 96 -259 50
6046 50 48 81 -25 127 164 -233 -152 110 -166 124 -45 -253 134 71 -48 -52 -251 -89 230 -4 -216 -2 303
6069 303 -199 62 -104 -117 -88 -232 306 61 114 -157 -248 -322 -6 -92 105 181 366 331 -29 21 82 -27 251
6092 251 -29 195 -48 -42 43 -67 136 -101 -47 -417 108 99 -190 65 242 67 -185 106 27 -102 202 -49
6114 -49 6 87 96 -156 124 -165 -89 -159 131 -4 129 276 32 34 34 298 -25 17 131 -156 -28 -74 130 -141
6138 -141 -1 -101 -101 -207 0 -42 -399 171 270 -35 -45 36 -218 187 154 -8 99 40 -96 131 36 -41 -53 -327
6162 -327 50 228 13 -62 -298 -14 141 -217 12 61 -388 -133 143 24 -252 -32 105 -51 -234 -9 -50
6183 -50 274 -188 219 127 -6 143 31 150 -26 29 -30 85 -108 -55 126 -34 -27 338 17 -89 83 61 -110
6206 -110 135 45 -264 72 73 -206 -40 51 81 -263 -133 -3 188 -59 3 76 61 -227 80 99 -46 194 -118
6229 -118 202 141 -117 -58 -93 -136 40 110 179 -100 -59 -264 74 -57 -24 -255 -167 24 -183 -60 -82 -191 218
6252 218 -16 156 14 -256 -20 52 220 -2 11 -342 84 -168 -94 309 91 57 125 119 -38 -115 21 -349 -9
6275 -9 -68 99 -207 -64 -113 109 283 -118 136 217 76 155 180 179 43 49 -65 3 -122 -248 123 29 44 -237 -217
6300 -217 -88 -35 -164 -164 58 25 -188 170 29 66 33 -207 138 94 289 -40 120 -122 -238 -97 102 -97
6322 -97 -26 -472 -37 255 74 228 55 111 57 37 22 2 -168 -68 289 -59 31 129 55 -37 0 208 245 110
6346 110 -17 -97 -27 -364 118 38 94 -43 -251 -70 106 16 -115 63 -124 -229 -166 -79 -21 155 56 145 -54
6369 -54 -129 15 -143 112 -288 103 -54 -72 37 94 -32 -38 124 -1 237 81 4 -67 -28 70 -84 -22 7 307
6393 307 302 119 31 6 3 -134 -34 -206 -25 -27 -148 -211 -36 144 -145 162 258 18 -238 157 163 48 -40 -135 -103
6418 -103 38 -112 46 430 -212 -220 54 -131 -190 -134 227 62 -59 -274 119 -155 122 -30 41 -182 -100 99
6440 99 -236 167 11 284 -110 297 -66 -15 -5 -291 332 136 51 150 84 -19 -259 55 -9 -50 8 -54 44 11
6464 11 -135 -71 61 -327 -83 -136 218 128 62 -65 3 16 -96 216 106 268 154 -78 -139 -86 -89 198 -67 -33
6488 -33 41 -189 44 -36 313 245 -93 152 96 25 84 135 94 -138 -140 195 -43 185 111 -202 30 292 278 154
6512 154 17 -111 -14 66 -142 -162 -231 -98 74 74 -32 112 -229 84 162 -321 87 -170 127 81 -141 36 -29
6535 -29 7 -129 116 -101 -258 246 38 201 72 -74 2 -293 70 -67 122 131 297 -73 79 -3 -100 15
6557 15 -62 11 129 19 138 -173 -291 153 -31 -65 95 178 33 7 -38 1 221 29 33 295 -169 258 59
6580 59 -45 -348 -20 220 -26 160 0 -112 -414 -265 265 5 -173 -194 13 119 19 27 -120 -304 -227 24
6602 24 -57 -7 180 -241 84 160 12 -200 180 183 62 -195 239 102 -148 -210 83 82 94 414 141 -20 -22 -52
6626 -52 -92 27 -357 96 149 -28 38 225 16 -25 -223 167 -162 -13 -228 -31 89 -83 21 -60 41 76
6648 76 227 -112 2 64 -195 -212 233 201 320 12 89 79 184 84 108 31 160 -118 219 -36 106 -185 167
6671 167 153 23 55 -5 -111 -410 -60 44 -94 -157 76 31 76 -74 -223 -28 -73 -98 102 167 45 -94 6
6694 6 -35 112 228 -38 -29 55 -145 -35 -140 -152 278 116 88 90 -115 -172 97 101 -66 12 -46 139 69 133 104 -210
6720 -210 -70 -17 -59 88 -36 -33 21 -5 -50 -57 177 -163 106 -91 75 -1 -63 -94 162 110 194 -113 -21 -38 -59 54
6746 54 -144 45 147 50 -135 160 -32 -43 193 103 -192 39 137 -111 -57 -147 -21 -344 16 -246 128 16
6768 16 150 183 -173 -84 58 -7 110 -150 14 -9 299 121 -148 219 56 -100 98 273 109 81 -49 -17
6790 -17 -215 -31 -9 -171 -59 18 -39 23 168 34 -17 237 -159 -29 9 -168 42 -8 0 140 142 -111 -76 -244
6814 -244 229 -96 -169 -215 -186 128 31 -144 -130 -95 -129 -17 -264 11 -13 187 -2 251 -163 -145 -151 -289 170 43
6838 43 108 120 67 203 -48 37 -298 123 -89 75 -74 -24 100 -218 61 -33 -174 -235 194 156 144 -105 -116 -99
6862 -99 -168 84 -12 61 -17 210 -79 -68 -21 333 189 -226 151 -35 -246 -78 -57 51 -106 182 -116 102 19
6885 19 104 114 179 65 78 38 -18 -23 -74 138 -12 -23 -147 -96 -18 67 39 -168 -152 -119 -128 -256 150 -51 51 -62
6911 -62 -220 15 -4 -12 -322 49 -62 195 -52 -5 273 -186 -139 -50 69 -104 -4 29 -139 -107 378 -120 -32
6934 -32 -109 168 -96 83 -190 -9 133 -36 -45 147 7 -172 -48 58 198 16 78 32 -168 -42 -167 -107
6956 -107 101 56 140 98 130 127 84 -157 -213 -124 90 27 337 104 -74 -37 -140 -243 218 18 -120 -166 -155 62
6980 62 -47 -117 36 9 -269 149 33 350 103 155 -299 33 136 -96 45 58 -169 -193 -55 112 31 30 151
7003 151 53 208 -63 17 264 6 -11 41 -288 81 116 297 170 470 -5 99 65 -118 -3 -163 -124 155
7025 155 -2 -68 26 75 38 80 -70 -149 -53 -59 326 -90 -106 -136 -44 -120 26 230 -217 125 80 107 304 142 103
7050 103 -172 -4 3 114 231 36 -67 87 128 -35 -290 249 -6 -68 39 -88 21 -7 262 -151 -7 158
7072 158 131 -130 70 -141 58 56 -125 -36 -159 -75 -75 59 71 44 244 -56 77 184 -113 170 -63 -37 5 -34
7096 -34 -10 -29 -125 -6 -58 40 -210 -77 -30 -29 -398 -198 -244 245 -191 -56 57 -55 159 -6 -221 256 -37
7119 -37 126 183 -35 83 -280 -46 31 -131 -75 67 27 -30 92 -102 68 -63 -79 -102 279 58 -168 -4 -238
7142 -238 14 -98 -125 -43 93 48 -45 129 -40 -284 -197 -59 37 -101 114 -185 48 -299 -183 101 -38 -111
7164 -111 100 5 -35 61 63 189 -144 14 95 154 -62 -47 85 -1 -76 30 -4 -1 -16 119 46 -14 2 -188 -55 141
7190 141 -194 51 -256 -102 89 -275 -113 115 -4 23 -77 -227 158 159 -115 -20 103 -172 234 97 60 -148
7212 -148 -117 -70 -47 137 -68 -85 172 83 -338 -197 -36 -35 -28 152 110 349 188 117 -60 -21 91 27 55 -5 34
7237 34 11 -11 -30 -105 -50 -92 -50 127 -149 -76 -84 -81 124 210 129 128 302 -70 -25 124 -51 49 119 27 -134 -25 70
7264 70 -85 43 -62 -131 -109 62 15 285 -68 70 85 35 -338 -237 78 189 241 122 223 50 377 -110
7286 -110 -194 204 -71 82 64 295 -51 -430 181 165 86 -150 99 90 143 58 86 217 -151 -228 130 -152 51
7309 51 0 71 42 8 204 49 -20 -148 111 227 -247 -100 107 103 151 -1 1 61 -99 260 188 61 -67 20 175
7334 175 120 103 -100 262 57 68 91 8 154 -236 328 128 64 72 -132 -31 -10 -298 31 75 45 -35 64 34 -155
7359 -155 79 6 12 297 207 -192 -104 -123 196 6 215 266 178 -60 -103 147 -282 48 13 -106 38 12 55 108
7383 108 37 -265 240 -204 -128 -97 141 -76 -44 145 11 258 12 -46 179 286 -8 -30 -62 -159 29 169 106
7406 106 -157 -122 -122 46 -61 119 62 -206 132 148 187 -7 -1 -122 11 -5 76 -7 -184 124 -13 105 137 -96
7430 -96 -25 -20 -200 274 44 147 23 -127 14 26 -102 -99 177 -8 -69 -227 195 211 -87 -189 80 -114 25
7453 25 7 -10 13 131 86 141 -138 -25 212 12 414 148 0 58 38 6 13 60 131 62 101 91 -146 -255 -119
7478 -119 152 71 -86 147 95 -93 -48 20 -34 -71 88 63 45 94 -234 -139 -145 166 17 84 -59 11 43 15 -16 51
7504 51 115 -25 218 313 70 -51 -158 -49 -11 -103 187 156 200 30 64 54 -51 -150 204 35 -142 -39 -216
7527 -216 59 172 105 -44 -30 -11 -109 -212 -198 -62 -202 -1 -406 184 -39 -47 193 8 -206 132 74 6 107
7550 107 111 -163 -9 -29 -164 203 8 -164 180 193 150 204 47 -82 -5 9 -169 134 51 -6 -114 170 -165
7573 -165 84 -40 133 107 180 5 -53 -339 72 30 168 -87 102 158 214 116 138 -215 -162 216 36 231 -54
7596 -54 -156 -200 -74 -265 116 -294 159 157 84 -57 -33 -104 14 -80 110 -27 -185 38 -59 98 -26 -104 139
7619 139 -72 -242 257 149 12 -218 86 31 36 80 33 -115 41 -222 221 -80 268 47 92 -50 25 239
7641 239 22 -57 -365 -30 100 144 20 -57 117 -14 -11 141 -69 -64 50 275 -158 203 -180 -263 -267 -108 59
7664 59 -151 95 82 -92 112 -122 46 -77 167 104 16 -3 108 -183 -48 57 99 -150 -117 -131 -22 114 249
7687 249 -238 -142 259 -115 -69 -116 -20 21 71 -25 -106 117 -29 185 104 90 148 209 -65 -50 -261 -64 187 146 165
7712 165 -130 -33 -48 -29 -157 -148 -90 40 41 -260 70 170 -73 21 133 -90 -83 52 -65 18 241 -87 304 148
7736 148 -255 258 218 -91 -141 59 161 -52 -185 -33 -220 -249 -104 -97 -32 62 96 94 -165 126 -30 -218 -103
7759 -103 -20 115 35 -10 -126 63 -135 -191 -172 43 43 -301 214 14 249 155 -65 287 37 -10 -67 -104 -177 -101
7783 -101 -133 81 -91 31 -154 -74 96 -73 -56 44 -188 -160 -83 165 44 -470 2 187 32 -30 -42 -28 12
7806 12 9 207 7 146 -248 123 -240 -93 -24 135 86 115 223 -94 47 -10 216 185 -102 6 83 -135 53
7829 53 288 -20 8 -122 -302 -132 -105 -105 169 -196 -144 -264 121 65 19 258 -324 -207 -162 186 -172 -84 182
7852 182 293 -158 213 -106 101 73 41 80 -50 96 13 40 -102 56 11 -157 232 10 -195 -38 -63 223
7874 223 142 -238 120 70 -277 176 21 -81 160 216 101 -114 -95 176 52 -29 -84 -76 -119 221 79 -224 46
7897 46 -135 -103 -5 -225 -31 24 -93 -32 158 257 -246 56 6 -60 -215 5 392 93 109 180 -169 -193 6 208
7921 208 -25 -40 -200 152 30 -49 -128 75 189 -374 243 7 -132 -116 -120 11 -111 236 3 -102 -16 -50 22
7944 22 -73 -130 61 189 276 -231 24 79 79 15 144 44 45 95 -98 182 -61 27 200 93 -120 -142 116 123 27
7969 27 -18 -44 3 155 340 -296 31 38 31 29 42 -12 194 84 -237 221 60 148 53 113 -3 126 -89 -79 237
7994 237 -17 209 109 145 282 -101 58 -77 -4 209 -282 -109 -90 -28 102 265 -6 -21 293 -185 -57 171
8016 171 -75 140 247 -264 99 91 50 -71 -107 -59 95 37 -367 98 -108 -154 -201 5 -245 59 30 -109 99
8039 99 -250 -208 89 166 115 -119 130 -79 122 -138 199 -217 -88 -45 -247 102 25 -67 -198 155 307 188
8061 188 93 -228 235 -8 135 -75 -144 -42 -55 35 -57 96 -64 -285 15 -348 -105 102 -145 -92 -253 43
8083 43 -108 -25 76 -76 69 114 -61 -9 -252 62 -148 -214 -169 188 -25 -118 -48 -132 76 114 -220 -83 -97 231
8107 231 32 201 191 28 113 141 -20 -22 135 16 230 -28 17 -180 -55 75 -216 -57 -27 172 60 179
8129 179 -155 -104 174 -57 -57 -111 -132 245 68 -279 30 -81 -33 -95 213 -16 -76 -63 -195 -92 165 -117 -82
8152 -82 86 12 95 -142 -77 -4 -7 275 -81 224 -3 -309 135 -14 -180 125 172 230 131 -258 238 27 -39 -74
8176 -74 -48 -58 -188 -62 -26 -16 -51 22 14 116 121 35 64 -424 165
8191A65
##END NTUPLES=NMR FID
##END=
