##TITLE=1H_Pr AmC3B
 200.13Hz, CDCl3
 8 sc
31.8.7.2026
##JCAMPDX= 6.0         $$ Bruker NMR JCAMP-DX V2.0
##DATA TYPE= NMR FID
##DATA CLASS= NTUPLES
##ORIGIN= UXNMR, Bruker Analytische Messtechnik GmbH
##OWNER= pz
$$ XWIN-NMR		Version 3.5
$$ Fri Jul 31 14:34:39 2026 Russian Standard Time (UT+4h)  she@DPX200
##.OBSERVE FREQUENCY= 200.1313
##.OBSERVE NUCLEUS= ^1H
##.DELAY= (6, 6)
##.ACQUISITION MODE= SIMULTANEOUS
##.ACQUISITION SCHEME= undefined
##.AVERAGES= 8
##.DIGITISER RES= 18
##SPECTROMETER/DATA SYSTEM= spect
##.PULSE SEQUENCE= zg30
##.SOLVENT NAME= CDCl3
##.SHIFT REFERENCE= (INTERNAL, CDCl3, 0, 14.3821)
##AUDIT TRAIL= $$ (NUMBER, WHEN, WHO, WHERE, WHAT)
$$ ##TITLE= Audit trail, XWIN-NMR		Version 3.5
$$ ##JCAMPDX= 5.01
$$ ##ORIGIN= Bruker BioSpin GmbH
$$ ##OWNER= she
$$ F:/spectra/data/she/nmr/H-C/1/audita.txt
$$ ##AUDIT TRAIL=  $$ (NUMBER, WHEN, WHO, WHERE, WHAT)
(   1,<2026-07-31 14:33:36.15 +0400>,<she>,<DPX200>,
      <created by zg, POWCHK disabled, PULCHK disabled
       configuration hash MD5:
       00 E9 B6 7A A2 85 ED C7 34 08 36 98 17 FE 4E 26
       data hash MD5: 16K
       BB 97 00 77 34 4D D6 A2 D0 75 26 2F 37 CF B9 B9>)
$$ ##END=
$$ 
$$ hash MD5
$$ 6E D6 62 61 8F 2E C9 36 DD AF 51 24 3B F9 81 97
##$RELAX= 
##$RELAX= 
##$RELAX= 
##$RELAX= 
##$RELAX= 
##$RELAX= 
$$ Bruker specific parameters
$$ --------------------------
##$DU= <F:/spectra>
##$EXPNO= 1
##$NAME= <H-C>
##$PROCNO= 1
##$TYPE= <nmr>
##$USER= <she>
##$AMP= (0..31)
100 100 100 100 100 100 100 100 100 100 100 100 100 100 100 100 100 100 
100 100 100 100 100 100 100 100 100 100 100 100 100 100 
##$AQSEQ= 0
##$AQ_mod= 1
##$AUNM= <au_zg>
##$AUTOPOS= <>
##$BF1= 200.13
##$BF2= 200.13
##$BF3= 200.13
##$BF4= 200.13
##$BF5= 200.13
##$BF6= 200.13
##$BF7= 200.13
##$BF8= 200.13
##$BYTORDA= 1
##$CFDGTYP= 0
##$CFRGTYP= 5
##$CHEMSTR= <none>
##$CNST= (0..31)
1 1 145 1 1 1 1 1 1 1 1 1 1 1 1 1 1 1 1 1 1 1 1 1 1 1 1 1 1 1 1 1 
##$CPDPRG= <>
##$CPDPRG1= <>
##$CPDPRG2= <>
##$CPDPRG3= <>
##$CPDPRG4= <mlev>
##$CPDPRG5= <mlev>
##$CPDPRG6= <mlev>
##$CPDPRG7= <mlev>
##$CPDPRG8= <mlev>
##$CPDPRGB= <>
##$CPDPRGT= <>
##$D= (0..31)
0 0.7 0 0 0 0 0 0 0 0 0 0.03 0 0 0 0 0 0 0 0 0 0 0 0 0 0 0 0 0 0 0 0 
##$DATE= 1785494015
##$DBL= (0..7)
120 120 120 120 120 120 120 120 
##$DBP= (0..7)
150 150 150 150 150 150 150 150 
##$DBP07= 0
##$DBPNAM0= <>
##$DBPNAM1= <>
##$DBPNAM2= <>
##$DBPNAM3= <>
##$DBPNAM4= <>
##$DBPNAM5= <>
##$DBPNAM6= <>
##$DBPNAM7= <>
##$DBPOAL= (0..7)
0.5 0.5 0.5 0.5 0.5 0.5 0.5 0.5 
##$DBPOFFS= (0..7)
0 0 0 0 0 0 0 0 
##$DE= 6
##$DECBNUC= <off>
##$DECIM= 32
##$DECNUC= <off>
##$DECSTAT= 4
##$DIGMOD= 1
##$DIGTYP= 9
##$DL= (0..7)
0 120 120 120 120 120 120 120 
##$DP= (0..7)
150 150 150 150 150 150 150 150 
##$DP07= 0
##$DPNAME0= <>
##$DPNAME1= <>
##$DPNAME2= <>
##$DPNAME3= <>
##$DPNAME4= <>
##$DPNAME5= <>
##$DPNAME6= <>
##$DPNAME7= <>
##$DPOAL= (0..7)
0.5 0.5 0.5 0.5 0.5 0.5 0.5 0.5 
##$DPOFFS= (0..7)
0 0 0 0 0 0 0 0 
##$DQDMODE= 0
##$DR= 18
##$DS= 0
##$DSLIST= <SSSSSSSSSSSSSSS>
$$ [...]
##$SUBNAM0= <"">
##$SUBNAM1= <"">
##$SUBNAM2= <"">
##$SUBNAM3= <"">
##$SUBNAM4= <"">
##$SUBNAM5= <"">
##$SUBNAM6= <"">
##$SUBNAM7= <"">
##$SUBNAM8= <"">
##$SUBNAM9= <"">
##$SW= 18.0517328524113
##$SWIBOX= (0..15)
0 0 2 0 0 0 0 0 0 0 0 0 0 0 0 0 
##$SW_h= 3612.71676300578
##$TD= 16384
##$TD0= 1
##$TE= 0
##$TE2= 300
##$TE3= 300
##$TEG= 300
##$TL= (0..7)
0 120 120 120 120 120 120 120 
##$TP= (0..7)
150 150 150 150 150 150 150 150 
##$TP07= 0
##$TPNAME0= <>
##$TPNAME1= <>
##$TPNAME2= <>
##$TPNAME3= <>
##$TPNAME4= <>
##$TPNAME5= <>
##$TPNAME6= <>
##$TPNAME7= <>
##$TPOAL= (0..7)
0.5 0.5 0.5 0.5 0.5 0.5 0.5 0.5 
##$TPOFFS= (0..7)
0 0 0 0 0 0 0 0 
##$TUNHIN= 0
##$TUNHOUT= 0
##$TUNXOUT= 0
##$USERA1= <user>
##$USERA2= <user>
##$USERA3= <user>
##$USERA4= <user>
##$USERA5= <user>
##$V9= 5
##$VALIST= <valist>
##$VCLIST= <CCCCCCCCCCCCCCC>
##$VD= 0
##$VDLIST= <DDDDDDDDDDDDDDD>
##$VPLIST= <PPPPPPPPPPPPPPP>
##$VTLIST= <TTTTTTTTTTTTTTT>
##$WBST= 1024
##$WBSW= 4
##$XGAIN= (0..3)
0 0 0 0 
##$XL= 0
##$YL= 0
##$YMAX_a= 28109
##$YMIN_a= -27123
##$ZGOPTNS= <>
##$ZL1= 120
##$ZL2= 120
##$ZL3= 120
##$ZL4= 120
##$ABSF1= 10
##$ABSF2= 0
##$ABSG= 5
##$ABSL= 3
##$ALPHA= 0
##$AQORDER= 0
##$ASSFAC= 0
##$ASSFACI= 0
##$ASSFACX= 0
##$ASSWID= 0
##$AUNMP= <proc_1d>
##$AZFE= 0.1
##$AZFW= 0.1
##$BCFW= 1
##$BC_mod= 2
##$BYTORDP= 1
##$COROFFS= 0
##$CY= -3
##$DATMOD= 1
##$DC= 2
##$DFILT= <>
##$DTYPP= 0
##$F1P= 0
##$F2P= 0
##$FCOR= 0.5
##$FTSIZE= 0
##$FT_mod= 4
##$GAMMA= 1
##$GB= 0.15
##$INTBC= 1
##$INTSCL= 1
##$ISEN= 128
##$LB= 0.25
##$LEV0= 0
##$LPBIN= 0
##$MAXI= 10000
##$MC2= 0
##$MEAN= 0
##$ME_mod= 0
##$MI= 1.114404
##$NCOEF= 0
##$NC_proc= 0
##$NLEV= 6
##$NOISF1= 3.799351
##$NOISF2= 2.8
##$NSP= 1
##$NTH_PI= 0
##$NZP= 0
##$OFFSET= 14.38212
##$PC= 1
##$PHC0= -4217.042
##$PHC1= 7.192299
##$PH_mod= 1
##$PKNL= yes
##$PPARMOD= 0
##$PSCAL= 0
##$PSIGN= 0
##$REVERSE= no
##$SF= 200.129724274929
##$SI= 16384
##$SIGF1= 3
##$SIGF2= 2
##$SINO= 400
##$SIOLD= 16384
##$SREGLST= <1H.CDCl3>
##$SSB= 0
##$STSI= 0
##$STSR= 0
##$SW_p= 3205.1282051282
##$SYMM= 0
##$S_DEV= 0
##$TDeff= 0
##$TDoff= 0
##$TI= <>
##$TILT= no
##$TM1= 0
##$TM2= 0
##$TOPLEV= 0
##$USERP1= <user>
##$USERP2= <user>
##$USERP3= <user>
##$USERP4= <user>
##$USERP5= <user>
##$WDW= 1
##$XDIM= 8192
##$YMAX_p= 0
##$YMIN_p= 0
$$ End of Bruker specific parameters
$$ ---------------------------------
##NTUPLES= NMR FID
##VAR_NAME=  TIME,          FID/REAL,        FID/IMAG
##SYMBOL=    X,             R,               I
##VAR_TYPE=  INDEPENDENT,   DEPENDENT,       DEPENDENT
##VAR_FORM=  AFFN,          ASDF,            ASDF
##VAR_DIM=   8192,          8192,            8192
##UNITS=     SECONDS,       ARBITRARY UNITS, ARBITRARY UNITS
##FACTOR=    0.0002768,     1,               1
##FIRST=     0,             0,               0
##LAST=      2.2672688,     0,               0
##MIN=       0,             -27123,          0
##MAX=       2.2672688,     28109,           0
$$ Real data points
##PAGE= N=1
##DATA TABLE= (X++(R..R)), XYDATA
0@%%%%%%%%%%%%%%%%%%%%%%%%%kOj1J5j6J6j6J6j8K2k6L0l3L7m1M6n3N7o5P2p7
46d1Q6r4J04j15J26j40J57j72J87k06K28k54K84l18L55l98M54n23O10p27Q91j129
68f35J503l214L0455q113m3394K485K6086O764q981l713q485k205J8511J2127
82A9191k2148j6781J8736K0936r637j7680k96J0841N547l865j1913o325J2037
95a357J2365j0073j3247O778J1371r19n292k577j720M037R528k483j3968K054
109e503J5930j573j3217J047P244n035m129P681l91j1109L447J3005n833j1591
123a0027R668R720j1516o760J4367O358j4827m211J3300J341j0184J045M570m997
137b153j579P361p64r657J061R372j194o749J381K987o99K595J624n022l54P943
$$ y = [0, 0, 0, 0, 0, 0, 0, 0, 0, 0, 0, 0, 0, 0, 0, 0, 0, 0, 0, 0, 0, 0, 0, 0, 0, 0, -2, 4, -7, 8, -8, 8, -8, 8, -10, 12, -14, 16, -17, 20, -21, 25, -28, 29, -36, 36, -41, 45, -49, 55, -60, 66, -74, 83, -89, 98, -108, 120, -134, 150, -168, 187, -211, 243, -280, 330, -397, 494, -635, 868, -2346, 28109, 19996, -23398, -20913, 5173, 11937, 2956, -757, -9242, -11447, 7064, 19191, -2957, -19738, -1002, 19934, 10297, -7383, -7679, 3162, 8709, 4844, -7069, -13394, -1357, 11008, 935, -12312, -5534, 5837, 4918, -374, -2951, -4671, -634, 8894, 6411, -7557, -5503, 10427, 8854, -4363, -3316, 3928, -1107, -5236, 2445, 2054, -9055, -5608, 7397, 1564, -10027, -359, 9361, -2155, -8915, 5452, 11810, -3017, -7228, 6072, 7413, -2771, -1726, 2844, -2153, -3732, 3629, 2865, -6792, -5731, 3641, 2447, -4302, -2921, 66, -633, 1962, 3586, -1436, -1790, 6153]
153F153K39r122l20P886k238p276L084L221n128Q64O338m038p755O567Q471p541
169e95o703Q375M363o644Q93N889m815m456P566L466j0776l027J0491m1j0202
184f216K458P436m807m950O557K924o950K84Q001k032o767N021N631o495l043
199b948N833P55m881O98K677l745k020N591k55p370J483O743k377m153L616K574
215B221l241R41N056l273n129N317M688p226l672O450J084n811K21L988l370k913
231d669O194R61q326J255R330j565p833L193O422k856l371M364m3o217L125O221
247F185n900o485N853M425n919k991M873L45l892K845L467n323p23P279m5o261
263b267J270N659k258l999K939J367m790R85M293m245m307N144L017o171j324
$$ y = [6153, 6392, -2730, -3050, 4836, 2598, -4678, -1594, 1627, -3501, -2637, 3701, -337, -8092, -1525, 6946, -595, -7298, 1077, 5440, -1204, -311, 5578, 763, -3693, 3873, 7339, -3437, -6464, 4027, 3986, -6216, -3758, 3678, -1129, -6079, 478, 3402, -3548, -3264, 4737, 2705, -4062, 959, 6590, 95, -2948, 2885, 3640, -1241, -543, 2134, -1611, -3631, 1960, 1705, -5665, -4182, 2561, 184, -3969, -353, 2221, -1020, -79, 4977, 1704, -3425, 1892, 6580, -646, -4318, 2132, 3216, -2595, -2374, 1614, -1756, -4669, 1525, 2486, -5840, -4585, 4745, 3180, -4653, -1460, 4962, 2106, -1265, 3099, 3056, -3161, -36, 6185, 285, -6200, -347, 4078, -1841, -4832, 41, 386, -3506, -661, 2806, -2517, -3240, 4039, 3994, -2267, -997, 4662, 2404, -1595, 1344, 2711, -2079, -1094, 3199, -1046, -5353, -209, 2808, -3363, -4687]
278d687O190K2m859K806M553m374j801O269q7o394J723N750l491n452M046L300
294C514n498k183N755j173n034L090M117m222k194N448J800n228J82O063j950
309B487m446L624K088m346p60L746j384m489K117L546l990k684M824R55m346J434
325a624M038k094k141L750J638m433k1N235j973m973L111K998m692k104M144j16
341G43m595J490M618l537l305N187K247n072J73N395j201l836K804L121m173j974
357a915M938k77n908J781M066l541l105L746J592m532K27M900j663l621L789L042
373C519m135n34M439m46l974J633L076l358k865M066L42m954P41M034k469k952
389c837L455K038l705l57M823n52l864K407L723l725j480L724J28m406Q08L462
$$ y = [-4687, 1503, 1525, -3334, -528, 4025, -349, -2150, 4119, 4032, -2362, -639, 5111, 1620, -3832, 214, 3514, -1984, -4167, 1588, 415, -4619, -1529, 2588, -1634, -3828, 1620, 3420, -1808, -1626, 4437, 2487, -1959, 1665, 3753, -593, -1353, 2393, 1009, -3480, -1363, 2183, -1807, -4491, 333, 1288, -3058, -1624, 2414, 320, -1821, 1929, 3567, -866, -887, 4348, 2375, -2598, 513, 3511, -1181, -3285, 859, 743, -3852, -2362, 2256, -1281, -4586, 601, 2848, -2224, -2051, 3344, 2143, -1693, 1111, 4232, 59, -1915, 3023, 2746, -3162, -1381, 2685, -856, -3961, -215, 1377, -3155, -2928, 1972, 309, -3312, 477, 3519, -616, -1150, 3289, 2843, -1131, 502, 3578, 220, -2645, 1421, 1763, -3191, -2450, 1584, -885, -3837, -382, 1656, -2049, -2406, 2417, 1865, -1999, 408, 4131, 406, -1074, 2650, 2778, -1628, -820, 2642]
405B642k389l681L104J900m249m78M323j124l213K714K804k624j552M061P20l899
421i41O58L922k516k786K771J204l969o33L518r83l666J927L070l195j316M097
437A162J16l169J744L196k037k350L255J476l791n15L609j732l565K688J700l607
453a820j472L636N13l958J186L863k213k369L973J416l401J01L755j349l006K026
469H81J938l618r82L405j026l619J658K544k685j657L296J024l319O81M064j768
485H17k690L218K193l422j096L160k51l075Q30J914k431j642L013o7l509J070
501a968L223j448j913K211J577k536M16L516j151l560K460K756k877k219K375
516H62N89k787M4K253j940k299K994J194l075P7L179l44j972J845J691k460m44
$$ y = [2642, 253, -3428, -324, 1576, -2673, -3151, 1172, 48, -3165, -451, 2353, -271, -1823, 2238, 2958, -941, -283, 3639, 1123, -1663, 1108, 2312, -1657, -2290, 1228, 245, -3421, -1494, 1576, -1619, -2935, 1162, 1278, -1891, -147, 3049, 1012, -1338, 1917, 3393, -398, -913, 2696, 964, -2601, 87, 1787, -1820, -3292, 344, 857, -3101, -1915, 1948, -265, -2634, 1339, 2755, -646, -545, 3210, 1861, -1145, 881, 2819, -799, -1781, 1624, 598, -3021, -1363, 1181, -1504, -3161, 135, 1159, -2160, -1479, 2585, 817, -1873, 1345, 3538, 116, -980, 2180, 1929, -1146, -316, 1598, -833, -2475, 538, 471, -3038, -1968, 1255, -193, -2106, 105, 1682, -854, -438, 3078, 1927, -1633, 827, 3583, 706, -1513, 862, 1451, -1336, -1292, 961, -979, -3278, -284, 910, -2165, -2088, 1091, 747, -1225, 620, 2311, -149, -593]
533e93L396m02m138J552K996k413k652K120J125k781n55L025r22k942K450K632
549A898k643j080K760J031k146O32J879j736j296K585M89l911J79K752j567k085
565b259J691J071k653K4L425n76l382K054L364k195j647K729L56k392L41K658
581B609j849k853K536J645l372j276K808n07k134J447J689j900o86K586J084l030
597a203O65K970j052k022J554J066j920n72J710o20k566J175J911k387j260K142
613d09M65j575R15J586j133r93K509J095k619j67K763j055k542J727J314k435
629e54j463K646J02k915K23K744j427j857K500J042j999M9K523k81k081J422J722
646B396j886j096K116l03k486O65J423j645j202J676P65k166O2K638q84j674J811
$$ y = [-593, 2803, 2401, -1737, -185, 2811, 398, -2254, -134, 991, -1790, -2345, 680, -242, -3184, -734, 1898, -745, -1825, 935, 1966, -180, 452, 2331, 595, -701, 1884, 2373, -1538, -1359, 1393, -174, -2259, -568, 503, -2150, -2126, 1299, 723, -2659, -605, 2759, 564, -1083, 1646, 2002, -390, -49, 2609, 760, -2093, 443, 2088, -1284, -2560, 248, -259, -2393, -946, 743, -1157, -1843, 743, 1827, -1203, -538, 2432, 1380, -642, 912, 1978, 58, -514, 1196, 576, -1990, -815, 1096, -1291, -2551, -409, 56, -1519, -604, 982, -151, -1144, 1365, 2460, -159, -326, 2437, 1382, -1160, 567, 1881, -554, -2017, 629, 731, -2184, -1961, 783, -644, -2501, -1, 1041, -958, -909, 1614, 1333, -748, 674, 2396, 510, -586, 1530, 1227, -1259, -594, 829, -816, -2018, -342, 423, -1743, -1681, 957, 73, -1601, 210]
663B10J481j685k57K188l21k393J197J775j976j628K144J67k758P26J766j119
679d83j984J960J370j952n00K735o6k172J523J927j674j263J810L61j931N8J473
696A192j314j741J578R46k134k09K014m93j296J139J406j294l87K028K52k366
712f79J067J683j386j368J283L12j888l39J800m88k389J565J718j980p26K167
728C52N41j803N82J920p53j207J316J133k104m75J979r05j640P10R11j342p78
745a563J576M0j986J049J794j091r03J836L22j248M55J514p29j771J576J045k388
762d72p07J932l68j846N78J300j371r04J815Q06j869K69K207p28j162J386P95
779A661j335m32J427o7k198P12J501j880q29J360K12j482K26J354n90j046J371
$$ y = [210, 1691, 6, -251, 1937, 1616, -777, 420, 2195, 219, -1409, 735, 902, -1856, -1130, 636, -483, -2467, -507, 863, -1089, -1589, 1146, 1080, -1092, 431, 2358, 684, -579, 1231, 1592, -339, -281, 1192, -122, -1863, -285, 661, -1473, -1682, 332, -161, -1457, -318, 1088, -206, -593, 1435, 1687, -679, 388, 2071, 685, -683, 600, 912, -976, -1315, 485, -3, -2392, -827, 891, -1089, -1815, 352, 893, -910, -328, 1592, 839, -368, 948, 2081, -23, -498, 1481, 576, -1064, -354, 557, -785, -1563, 13, 53, -1933, -884, 910, -181, -1084, 752, 1074, -174, 281, 1795, 1066, -705, 871, 1916, -472, -1179, 753, 385, -1461, -883, 417, -954, -1858, -43, 763, -1106, -837, 1370, 642, -520, 866, 1661, 326, -106, 1321, 1254, -944, -232, 1269, -611, -1440, -80, 132, -1350, -1124, 230, -360, -1406, -35]
796c5J110j475j77K155m98j440Q78J071j376o90J262j56j739O5J508r73j218J348
814c80N71j348J34J691l17j178R84J557j359o48J524J82j704M74R55j133j139
831a134Q94N48j545RJ516m44j324J062J032r45m00J525R2j064M28J286p71j385
849f20J456L00j800j5J289o91j452J052P80j326l29J637%j442J113J147q43p51
867d95J561K12j189j52J455q77j466J174O24j612l79J218l21j237Q23J052q94
884e03m10J332M41j200K87J375o50q12Q01O10j141m93J050m92j449P94Q11j183
902h32m30J115J98j041M42J177m97p24J123P49j315OJ366n56j126O10P60j340
920c15n50J027L7j592M52J095n57p14Q74P52p47k29J382O8j233P56R19j081o80
$$ y = [-35, 1075, -400, -577, 1578, 1080, -360, 518, 1589, 213, -477, 785, 629, -1110, -1045, 463, -510, -1728, -380, 191, -1157, -1023, 668, 351, -827, 157, 1714, 355, -293, 1231, 1413, -291, 183, 1138, 5, -1134, -240, 308, -1237, -1228, 288, -156, -1480, -418, 614, -331, -731, 794, 886, -178, 250, 1536, 765, -620, 836, 1136, -664, -679, 610, -81, -1533, -481, 299, -1027, -1356, 281, 281, -1161, -48, 1099, 256, -495, 1066, 1278, 89, -63, 1392, 515, -951, 223, 847, -765, -1144, 74, -247, -1484, -661, 391, -503, -913, 419, 860, -340, -53, 1322, 672, -140, 661, 1271, 130, -363, 687, 195, -1254, -460, 351, -832, -1262, -147, 51, -990, -548, 629, 132, -592, 531, 1280, -35, -29, 1337, 781, -345, 265, 1025, -315, -865, 162, 199, -1393, -941, 154, -403, -1117, -243, 509, -238, -467, 915, 983, -250, 506, 1425, 344, -336]
939c36J139j67j246J48R98j048q12J027L88j287J30J358l48o41J036P19j054k89
957b85J188J17j105L83Q67r22r81J008j1j068l1R30n16q30P55Q37r04j78J390
976F44q9r47P72P93r16k46P78K53j386K6J069r15q87P36L81j007o4J043j37p48
996h47M94R30m26l05Q22J93r12L98O30o23p34M96N26j089l23R01m62q10O42P85
1016B86j026j6Q73K00o71L16J034n39p40Q88L88j014N9P70m37r18K53M02p08l51
1036i51Q48Q0j033N37R10m67m56R22J86m82m3Q57k41r34P76L37j083j17O74l53
1056c3q14L21O86n53m98P26K84p30M19J090n76m97O26M41n51m49R27j05j150N15
1076G9L71r23k91O82N6q47J4R90l77m80P45O71p21j40R19o3p25N37L77n13o11
$$ y = [-336, 803, 636, -610, -462, 536, -512, -1324, -297, 91, -1196, -1066, 292, -56, -697, 339, 1058, 4, -285, 903, 1020, -85, 298, 1165, 243, -738, 270, 259, -809, -840, 90, -426, -1256, -501, 336, -568, -746, 644, 555, -392, 380, 1173, 257, 11, 789, 1042, -344, -318, 751, -164, -1051, -315, 66, -941, -1005, 38, -99, -847, -353, 577, 151, -154, 668, 861, -51, 347, 977, 354, -380, 116, 642, -447, -770, 131, -331, -1141, -499, 286, -740, -756, 117, 317, -354, -38, 996, 457, -283, 605, 993, -21, 38, 808, 371, -547, -294, 108, -600, -951, -103, -23, -1056, -519, 391, -76, -532, 390, 576, 94, 51, 908, 667, -267, 509, 846, -237, -354, 320, -33, -847, -526, 160, -393, -891, -165, 119, -611, -192, 898, 322, -175, 451, 892, 341, -108, 819, 714, -436, 79, 450, -473, -764, -82, -26, -873, -859, 131, -246, -726, 19, 690, -31, -171, 748, 685, -40, 497, 874, 361, -250]
1097b50N39k5q11M0O05n75m80P60J62n28mP69Nn96O17N59m54q5O23l86n75K90
1119B00K96m84n60N13J01q26J3Q55k33p97O55O65q14K61O59K26p54K96R25q45
1139C52n47O61L4r19K18M97m39n94N23L75p46j39Q92p4n97K85P47l00j18N12J26
1160G49o29m1O89o32n03M96J54o34j69M59k62n18N62L19l21k24R40J59p18L21
1180A97O81l55m64L13K52p21k43P97m13o39L25K75l43l99M69K23m27M5Q74k70
1200A77n35N58O26o58j9M63j53m29j34M75m51k86L37P3p71K25N89m41j46M10K65
1221A75l01M2O43j63m26M31L52o14l77P35j79n54J60L08n89o26P97L29p15L5O99
1242A62j49l61M49N56m68j45N16o1m87J57M68o83l44M86qn80r4N72k39m49L60
$$ y = [-250, 289, 264, -547, -507, 98, -477, -957, -197, -35, -563, -567, 202, 207, -389, 228, 787, 333, 248, 871, 485, -90, 200, 496, 12, -548, -35, 66, -760, -747, 108, -125, -922, -267, 398, -416, -155, 504, 730, -24, 272, 1197, 352, -195, 466, 500, -419, -201, 296, -143, -737, -214, 161, -585, -724, 168, 94, -503, -218, 529, 229, 111, 623, 749, 120, 79, 768, 136, -367, 129, 283, -351, -520, -61, -323, -841, -279, 40, -281, -505, 435, 594, -124, 197, 878, 523, 59, 372, 624, -97, -340, 457, 44, -595, -270, 5, -338, -737, -268, -45, -472, -427, 447, 177, -358, 200, 826, 168, 149, 612, 459, 30, -104, 371, -80, -366, -29, 44, -727, -502, 87, -354, -500, -90, 175, -126, -84, 559, 396, -30, 401, 753, 139, -238, 497, 318, -236, -76, 232, -357, -983, -186, 143, -572, -537, 162, 13, -348, 101, 657, 189, 44, 560, 499, 12, 169, 637, -46, -390, 96, 88, -492, -586, -14, -253, -702, -342]
1263c42N22l20j74O65n2l92M18K82l77r4K47J02n60r8L98m21k96K79J30n32K6
1284e89M92O4m16L26N30m01j15M87J12l40J7L25j65j88n6J43m42j49L94j99m68
1305f38L77J75k40j71N86J82l90J16O02l70j27M04J57p27M4L32l39m52J46L17
1325a6m87kL16K04m30J94M07j05j47K88K56n24J22N00j47m97M95j08n06N4J00
1346c3lm30Q1J53k66j6M44k3j90K50M20j85k21L65J65k96k13K83L3m86l9K03k59
1369b63k58J39J44l6j10M41j06j32L35J97k03j12L95p8k42Q2J71j64l41L28j10
1390G7l39j07K09q2k98K67K09k33p9N16J2o0J14J17j77J05KP9k30q1R9j12m67
1413d59K42K61n04Q8L25m4k91J24N08k98j00K81L00l70J29K78m03l0J58J97m88
$$ y = [-342, 180, -140, -314, 351, 299, -93, 325, 607, 230, 136, 383, 485, -75, -173, 225, -196, -492, -213, -83, -615, -589, -97, -33, -449, -123, 407, 6, -109, 378, 490, 150, 167, 492, 327, 139, 83, 226, -216, -365, 29, -170, -638, -261, -86, -326, -497, 89, 271, -119, -3, 599, 229, 102, 506, 663, -64, -20, 312, -27, -479, -333, -16, -503, -505, -189, 15, -415, -221, 186, 81, -66, 222, 478, -46, 76, 576, 429, -68, 427, 319, -187, -133, -33, -36, -466, -385, -232, -498, -514, -70, -93, -283, -33, 387, 202, -19, 346, 511, 215, 2, 285, 318, -168, -207, -4, -263, -521, -382, -238, -274, -384, 57, -49, -181, 154, 351, 148, 36, 431, 353, 111, 193, 364, 200, -141, 187, 77, -262, -369, -160, -242, -540, -273, -64, -297, -376, 140, 152, 92, 206, 323, 146, 251, 253, 332, 102, 21, 120, 8, -459, -217, 44, -460, -372, -47, -91, -382, -258, 250, -48, -148, 133, 433, 63, 192, 470, 67, 37, 195, 392, -96]
1434i6r6O0L7m33K43L22l38j46M03O7j88K85R7j24q3K56J23j32k57L55j40k18
1456cj08O2j05k76L73J9k96P5K39J39l08M09j12j39K86P3j5l49J29J6j75m13N86
1479A07j93l77K36K09l42J06J89M5j77J56K04j76J93N0J24j10m9J19P1m77J19
1500B7J80k95l05L26K8l67J47L54%m75R5O17k18k12L10J42j77Q4J03l65j35K16
1522H0j11j34q7J50j41o8J14K16k93J44K13J6k41K56J97r3O0N0J4l55j56L75n6
1545A50k50j52L55m95j0L62K5j73k2L94j94j48N11j22j27J59n0J13l12K39o3k39
1567d9k6L3k16J39j31J18j45N0K53L2k50R3J33Oj09J35K48k60k4J37j30M2k46
1590a67L53k88k81L04n0j23J4J65l4j27K24K82k38J2L15j63k47L80j47p3j70j03
$$ y = [-96, -192, -132, -95, -528, -285, 37, -301, -447, -44, 23, -165, 120, 217, 93, 10, 266, 389, 257, 0, 355, 215, -3, -111, -49, -154, -430, -57, -38, -334, -259, -20, 119, -189, 220, 108, -31, 255, 328, 313, -36, 93, 109, -66, -479, 107, -86, -463, -227, -18, -360, -254, -65, -20, -197, -41, 163, -13, 180, 230, 354, 244, 195, 314, 385, -92, 27, 207, -88, -393, -67, -39, -406, -259, 95, 95, -380, -285, 332, 114, -98, 212, 354, 177, 261, 364, -1, -136, 80, -31, -165, -252, -102, -243, -311, -197, 19, -274, -130, 83, 99, -142, 114, 311, 218, 278, 328, 342, -13, -169, 206, 150, -100, -252, 103, -392, -402, -40, -15, -188, -210, 184, -10, -158, 353, 231, 104, 263, 213, 326, 14, 253, 190, -49, -75, -42, -258, -119, -250, -132, -277, -227, 26, 58, -192, -99, 34, 40, -69, 66, 314, 54, 30, 167, 37, 79, -167, 186, -102, -383, -79, -129, -252, -238, -73, -107, -234, -10, 272, 34, 46, 361, 198, -49, 331, 184, 111, -59, -162]
1612a62K36k65mJ49j25k74J53K51p6K3J99O6j20J42Q8k04M2j2L7l45K8L47k08
1635c4PR1j54M7k55K26k15K08p4K31n6k60N77j24k31K10J83l02j50L98j13k14
1657dj57J78rm82J56K96j1l0J64j18k44J96M43l28j31L22J51l54m6K17k17j04
1679a12J08l1j30JQM2j61ML85q7k05L13R7o6j12L53k84j72J60j06J69k67N0M1
1703bk05J59Oj30M5J55o6k17K99nj30M3J26K08j30j77J89j0k25nJ86k44k13L86
1727D3L0l47J51J41j43J04J47q4J31k42L55j85j7q6J97k3j75Q0Jl21J08J46j72
1750a61l7J23M7j64Q5J07N5j60N5J89o6K4J16q7l9R8L1k09o5P2N4k42J20M7j73
1775a80m6J76J5r5J3J74O9j82J44K6L3Ppj56N6k1MM1l59L62k86K23r5j21J1L15
$$ y = [-162, 74, -191, -195, -46, -171, -445, -292, -41, -117, -94, 105, 171, 51, 193, 281, 77, 119, 107, 144, -201, -173, 174, -34, -27, 64, -90, -43, -298, -72, -287, -79, -153, 78, 22, -238, 339, 215, -16, 194, 377, 75, -75, 323, 210, -4, -161, 17, 8, -474, -318, -22, -33, -63, 101, -17, -261, -65, 378, 50, -81, 241, 392, 38, -8, 209, -8, -112, -4, -35, -165, -164, -156, -114, -275, -271, 114, 27, -178, 135, 232, 166, 54, 407, 123, -49, 111, 5, 174, -93, -43, -2, -207, -48, -42, -172, -127, 28, -38, -255, 44, 39, -91, -48, 78, 286, 156, -21, 168, 158, -67, -72, 114, -130, -343, 43, 73, -274, -123, 18, -125, -21, 126, 42, 173, -69, 286, 101, 84, -2, 195, 172, -3, 77, 78, -243, -135, 11, -161, -198, -75, -28, -192, -107, 0, 55, -105, -50, 139, 73, 97, 213, 126, 87, 185, 216, 7, -58, 14, 68, -174, -54, -7, -180, -226, -50, -35, -130, -117, 57, 126, -56, 88, 114, 147, 154, 147, -9, 47, 26, 30, 71, -288, 74, -212, 11, -84, -205, -194, 121]
1801A21j04Q6O0p1M4R1l41K10R2k06J21j74Q4j60n8K25p3p6n2L7J26j7Q6q5p6
1826a10L20M0j47l3k9J25r3j63J88j27j56p0J55n5p8L17L4j11q4J97j02m2Q3J04
1850A63J9j79J10J83m94K14Q0j68j42P2N9p6K9O6l1l4J51q0q2J76J85j65o2J58
1874A52j29K6M0j30K7j04o7K25k98n8J11K9J53l5J22j8j30J47Q3K1r8p2J27k58
1898a34J17M2j17N9O0j28j69J29J49j22O8q0J57J1j41j3K47j09j20K95o0k51n3
1921a63J20N4j13N7nn7J49j30j12R6N3k8O7PJ90j64M7P8j20J09j79J04l0J5k38
1946a93K56p9j70J82j14j6J34L9j18J04J03J46k27KJ9J81j02M0n4Mk19J72l9J
1970E2j63N6j79O1K58k03Q1o0K50j64Q4j07J86pj0l9J15k56O4J56k72j3NOq6J29
$$ y = [121, 17, 103, 163, 92, 136, 227, -114, 96, 188, -18, 103, -71, 13, -147, -205, 20, -53, -129, -181, -144, -18, -35, 51, -34, -110, 210, 250, 103, 70, 41, 166, 73, -90, 98, -29, -185, -255, -100, -155, -233, 84, 118, 7, -77, 120, 18, -24, 59, 163, 182, 3, 113, 296, -198, 16, 96, -72, -214, -142, -83, -159, -130, -64, -95, -129, 22, -58, -140, 36, 221, 56, -6, 152, 23, 49, 89, -41, -14, -118, -185, 40, -258, -316, -205, -176, -23, -58, 64, 46, -84, 63, 146, 167, 69, -3, 124, -134, -17, 25, -92, -33, 27, -101, -270, -141, 8, -114, -46, -126, 31, 42, -99, -112, 135, 26, -94, 201, 141, -110, -163, -43, 11, -102, -45, -50, -107, 42, -88, -200, -104, -51, -79, -12, -5, 185, 21, 68, 146, 26, 135, -44, 60, 30, 45, -193, 63, -16, -186, -4, -118, -134, 0, 39, -79, 25, 128, 274, 47, 49, 68, 249, 147, 187, 133, 137, -82, 90, 51, 52, -111, -55, -234, -173, 85, -118, -37, -97, 153, -11, 73, -34, 152, 145, 135, 96, 211, -45, 19, 175, -97, -110, -105, -99, -185, -56]
1996e6j41J35N2j22K14j95lL36j23m3N4Km7K5j58K05r4k24J91L4o2l1%r8J91K7
2022F9q1n2R5J08j8K5MQ9j33n3jp2j42K51l14K39L9p5K8p7j1K35k56n2L18J8r8
2049H3l7J32j78O0j2Q7k05j0N9p2m8O4o3o1M7L15j30j60P3M2J31k06K72q6k80
2074a83J76J63q9n1j2J44k89J03Pp1mL4J02p1J09M3k2q8l7J00l4J26J3j28r2m7
2100i8J61j21Q8j18J14j35J98j21J33k03k1J1J26j7N2N6mo7J79J7k11L1jr2R0
2125D7k10J77r6OJ44q9o2J41k6k01K55p2l7M3N6K02l27J68K3k09M5K5N1j44P8
2150a2p6J10j19KJ29m6o9K83j84J67J1j75j65K05rJ36j13n9o5M7k17J84L2j64
2174a67j36J08K23P8k52J17p3J56rJ3P5j49J95j2j90l9R2r4o1J12r7Oo5P8r6K71
$$ y = [-56, -197, -62, -10, -132, 82, -113, -116, 220, 97, 54, 108, 110, 63, 88, -70, 135, 41, -183, 8, 42, -20, -51, -51, -149, 42, 69, -12, -64, 31, 139, 121, 146, 150, 239, 106, 53, 52, -20, -162, 89, -225, 14, 53, -22, 6, -71, -82, 153, -103, -155, 163, 181, 83, 46, 178, 0, 60, 48, 135, -70, -80, -21, -93, -141, -77, -140, -201, -154, 161, 31, -129, -56, -14, 117, -89, 183, 97, -183, -7, 156, 67, 16, 4, 148, -141, -38, -31, -102, -106, -72, 30, -41, 68, 111, 89, 1, -36, 64, 30, 156, 169, 41, -51, -98, 63, -58, 30, -88, 26, -109, 89, -32, 101, -102, -123, -112, 14, -3, 49, 105, 101, 34, 213, 230, 19, 50, 49, -43, 47, -163, 14, -82, -76, 68, -21, -83, 58, 32, -169, 86, 14, -23, 20, 76, 278, -49, 119, 142, -67, -22, 3, 54, -90, -12, -88, 22, -97, -95, 34, -12, -81, 202, 18, 185, 196, 21, -144, 61, 52, 188, 75, 16, -49, -2, -219, -35, -3, -167, -303, -195, 28, 106, -146, -29, -102, 54, 45, 58, 133, -16, 179, 167, -23, -62, 30, -64, -125, -13, -110, -104, -169, -91, -187, 84]
2200H4Kj72J30j19P9P9j05J15l2N3O3j42K8j64J22j10N6k14J25J82J4l7k57L68
2224A48m24L18R9j18j0L8L7l8jJ9q2j29P4nOo2Ll6J22j73J90j58R2m5J86q8J25
2251H8j1m5o1Q9q6Q5Q9k39J29Jj52P1Q4j49J06O1o6J72k17O0o7J3L1J06M1j29
2277Dj30J01j44O2p5m2J19P7l5q9J36k17J89jK58k95J53J17j74KM7K4n6J3J9j08
2303d5Rj0j97K04q1O6m8J61qj7J24l5r4K5J8J4m7J09k03J5M1k53Q9Q5K4m6j6J35
2331A9Q6k86J68N1P9j89l1J65nk4nM3O9j83P7L9q9N3p6j11O1kJ19j11jR2j13K94
2359A89k14Q2o6J54n4p0R8p4j80K19n9J86j07q0p9J34k25j4J24J40Lk65J60j1
2383iO3L2l6M6o8N9J32j44j68J07n9Jj45K89k43K59k58J99l7m5J40o0m2J35J1
$$ y = [84, 86, -86, 44, -75, 4, 83, -22, 93, 61, 114, 177, 35, 63, -101, 21, -89, -33, -247, -122, 60, 74, 37, -220, 148, -276, 42, 141, 23, 13, 51, 88, 50, 49, 68, -14, -143, -69, -74, -68, -130, -127, -163, -41, -214, -24, -182, -90, -135, 51, -37, 88, 77, 32, -29, 60, -26, 59, 148, -91, 38, 39, -113, -42, 42, -107, -1, 60, -6, 166, -51, 9, -58, -45, -14, 92, 133, 4, -126, -25, -169, -107, -182, -224, -105, -28, -63, -152, -16, -233, -44, -45, 213, -82, 71, 188, 14, 16, 63, 87, 31, 44, 63, -45, -36, -46, -243, -39, -120, -54, -102, 59, 51, 34, 158, 123, 29, 54, 72, 86, 39, 148, -55, -40, 1, -252, -163, -78, -54, -100, -116, 19, 105, -181, -13, 38, 117, -72, -103, 62, 57, 33, 28, 71, 140, -43, 34, 73, -16, 37, -39, -150, -89, -91, 28, -83, -84, 8, -105, 189, -25, 57, -9, 145, 91, 21, 119, 45, -135, 84, 25, 211, 104, 24, -55, 79, -146, -160, -36, 104, 107, -158, 2, -9, 54, 86, 50, 96, 28, 87, 219, 75, -93, 14, -45, -44, -189, 100, -143, 116, -142, 57, 20, -25, 115, 55, 13, 148, 159]
2408A59j76J51p0p2J25r3k08J47p0R9k04J28Q2k46K74J27Oj54k7P3r6J20r5J52
2432A32l4J4k4n3j27o7J89m0Q8k33J90j23O9J17k34P9J3j3J8K19k23O7M2j8r2
2457d4Q5o6Jo8q2m5J28L6J18p2j23K64J7j86K7R4ln6K28l18j21L15j7j48k8J29
2483F5j50J41k5j49J6J15r8Q4O6j70K22p8L9J42j07j21M0N2o2k44J37J13M3j43
2507g2Q5k04J29Q0q0N8O2Jn0R8J21k22j8L5M4m1M0r0mJp6J21l6k31J55M5n3J11
2535IJ17j01K20j95j54L59k96M1J58j12O0q9Q5j72q9J11L0p3J2L9j57J57K23k
2559A81j77l0k4J94j56q2Q1M6O6O0k60r3K26%j1q5J68q8OJ04o9j25J02P5p0J42
2585A81j68Q0q5K15l42J57j54J15K0j34J74j10K0L4J9J60k05k5j5J61N2k42J33
$$ y = [159, -17, 134, 64, -8, 117, 24, -184, -37, -107, -8, -212, -84, -2, -248, 26, 153, 159, 5, -22, 51, -45, 75, -20, 132, 98, 112, 88, 35, -92, -159, 30, -10, 78, -155, 35, -88, -19, 98, -136, -57, -44, -57, -39, 180, -43, 24, 66, 48, -44, 41, -25, -24, -92, -174, -219, -91, -55, 63, -9, -132, 132, 149, -37, -10, 84, 81, 25, 253, -65, -186, 129, 112, -36, -64, 65, -85, 56, 31, -118, -102, 13, -85, -1, 65, -105, 117, 39, 78, 220, 113, -8, 32, 84, 22, -222, -85, 28, 71, -72, 13, -191, -62, 18, -62, -4, 58, 59, 9, 107, 228, 6, -12, 23, 67, 26, 66, -24, -28, -27, -103, 18, -18, -249, -94, -49, -102, 9, 126, 25, 245, 50, -104, 255, -41, 0, 158, 46, 106, 17, 102, -70, -159, -48, -18, -91, -79, -40, -197, -40, 183, 181, 4, -26, -50, 144, -12, -94, -13, 33, 99, 159, -101, -194, 32, 32, 21, -64, 104, 16, 22, 126, 57, -68, 34, 109, 39, 181, 13, 93, 8, 223, -119, 38, -116, -1, 19, -115, 59, -51, -31, 3, 22, 182, -23, -48, -63, 98, 150, -92, 41]
2608D1L4mn1P3k46O6p2Q6M7J01o4r2j4J48l4n1J4j51J85K6r3j0R1MJ13j17j34
2635a04J30j03J63j53M8m8R0O6m4j48N3N1R3kLn5m0J05M2l9q1k1Qo5P0J85k13
2662iJ13j30n8Q1J4O6l0k0L7q9J24l2L4P2m4j54r2J29pj19J98l2M7n3p9jl5R2
2690B3O0lr1QQ3J6j42Q1k1J11j05q4j7J82J6l17L6n0K94M0r0rRr0P6J39j3k08
2718f6K65j87J2J14j70o6J79j01o0J99k26k1J28J2r8J80r3J31j08j94J57L6j34
2741a11J14k3j0j9m1J32M8j32j97K94o4R2pk46K29Q7j96jL4R7n4%k31K08J1j36
2767a22K19ok4k08J36o2R3p5K7q1K47k09r9J64J50q8k28K69j51K3O7M4kRj46%
2793e3J74oj20m9Q6R9j44l7M4L0K2j01J91j28K10k07r8J78R3k14L7j1K1o8J61
$$ y = [41, 75, 71, 20, 93, -153, -87, -159, -73, -26, 75, 11, -81, -95, 53, 19, -32, -18, -169, 16, 42, -51, -61, 30, 34, 147, 30, -104, 26, -77, 86, -67, -19, -67, 23, 89, 45, -103, -50, 1, 94, 92, 95, 40, 0, 105, 147, 108, 27, 6, 14, -51, 19, 204, -9, 104, -26, -84, -3, 11, 77, 47, 27, 64, -25, 99, 67, 101, 173, 129, -25, -117, 12, 5, -114, 84, 52, 99, 46, -33, -34, -69, 23, 83, 80, -11, -3, 80, 96, -46, 35, 14, 125, 20, -64, -81, 101, 117, -200, -164, -214, 80, 120, 30, 21, 30, -60, 16, 155, 142, -66, 199, 12, 24, 138, -32, -98, 81, -20, -80, 119, -107, -128, 0, 12, -86, 94, 1, 132, 24, -170, -13, 23, -111, 3, -20, -30, -49, -90, 42, 90, -42, -239, 55, -9, 83, 76, -170, 59, 146, -50, -51, -17, 80, 26, 26, -205, 3, 14, -122, 97, 91, 67, -141, -5, -67, 26, -49, -22, -103, 144, -65, -164, 0, 150, 62, -166, 103, -48, -25, 42, 86, 84, 93, -53, -53, 121, 115, -5, -54, 32, 131, -13, -50, -6, 24, 46, -55, 136, 8, 218, 11, -87, 91, 184, -30, 7, -4, 17, -51, 110]
2818A10R8k14N3j34O4P3j9k16J81J9j8N3N0J07j81r8J14j07p2J10P1j29O0Q9k12
2843a48K10M2j13N9m0j9J8OM7N7o8N0M7j08k6J43k27k6m8L35j07l9k1r6J47j52
2869g7J3J32r1LQ8j7p0J63k28P0K3J6n4J23j64m7Q3j96K77p1j7r6J43j09J23j21
2895a01J52J50j93oM8k75J77M6j7j5j51K04J57k98O1J99j83m0k9J65rj18P8J5
2919A7k9J6JRqj01pJ51K7J1o3O0J16l14J81J5q6P8j51J54j22j24l2K73k41J96
2945B7l1L8N6j75J23m1R5k31N5O9O7o7O4j48M7n4O4J98j5J7j04N8j35M4Rn0j46
2972a66KK28j30q3K89l19P9l7l1J51O1L2j16J01l2j3K5n7R7qj10K3j8r0K76j32
2998B2N2j28J7M5r9K23q0q4M2J0J35l15J58n3k39K91L7%L8j52J7K80j89O9o8j69
$$ y = [110, 208, -6, 47, -87, -23, 50, 31, -185, -4, 15, -3, 50, 100, 207, 26, -72, 42, -65, -137, -27, 44, -85, -25, 64, -148, 62, 104, -9, 50, 10, -9, 9, 15, 62, 119, 51, 101, 148, 40, 14, 157, -70, -96, -144, 191, 84, 45, 24, -72, 75, -77, -64, 68, -23, -20, 68, 51, -19, 144, -84, -14, 9, 25, -29, 94, -70, -117, -34, -230, 47, -24, -41, -137, 6, -103, 20, -101, 51, 201, 8, 2, 50, -225, -48, -2, -19, -34, -185, 19, 176, -122, -61, 138, -45, -85, -114, 51, 42, -76, 2, 17, -12, 4, 5, 14, 6, -95, -102, 49, 76, 87, 24, 84, 200, -114, 67, 82, -4, 74, -77, 77, -45, -169, -201, 72, -169, 27, -4, 34, 90, -85, 38, -3, 92, -139, -84, -15, 52, -15, 49, -99, -52, -106, -42, 156, 141, 158, 54, 112, -23, 21, 30, -20, -166, -164, 64, -66, -149, 140, -179, -100, -137, -168, -17, 44, 76, -40, 61, 29, 16, 41, -16, 81, 73, -37, -14, -32, -122, 154, 22, 74, -54, -37, 8, -91, 132, 52, -32, 10, 20, 155, -160, -2, -55, -294, -3, 34, 34, 72, -80, -63, 217, 28, 97, 29, -140]
3024a40J85L3j13R4O5q7j16k1P7Q5k22J63m7n8J22j02L4nJ4L5n4k7M1P3J14j30
3050A3PJ0Ll1j44R9J27j1j7r7J27j06P0K1o3j12J59j56J81k74K29l3j61K62%k26
3076a23kK40p4j33J10n5k43J36N6Q8q3J14N5j18J79j3k20N2J67k64L3K79k28N1
3100DR5r1J27k43Rl1P6Q2R8k08Q0M8K9K6k5j38J28J12j85J33o2m7k5P7M8r3m3
3127a9PR0q0n3m9O3J33q8o9j51L13j91N0J35jrJ1p0P8j26J13p3p0K20j21k5j47
3154a29J00J49j81%K53k64Q6j10J98o3N3o7k6p1LJ04N9j18P0lL5j8M9j40J68m3
3180I4j06M7j09J66k7j02J42k33K49j45q2j05K66L5j23J3k05J98J26j88P5P8l6
3203B8m3q0J65k3k02J56N4Q6O5k47rr2K82l85J83J82j44%J09k01J41J29r0N6j17
$$ y = [-140, 45, 78, -35, 59, 124, 37, -79, -100, -23, 62, -160, 3, -44, -102, 20, -82, -48, -53, -39, -4, -58, -85, -44, 29, 143, 13, 20, 30, 33, 2, -142, -43, 84, 73, 56, -41, 86, -20, 50, 71, 8, -104, 55, -101, 80, -194, 35, 2, -159, 103, 103, -123, -125, 115, 41, -92, 18, -37, -280, -144, -88, 0, -83, 31, 86, -32, 147, 134, -86, -34, 133, -131, -98, 181, -47, 4, 99, 8, 135, -108, -99, -130, -54, 28, 126, -82, -2, 46, 75, 101, 76, -62, 66, 178, -7, 126, 64, 17, -8, 69, 117, 24, -19, -12, 78, -2, -55, -104, -41, 92, 4, -65, -216, 97, -94, -44, 91, 90, 81, 92, 22, 100, -26, 87, 14, -56, 164, 43, 18, -129, -29, 120, -61, -61, 192, -72, 14, -96, 102, 39, 92, 25, -1, -72, -69, 35, 94, -24, 46, 43, 78, 60, 109, -31, 137, 94, -12, 35, -74, 92, 65, -37, 105, -128, 121, -24, -106, -211, 55, 90, -33, -20, -225, -27, 99, -89, -14, 64, 28, -15, -95, 70, 47, -155, 1, 55, 141, 206, -41, -50, -142, 140, -245, -62, 120, -24, -24, 85, -116, 25, 154, 64, 120, 3]
3228Cj35j1J88OJ4l5J34k35QR3k1pj59J05K6q5Q3N8L1j23N3m7k0K33l5j1j47K
3256c4LN1j30J88o9N2J7r3O6j59K92k46l4N2nM1j2o1j4K71n6N8q6j43L7M6q5P6
3284B3p8Kl1q3J97P1j15J37j27J00m9r2Q6j20J99n7NnK4j84j13J28O0R3j85J52
3310C8k8K7Ql9J59j01n3R5k16J31mq3j85K03N4j27m3K32k1k10J73p5P6m9L0K7
3336A9J41q5r9K31k69M1J42n3oj85K64k70J29L0j08M4K8K7P7k45K15j0rP8l02
3361a75J94Mq6P0M3l1l1K43k98J52q8k21J87j59K29KN1Nn3m5lj19O7J80k92J80
3387Fm8j19J21lJ02j61J89q1p1J56m9p4q6R5J74r7k55J50J98j07r7J97j59J73
3411A54k53L4R2qq3rO6o2K3N9J94q2k05j7J68r0m7J79j26R9j82O7P9q0J50k39
$$ y = [3, -132, -143, 45, 51, 65, 30, 164, -71, -63, 30, 9, 2, -157, -52, -26, -111, -28, 30, 61, -62, -9, -56, -76, 157, 122, 111, -36, -34, -31, 20, -110, 78, 9, 61, 78, -15, 51, -108, 184, -62, -96, -44, -49, -8, -20, -81, -95, 176, 120, 178, 92, -51, -14, 32, -53, 23, -55, -53, -84, -167, 30, 101, -14, 123, -4, 96, 47, -45, 41, -79, 120, 63, 68, 63, 87, -97, -210, -82, -22, 71, -114, 38, 10, 37, 45, 6, 165, 64, 11, 106, -110, 21, 17, -66, -251, -48, 6, -121, -164, 68, 47, -163, 10, -65, 11, -38, -8, 19, 160, 75, -24, 207, -62, -21, 121, 68, 62, -123, 141, -129, 0, 30, -78, -34, -6, 21, 98, -147, 68, 58, 49, 127, -175, 19, 23, -63, 7, 50, 19, -12, 231, -67, 85, -3, -224, -37, -196, 33, 35, 86, 91, 38, -7, -10, -129, -62, 118, -174, 6, -42, -161, -40, -43, 59, -102, 87, 6, -65, 91, 42, -32, -118, -23, 151, 54, -201, -51, 147, 40, -57, 140, -19, 154, -99, -65, 27, 19, -64, -73, -7, -69, -46, 13, 207, 125, -80, -97, 71, -19, -66, 113, -13, 86, -96, -29, 50, -30, 120, -119]
3437a19K01K4k36K31n0PK8n2k48L40k01P1Q5O3o8p1R3o2J5k07R5r5J59j53J50
3462@P2k50J44k2J94j92P1O8o6L2q8J00j23K08l5J18l01J67j44J33j1l2j34J27
3486C6j14PNN0J27L6M9l23L08r7mN1k52K35J7nm6o1J4o3j6J39j50j01K33q9j39
3513a53J44p3J94k29R7J16p0M5n5q6J35j35J56q2P9k03J41J23j73j7L7L8n7o3
3537i1RKJ10J14j95N6m7J12J57j95o1m9O7J78l42J68M2q8J01j98J52k6l2J32n5
3562B1P9O5k28qO3k3o7l0J13J96o7k72J56Q7j20L6O5q7J36Lj22J4R5nM3p7P6M5
3590A87O7l11K2P9r9J73p0M7L8j63j04N9L2Q9p6J09j29R2m6N2p4J23m3N0m2O5
3616A27j88R6qj24M7J77J05l57Q3Q8n1l1J63m7q8R3q1k1QJ92o4K1j74O6j14J75
$$ y = [-119, 82, 106, -130, 101, 51, 58, 86, 34, -214, 126, -75, -4, 81, 144, 76, 5, 98, 36, 51, -156, -61, -156, 3, -150, 0, 72, -178, -34, -56, 138, -54, 17, 85, 19, 51, -37, 63, -60, 148, 113, 231, -70, 97, -47, 86, 75, 43, -91, 36, -78, -71, -66, -16, 111, 147, 196, -127, 181, 84, 80, 131, -121, 114, 131, 126, 80, 19, 33, -30, -46, 93, -57, -158, 75, -14, -153, -9, -82, 112, -117, -20, 96, 26, 71, 16, -70, 65, -70, 86, 4, 83, -120, 21, 144, -29, -46, -9, 29, -28, -91, -82, -80, 30, 144, -51, 5, -42, 70, 227, 32, -29, -78, -11, 167, -175, -7, 35, -53, 48, -150, 2, -24, -56, 76, 21, 100, 165, -63, -71, -8, -31, -98, -128, -15, 181, 114, -158, -2, 85, -35, 1, 66, -21, 115, 118, -4, 10, 105, 100, 143, 66, 142, 187, 254, -57, -35, 44, -55, 118, 48, 95, 133, -30, -134, -75, -43, 46, -30, 79, -50, 42, -4, 48, -26, 97, 54, 104, 62, 127, -61, 35, 27, -97, -50, 127, 232, -125, -42, 46, -5, -36, 127, 80, -8, 85, 4, -17, -9, 183, 119, 140, -34, 32, -82, 93]
3642I3QO5j19j90K05M4j87m4N4J8L5K79l94J23j47J16O5k02M5L8J92k44J38l6
3666d5j14L18j96o3J39J5L4r0J34r2R9k92K18j16J81k45L49k57J6p3MP2j2P6k
3691E8j47N2Q9k25J09L7m3R7J19j07M5j20n2J32k32Q2J4rR7j59K48Q7j11k42L30
3716A49k45K42j80K36p7j10%k7NJ57j7o9j03r3k3J37j00J40O5k73J07J28j25l2
3740a08K32j27Q0m2mj9m9K2jk99L64q5n5Lj15J93n7O9L5j0j10J33p6Q2P7j73M6
3767Fj3k8J8K8o4J18j88P2N8J10j80k28J33J99j28J20n3J3M0J3P6k34M2J60r9
3792ik48L08l3r6J10l4n2j15J90r0K55m09K42M0j04o3J47j07L1m7M1N1J80k95
3816a07J78j20L1R1l05K55K07k93l9J44%j59J54mk52K71q5M9k46L24j98J32j34
$$ y = [93, 101, 166, 47, -143, 62, 106, -81, -125, -71, -53, -18, 261, -133, -10, -157, -41, 24, -178, -133, -95, 97, -147, -9, -45, -159, 159, -37, -100, 39, 54, 88, -2, 132, 40, 139, -153, 65, -51, 130, -115, 234, -23, -7, -80, -76, -4, -16, 60, 58, -89, -37, 52, -173, -64, -27, -70, 27, 146, 39, 84, -36, -88, 44, -188, -106, -92, -101, -4, -163, 85, 172, 61, -181, 149, -96, 146, -34, 202, 125, 15, 15, -12, -7, 150, 133, 64, -39, -132, -155, -18, -118, 22, 87, -186, -79, 49, -76, -108, 124, -3, 77, 35, 31, 12, -37, -15, -16, -315, 49, -36, -91, -88, -203, -10, -67, 2, 37, 27, -83, 50, -26, 56, 133, -40, 6, -7, -35, -17, 11, -53, 65, -123, -51, 7, 117, -63, -291, -158, 41, -87, 33, -20, -7, 33, 46, 122, -112, -70, 90, -9, -257, 51, 18, -78, 32, -2, -54, -169, 21, -69, 186, -223, 19, 59, -45, -108, 39, -68, -37, -84, -43, 8, 188, -107, 71, -49, -18, 73, -232, 23, 230, -63, -102, 42, 42, -117, 37, 33, -219, 52, -33, 16, -230, 94, -104, 28, -106]
3839a06L1L04j93q6r2R9J70k6J3j67L5J7N8r9J01L6j61M3O5P2r9R2l2n1P7k6J6
3866I1J4j24P2j77K12p8j2m5j16j5Q9n0J41O5Np2Ol1J15m9k49L26j33K61k64j27
3892a45J07M2l7J7L6N2j54j9J91k41K39j48P4J77j15Jq2q2j75K53J81j63J96j28
3916G7k55J50m0Q0m5J77p3ol8j23J88K4nk59J93J04n4n8O0K6q2o4j8r0J43J11
3942A23l0k5L5o8l0k2m3P3j06J28L7O8k17p8J64j06J05K4o8J4J1q5L7K2J54l3
3968H4K2P1k38M9q4L7j10K35j08J66k85J59r4N5Q9K9j51j96O08n38K37J0q5P5
3992C7n6Q9j86R3j24J25J47o1j36J71k04j11K03o5R0J38j3q7L5r2J1K29k36R3
4016I0j15l7K62l4k05o1J52Nm7N3j64J28J4j31J11p0M5p3Q9j07J22k22K81k62
$$ y = [-106, -75, 229, 36, -50, -142, -43, 127, 101, 114, -53, -18, -1, 57, -42, 59, 95, -66, -23, 42, 114, 15, 107, 75, 24, 101, 75, 91, 105, -19, 53, -124, 88, 10, -2, -47, -163, -178, -89, -139, 2, 67, 72, 0, 6, -25, 90, 41, -208, 118, -15, 246, -18, -145, -38, 4, -33, -16, 20, 72, -82, -101, 90, -151, 88, -60, 14, 191, 76, 77, -5, -87, -262, -9, 172, 9, 205, 77, -178, -28, -68, 12, -33, 144, 71, 65, 27, -96, 92, 116, 111, -148, 45, 149, 95, 37, 97, 123, 41, -23, -41, -131, 12, 123, 93, 68, 103, 35, 5, -17, -60, 13, -93, 35, 72, 140, -77, -155, 9, -97, 8, 32, -36, -22, -11, -96, -59, -37, 117, 84, 106, 177, -61, -12, -96, -59, -169, 66, -42, 124, -161, -2, -96, -41, 48, 77, -74, -270, 338, -200, 37, 47, -38, 37, -19, 70, -116, -23, -147, -22, 125, 64, -72, 99, -105, -216, -13, -78, 12, 150, 137, 50, 85, -7, 4, 233, -3, 90, -25, -62, 200, 166, -39, -100, 52, 57, 10, 63, -101, 27, 41, -90, 21, -49, -4, -77, 12, -95, 27, -195, 86, -176]
4040a76K09j4j60J69j34O4J53p3J1n0m6R2nk9J5n6N3k9r4N8J36p8q0N6J8Q5j36
4067d1l5R3J16j1m3j79J40J2l8o2L9M7k8q7j84L12j10J01p4R9L5j66J45p8l6K7
4093fk6J7J25n1k1R6J42k17j60R7m5L05l39J0K65j36l7q4J5M0n8q5J85k0p6K44
4119A80j55N3n5Kj11M9J39j65j8l4J04r4Q7JR4n2p6M9J09mj19K8P8l11K23Nr2
4146h5J22k27K1K39j09l0l0N2R0o2Q7j25k1l2m2J48j19J64R4j42n1J58j51K4J09
4171H2k1k5r5N2J82q1q4n4J8r6J44j33J56k4J3J2l9J21j23k2J06rn1m5nN6m7j0
4199b2J08J06j62O1j78K49j12P5j01p2Ll4j03K26m7l2q9K07J9J2m6k7j68K20j26
4224c3k8K40k72P1J11p2Q0q4K8KO3J8Rp7K5j5k87Q0L20j83l6N8o8Q6j14J87k9
$$ y = [-176, 33, 19, -141, 28, -106, -42, 111, 38, 49, -1, -47, 45, 40, 11, 26, -30, 23, -6, -100, -42, 94, 16, -64, -8, 10, 95, -41, -76, 17, 133, 122, 79, -100, 40, 52, 14, -48, -9, 38, 10, -77, -261, 51, -59, 42, -32, 67, 102, -64, 81, 3, -33, -6, -32, -15, 110, 59, 38, 134, 276, 59, -101, -4, -49, 256, -83, -73, 192, 56, 19, -65, -50, -10, -68, -153, 32, 12, -64, 180, 25, 78, 23, 25, -86, -37, 102, -63, -81, -115, -11, -105, -18, -17, 77, 25, -51, -2, 107, 103, -16, 12, 90, -221, 2, 7, -85, 37, -190, -169, 70, -39, -69, -99, -47, 43, -19, 68, -57, -78, -110, -152, -4, -123, 41, 135, -7, -58, 100, -51, -27, 82, 61, 36, -59, -7, 175, 94, 10, -44, -26, -122, 22, -111, 45, 21, 34, 46, 7, 128, 5, -17, 89, 80, 29, -16, -21, 35, -12, -22, 86, 192, 30, 91, -87, 162, 50, 125, 24, -48, -45, -79, -182, 44, -3, -35, -124, 83, 102, 114, 68, 41, -127, 93, -33, -61, 179, -93, -22, 89, 17, 97, 13, 41, 43, 106, 124, 133, 56, 81, 66, -221, -141, 179, -4, -40, 18, -50, 36, -78, 109, 80]
4251H0k35r3J66R5o1l3J49j36O9j38K07p9r3J17j18J68j42O7m5q8J15J05r1n9
4275g3R4r2K30j28M9k24K00rL9l3j04M3P0n6o9k7J09P1O9k28J24o6Q4j18R5K0
4301G0l8m2k9N5n6L5l1o1K62l30R9J2N0M4k23Q9J53k1k3q4MJ33k06J27K1p8J04
4328C6p0K1K08k71O0k06K54P8n4o8j91N0K61p8M2pj04r6L04k11Q5L7q6j7j38J68
4354GJ07p5p4P6N0j03nn0O8J5PQ3k8j95Q6J64l84K85j00J16o7M2J56k34J64j27
4380a6j9l7P7J20p2o7M6j72J55r0J01P1j08l5N6l3L4L0p0l4J79j85J59j52J89
4405A27j01J1Q0Kj31N7J02j75L3QK4O7p7K7P5m7k5n2M9o3k7j32M1J44q1N1K12
4432A99k57R2qr6J2K16n4k08N5J8R3qK0r7k08L20j68J40o2L3j9K3p2J88k09K2
$$ y = [80, -155, -248, -82, 13, -48, -81, 68, -68, 1, -137, 70, -9, -102, 15, -103, 65, -77, -10, -55, -143, -28, 77, -14, -73, 21, -71, 159, 31, 80, -144, 56, 47, 86, 53, -51, -8, 62, 6, -63, -90, 19, 90, 159, -69, 55, -11, 73, -45, 50, 70, 32, -10, -39, 16, -40, -5, -36, -97, 165, -165, -66, -54, -4, 40, -183, -94, 59, 38, 15, -69, -65, 68, -138, -11, 10, -68, 36, -34, -13, 195, -76, -16, -222, 32, 110, 56, -12, -203, -153, 108, 30, 72, 65, -39, -135, 169, -42, 43, 80, -6, -23, -161, 7, 114, 39, -35, 41, 91, -12, -17, -67, 1, 16, 23, 106, 78, -117, -31, 133, -251, 34, -66, 50, -17, 25, 181, -53, 111, -16, -35, -72, 5, 125, 53, -14, 32, -140, 15, -75, 26, 97, -11, -46, 10, -23, 11, 41, -29, -63, 116, -69, 90, -62, 127, 26, 37, 117, 119, -12, 45, 147, -28, 5, 13, 37, 104, 27, 54, 129, 82, 57, 5, 54, -9, -36, -168, -127, 17, -64, -13, 199, -58, 34, 26, -70, -58, 158, 104, -104, -49, -31, 62, 54, 74, -23, -231, 89, -79, 61, -1, 32, 13, 36, -36, 152, -57, -35]
4458c5L5j18K30j36L1J9r3M7J66j62J21j89M4l4JK4L0J21j28K20l24k1J87j22
4482h6K43j15n4J6j65P5P7NK27j50j08J81j77L9o2L0Q2j02J7J48j84m8J49j64
4506a26J73j9j55R5J56j30O4j65K59k83l1K45j92rL7R4J4j3R7m2j79J93k00j8
4530a35N2J94j31m4q9J50Q3j01K20j85j3J05k83L11k03Q3M0j58L6MR6L1Q2j10
4554C5k11J11l2J37q8J3q0J43m1J34o6j08J48j97K06j61J39j26o3J88Q0j08L0
4577H3Q3j30m2Q0j70J6j08J51j24J52ok1P8j21JK43j37qm8J73j40QO0j46J58o0
4603B5rJ3o6l5J32J5j78J5P1m7N2m1K6j13J56o7l2P5J9N9j95o2J94Q4j42Q7Q4
4630A20nj22o8M9j05K20j36j06Q7j2J80j54M8j9RK7n3j08P2J41k00L19l37J00
$$ y = [-35, 0, -118, 112, -24, 7, 26, -67, -20, 146, -16, 105, -84, -40, -74, -73, -49, -19, 102, -26, 194, -130, -151, 36, -86, 157, 42, -12, 4, -161, -86, -9, -4, 223, 73, -35, 146, -31, 8, -54, -24, 58, -44, -27, 121, -63, -111, 38, -126, 47, 28, -127, -32, 124, -6, 58, -107, 152, -131, -162, 83, -109, -118, -81, 13, 27, 14, 111, 69, -110, 83, -117, -135, -83, 111, -20, -64, -153, -3, 80, -21, 199, 14, 1, 106, -177, 134, -69, 14, 54, -104, -68, -64, 32, 63, 145, 35, -176, -65, -97, 40, -48, -35, -115, 28, -13, 121, 55, -53, 95, -102, 104, -57, 82, -44, -107, 81, 161, 53, 83, 166, 36, -6, 74, -96, -80, -188, -37, -161, -9, -15, -36, 42, -79, -78, 165, 28, 20, -28, 145, 5, 13, 73, -73, 85, 25, 16, 29, -37, -72, 60, 75, -103, -88, -17, -64, -12, -53, -27, -140, 16, -51, -83, -8, 11, 70, -125, -187, 7, 91, -51, 36, 120, 115, -7, -75, -26, -131, 89, -47, -153, -66, -78, 102, -52, -4, -23, -14, 13, -40, -148, -76, 65, -135, 184, -153, -53]
4654e3O6lj67J50R5M9j05j56K45N2j82K2J53l50J02Q8k37J37p1N7m9P6K45q3j14
4679c3j62Q1MK40r1j36J37j5r5ro6J89r6J25l8l7o9O2j9K8j37J31N6P4R0k38M5
4706B1n6K6J15q5N5q0kl2P6J8j39K0N7j38N0K42j70k9j39J98p7K34L7q4K5K2k12
4733d7j05J80j15O8O3rKM6m2k3o4J49j01k2J76k86K07k3p1J63r9k36K05L9m9J9
4759B5l4kJ25k10J48j97J69j83K63k47L2J67j19J71o3o6J2J03p3j17K8j78J62
4782h4P5m0o2K03j82J52R4k11J67r2p9M0J4J9K8n8N1j93J09J33O2l05L6Q5K60
4807B22k39KNO8j7j14L9j7J23j11j64K74p2p0J59q8r4O8J46j00k1N0r7l7M8J9
4833a8O3k8m9p7J09n4L6lN3k33N1J73q9R4P2j43p5L5P9K9r4P5o6R2J81k09p5J2
$$ y = [-53, 13, 10, -157, -7, 88, 137, 32, -124, 121, 173, -9, 13, 166, -184, -82, 6, -231, -94, -165, -108, -157, -81, 164, 81, -33, -195, -114, -110, 130, 39, -97, 40, 25, -70, -79, -145, 44, -52, 73, 35, -2, -71, -9, -28, 0, -137, -6, 50, 124, 214, -24, 21, -35, -9, 106, 21, 76, -4, -6, -38, 38, 56, -83, -63, -6, -144, -94, 148, -22, -51, -190, 8, -69, 165, 202, 118, 143, 165, -47, -152, 28, -87, -19, 44, 35, 37, 83, 41, 18, -46, 103, 2, -20, 156, -130, 77, 54, -17, 146, 47, -189, 16, 55, 6, 25, -9, -11, 114, -96, 52, -145, 24, -159, 104, -143, -111, 56, -63, 108, 45, -21, -9, 94, 21, -96, -68, -246, -84, -9, -49, -111, 92, -90, 62, 156, -55, 112, 20, -59, -19, -5, 14, 42, -16, 35, -158, -49, 84, 146, -159, -123, -38, 222, -17, -15, -10, 58, 41, -73, -34, -51, 72, -39, -203, 71, -1, -71, 88, 0, -94, -26, 120, 20, -1, 49, -48, -85, -37, -18, 45, 17, -32, -109, 0, -54, -18, -21, 32, -201, -150, 23, -66, 28, 100, -43, -118, -83, -4, 25, -69, 6, -60, 32, 213, 4, -71, -59]
4861e9J58j09j44K79mn1L4j24O4o8J94k60J60j57J09J00j56R9m0q1R6pO1j40J55
4886A09j81m8L5J73O0j26j45N9n4J07r4l6J54m5j0J82p2j51K09k04R6K7m0J2M8
4911F5L8l1q5J48r8j20J92r6m2M9M3j4j15R7O8j25p8N2P1J51k02N8L8j19RP1j22
4938i7lk3P8P1m7j8p7K02l8r4J54j75R1K2j29K44k5o7j7l3M1O3j94J40k72J62
4964d1L8Q7Jj39J01R6j68o7K7r8K68j45rN2q3J19o2N8J55j39m3Kk1Q6j03J01Q1
4991A54k99R3J8R8M2nj39J50N9k33M5NQ3r1Jj55J89k5k9J53j38l0J61k26J90k8
5017D3j87J27L0Kn6M2o2J14r4L8L9j35J84k14M1K65k46K04k46O3J72m6M7p2L6
5042H9nj6j35J27kj05J32p8J6n4j2n3J51j36o5K45q5J21j45k9K13k06Qk8P2p8
$$ y = [-59, 99, -10, -154, 125, 121, 70, 104, -20, 44, -24, 170, -90, 70, -87, 22, 122, -34, 65, 25, -56, 40, 33, 94, -46, 109, -72, -120, -85, 88, 148, 22, -123, -64, -118, -11, -105, -141, 13, -32, -42, 140, 68, -83, 126, -78, 18, 45, 5, 17, 65, 103, 72, -13, 135, 37, -83, 109, 13, -29, 20, 63, 49, -66, 31, 99, -26, -104, -52, 19, 170, -32, 26, 64, -55, -46, 25, -97, -100, -123, -45, 26, -21, -39, -116, 86, 48, -46, 108, -67, 24, 46, -83, 161, 136, 69, 52, 19, 60, 123, -71, 69, -203, -41, -3, 84, 85, -54, 47, 143, -25, -92, -65, -163, 105, -40, -49, 3, -80, 39, -23, 35, 190, 51, 8, 10, -11, 75, -28, 73, 154, -145, -52, -34, 64, 106, 101, -38, 112, 171, -62, -17, -12, 71, -20, -19, -174, 15, -10, -39, 114, -24, -54, 107, -119, 71, 43, -144, -17, 13, 15, -41, 1, -61, 53, -41, -3, 36, -99, 85, -129, -88, 177, -69, 135, -111, -48, 124, 78, 125, 53, 89, 84, 68, -67, 60, 58, -47, 85, 7, 23, -31, -43, -96, 55, -81, -146, 99, 14, 135, -10, -39, 174, -32, -24, -52, 20, -58]
5068e8o8N0R4K29j75o8k1J04l3qK2q5M2o2J20N8j52J05j5j79m1J97j8p9o7J06
5094bq4J36j10RP2r7j26L7J91L2j64K08J86k35o7N4j43J1L3K9K53j65p5J78j1
5119A50k32K6J58o1o2p4J42k9o5K04j02r7L6oj48L51k88K35m2j45R6Rj1p9Q3L3
5145H2j94j4K41j74N5M2K7n8J39j62J9N3o5nj41K58j29N2j32P4m0M4O4p1M9j2
5171Bl0j6nJ07j23J0k5L7Q4m0J64r4j94J68j55J12M1J1k49K03j1o3pL3P0q9j01
5198a60J46j16K9J13Nj84K74q6q9kJ95j04n2J44l41L03r8K5L3j97M6K18j15l9
5222e2k2P9P3p9M9j03J55j24M5P0O1j02p4Q8j74N2n0K35n1j36K24k15J21q1np6
5248i2J43j50L4Q7m6p1J53k20J12J15j61N4n5J33o2L3j29J38j2Nj28P4O0o8J23
$$ y = [-58, -126, -76, 18, 247, 72, 4, -17, 87, 54, 46, 68, -17, 25, -37, 83, 141, -11, 94, 79, -100, -141, 56, 38, -41, -108, -2, -86, 50, -60, -51, 21, -76, -202, -165, 26, 58, -106, 102, 288, 53, -14, 40, -103, -92, -59, -30, 223, 58, -17, 161, 150, -82, -56, 102, 41, -21, -95, 47, 18, -47, 157, 55, -42, -6, -12, -160, 191, -97, 138, 96, -49, 47, 56, 45, -34, 49, 82, -112, -126, 115, -59, -4, 38, 65, 7, 146, -16, 3, 56, -9, -14, -155, 103, -26, 26, -106, -32, -72, -28, 36, -35, 14, 2, -28, -44, -49, 58, -65, -55, -80, -43, 41, 1, 165, 71, -123, 45, -110, 2, 43, 54, -195, 8, -3, -66, -73, -40, 30, -59, -160, -14, -130, -101, 12, 17, -167, 107, 21, -68, -70, 125, 21, -31, 113, -228, 75, -23, 2, 35, -162, -116, 102, -13, -52, -74, 5, 78, -1, 48, -55, 100, -24, 21, 91, 152, 50, -24, 64, -110, -58, -108, 127, 76, -60, 164, -51, 70, -11, -16, -92, 51, -99, -65, 22, -24, -95, 58, -162, -50, 65, -96, -42, -97, 36, -26, 7, -122, 16, 4, 9, -119, -45, 15, -53, 70]
5273G0P8q7k06K75j2n5q7n9l0J89k2RJ1k1O2j7jR3j37j84J8K28r5j4j33K18r7
5300fJ1Nl4K8J2k7j16J60p1J84k14J10M5k4j00l7O2l7J7k0J84j89k1P0o3J5J1
5327d5%M6J18j25J8J02q3j28M6j36K63M6j66M9L9j59K12k43K11p8n8N6K12j22
5351G5nm5J5q8p9J11OM5r7J51j99k1J30Q8l0n5n2J28k12J50OJ32j41nk2k3P9J63
5379B05l62J04l5J4ln8J82k57L08q7k1J48k22O6J14j23l5Nl8J27J8K5j76P1J02
5404G2k33LJ63p5lJ16r0M7j9J51j26o6R3J46n1j38k8o3K58o2P5l27J48k4R2J08
5430A67l30K12Q9j64J19k33J07j1R1n4n6O8j3k4M4M2r0Nj34L39k49J58k22J31
5454hJ67k16K28j75r7l7J13j0o2L22k23NJ0J44j03J87j45n5l8k10K50k88J87m7
$$ y = [70, 148, 61, -145, 130, 118, 63, -24, -83, -113, 76, 54, 63, 74, 53, 115, 98, 97, 190, 53, -131, -113, 115, 20, 6, -127, 91, -6, 5, 10, -24, 4, 16, -11, -127, 33, -38, 146, -68, 42, 87, 63, -37, -74, -12, -49, -32, -52, 132, -57, -78, -8, -71, -56, -45, -45, 1, 119, -6, 12, 114, 31, -97, -51, -187, 76, 122, -44, 5, 44, -115, 97, -146, 65, -13, -71, -15, 197, 75, 70, 25, 40, -48, -127, -16, -10, 35, -62, 89, -110, -131, -1, 87, 57, 2, -50, 78, -134, 16, 22, 154, 13, 8, -14, -37, 42, 205, -157, -53, -88, -74, -77, -135, 47, -210, 98, 11, -10, 138, -84, -18, 96, -27, -62, -57, -95, 32, 50, 75, -101, -30, 72, -161, -158, 5, -70, -73, 43, -47, 0, -19, 132, 6, -60, 33, 179, 128, -10, -38, -101, 157, 95, 170, -157, -9, -33, 59, 167, -163, 49, 138, -26, 93, -140, -33, -44, 47, -7, -63, 5, -8, -32, 12, 54, -36, -31, -165, 174, -75, 83, -139, -8, 159, -57, 171, -4, -101, -138, -25, -35, -97, 225, 2, 7, 17, 161, 58, 245, 100, 45, 7, -203, 47, -241, -54, -101]
5478a01N3l3K16j10P5K3j55j6K1L3K49j81r8R5q0jl9l5J13oR8r8o5J02r8j11J59
5505A0L8J5j1O0lk54R0P5j9N7M9j19R4l8M5j03L9j13J40K2j96Q4J0l0L14l25J13
5532D4m4p0n5K18p8O4k2j47J50M1p8r1jM1o3J01j5L0m1m7J00j73Nj3J50J9M8N7
5560A30K8k62O7J21k9J60k28lK07j20Q8j00J1p3R3m3j4j29J33o4rJ15kk6qp3P9
5587D9J42l54J17R1j35K94k73Q2Mn1P9n5P2J14j43n3J7P1k87J23k4k03L95rj12
5612d9PP8P8O1k45J78k64R7J22o8j25L3Q1J49K29k34K8j58k%L7j34Q0J32o9rj16
5639h3R1J8j75pJ45n2M1n9J7R5N8j75K49j12l5L3K7k23K60N4j14k6M7PMj60M9
5666b6k4P8J29j06J07k97J30J63k55R3K8J7R5k30R8K20j97q6O2k9Q4p8j45L01
$$ y = [-101, -48, -81, 135, 25, 100, 123, -32, -48, -27, 6, 255, 74, -24, 71, -9, -10, -49, -84, 29, 23, 121, 23, -42, 60, -38, -149, 10, 48, 63, 52, 112, 109, -145, -55, 20, 1, 58, 107, -12, 82, 44, 89, -14, 25, -88, 52, 74, -122, -38, -28, -58, 256, -69, 44, 0, -70, -125, 93, 15, 79, 57, -90, 60, 101, 23, -68, -69, -28, -91, 10, -5, 25, -16, -63, 37, -136, -131, -144, 6, 25, 73, 130, 158, -104, -37, 84, 55, 215, -13, -16, 191, 71, 159, 59, 70, -3, 90, 47, 33, -96, 37, -27, -36, 79, 77, 51, 43, -30, 49, 191, -163, -46, 45, -90, 204, -69, 13, 17, -34, 45, -10, 62, 176, 33, -20, -3, 68, -219, -96, -120, -323, 72, 63, -49, -42, 36, 114, 175, -70, 108, -156, -59, 63, -5, -130, -97, -16, 133, 362, 128, 156, -2, -4, -4, 33, -101, -21, 111, 42, 33, -83, 8, 26, -149, -156, -11, -63, -22, -81, -64, 31, 89, -86, 163, 51, 16, 49, 76, -147, 113, 167, 53, 27, 74, 81, 85, -75, -26, -50, 28, 157, 51, 158, -139, -9, 154, -101, -8, 20, 37, 132, -98, 0, 220, 23, -63, -1, -30, 54, -24, -169, 132]
5690A32j10j3L9pr9M1K55l04k6N3j55L27k58J75rj35J25l4n7J99k47M4J31R2j16
5715D3j54N5j47K47p6L1q9J24O6j52p5K00nmj51M3q0K46k90K56j06k9L6m7O2q5
5741h1P7M5J11k07o8J4k7J79k4n6%M1k5N5p4o0K37k06j5m4O3J49j16M1J7p7Q2
5768C1M4k64j4J27K88l27J41M2j89J17r2j36K1L40n7j59J22k3n7P2J6k4j04R3
5792HJ03j12m1K10l69J89j03J33k8q8n8J10J25O5j16N3j82RJ7L42k05o8K13k31
5816b4K8p9OO9J47l2k8n2R1j35Mj54M3L3J97j45N2P2k3j15j21K77j52Q6J5q8O4
5843C6j22J77m8o4o7J46j88J53J6j28J49j25j26L41k23JJ80r6j34K09q7o7k3J64
5867G4j34J69J0k9p1m2j62K28l8K0L3m1P6l89J31J49J01N2k21R5r9J16j06R4n
$$ y = [132, 22, 9, 48, 41, -58, -17, 238, -66, -92, -39, -194, 133, -125, 50, 41, -94, 31, -3, -60, 139, -108, -64, 67, 159, 43, -111, -56, -203, 44, -32, -1, -90, 34, 100, -52, -127, 73, 68, 64, -87, -44, -124, 122, -168, 88, -18, -47, -11, -58, 4, -81, -4, 41, 152, -55, -123, -109, -136, 43, 19, -37, -37, 4, -21, 34, -40, -100, 137, -69, -84, -128, -65, 84, -32, 9, 26, -51, 31, 75, -189, -203, -76, 212, -115, 26, 68, -121, -4, -96, -232, -211, 129, 72, -87, 35, 12, -45, 27, 43, 19, -85, 8, 111, -1, -42, 168, -201, -12, -115, 18, -10, -98, -156, -46, 79, 144, 28, 81, -101, -92, -75, 267, 62, -6, 207, -24, 4, -75, -69, 0, 147, 115, 87, 35, 126, -9, -5, -159, -116, -83, 114, -31, 21, 93, 70, -45, -166, 111, -41, 45, 60, -28, 36, -86, 91, 43, -21, -88, 58, -130, 23, 39, -89, 60, -65, -191, 150, -73, -72, 108, 12, -122, 87, 0, -67, -90, 74, -60, 109, 119, 90, 19, -23, -185, 43, 5, 25, 58, 17, 93, -296, -165, -16, 85, 137, -84, 11, -88, 28, -78, 16, 11]
5892A1J4O9q1p9m7Q7O1j2m3R8m0k6p4kj6P0Q6o2j53K35j59l1J35K4r2O4o1M5J0
5921C1m4J60k29KN6J30k12N3R8j74J42L1j1O3j17J84j17j24O9nQ1j1j5J2j63O8
5947d2J04j41J34n7k6n6J07J24k5j51L8j53J34L8L8L9j10j32J50J93k5k58J18
5970D1j9k4K8O4j6L9l4j10N3P6p2l8j21J08O5L1mJ1O2l6k0j16J50o4j54R5JM0
5998C6m9p2J46p6M7m0L7K2Q1m2j76M1O5m8k5jL1L4j23J26j07K8j79J80k0m6J57
6025B7M0o8p2J02m7Om7J91P6r8j82J22R4k61M1M1K78l18P7L1j05KL7R1k32K95
6051A21o0j05L6N4p6l5K92j84j81J72nq9qK04j15j3j73L24r3r5l3pO2K8q8J15
6077D8Pj3R2m5j07P7J0m4m8k9L8o7K13o4l07L06j46K13q2M6j89P5Q8L0k54J70
$$ y = [11, 25, 94, 13, -66, -113, -26, 35, 23, -20, 78, 38, 12, -62, -64, -80, -10, 76, 14, -139, 96, -63, -94, 41, 65, -27, 37, -24, 21, 31, -13, 147, -82, -80, -24, 106, -106, -53, 45, -129, 13, 44, 33, 96, -21, 163, 46, -78, -9, -14, 67, 56, 41, 53, -110, -42, 62, -79, 55, -2, -28, -84, 23, 147, 122, -29, 9, -144, -10, 28, 66, 105, -5, -137, 13, 206, 181, -77, 41, 22, -2, 26, 90, 74, 113, 79, -31, 22, 98, 26, -12, -133, -25, 40, 71, 67, 78, 140, 104, 84, -32, 118, 54, -100, -5, -4, 36, -13, -85, 61, -15, 32, -8, 29, 51, 132, 90, -86, -45, 20, -28, -53, -54, -23, 11, -112, 14, -93, -65, -244, -64, -84, -130, 27, 67, -1, -73, 29, -18, -12, -59, 132, 208, 110, -72, 50, 144, -117, -76, -35, 243, -75, 2, 33, -72, -70, -33, 58, -174, 121, 61, -44, -8, 46, -30, -65, 227, 43, -138, 34, 29, -60, -68, 136, 21, 8, -165, 159, 66, -29, -62, -69, -7, 21, -67, 48, 55, 42, 134, 89, -18, 59, 69, 25, -23, -52, -14, -81, 132, 68, -239, 67, -79, 134, 52, 98, -91, -16, 72, 102, -152, 18]
6103A8k80L10oj20O6k4n5QO2J4Jq3O6K29l76K57o4Q6j87m7R3j25J73n5jJ54k26
6130a12J49P7j79J93j55R3Q9J0l18p3K01pJ21P1O8k25J56j53j02J11j50RJ39J3
6154B6m2J1jj9kQ6j79J20J31k1j46J56P4j85R5jN9k69J82j26K63j06K6k68J86
6179E0k9M6J01k81J37j29K35j46J27k16R0l7K8l1J6l4J06K0J29j38j1p2n0K8J4
6204d7J33rk39J03P0J08r0N2j8l5m2R1q7o3Q6J76j09j45P1M3j84J73p8q0O9q0
6230a31K01N2j34K3l2N6p6K6q1O4oO4j8J24j05k44L17q4K6j08O3o6k0R6L9Q7k60
6257a27L6Q3jJj79M4J61P7o2j9o2N1j33K56N1r0p5o6J3J17r0q4J93J45j82N9j09
6284HL5j17J04J1J2j68P9j71J33j15L2J37R4r6Q0m0o9p8Q3j02L00j45m6O8k03
$$ y = [18, -262, 48, 42, -78, -12, -36, -91, -83, -21, -7, -6, -89, -23, 206, -170, 87, 23, 109, -78, -125, -32, -157, 16, -39, -40, 114, -112, 37, 114, -65, 128, -27, 66, 155, 165, -153, -226, -25, -32, 89, 160, 228, 3, 159, 6, -96, 15, -135, -126, 13, 26, -16, -5, -6, -25, -27, 59, -120, 0, 131, 110, -36, 120, 194, 9, 104, 103, 162, -107, 75, -51, 212, 106, 132, -136, 50, 21, 67, 168, -113, 24, -105, 130, -16, 111, -105, -15, -52, -24, -55, -39, -73, 33, 53, 182, 44, 33, -39, -89, -61, -47, 86, 77, -162, -59, 11, 119, 29, 81, 63, 28, -14, 77, -10, -73, 13, 189, 80, -65, 6, 49, -135, 38, -40, -120, -51, -131, 70, 122, -12, 11, -21, 35, -41, -15, -96, -32, -38, 26, 8, 132, 27, -217, 100, 16, 42, -66, -3, -69, -89, 7, 46, 133, -127, -91, -8, -9, -8, -187, -143, 18, 95, 33, 14, -48, 3, -130, 126, 177, 87, 12, -54, -41, 76, -14, -98, 95, 240, 58, 117, 8, 43, -74, 30, 41, 53, -115, -36, -207, -74, -189, -157, -20, 74, -22, 58, 18, -51, -129, -46, -148, 152, 7, -39, 29, -174]
6309a74K33j31J31o5J91j0m7q1j07Q8P8l1K2j43o9J59j03J72j46j59J30O5J00
6332A03q2O1j22j9r3k3N1J61j47P0k0pp5J14m0J86j12j28J20K9N4j15J72n0l6
6357E2j7PK4j00J11j29K9j16J00l3Q8q9J69j96J5K07Q5r5j95J47l5l0p0J21Mq0
6383b6J41j72J71j39l8K39Ol12K4O4M1K50l01J01R9k05P2R2k9o4kj23P5J16J17
6408A97p6j33L9J2O1O7j88n6L2J12n9j2N1J47j64K6k0nk28K23o6J12j29J42jj24
6434d0o5Q3j6J65j5l00K56j11R8k91L27j25r7O3j33K00j7K03O2k30j15K16k6j93
6458a01J95Mk6n4r6m7KJ95l1j60O9o0K10j37k2O2j22k9J67M6m5j12P7K7Q0j22
6484c0Q0p2p2O3j50K24O1m5p2mo2P2M0j09P4M8L9m0K0j57J85o2K30l85%K26j86
$$ y = [-174, 59, -72, 59, -6, 185, 175, 128, 47, -60, 28, 106, 75, 97, -46, -115, 44, -59, 113, -33, -192, -62, 3, 103, 21, 82, -40, -59, -152, -175, -124, 37, -110, -40, -60, -67, -142, -28, -68, 118, 6, -122, -2, 27, 81, -34, 138, 88, 52, 35, 42, 66, -34, 77, -52, -23, -139, -39, -72, 16, -73, 96, -100, -85, 122, 207, 112, -83, 64, 29, -1, -71, 50, 54, -26, 115, -57, 114, -25, -63, 176, 182, -130, -106, -42, -1, 249, -52, 49, 148, -57, 15, 107, 78, 14, 12, -111, -36, 80, 197, 121, -12, 27, 39, 100, 167, -21, -77, -45, 67, 8, -4, 47, 194, 30, 56, 36, 31, -197, 26, -40, 72, -57, 85, 84, -40, -105, -22, -38, 127, 112, -188, 68, -43, 55, -236, 91, -34, -131, -68, -201, -1, -18, 185, 247, 17, -98, 118, 92, -101, 94, 98, 72, 18, -78, -125, -123, 72, 41, -119, -50, -110, 100, -37, -59, 3, -119, -148, 19, 65, 20, -92, -15, 12, 92, -30, 50, -22, -94, -31, -181, 43, 104, 59, -13, -17, -79, -7, 33, -76, -2, 46, 85, 45, 65, -92, 93, 31, 261, -124, -124, 102, -84]
6511h4k7O4O2j8l1J1R2k8K0k18K74n6M1p3J10p1n7O4Q4j13J3o5P9l06K69J93j58
6538G1j46p0J03J27M8j53j22R7J01q5J35m0O2k20mO8P4j5l4L8n5j9J60Jj66p3
6564a17J33j61J25M4o8K39k40m5J25n8J7j9j4K01j13k40L32p9k63L40o1k5j21
6587f8j1J84j05j10J43m1m2J04M0k51J57k1J16j29Q6j01l5K2K16l6l04J84q9M9
6611d2M8j12n6L06k94J97q4m1k1L8O7p9J12P6j00j2k3j30K48K8n4L2K6r8k6M9
6637E5K1m0J01j03O5m1j14J89j6k46J5J75O0p2o4Q4j44J32R9r7j08k0n8K26j17
6662a8P4j86l5K38j51O4k6lro0K51r3j41J49n3q8J82m2R9j23j11R0k2P6L7QQ2
6689A89j46o4j4k2j03J64M6j5j36J77j74K26o8J15n2q0Q3j58J09j54J58j2k41
$$ y = [-84, -111, -47, 15, -3, -34, -23, 69, 41, 61, -157, 117, 61, 102, 29, 139, 68, 11, 75, 159, 46, 59, -6, 73, -233, 36, 229, 71, -75, -145, -42, 85, 133, -20, -142, -45, 56, -29, 106, 66, 128, -92, -96, -28, 46, 31, -3, 35, -20, -39, 121, 122, -44, -117, 16, -145, -20, 24, -44, 195, -45, -90, 35, -23, -6, -25, -39, 162, 49, -191, 141, 62, -201, 139, 78, 53, -68, -79, 105, 0, -110, 33, -8, -50, 54, 94, -157, 0, -21, 95, -34, 52, -49, -84, -62, 154, 118, -186, -2, -91, -42, 6, -106, -162, 144, -150, 47, -37, -78, -99, -61, 6, -73, 39, 115, 15, 3, -20, -150, 98, 126, 72, 104, 130, 32, 6, 55, 76, 36, 137, 34, 99, 58, -56, 133, 117, -129, -114, 61, 121, 49, -15, 69, -75, 57, 156, 59, -49, -69, -127, 99, -18, 56, -130, -165, 73, -78, -14, -40, -43, -52, -112, 139, 46, -95, 54, 1, -87, 95, 53, 152, 29, -82, 8, -14, 62, 99, 107, 189, 43, -21, -35, -57, -160, 4, 50, 35, -101, 76, -98, 128, 60, 175, 123, 43, 126, -32, 77, -77, 81, 69, -172]
6712a72K14k95K42K5J62k35N5O4j89R8J56N5k73N9N3j44K28k75J6M0K0R1j92K25
6736B8o9J24j37J08m8q4K6oR8p0K4j31LRP0j0J85j71J62j41m9Q5o6N0j78K05J59
6763A76j29j40K2J93j34l0J0J5o0J30r5J1j25J03j6o6J78J30r9j30J63j80oO9
6787a0J35j61j3J77J7k46J28N5n8j84J87J34J0l99K44n1O8j17R5o6J84j94L9k06
6811b32K46j03O2J29k17P2Q1j87j1q3K49J48l81pK64n3n5L1J64q7n0Q5n1J01l5
6836H0m5J2j29J56%n1q1J51j65P0j26J06J06o8M0r4J17j56K26j25l5M2Rm7j00
6861a07J22O9n3q2n8J10q9J8QJ8L3L5j00l7J19m8p3qK54j46J32j17n5N5l3lmJ03
6889F3j69mq2J66j18J38R8j11j67J06j09J89n9kJ91j11Q8n7m2n9j45K54m4J1m9
$$ y = [-172, 42, -253, -11, 14, 176, -59, -4, 60, -129, -31, 125, 180, -93, -34, 19, -125, 103, -172, -156, -116, -96, -5, -197, 28, -41, 83, -54, 54, 6, -78, -52, -58, 40, -30, -6, -137, -134, -125, -55, -65, 120, -51, 111, -30, -79, 6, -60, -10, -188, 17, 176, 47, -93, -71, 122, -12, -42, -32, -17, -77, 53, -42, -31, -156, -53, -69, -135, 43, 173, 74, -56, 107, -73, -79, -10, 125, -36, -49, 128, 145, -101, 27, 82, 24, -160, 27, 161, 171, -228, 16, -35, 33, -84, 11, -55, 129, -65, -26, -232, 14, -89, -27, 102, -115, -43, 38, -149, -160, -243, 6, 154, -227, -234, 30, -23, -78, -47, 117, 30, -20, 65, 14, 115, 80, 35, 47, -82, 74, 74, 23, -58, 93, -72, -2, -128, -22, 84, 16, 56, -38, 79, -77, 149, 24, -11, 31, 40, -7, -107, 15, 84, 31, -51, -109, 1, -88, -70, -62, -44, -11, 24, -76, -113, 6, -42, -115, -123, 131, -15, 117, 0, -55, 0, -33, -36, -40, 63, -106, -110, -192, -26, -144, -6, 92, -19, -186, -80, -189, 0, -59, -61, 130, 19, 107, 50, 8, -51, -196, 58, 14, 25, -24]
6914b4K4P8j69R4J34k39n4J10KK6Q1m4M7j68J53k0np1k17K54J33J03k70j06J2
6939a36K41n9m8%m8J1P2P6P6j69j49K06j49J02Q8r6r6Q3l0k10M8J52J0l8J14q8
6965c7O3n6L9O2j20J93j55m2p2J38l3k37K97N6m2j9Rp8N6K7O2n3j41K53l53J13
6991g0K3q2P5J9P9o9P4pr7O0j12n3K55J22j33k89J45K03J6k03pJ54o5K4L2n9N3
7018H8j34n2R8Pl5K31k68R9p0l6j1M1K2j53K88j25j36O8k2K11k75J77j6p3Q6N0
7044F0m9n9o2K43m13K07J72j08J35M3j03R8k84K54m6J07j99mj7J30j09m3Q5q1
7068d3P7j09J03j99J90O4k4r8q2m2K21j05k8o7m1K90J21k48k08J16J09Q8k25J57
7092A7q2J11K0j56J65j0j07j34K74j18K50k05k5J24j19J8k50M10l35K41n0j8L5
$$ y = [-24, 0, 78, -91, 3, 137, -102, -156, -46, -44, -18, 63, 19, 66, -102, 51, 31, 26, -45, -262, -8, 125, 228, -42, -148, -136, 105, 46, -2, -2, -50, -39, 33, 109, 185, 16, -133, 73, -76, 26, 114, 18, -78, 5, -25, -235, -187, -35, -25, -63, 51, -37, 26, -30, 9, 71, -49, 144, -11, -53, -125, 13, -20, -257, 40, 96, 54, 35, 44, -34, 22, 49, 111, 58, -83, 170, -183, -70, -47, -129, -54, -35, 44, -25, 49, 42, -55, 5, -107, -160, 95, 217, 84, -205, -60, 143, 159, -44, -51, 103, 38, 62, 94, 35, 88, -46, -98, 0, 7, -28, 203, -65, 34, -36, -72, -83, -42, -20, -173, 115, -10, -146, -78, -100, 111, -164, 13, -3, -76, 10, 60, 11, -48, -110, 133, -280, -73, 99, -9, 126, 169, 66, 164, -120, 134, 88, 195, -4, -8, -25, 105, -4, -47, 38, -43, 34, -75, 28, -171, 19, 83, 59, -39, -121, -163, 58, -47, -75, -142, -183, 107, 228, -20, -228, -112, -3, 85, -140, 17, -65, 46, 66, -90, 75, 65, -42, -176, 98, -20, 230, 25, 0, 124, 5, 23, -227, 183, -152, 89, 39, 21, 56]
7115E6M9k66J55J80k62O8r6K83j46O0k08J12J6r2N6K8N0l7K9J26l38K49Nj64J43
7140E6J00k39J60j07J13Jl2p5k9J79p9J36k75J60n5Rj73K45r3K2j21J87j37L7
7164a0n1Kq8J88J47j73kJ40p3k4Q1j00K0L6p5R9r8M2M5n1o7J61q1m4j02Q0K16
7191B18k11P2M0j27j03Q7j4J20q3M8k36K90j31J35k16J74nn1J37r2o7J06j73J21
7215C9J75k58J46j26m0J6J85j47pk55Q6K46q9p2J25Kq7J42J15r0j53k1O5J57J2
7240A66o4oj46P7j80J48l9L6K8m9J07j20N2j00K14J8j91n7J94n5Qo4Q5j08j6K43
7266A81n5j61J70k07M9m2o3J82j75J98j23O0P3j49Q1l9j25J99r7J18o9m5p0RL7
7291f3k8J04p0l7j97L54J76j94L9J35l60K69k34m4J71lJ5n9L5N8j50p9K22j74
$$ y = [56, 105, -161, -6, 174, -88, -20, -116, 167, 21, 81, -127, -15, 1, -91, -35, -7, 43, 6, 35, 161, -177, 72, 77, -87, 56, 156, -83, 77, -30, 83, 84, 52, -23, -52, 127, 48, 184, -91, 69, 14, 23, -150, 95, 2, 24, -97, 90, -47, -10, -61, -59, -147, 41, 188, 15, 13, 153, 80, 56, 137, 37, 57, 93, 18, 117, 19, 61, 106, 55, -12, 149, 68, 24, -78, 2, 218, 7, 79, 119, -8, -111, -24, -38, 82, -1, 47, -189, 101, -30, 105, -111, 63, 58, 7, 144, 52, -15, 91, -82, 39, 214, -44, 102, -24, -64, -48, 137, -10, -17, -272, -186, 60, -29, -101, 24, 26, -61, 81, 196, 106, -47, -68, -3, 154, 166, 102, 96, -50, 27, -153, -5, -44, -8, 20, -29, 78, -42, 10, -90, 124, 142, -49, -106, 88, 33, 41, -23, 62, -46, -62, 181, 126, -35, 135, -72, -23, -65, -128, 54, -121, 77, -46, 14, 87, -62, 19, -20, -145, 54, -43, 75, 6, -39, -109, -100, -63, -91, 13, -57, -94, -291, 63, 239, 45, 84, 219, -141, 128, -106, -150, 21, 18, 33, -26, 9, 67, -83, -162, 60, -114]
7315a14J55j14N4N7l5P8L2n0j69N1N4l5J6R1Q8r8j33n2R9J14j50J23k35L74k74
7340g3J16j5j57Q9%J78o2j32OM2J00J07j51k10K93j94J3%l7PN6J15j07O8n4Lk8
7367b7J9J01j15Q3j76J52KJ26l15J12p5L6J38M4J3j84J99k21J47j86J97k00R9
7390c1oN4m8J16p4LM5j58J27j26J67j09n2N4k05K30p2oJ27j95OJ04M5K2m5M2q0
7417f5J04M3j07l4q0J54J66j92j05R1L4m3l1R5j05J36j37q0O6K7j1J07j00Q0m3
7442c0pO2j70J58n1J2J65j19m2Q2%l27L04j15N5J25k3k69K14l4K0P6j43J85j48
7467b0n6J2J14j76J66K2p0j8N5Qj4J2p4K27j83J07K8j30J18j55p7L1n1Q4j04J36
7493hj8J81j68nj71J85J00q5R2j22P2j26L5K28Kk06J26p7l5mj5l1K01j86J01o7
$$ y = [-114, 41, -73, -19, 38, 3, 81, 113, 63, -106, -55, -1, -36, -20, 71, 159, 61, -72, -124, -25, 89, -61, 62, -173, 201, -73, 43, 28, -129, -40, -40, 138, 76, -56, -50, -8, 92, 199, 48, -162, 131, -63, -50, -50, -87, -80, -24, 91, -16, 52, -2, 1, -27, -8, 93, -22, 61, -115, 37, 39, 165, -150, -38, -113, -77, 61, 105, 118, -66, 133, -88, 59, -127, 70, -130, -31, -37, 17, -31, 85, 11, 14, 59, -99, 28, -98, 69, -40, -92, -38, -243, -13, -85, -91, 36, -159, -153, -49, -4, 18, -27, 15, -65, 39, 82, -25, -59, -139, 15, 181, -11, -116, -25, 9, -34, -65, 30, -75, 61, -76, -156, -90, -63, -74, 33, -67, 13, -30, -37, 25, -145, 13, -38, -26, 139, 20, -22, 60, 60, -267, 37, -78, -23, 102, 79, -190, 24, -10, 10, 86, -57, 128, -20, -76, -64, 50, -126, 40, 62, -8, -26, 29, 37, 23, 35, -39, 188, 5, 112, 140, 10, 128, -27, -104, -73, -124, -40, -144, -8, -26, 155, -13, -18, -189, -4, 96, 11, 103, -19, 53, -73, -38, 190, 192, -14, 112, 35, 0, -4, -19, -50, 151, -35, 66, -1]
7519aJ67k36J20J24k16J71j12P5j38J26j01%L1j13J34m2K09j43k13J57M3j06p7
7542a41K10j96Q6J57R0k41O2nK4j90J34J08j31M4R1j23J20k5j8Q3k45K26o5j69
7566a14q8K01K9P2r0k4o9Q0q2K9K53l55J49mJ07j56J16j8n7K6J41l08K57l9j77
7591a21J47K5O2j54P2N7j24R8j38J12jk28L11k59J87m1l0N0M1q2l7K36k69RJ36
7616E9o8J61k48L65l65l5q8L51k12J35o3k7mKl3p9J24O8m0j7R3O2n9j23J01j53
7642i3J28l2o0R0j22N5r2j11K58j8q8N2j43K58l6n4rj64K69n9j03q8K90j0j81
7667f3M4q0J41M2m1N4j16j5L3J45k13J06P3j55oJ11L2j63J19m6N4J3j22P6o3N6
7693A6k0ln4m8J27j82J62P8j10n6P9M6l7M0j45J48k6j15L73m00M7L5j8p6P0K70
$$ y = [-1, 166, -70, 50, 174, -42, 129, 17, 92, -46, 80, -21, -21, 10, -103, 31, -11, 198, 55, -158, -1, 42, -64, -141, 69, -127, -41, 116, 206, -35, 27, 22, 46, -144, -10, 98, -33, 11, 102, -21, 99, 74, 56, 139, -106, 120, 55, -114, -202, -1, 28, 100, 10, -14, -83, -3, -85, -56, 197, -158, -9, -13, 94, -62, 54, 36, -21, 5, 146, -162, 95, 56, -121, 26, 51, 113, -41, 31, 88, -36, 62, -76, 36, 35, -193, 118, -141, 46, 5, -25, 25, 66, -16, -53, 183, -86, -77, 59, -9, 152, -96, 269, -96, -131, -219, 132, -80, 55, -8, -35, -39, -37, -70, -149, -25, 43, 3, -14, 79, 141, 82, -41, 60, -93, 35, 3, -57, 33, -89, -34, -126, -237, 21, 3, -85, -33, -176, 82, 46, -8, -17, -181, 88, 29, -74, -162, 128, 118, -63, -19, -99, 42, 84, 43, 97, -19, -34, -1, 144, -69, 37, 110, -45, -51, 60, 92, -71, 48, 2, 56, 69, -53, 23, -40, 16, -4, -7, -61, -109, 18, -164, -2, 76, -34, -90, -11, 35, -2, 38, -107, 41, 15, -100, 273, -127, -80, -45, -63, -139, -69, 201]
7719B01o1j86J27k16J42M1n4J38l3j65L7j2K54j51J0m0J2k3N7Nj06Q5j89Q2J17
7744G2j17l8Q1KL1N4o6j77M7K09p5J30k46J34L7l1L3m2j05J26J7j32N6p9L4Q8
7770D3P9k55J14O0j07K03j33K3n8L8O6j97J56n4K0L1p1n5L2N9o2K0k1L19k6k12
7796A2J1j27R6k8J05J2j39J83j09j22n1K23p4N4j34J37r7l4p7J70l3K2k2N4Q5
7821A17j38JO2l19K98J37j93J13j15J49j32J4j58K80jK7j13m6L5m8J62k72R9J86
7845A45o0j09P3Rr9Q2l0j43J96j10O9m8K10j81k9J06j7k07J19P5o9Pj22J27q6
7870i2L5M5K0O3J2k73K63j69r0p4K75n7M4o7N2N9N6j30j28K05J6j23R0j46K58
7895A44m4k04P2R1j86N5K4N2m8N6O1o9Jm4J67M3r7j15J95k29j9l3J35Q9j88P1
$$ y = [201, 140, -46, 81, -135, 7, 48, -6, 132, 99, -66, -29, -41, 213, 62, 72, 32, 44, 21, 78, 83, -23, 62, -127, -45, 72, -45, -83, -2, 0, 31, 85, 19, -158, -111, 98, 23, 153, -93, 41, 78, 47, 80, 38, -67, 59, 76, -56, 0, -79, -45, 43, 122, -133, -19, 41, -66, 137, 4, 27, -31, 7, 73, -124, 32, -22, -2, 29, -42, -97, -65, -6, -68, -48, -69, 250, 224, 12, 23, -104, -8, -36, 69, 81, -58, 125, 16, -106, -157, 66, -8, 46, -88, 49, -48, -82, -159, 11, -22, 0, -22, 32, 117, -21, -20, 42, -277, 21, 158, -35, 78, -37, 112, -20, -6, -164, 116, 115, 142, 29, -17, 18, -30, 132, -140, -41, 145, 85, -24, 49, 58, -41, 41, 11, -132, 64, -46, 23, -25, 185, 4, -25, 81, 64, -143, -24, 51, -18, -11, -133, -6, -92, -57, -12, 8, 71, 83, -190, 73, -96, -186, -260, 15, -42, 2, -65, -13, 46, 102, -28, -156, 49, 65, -58, 32, -114, 144, 100, -104, -32, 59, -127, -72, -48, 4, -44, 12, 73, 4, 5, -39, 128, 171, 74, -41, 154, -75, -94, -127, 8, 97, -91, -20]
7921b0N4l1N4M3L7k02J62j18R8j39r2P7R8m0L3p3p5Jk5K15k3q6P0Q6k02m2K73
7948A33k44r4J00J16n5N1j35J20J01n4n1m3%J64q4M7J2K9o1q1q4RJ01j43j0J63
7974GN5L8l9qJ9n2o3J28j17m0L2M8jJq7n5J08J46k4j51o0K90j01r6j49K16j08
8001f3J29K9m2k08K41j14P5m7o3QJ7K5N1j3J03j58j6O9N3M9j61J8n4O9K9J7l5
8028HK4Kp0M1J8j00J47j13pJ05N7q1r8J08k9r6M8o7Q7j13k7L25j06m1q6R7q4j66
8056b17J19J03%p4J30j03M2J45j15J8j28J49j57P5m2R9%m5k9K01k64N8j32JJ09
8081e7kP9Q2j85Q9n9K27r4k15k0P9J07P4l28K23q6J8J04k04J78K3r9J37r5q4r6
8107b04L71j53j09J01k5j17p5K96j61m9J25k6o5k4J46n6j0P5q0M0ln8M5J73j76
$$ y = [-20, 34, 3, 57, 100, 137, -65, 97, -21, 77, -62, -154, -77, 21, -19, 14, -59, -134, -133, -158, 57, 34, -52, 18, 104, -98, -140, 133, -111, -205, -105, 11, -44, 7, -128, -8, 93, 39, -12, -55, -55, 109, 25, 72, 84, 113, 52, -29, -113, -104, -3, -146, -156, 7, 62, 100, 61, 53, 72, 20, -43, 85, -32, -72, -40, 8, 7, 8, -79, -134, -26, 120, 96, -55, -115, 175, 74, -22, -171, 45, -63, 66, 95, 53, -155, 86, -28, 47, 0, -63, -55, -38, -13, 38, 25, 128, -30, -46, 23, 76, 125, -36, -18, -72, -3, 26, 43, 8, 32, 34, -36, 5, 23, -77, 70, -43, -50, 55, 112, 31, -67, 41, 12, -84, -36, -103, -16, -129, -156, 169, 63, 22, -64, 33, -51, -217, -98, 5, 5, -69, 61, -42, 0, 145, 30, 48, -80, 69, -88, -13, -55, 44, 44, -1, -30, 171, -93, -35, -167, -166, -57, -59, 20, 102, -83, 6, -53, 174, 80, -135, -155, -76, 31, 105, -223, 0, -86, -68, 36, -168, 10, 33, -66, 71, -24, -108, -204, 167, 14, -95, 6, -19, -136, -211, 85, -76, -125, 0, -26, -91, -115, 31, -25, -35, 40, -40, 0, -3, -61, -16, 157, -19]
8132a9l9J39j29K78k45P1Kl5Nj9O8n3J64j42mj75K93j82J0L9p7j2m5J43j47O9
8158d2J16m8P5j03j84J87j12J11j1M4L1q2Nm2LN7j18P9prk22L41j76k6J26J29
8184A22o3lJ32j63l1rJ06
$$ y = [-19, -58, 81, -48, 230, -15, 56, 58, 23, 28, 9, 77, 24, 188, 46, 42, -133, 160, -22, -12, 27, -50, -62, -107, 36, -111, -42, 74, 26, 101, -2, -186, 1, -111, 0, -11, 33, 64, -18, -13, -55, -52, 5, -113, -34, -41, -50, -272, 69, -107, -133, -7, 122, 59, 56, 188, 25, -6, -15, 91]
8191I1
$$ Imaginary data points
##PAGE= N=2
##DATA TABLE= (X++(I..I)), XYDATA
0@%%%%%%%%%%%%%%%%%%%Mj2J6j6J6j6J6k3L1l2L3m1M8n3O1o9P8q8J00j10J21j36
41g2J52j68J86k07K27k51K79l06L36l72M11m53N00n51O09o76P53q41R44j069J220
62F51j405J647j975K443l167M456p443K9379J392n3101Q401L0644M838k0654m500
77h394j172K749J3884Q037k2222j4304K0553K0467j4645j8433N015J5873L910
90A1318o959r483j837J1397R043j2277j3706P888J2436l754q663j414J954L128
104i29N902l178j1649K910J6369o28j3975J397J0754l044o180N465R97r848J166
119d471J2091m702j2516P630J0198j0939q350J3039O244j4408m490J5244L959
132H529j1141J78P966l213l303N988n70r226K17R737j769q646J294M901j408m48
$$ y = [0, 0, 0, 0, 0, 0, 0, 0, 0, 0, 0, 0, 0, 0, 0, 0, 0, 0, 0, 0, 4, -8, 8, -8, 8, -8, 8, -15, 16, -16, 17, -24, 24, -29, 32, -37, 41, -47, 53, -57, 64, -72, 80, -88, 98, -109, 118, -133, 146, -160, 176, -196, 215, -238, 262, -289, 320, -356, 397, -444, 500, -569, 651, -754, 893, -1082, 1361, -1806, 2650, -4793, 24586, 25978, -27123, -18722, 11922, 16760, -3894, -8394, -9566, -6817, 7067, 15104, -7118, -21422, -869, 19598, 4953, -13480, -8465, 7408, 11318, 4359, -5124, -6961, 4436, 13479, 1202, -12504, -4616, 7820, 4066, -4597, -6011, -4057, -929, 4973, 1795, -9854, -6944, 9425, 8797, -5178, -3781, 6973, 3929, -2251, 3214, 4211, -5637, -4471, 7620, 2918, -9598, -1968, 8230, -2709, -11059, 1980, 8224, -6184, -10674, 4570, 8529, -2612, -2434, 5532, 2319, -984, 5004, 4434, -4792, -4575, 5162, 3393, -5253, -3959, 942, -466, -914]
148i14R96l570o61O885J523q224Q9R443m77p868K501N177m687j527N502k999p223
165f034M906P555p517q208P952N742p303j345O942k401m571P090M289r000l201
180e104J0649J566j0822P83Q651m055o554N256L444p402j726P340j134p189L914
195b383O826n372l760O912K420n075J26L868k432k557M425P66p158M85O648k347
211A392n987K685L067l403p11M398j561m681M998N377o022l724P228K323n817
226d38n83M677k192l818M148J649p796m19Q433j740q595K540P464k987m197M312
242D58K149n057J975O698m459o561O216N493o304m273M968J340m910Q72L203m612
258b804k134O518M77o696J335O447j243m490L074K937l843J13M743k901m510M433
$$ y = [-914, 82, -3488, -4149, 2736, 4259, -3965, -3876, 5567, 5090, -2778, -277, 4900, 213, -1314, 4188, 1189, -6034, -1128, 6427, -1090, -9298, -1346, 4396, -2907, -4252, 2690, 289, -4282, 2808, 7097, -1903, -5104, 5545, 7111, -3711, -2928, 5723, 1668, -4886, 370, 3814, -3588, -5314, 2026, 892, -6297, -2383, 4443, -929, -4689, 2223, 4643, -432, -306, 3562, 1130, -1427, 2998, 3764, -3394, -2909, 3739, 1392, -4595, -1910, 1157, -2246, -2957, 1441, -120, -4801, 197, 5574, -448, -4172, 3056, 5379, -438, -1021, 3656, 1464, -2354, 1794, 3443, -4353, -4772, 3661, 1921, -6674, -4134, 3330, 343, -3854, 458, 2607, -2450, -475, 6223, 1764, -4797, 1419, 6912, 608, -3665, 1303, 2643, -2267, -1395, 1808, -2804, -4938, 1580, 2057, -4639, -3304, 3143, 1900, -2590, 484, 3421, -422, -309, 4434, 1533, -2977, 1456]
274A456L152n982k762N749L77n763Q47M869l537k939N793J417o223J530O564k154
290B394n523L996M675n070k886N526m9o112J849M151m247l253M516J994n398n82
306d019O226r47m802L201L822l789j080M363Rm360J726L772l528l611L980J500
322B463n213j79M057j829k920K829K194l738n52N452m62m783K670M641l850k428
338a648M108Q24m812P57L911k852m667M312K505n609r85N333m39m515K607L906
354B736k936k152M801J050n021J004N125k881m067L421J907m400j014L996j150
369D19m613K649L530l993j658M870M32m088J671L967k043k863L800J865m882j03
385a040M500k241m021K705K098m007j451M206r2m245J775M175l008k491M679J060
$$ y = [1456, 4608, -1374, -4136, 1613, 1990, -3773, -2926, 1943, -1594, -4533, 1260, 2677, -3546, -2016, 4548, 2394, -3129, 867, 5542, 472, -2414, 3112, 3063, -3049, -1200, 2951, -1296, -4549, -33, 1961, -3437, -4019, 2207, 1260, -3542, -341, 3481, -308, -1388, 2975, 2984, -1376, 350, 4122, 594, -3017, 963, 2463, -2750, -2929, 1128, -701, -3621, -792, 1402, -2336, -2888, 2564, 2102, -2681, -11, 4630, 780, -1648, 2460, 3284, -1528, -771, 3140, 288, -4379, -67, 2438, -3171, -4156, 1177, 738, -3777, -1170, 2736, -200, -2352, 2449, 3499, -1522, -518, 4607, 1726, -2341, 1080, 2987, -1413, -2427, 1569, 419, -4194, -1545, 1985, -2008, -3666, 1204, 1636, -2452, -781, 3186, 1143, -1720, 2080, 3945, -937, -1040, 3460, 1219, -2802, -97, 2001, -2006, -3457, 749, 657, -3588, -1813, 2362, -646, -3137, 1542, 2602]
401B602l762O17M034j310l589K432K551m104j682L835o40m054J494L050k981k199
417c706L666J558l685J34M377j199l080L197K118l489r00L907n06m093J088L065
433B452k825k595L288M90l752Q43L248j610k619L071K463l258m60M066o55l564
449a417K471K613l567j824L411N33m551M36L603k386l088L165J917l621j24L693
465A264k97l138K332K639k483j203L604p8l930J415K794k711k475K565P79l333
481b256l55L716j249l290K783K838l279j069L868M80k786O70K724j804j962K824
497A853L87l980M95L071j639k811J622J610k377o15L107k17l492K373L492k370
513E09k172K993J493k566l55K391j318k658K406J416l788p85K981m55k642J133
$$ y = [2602, -1160, -543, 3491, 2181, -1408, 1024, 3575, -529, -2211, 1624, 984, -3070, -1576, 1474, -1507, -3706, -40, 1518, -2167, -2033, 2344, 1145, -1935, 1262, 3380, -109, -1009, 2898, 2392, -1701, -613, 2452, -373, -2968, 320, 810, -2942, -2099, 1149, -461, -3080, -9, 2454, -804, -1264, 2802, 2147, -1417, 1054, 3667, 100, -1724, 1687, 2220, -2331, -1895, 1708, -678, -3766, -601, 1316, -2305, -2429, 1264, 967, -2171, 161, 2800, 317, -886, 2718, 2640, -1290, 125, 2919, 208, -2267, 298, 1077, -2256, -2611, 1105, -144, -3434, -651, 2187, -1092, -2161, 1707, 2187, -599, 71, 2795, 991, -971, 1853, 2240, -1740, -1245, 1826, 187, -2624, -1002, 608, -1769, -2384, 723, 506, -2986, -613, 2879, 509, -1663, 1330, 2823, 257, -98, 2293, 975, -1683, 723, 2139, -1649, -2434, 547, 92, -2550, -1417]
529a417K032j737r60L234O23l623J163L867j633k961K397J964k666j390K466k40
545A119l465J471K414k656k026K929R81k414J57K446j046j161K323J420l036k7
561e71L362j032k529J366J006k450p76K700n90l425J055L254j937k228K618J156
577I79j936K71K817j115k046K045K098k979j317K759M0k727N06J827j966j513
593b257K172P08k793m5L278o87k440K000J803j388p41J942O5j883P51J918j968
610D35j977K004M77k282n7J739j338j260J844J483k700l59L279k41k184J424K109
627B396j940j001K331N31k859k99K608j150k629J394J476k571n52K586k9k188
643a896R12K278r55j426K422M69k352O12K235j462j642J329J055k488o02K325
$$ y = [-1417, 615, -1122, -2082, 1152, 1775, -1848, -685, 3182, 1549, -1412, 985, 2949, 283, -1107, 1359, 1119, -2346, -875, 1539, -1117, -3143, -214, 767, -1647, -1490, 956, -90, -1251, 1072, 2492, -544, -571, 2791, 1759, -770, 596, 1602, -848, -1624, 1076, 486, -2939, -1884, 1370, -567, -2795, -177, 979, -957, -686, 2131, 1016, -1030, 1015, 3113, 134, -1183, 1576, 1616, -1111, -605, 1222, -744, -2257, -85, 623, -2170, -2215, 1063, 376, -2064, -64, 1739, 351, -390, 1552, 1617, -266, 485, 2403, 435, -1542, 462, 939, -1343, -1400, 339, -999, -2259, -415, 1068, -1632, -1991, 1288, 1047, -1137, 287, 2396, 456, -545, 1786, 2317, -542, -841, 1767, 617, -2012, -618, 858, -1713, -2265, 321, 292, -1896, -984, 1294, 339, -1087, 1335, 1804, -548, 64, 2299, 837, -805, 524, 1579, -909, -1511, 814]
659H14p29k475J536J598k036n32K244J77j769R02K396j436j746K499P13k449P8
676b15K310j474k185J365J378k177j120K174J74k406Q96K173j375j105K016R64
692A393j506j7K021o58j785J478R45k245q21J825k37j955M31J384j195j006J940
709hN35k258Q41K477r61j557J634J095j563o27K187m06k234O77J607j844j406
726a811J948K08j945J26J749o41j419J585J514j702m08K475k47j620N93J545j230
743G20j270J395K15k361K90J780j363j528J547Q25j397jJ792k11j537J344J823
760B063j751q57K165J5j857M46J145j186j395J416O00k242l00K119o27j645J173
777g18J517j280m78J785J64j244N56J456r08j324J485K75j803M1J117o67j470
$$ y = [814, 85, -2390, -854, 744, -1292, -1824, 420, 597, -1172, -270, 2126, 690, -1056, 1443, 2156, -293, -215, 2095, 621, -1564, -199, 1179, -998, -2118, 56, 230, -2176, -1280, 893, -482, -1587, 429, 1393, -113, -130, 1891, 1233, -552, 926, 1871, -374, -1195, 630, 393, -1562, -1131, 253, -942, -1948, -8, 527, -1731, -890, 1587, 626, -931, 703, 1798, 235, -392, 1795, 1389, -845, -168, 1439, -405, -1811, 137, 345, -1600, -1474, 275, -366, -1785, -200, 1314, -388, -796, 1679, 1432, -188, 405, 1950, 720, -550, 845, 1060, -1301, -1011, 769, -594, -2122, -575, 250, -1147, -1148, 644, 433, -1104, 240, 2063, 312, -545, 1620, 1635, -222, 224, 1369, 183, -1212, 204, 804, -1438, -1738, 381, -246, -1891, -718, 799, -481, -959, 826, 990, -254, 302, 1758, 850, -474, 1011, 1286, -517, -476, 641, -26, -1496]
794a496R13J014j614n07K019N3j596J000J377j113n59J462O27j491j35J754r18
811G90j626J124O45j829k84J244k37j512O64J490j140p55J746O47j647N07J549
828A376n61j110J027Q69j564n24J246k26j827N85J342j658o09J268M60j317L92
845h31J624o05j252J739Q86j365k53J461m80j318P50P97j210r78J228Q9j676L96
863i98J287q99q04J440K58r20J7J610j55j288J048J067j487o35J684l63j511J58
881d91R78r75q76J267K58j392J94J442n17r06J039R29r89j21J346m5j477N51J050
900A265q66j037J097Q9j344m5Q65m96j091J050Q91j063l20J646N3j185Q71R46
918A326q34o52Q27N51j459m8J216r25r70O05N33j050l11J210K9j122N66J397p80
$$ y = [-1496, -583, 431, -1183, -1690, 329, 382, -1214, -214, 1163, 50, -509, 953, 1580, 89, -46, 1708, 790, -836, 288, 933, -896, -1180, 64, -173, -1685, -1021, 469, -671, -1426, 320, 967, -680, -173, 1376, 815, -295, 732, 1601, 37, -487, 759, 533, -1294, -709, 633, -1025, -1634, -366, 94, -1223, -831, 793, 188, -1064, 675, 1561, 196, -57, 1404, 924, -394, 356, 1153, -57, -1035, 193, 282, -1394, -998, 289, -610, -1414, 26, 284, -636, -619, 991, 836, -452, 596, 1663, 176, -459, 1225, 862, -649, -491, 487, -488, -1364, -97, 161, -1231, -1037, 405, -112, -1018, 21, 950, -39, -160, 1186, 1141, -336, 215, 1265, 399, -638, 459, 548, -796, -841, 24, -472, -1563, -513, 378, -685, -1005, 641, 694, -491, 380, 1326, 492, -160, 667, 1218, -241, -289, 927, 2, -968, -363, 170, -880, -1191, 19, 48, -1074, -508, 889, 109]
937A09n14J228L53j133P3R10n48r08Q11N61j205o05J135n44j190O24J042j016
955h17M5Q47K32r17L92J306o37o54J033L84j139q7Q90m03q89K53N18q01o49J099
975Fk28j054M37J196o93k70R62N61q44l7J137m31r57P65K89p83n65P70j53j021
995i13L98O26q08m28R82M27j207N72J034l37o50Q36N27q47k62J038k97j166M77
1014BQ39j223n15O70L29r82j57J090l16n14O53R01j067L09Q88k60n78K67O67o06
1034C97o94Q93r1j254J88P97n44r01J005J89o30j31J190k60o19O64N93n37m55
1053b00J096l5q93J12O05m54q95O78J14r75o0J080n36m86O33M16m84j58J115r0
1073E83o23J02R00n88n19Q11L3r33K1M32l84o58L89M91q19o4J051k67n61L69R04
$$ y = [109, -405, 823, 1176, 43, 116, 1026, 478, -430, 381, 942, -263, -868, 267, -277, -1467, -843, 199, -817, -772, 75, 307, -610, -218, 1088, 451, -203, 830, 1214, 75, -12, 878, 475, -414, -161, 357, -444, -1093, 6, -222, -1276, -839, 357, -336, -606, 356, 917, 73, 36, 1173, 742, -215, 550, 839, 56, -509, 261, 108, -913, -515, 111, -697, -1125, -143, 284, -923, -351, 683, 346, -304, 532, 1059, 212, -50, 988, 691, -475, 2, 841, -382, -897, -227, 102, -880, -1037, 53, -263, -777, -124, 777, -290, 19, 907, 647, 69, 336, 1003, 397, -297, 596, 505, -749, -561, 236, -308, -1209, -204, -15, -645, -776, 414, 154, -465, 199, 792, 255, -200, 896, 861, -32, 80, 685, 231, -664, 14, 128, -847, -907, 173, -363, -849, -216, 200, -284, -442, 673, 583, -40, 62, 962, 374, -145, 666, 699, -234, -213, 219, -165, -823, -434, 57, -762, -826, 225, -42, -603, -234, 670]
1094F70o53l25R65L98j031J17P15m52p23M19K46p05l13O52k01n98J81Q42l51n61
1114g08J006N5m43Q8O12j76m88M48K79m90j43L89l16q17M72L13n95l96N42L77
1134Io94N0J080m05n01R77M11q07j00O48q9o47L06L46p25m62O22lr01K95O18m55
1156d27l17P00K23l33l1Q17j51p83P88M21o65j30K14J54q46J54L41l40n94P60
1176d5p5m62J73N37M3n41N01L30l36o4P47r2p07J55O66p28m08M10P4m99l99P91
1198G1k90p58P09N26p13R6N75j53j22K01K99p2l67O46n5p64J7L81k48m35J81J46
1220a29o04Q9O73j62m75L57O73m42p9N92K34p33J58L80j29m29J60K64o58j33K88
1241a05J83p05M00J78l37j94O72K49n98K25O20l33k87L86L33m03k26M98l39n23
$$ y = [670, 17, -308, 657, 1055, 24, 141, 856, 404, -319, 100, 346, -359, -672, -20, -221, -819, -638, 204, -147, -708, 298, 353, -90, -2, 610, 434, -54, 394, 673, 183, 40, 429, 113, -704, -232, 81, -514, -910, -368, 9, -685, -635, 445, 40, -461, 516, 927, 120, 20, 668, 579, -68, 238, 584, -141, -603, 19, 16, -885, -590, 28, -427, -744, -44, 179, -154, -185, 632, 481, -302, 486, 907, 242, 112, 326, 480, -366, -212, 129, -211, -805, -45, -120, -582, -409, 128, 171, -370, 131, 461, 125, 61, 808, 716, 9, 164, 830, 102, -306, 104, 178, -321, -720, 71, -219, -977, -268, 258, -455, -359, 216, 63, -59, 142, 441, 369, 2, 648, 593, -171, -154, 227, -21, -456, -275, -129, -733, -644, 29, -133, -608, -251, 422, -20, -99, 493, 727, -6, 152, 532, 403, -26, 134, 398, -260, -393, -105, 78, -627, -227, -49, -386, -580, 92, 341, -257, -32, 588, 255, -32, 354, 687, 284, 58, 556, 217, -306]
1261c06J46L83o22k73N49K2n59K39N50j22l12L85N02l99j77O44k47l86M49N4m84
1282C6k06L54l08l04OL07k08r3K68J50k79K3O03Rl97K18N31m74j47K99n4m64K95
1305A65K22o71p6J24P8m05Q6M70j19k25M91K46k99k3M41J02o09K52L64n33k19
1326a38K50q1l49K1K27j67l12J35M55l54K4L27J27k99J67N34k81l11M48pl95m0
1348a9K00J4o70N13J83q70L09K01m8k76K87K07k19Q1K67L48m28J09K68l83O0J82
1370C16j05j63j61J06j14l08J2L51m22M1N77j18j07j01N95j82j62K60J47m78L1
1391A5K59r2k26j54O7j76M1P6K19n49J33L32n5k30N74L8k42K34K26j62l68L40
1413C00N3m00M7J19N2m58J94j6k46r4L99P1l48J59M50j95l50N93M2k39J61j60
$$ y = [-306, -160, 223, -399, -672, -123, -101, -660, -421, 129, 7, -305, 80, 582, 183, 6, 650, 403, 17, 466, 520, 36, -170, 184, -124, -428, -422, -115, -323, -416, -148, 2, -277, -254, 349, 358, -39, 179, 710, 236, 89, 388, 334, -130, 165, 387, -284, -360, -236, -158, -563, -477, -7, -126, -351, 140, 386, 87, 64, 505, 607, -2, 250, 614, 81, -138, 112, 31, -318, -297, -70, -237, -549, -414, 41, -313, -289, 38, 165, -134, 33, 567, 286, -25, 423, 416, 21, -19, 181, 195, -475, 38, 221, -649, -340, -139, -187, -463, -176, 31, -188, -107, 160, 508, 80, 189, 457, 74, 134, 316, 211, 48, -113, -7, -121, -429, -417, -66, -488, -447, 130, 12, -95, -196, 399, 217, 55, 315, 462, -16, 15, 274, 182, -44, -198, -131, -307, -266, -190, 29, -520, -387, -55, -110, -340, 234, 272, 30, 264, 490, 328, -40, 300, 353, -47, 0, 119, 171, -287, -93, -109, -355, -449, -50, 21, -327, -168, 282, 87, -263, 330, 372, 133, 294, 134]
1435A34K57l81n1L69n59j38M41K5n96J09K01K46l99K60K06k03J15J64m8q6K74
1456C40R0k74j31J27J00p21L25J64r7k05J04k0m9l8K62K3n4q9M03j55p1K04K38
1479D76m29K66l4j88m42L03N2k70M9J0J37n00L01K24j65QL80J30k60L4K47l05
1501B4l7M02l6l11k1k33K11k94K49p7M6j07R2J80k77P0J25K91j53J63j45j44M2
1524F0L57j40l71J83K11k33l36K03m16J93J32J68k66k1L34K97m78K0L76r5j69
1545IL29R4k25k75J90m4j95M1J09j04k03K37J32k18k0K62j75j9L13jq4k13K02
1568A42M7k4j8J32k83k64J37K90m90NL21k4l09L55P5j07J00q9J55k9j43J41O4
1591A84k10L30k30j35j34J18m3j19J47J53l47R4K38K7k94J38K78j55K0K67j7k89
$$ y = [134, 391, 10, -41, 328, -231, -369, 72, 97, -499, -390, -189, 57, -342, -82, 124, -79, 36, 200, 152, 66, 340, 430, 156, 25, 152, 252, -469, -144, 20, -77, -282, -178, -198, -247, -285, -23, 0, -54, -143, 260, 105, 34, 238, 476, 47, 313, 279, 91, -351, -48, 4, -266, -217, -207, -70, -570, -269, -45, -210, -202, 178, 308, 48, 82, 329, 24, -13, 389, 353, 42, 21, -212, -1, -295, -46, -123, -77, -184, -92, 88, -189, -119, 6, 297, 144, 307, 162, 18, 60, 417, 277, -94, 89, 300, 67, -269, -66, -482, -289, -157, 11, -255, -276, 58, 355, -123, -103, 273, 178, 9, 338, 432, 207, -68, 122, 78, -117, -76, 33, -71, -274, -37, 95, -123, -143, 119, -56, -75, 238, 237, 153, -60, 142, 189, 165, 147, 279, -4, -268, -131, 159, -331, -326, -5, -29, -338, 17, 92, -15, 85, -4, 151, 122, -21, 120, 184, -26, 304, 74, -61, -195, -77, -120, -239, -92, 61, -286, -192, 46, 73, -221, -83, 195, 40, 60, 327, 310, 21]
1613B1O2J84M5l57j0o4n6K9l1K15k68J2K00p1j2L09n3k08J72J65J5j88N8K25l67
1638B7rM7ol86J33J89k43P2K29j27j07R8L00j34lK19j19n8Q5M1j26k92K42P0k66
1663a24kk2L7j24M6J15j9Q4j11J88Q5m0J83L5j03j4J70k36m5mLl5l17L25j35j98
1689b58J49O2j37L2O3K15j63J55L2M9o2O1r9oO1j0j49J16l1k93N8kk7L14k66J06
1715c0J5j94K27J53mj74J7K10L9j42J42j03q7o3L3l2l26K01N6n4j18J55J97j23
1739ek9J03J61j85J98Nk75J64P7k06j40M5l2R3j77O1O8R6k90J74lj07J71J85l7
1764A15q9J79j25m3O9K64l84J41P7k73l3o0N9k00K91J4J66m68K27J73j47N2K18
1787B23l9j86P3K9n9Q5k12N1K50m26J03J3p9j4P4M0j09J17Q7j22P3K19j50M5j5
$$ y = [21, 83, 267, 312, -45, -55, -119, -175, -146, -177, 38, -230, -218, -18, -89, -101, 208, 155, -53, 119, 284, 299, 111, 169, 394, 27, 18, 65, 59, -327, -194, -5, -248, -176, 53, -74, -181, -83, 217, 83, 80, 299, 180, 122, 207, 248, 122, -170, 72, 142, -124, -126, -148, -111, -235, -189, -74, -93, -9, -120, 68, 153, 113, 296, 331, 228, 214, 384, 148, 103, 99, 102, 67, -250, 75, -60, -258, -109, -47, -184, -152, -89, 126, -37, 118, 150, 199, 137, 198, 99, 93, 154, 144, -5, 111, 80, -213, -155, -157, -184, 130, -136, -30, -15, -209, 18, 171, 167, -7, 10, 220, 259, 117, 259, 156, 69, 6, 39, 7, -319, -118, -62, -116, -234, -79, 118, -5, -34, 69, 230, 45, 243, 248, -27, 137, 214, 8, -132, -87, -119, -26, -203, -142, -74, 22, -268, -94, -97, -204, -33, 152, 115, 26, 205, 80, 37, 106, 370, -14, 127, 204, -69, -102, -162, -103, -303, -12, 2, 168, -300, -73, 100, -47, 5, 223, 184, -2, 71, 100, 41, 126, -86, -35, 215, -211, -108, -95, -174, -188, -114, -74, -183, -66, 21, -101, -28, 191, 41, 86, 71]
1812G1J94o5j41J22m7j55J14q5J04j94n0k1R6r5J78p2o4J58J04p5j3o3N3J25m3
1837A36j2j20o9n4R3j49J41K2j26n1J3J60%m1J70k04K41J3J9j2j61J18j7o0m7
1862CkK8k76rK18nk5R7r0j05O2K17o6oj22L90k99K6J21j57j85K58j16m4K3j13
1888a77l1Q0j8J43K7j28K14l7q5M2n2K06n9P1Nk79L1J41j40M8J06j27j23j02J62
1913h2j04J16q0K38N6k21J29J24q9q0J61j41O1j94L89k57j40M2J64j42M1K6k96
1936b79K02Q1N4r6J01J41Nj67m0L6mJ25J64k82P1j59P1j87n6K55j22j73J45J44
1960C0k21PJ60K62j52k54K43J13k39J98j68N1OL9k9j00o6J16j66K3j5L10j11j49
1984a12K26j55J56M5p0J08k66K81j00j28q0J93k25R8Ok37kj8J71J37k42J44J36
$$ y = [71, 265, 200, 59, 181, 134, -21, 93, 8, 112, -82, -132, -153, -57, -152, 26, -46, -110, 48, 152, 77, 64, 1, 54, 179, 136, 124, 4, -65, -119, -26, -175, -34, -12, -138, -189, -176, -16, -16, -57, 113, -91, 150, 163, 182, 170, 9, 127, 110, 50, 3, 1, 29, -247, -256, -38, -43, -68, 29, -61, -166, -104, 113, 47, 41, -81, 309, 10, 36, 157, 0, -185, 73, -43, -87, -64, -177, -208, -128, -146, -3, 24, -104, 110, 73, -12, 30, -22, 184, 125, 196, 201, -78, -47, 94, -46, 2, 108, -19, -142, -244, -82, -186, -70, -150, 88, 144, -77, 52, 176, 87, 7, 168, 27, 88, -106, 283, 26, -114, -72, 92, -50, -9, 17, -279, -77, 4, 58, -38, 63, 204, 209, 42, 2, 38, 34, 159, 323, 41, 112, -47, 24, -163, -219, 36, -86, -259, -114, 30, -191, -184, -24, 238, 86, -168, 75, 188, -51, 147, -21, 30, 36, 75, 46, -54, -120, -4, -170, -147, -162, 148, 37, -112, 114, -41, 115, 160, 90, 198, -68, 213, 113, -15, -95, 98, -127, -29, -23, -260, -262, -280, -109, 28, -214, -70, 66]
2007F6j07P7O3m2N9Q6k4j09j82K83k12O9k4Kk11J76J1l5r9J3RN4m3N9J40o6J31
2034A44q7R4l8p6L3R4j00O3K9j15p8j52J89j35o7L87l64J34J18j12K92k77K81
2057B57J8k43m3r2J39P1r0j3j42r3K05pj48N9O9P2j03K09%J4o3K50l91J61O2K6
2083A84j90J7J49O6k30j58J87j71P5L0J53k42J81q5J37j09R5J17l22K47j61J98
2105A68m0p4j10k47J93J10k36J82rK8p8J04Ol7O3j26K88r1m7L9R2j8k12M3J4j68
2131a63K01j8j33N7n2P9l8J81j22J5l3oL2QJ4J23l5L9k02M1J0n1J8J64k00l9K07
2158I7q7j22J69l3p0K31k07K38r5M4k4k46J75q0K70k24p4j8j35Q7J49k06Q7n1
2182a25K4J09QK6j26J73m1J72p5j73M6J40o2l86L57Jk29L11p0r4k31P1K47j13
$$ y = [66, -41, 36, 99, 57, 116, 202, 178, 69, -113, 170, -42, 27, 3, 5, -206, -30, -19, -54, -153, -140, -131, -77, -120, -61, 79, 13, 144, 57, 151, 113, 37, 70, 164, 64, 127, 156, 41, -37, -189, 0, -135, -202, 185, -179, -45, 73, -39, 253, -24, 257, 275, 32, -11, -103, 36, 107, 17, 4, -138, -231, -26, -33, -181, -122, -53, 19, -84, 125, 125, 139, 76, 326, -65, 96, 158, 184, -6, 11, 160, 226, -4, -162, 25, -146, -71, -41, 112, -130, 51, -34, 103, -6, 89, 206, -116, 131, -30, 168, 128, 54, -56, -303, -110, 0, -236, -54, -63, -35, -113, -9, -3, -40, 23, -103, 185, 94, 47, 86, 178, 160, -52, -9, 5, -163, 38, 20, -113, -56, -108, -29, -67, 114, -8, 7, -26, -32, 0, 8, 22, 145, 110, 149, -53, -12, -2, -53, -35, 129, -71, -110, 97, 10, -112, 57, 24, -46, 185, -22, 216, 121, 165, 141, -105, 70, -10, 260, 36, -38, -56, -191, -104, 45, -161, -74, -125, -101, 8, 16, 42, -84, 89, 48, 220, 145, -28, 18, 158, 96, -290, 67, 68, -161, 150, 80, -14, -245, -174, 73, -40]
2206d0J10P2k22J39R2nk4r3O6k07J25o5K28l18J20j6K0J7m5J03j22J08J78k77
2230e6R9J02l2L9j64K7K54l67O1K07J00j89j84K2R6Q4m04K23o7R3Mn6mO5J11j40
2256g6J87mm7J05k38O2PmJ25%q5j61J8J5J19p3K29k48J09j0PR0J6L1k00p1K51
2283A54j10k4M6J30j31k47O5J13j15J45j51J72k22R0K80o1k10p6R3J55l8J2r4
2306b4J06l07L03j2j85lJ61k40MK51j75M7N9Q7J02kj00J46j87K73k96qr8P6K3
2331Aq5P8J27k76K18j44q1K3p8J59J42p9j73K69kn8J03j33M7k81Q7J05j81L22
2355A10l4K9l80J99oJ16k0o7m9R4P9O8j44p4J87j79K6O3J15j53j91J02kL0K0J54
2381I3j66O9n3J09q5K09j78L6P6o0K5j36PM0J08l1j42J21p6OK8j02J42k83K49
$$ y = [-40, 70, 142, -80, 59, 151, 146, 122, 29, 95, -112, 13, -52, 176, -142, -22, -38, -18, -1, -46, 57, -65, 43, 221, -56, 43, 145, 113, 152, -12, 15, 269, -98, -37, 170, 270, 81, -103, -81, 15, 99, -305, -82, -149, -56, -52, -108, -112, -47, 64, -76, 111, 107, 60, 165, -73, -11, -4, -8, 117, 117, 32, -129, -111, -96, 23, -50, 179, -69, 40, 30, 37, 127, 143, 174, -26, -97, 154, 44, 20, 66, 196, 65, -182, -117, -4, -119, 26, -125, 47, -175, -85, 195, 134, -76, -152, -59, 96, 58, 70, -24, 82, -225, 78, 66, -119, -122, 39, -201, -197, 54, -121, -74, -15, 72, 174, 172, 72, 218, 31, 304, 8, 0, -98, -22, 1, -84, -6, 121, -155, 63, -81, -162, -139, -217, -58, 84, 5, -168, 101, 99, 41, 144, 11, 58, -223, -136, -31, -212, 110, 76, 105, -275, -76, -82, 34, 14, -53, -102, -8, 71, 139, -5, -79, 108, -71, -45, 18, 133, -20, -211, -109, -111, -81, -61, 93, -73, -4, -57, 52, -33, 176, -2, 34, 110, 50, 75, -61, -54, -14, 94, 63, -79, 42, -34, -28, 0, -102, 40, -243, 6]
2406Fj65L07k96J24J21j56K38l02K61m5M1p0o1j5j4N0j43O4l0p1L5J51n3j86L09
2431A00n9N2l0J55o6j23j10J13L3j98R6Q9k20N5P6k01K35%j12K5P1J31j96P5J80
2456A71J5o1p9m3R3J2q0j14L0J77j75J09k94N1R4Q5J3K9K6r4J13n6L2j6P1j7j3
2483G9p1m5j8J23j16j1J25r3l2O2n7J52j02J30k57J56q7Q7P4M4j68p3J43j38N6
2508c7j6Q3j16M8J06q6N7ON9m5m4J19j26L8n4L7j04K8N3K25j99k01J30R5n5qn3
2535f0n8O8J6K7j20K44L9r7j77R6O3m5q7J6J41l8nj1J04k49L8m5J46PK3o2k67
2562b93K27N2L4j76J05k8O1%J85k67K36j64K6O0jj33Q4j57K45q8J02k5k39J00
2586e4J47j45l3J11J1O5j30o6O3P8J0Jj39J02l0R5Mj82J59j44J64N3j88m1J38
$$ y = [6, -159, 148, -148, -24, 97, -59, 179, -123, 138, 93, 134, 64, 3, -12, -26, 24, -119, -55, -85, -156, -121, 30, -23, -209, 100, 41, 93, 63, 218, 152, 29, -81, 32, 65, -133, -37, 52, -168, -113, -37, -238, -3, -3, -115, -90, -19, 112, -84, -9, 171, 186, 125, 46, 3, 96, 108, 28, -86, -56, 121, -54, 55, -239, -188, -94, -9, 4, 33, 59, -35, 78, 22, 54, 38, 109, 92, 79, 8, -37, -55, 68, -48, -59, 66, -27, -59, 3, -54, 98, -4, 126, -131, 25, -62, 25, 99, 143, -25, -98, 45, -93, -37, -53, 30, -86, -38, 68, -18, 39, 45, 104, 59, 15, 134, 8, 46, -8, 29, -75, -47, 6, 231, 32, -169, -39, 56, 1, -7, -60, -118, -50, -34, -7, -127, 117, 156, 59, -118, -22, 41, -4, -91, -75, 66, 28, 23, 12, 116, -133, -95, -140, 6, 13, 36, -26, -293, -66, -14, 20, -156, -51, -79, -18, -18, 167, -100, 136, -28, -2, 58, 57, -76, 8, -149, 96, 8, 110, 85, -154, -54, 93, -52, -85, 26, 37, 102, -28, -94, -31, 47, 57, 58, -81, 21, -9, 86, 90, -92, 67, -77, 87, 140, -48, -89, 49]
2611D9p5P8m1R7j63K01p8q4j20J07J94j24r6J46l29J46q8L36N2o4j48R9l1q7J55
2636A32qj94m0L10l41J69k6o1r6N4P5O3j03J85k9q7j70J13J53M3r8j09M6j6p6
2661a11J86j88l3j7R2J53l0L0j15m4m8R5p8J10P1o9J8Rk30K04J01j0n6l4q4J70
2687I2j83N5M6j41J73j46P5j5p4O0llJ76j42o5J41j57L14j23j37K18l49J46n0
2711i2J26m1j2p0J37j26J50r6j13K46j08J53l8J05k99K8R4j18J07M2q0K1r8P5
2735gj33J72k09J78m7J22j36j8OJ74j00o4J84j09k5N9j82J36K5j60J46q3K7j9
2759f3J09q3P2l9P8j17N6OqR8K9k22J24j74J56O5j5j51J29j13k6q1R4k9L3J3o3
2786a22K18k14J12j41O7L75k99N7j01K15j03jR4j23l8j14k6j12J52K35l08J53
$$ y = [49, -26, 52, 11, 108, -55, 146, 68, -16, -136, -29, 165, 41, -55, 91, -238, -92, -180, 156, 208, 144, -4, 95, 64, -23, 132, 124, -70, -110, 200, -141, 28, 2, -59, -155, -101, -26, 37, -66, 119, 90, 3, -167, -54, 99, 142, 44, -65, -19, -35, -111, 75, -113, -146, -163, -71, 82, 52, 82, -33, -77, -125, -30, -108, 2, 73, 4, 22, 31, -199, 5, 106, 96, 40, 6, -78, 92, -91, -36, 10, -131, 42, -104, -29, -44, -118, -58, -61, -64, 112, -30, -95, 46, -111, 203, 80, -57, 161, -188, -42, -92, 34, -7, -19, -89, 48, -78, 72, -24, -137, 109, 1, 154, 116, 221, -78, -50, 44, -74, 33, 75, -5, 16, -82, -7, -140, 32, -177, 1, -46, 76, -60, -78, -72, 102, 2, -62, 122, 13, -12, 47, -135, 1, 26, -134, 12, -71, -44, -63, 46, -37, 35, -4, 74, -43, 13, 19, 11, 109, 138, -84, 40, -134, 22, 87, 72, -79, 50, -63, -89, -170, -76, -105, -72, -59, -122, 96, -118, -6, -147, -80, 295, -4, 53, -48, 167, 64, 63, 157, 34, -4, -118, -144, -256, -104, 131, -177, -24]
2808b4N6J59k37k2J94j0j76pJ01r0M1q8Q6j2J44k01J6K41l83L49n5k41J01J56
2832I8O6p7L1k97K10O7k80J33q0J45p0J73k56N0J00n0R0k43K39j53K05p9j16J45
2856E1m8M0q7J50j41p1R3j15J27j7q4j08K03R9j59j08J61oJ07j49l8J51k40K70
2880H1j78L52l52K62j63k5R0j93K42j4j25L4l1J09K0k3k92K60J2K9k0p1K1o4J1
2905b8nK00k02j01J97j51J29j9j96K29o6O8j47J34j0nN5q8qR7p2pR0l3Rk51K35
2932E4o2j17K01j7j46J29Q8k13J46j00J18k04K6J46N8j95O6Pj07J93j48K5p0J36
2956A4J22k36L4J54r2l4n5J23Oj56J32n9R0j12r2L55j71k47K89ko7OJj05J06P1
2982G5r9MQ3m8j62J28P4r4l2j06K09M5j68Q4p8J26j08J19j76J58o0J8p1K31j35
$$ y = [-24, 32, 191, -46, -68, 126, 116, -60, -67, 34, -56, -15, -103, -17, -29, 115, -86, -70, 171, -212, 137, 82, -159, -58, 98, 164, 87, 118, -179, 31, 98, -182, -49, -129, 16, -54, 119, -137, -87, 13, -37, 53, -190, 49, -104, 101, 22, -94, 51, 3, 43, -44, 106, -35, -106, -13, -128, -1, -18, -102, -210, -7, 92, -67, -175, -14, -20, 87, -62, -100, 51, -189, 81, -97, 255, -97, 165, 2, -23, 67, -126, 116, 102, -23, 11, -20, 89, 109, 86, -206, 54, 66, 95, 75, 4, 25, -39, -28, -33, 167, -35, -136, 61, -90, 39, 20, -176, 53, -13, 55, -92, 42, 32, 27, 82, -6, -14, 83, 11, 4, 94, 61, 70, -181, 54, -8, -125, 76, 59, -87, 42, 130, -83, 63, -37, 81, -123, -97, 49, 107, -88, -22, -15, -122, 71, -77, -52, -122, 14, 136, -100, -66, 88, -4, -38, -93, 30, 36, -120, 12, -47, 43, -69, -161, 194, 23, -224, 65, 63, -4, 2, 3, -102, 4, 75, -24, -20, 63, 15, -147, -19, 55, -39, -71, -177, 32, 77, -91, -7, -85, 41, -67, 52, -124, 34, -26, -8, -79, 152, 17]
3007A7J2N5q9j27J50L1p4K15k00P5j74J01qJ29P5l36J98K2J7o6p0O9k21K30J96
3032B27l11Q8k31L30l1j21J37j15J22j76N5N0k3j29J23J30k12P0L3l5q0J77k80
3055b02J94k5o3K28j41j15O0m5J64n2nO3j46J76j61K7l4J39j19J91j66K40k73
3078f5K3J97j36J91j27k25K13k2k8J96k98P4q5J29M0j34R7k9K76l00k0O8j5M2
3102F2k94K29jK01k23o0n1J69k3K81n43J10K0K38q0m6K5k2r7Q1l8L7k9J04J02
3127A52k47J46Kpj20K5j10J63M0j17K25j01p7O2j63P4j48J69Q8j05jo3K12j74
3151g5p4P1R3q1L6R9j02j40J36K05k25j5J32p6O8J0q0k8J51p8K4o9mJ51r6k31
3177a98o8K22P4N8j68KK9J72j14N0k4n3J73k01J25l8j04J72M3j05j44J0M7J2o8
$$ y = [17, 29, 84, -5, -132, 18, 49, -25, 190, -10, 65, -109, -8, -16, 113, 188, -148, 50, 72, 89, 23, -47, 22, -199, 31, 227, -84, 4, -227, 103, 72, -49, 88, -27, 95, -81, -26, 24, 1, -128, -5, 125, -87, -17, 16, -19, -99, 78, -202, -8, -33, -96, 132, -9, -124, -64, -109, 55, 3, -2, 61, -85, 91, -70, -43, -77, 62, -57, 134, -32, 208, -65, -42, 155, 19, 210, 83, -142, 71, 49, 21, 217, -81, -7, -92, 37, 77, -57, 40, 11, 287, -13, -33, 35, 20, 62, -232, -3, -4, 197, -26, -86, -137, 32, 9, 290, -253, -143, -123, 115, 35, -11, 14, -8, -105, -24, -62, -25, -54, 50, 152, -95, 51, 53, 46, -74, -49, -159, 4, 44, -73, 152, 51, -26, 36, -127, -53, -201, -32, 56, -49, -50, -113, 99, -75, -149, -78, 15, -66, -30, 69, -33, -173, -37, 168, -57, -72, 60, -16, 52, 62, -18, -46, 105, 27, 51, -18, -22, 129, 33, -198, -266, -44, 30, 88, -80, -78, -49, 123, 9, 59, 35, -18, 155, -46, 79, 41, -63, 109, 152, 47, -97, -87, -40, -28, -96]
3202i6L39l71J62j66J08J91k52k3J82j6j4l9J52j41J08k64J70m0oq1L8L3O6L2
3226G2j25N5K1m2O9j39K4J01R6O5k11n5J43q1j64K44j88O3O7M9q2j3O4L0rj73
3252a19J90q7M1m1Q4j6o8j36J18RpN4J9j40k1J36l6m2mk5R5Q6j74Q5M4j07J00
3279C8j2n7P0j39Q4O6J09N1l81L68r4k11J18j05K2R0m6K2r4J99l5j13J87q4m8
3304EO6j58J9L7k3M8j20K08r9n8J02n9p4K60%l11J61o8J83p6Q7j17Q2k56J25K0
3330a6L4q8O2j40J05m2j55K91j66K0K13l8j41j14M6J99j02L0k4m0l6P9M5m5l7
3355f0K9p9K30r1j31J5O3J71l7n5j26J22R9N2l5k05KJ5L7r6J07n8O1K1j22J02
3381C1J1l9n8k1J76p4J69l39K75j91J48j0o2M7j35K00j63K06o5k31K98Mk72J04
$$ y = [-96, 243, -128, 34, -132, -24, 167, -85, -108, 74, 58, 44, 5, 157, 16, 124, -140, 30, -10, -16, -97, -59, -26, 40, 72, -53, 2, 23, -19, 50, -89, -65, 36, 132, 197, -14, -69, 74, -7, -171, 73, -115, -52, 15, 64, -18, -31, 33, 63, 54, -119, 71, -16, 25, -16, 68, 52, -16, -152, -34, -25, -32, 22, 41, -99, -120, 16, -20, -62, -66, -91, 4, 90, -84, 1, 45, -62, 38, 26, -31, 39, -100, -16, 50, 159, 210, -171, 197, 103, -108, 10, -95, -73, 17, -29, -7, -101, 98, 63, -50, 137, 53, 5, 71, -87, -68, -31, -54, -6, -126, 82, -17, -75, 27, -32, -106, 154, 154, -157, 4, -64, 119, 43, 130, 13, 95, -161, -36, -16, 18, -70, -8, -148, -43, -85, -240, 51, -115, -95, 118, 80, -61, -175, -129, 70, -32, -2, -26, -66, -102, -23, 22, -23, -60, -31, -110, 120, 29, -102, -87, -24, 147, 110, 55, -71, 51, 150, 202, 167, -38, -36, -21, 16, -80, 27, -31, 30, 51, -71, 31, 42, 3, -55, -76, 100, 26, 195, -144, 131, -60, 88, 78, 16, 63, -72, 128, -35, 171, 106, -125, 173, 177, -95, 9]
3405Ij12Pq8L11j69J63q5J32l5j20P9Mj4j87m9J84n1l1j8J12O3j53Nj39K40l8
3431B0P5j9r0nJ65k37lJ2M1j7p0R9j82K16J13j39K0j32J13J12j45l6J70o7j24
3456a10J35J33j53n2O8Q5j07J05o5p3r0J67m5N2K4j29J72j08J15j63J52kj88J95
3480A18k09J38qk09J23K19k67J15L2M2j07K55k96N0k8o1J13l7o1K57j28L4l7j21
3504g3R4J10k83K73j43k0J15r2r6J36n6r2Q7j12J70J9J44j29P5j65J27j68K04
3527A25j00j12J6P1j4j39J80k56J59J82j48kJ63j43j33j9J8J94J42m8p6k13J93
3550D0N2j80O5p5J02j0R0o9N1Q3r3L1j63L8m4nJ62j75K03m2kn0R9n5J31k18J01
3577F7m8j68J37P1M8p3N5m0r1J00k7J5n8L5j06K78j74j88J51J08r8J7L5j79K96
$$ y = [9, -103, -96, -184, 127, -42, 121, 36, 168, 133, 13, 92, 96, 82, -105, -154, 30, -21, -52, -70, 42, 105, -48, -43, -182, 58, 20, 95, 76, -14, -19, 146, -91, -94, -82, -41, -58, -128, -29, -211, 5, 118, -21, -1, -133, -20, 92, -53, -89, 81, 14, -110, 25, 158, 5, -47, 21, 106, -1, 104, 39, -34, -124, 43, -2, 50, 74, -55, 117, 9, 124, -39, 113, 111, -77, 118, -91, 47, 39, -170, -47, 172, -95, 20, 52, 94, -13, 242, -54, -4, -32, -93, 20, -17, -78, 179, 51, 85, 48, -73, 21, 131, -152, 121, -22, -42, 73, -19, -115, 21, -35, -127, -40, -152, 18, 37, 181, 52, 127, -38, 89, -79, 125, 25, -87, -71, 0, -14, -153, 27, -229, -70, 112, -36, -38, 125, -18, -151, -170, -152, 42, 184, 136, 60, -153, 40, 92, -88, -23, -98, 4, -6, 84, 15, 66, 149, 56, 87, -76, -38, -82, -87, 75, -100, 103, 61, 59, 9, 108, 53, 184, -34, 67, 19, -149, -12, 59, 107, 34, 89, 49, -42, 58, 31, 46, -12, 23, -83, 195, 21, -167, -16, 92, -6, 11, 46, -133, 163]
3602A63k92R8m4N5Q8j99J63jNQl4J09q6k8n6J53p3L5j34K69j21j45J09q2k3M5
3628a8Q0k9l2J08q1jj3j7RN3M5j23M8J31j63M0j19J80j25L0P6O0m37K42O0J10
3654A14o8N2M2k32J61K1l8mj68J09J37j7k48P8K62l84K23j48P6q8R0J09N6j17
3678A8O8j0mj76K27j22oJ21j00J13j95n6K41q4P4j79kK8J16m2r6r8J39P1q0M5
3704A1n6O2J52j89j3l7Rj24K02N9j25mK1J91j87PK3J44m0j43l7Q3J36j54%p7K4
3731f2n2J54KK1j17O8J9j2r9P3j9j02J28r0N1rR6o1J51q7j13J94q4k72J80l6L9
3758c9q9k6J09L7Jp9r1K05J43k91m6J26L36m72J25P9P4p5n9RJ09j07OJ28j64J4
3784c7MJ65J2k34J83k44K05J22k16rJ67j86M5n3n6K28k5j22j4J29o6P8K6j54Q2
$$ y = [163, -129, -31, -75, -20, 68, -131, 32, 31, 36, 44, 10, 119, 33, 5, -51, 102, 29, 64, -70, 199, 78, -67, 42, -40, -63, -18, 62, 33, 1, 109, 28, 27, 14, -3, 6, 59, 104, -19, 29, 160, -3, 37, -82, 98, -27, 3, 79, 139, -298, -56, 4, 114, 46, 98, 140, -92, 69, 90, 52, 48, -120, -11, 126, 109, -139, -61, 201, -183, 40, -108, -32, -120, -30, 79, 135, 18, 86, 76, 72, -104, 123, 1, -5, 116, 16, 129, -66, -122, 119, 35, 109, -70, -72, -44, 72, 30, -66, -164, -25, 46, -34, 11, -45, 17, 169, -20, -33, -70, -61, -185, 17, 76, -49, -53, -32, 159, -28, -21, 2, 146, 106, -37, -74, 9, 145, -9, -9, -86, -62, -114, 40, 42, 63, -54, 14, 33, 21, -78, -5, -24, -126, 2, -88, -37, -46, 50, -11, 140, 53, -60, 134, 50, -222, -42, -78, -39, -128, -154, -45, -8, -7, -86, -177, 28, 171, -120, -166, -40, 296, -176, -51, 28, 102, 27, -32, -23, 86, -21, -15, 113, -51, -37, -33, 132, 144, -90, 93, -151, 54, 176, -40, -49, 118, -68, -23, -76, -132, 96, 71, -51, -65, 64, -2, 76, 102, -52, 30]
3809C0j1q2J66j39j54J68J66k73J79j88O3Q2K1r0L4J05L6k39J28k9L7K5K5q1o5
3834h6P7J32j36J81k05n3L32l30J15P1j92J22r5K6rj20R6K3j27J98k6J34J1j80
3858d1J14p1Q2L7o7j32k8j0O2L3N3k8j15l4P2J08P6o1j07KJ00P3j87k1j38J08
3884a20J23M6k4M1J6p9j18J12j12J62M6n7n7O9k16J84J01k21K39k2j66J04q2J15
3908H4l0k04J29J13mj60J03j62R4M1n6mm8N8J08r3qJ05l2q0l2J43j37J38n5Q9
3934A00q8j24J91j66K91k26K2j10K91k36J83j57o4P0J75j60j07k3Q7J9O6J60j06
3957H8j07j16P8PJ64j53j28J62q8R0K3m3O2J6q0jM2k54J44k1J22M6k5N6p0k6l9
3984e1J6J96j68K7p2M9j20OK52k6m7j32K09k21K31j35j02K01q8p7lj46N0J41o6
$$ y = [30, 19, -63, 103, -36, -190, -22, 144, -129, 50, -138, -75, 7, 28, -62, -28, 77, 113, -126, 2, -27, 10, 35, 60, -21, -86, -9, 123, -13, 168, -37, -90, 242, -88, 27, 98, -94, 28, -67, -41, -50, -170, -74, -51, -178, 20, -6, 128, 139, -41, 73, 2, 84, 121, 54, -78, -106, -116, -54, -21, 32, 4, -111, -145, -73, 35, 111, 50, -57, -55, 45, 118, -69, -90, -228, -120, 3, 49, 25, 66, 82, 3, -115, -3, -115, 47, 93, 36, -21, 48, -168, 16, 117, -104, 135, 113, -53, 51, -31, 84, 54, -150, -21, 92, 88, -72, 31, -131, -37, 4, -52, -56, -104, -46, 62, -31, -39, 66, 34, -46, -78, 65, -72, 66, 11, 100, 12, -112, 79, -87, 204, -22, 0, -110, 181, -55, 128, -29, -93, -23, 152, -8, -115, -138, -51, -32, 34, 194, 88, -19, -135, -57, -50, 114, -39, -167, -5, -93, -3, 20, -23, 39, 55, -25, -26, 16, -238, -94, -115, 7, 53, 28, 84, 14, -12, -51, -35, 161, -7, 20, -52, -3, -123, -117, 135, 109, 62, -70, 139, -82, 149, 14, -88, 113, 25, -52, -55, -201, -151, -10, -76]
4009g6J59J18o7j28m9NJ23L2Q6j56k12L9N0J19j65P4j04J13p2J32o0J25n9p6Q9
4034D0N6L4j27j38J79M7k00N9P9N8j50K86k56p4M3k3Q5p3j1Q2o6J11Nk9j55J07
4060c1L9l8J21rJ5q1m0RJ38n4r9k2J34r6K21m97M27k07J52j68J25oj68P5rQ3M9
4087F3J44j14n1j25M3R9k66L43n5q9O8n5K4r0o4J56jm2m0L4n1R1p3J2N5r0M6r9
4115a27P6N9j53K28M4k43P9N9N0n3N2k34J25M7K29j82j57j30J95j2J64j19k01
4138b04J34J72j26K8j2p9R6k5j48K92k35J04oM1n0O4q0q5J19j55J32O8j21N4n1
4163g3mJ00N1p5J03o2j67J17J40p5N3j66J58M0j86K6j37R9L9j60N6nL44j74p2
4188c0j08N4J86k17P4J77j00j24Q5l1L2N7j03O0p5k9K05j76O3J33k15K21l3j76
$$ y = [-76, 83, 201, 134, 6, -43, -38, 85, 117, 203, 47, -165, -126, -76, 43, -122, -48, -152, -39, -111, 21, -39, 86, 27, -49, 40, 96, 130, 3, -135, 44, 91, -109, -50, 29, 87, -63, 223, -33, -107, -64, -87, -2, -75, -86, -4, -70, 41, 46, 17, -138, -31, 8, -30, 91, 82, 97, 16, -24, -15, 123, 69, -30, -52, 82, -14, 207, -290, 137, -70, 82, -86, 39, 33, -135, -60, -69, 14, 63, 207, 93, 42, -83, -40, 59, -207, 136, 81, -8, 60, 5, 29, -61, -125, 31, 30, -12, -52, -18, -69, 22, -51, -39, 16, -74, -28, -127, -51, 8, -145, 83, 127, -116, -37, 22, 72, 19, 71, -163, -38, 9, 238, 56, -101, -231, -36, -48, 116, -3, -204, -70, 102, -24, 4, -8, -87, 9, -16, -164, 128, -107, -3, -9, 32, -18, 46, -34, -119, 0, -155, -23, 45, -76, -22, -73, -77, 23, 74, -1, 102, 40, -127, -10, 130, 55, 108, -58, 100, 140, -46, -20, -157, -58, -19, -179, -123, -128, 216, 42, -30, -138, -84, 102, -115, -41, 136, 36, -88, -3, -34, -2, 55, -48, 12, -63, -92, 113, -63, 0, 133, -82, 139, 106, -70]
4212g0P0M9k09J70Q5p7j11K83j86j64K89k24K37jj85J18j9j28J07K0j75J96J9
4235I4l0q2J60j39J73j64q0K05j25r7J62j10J04p7j9M0j43R7r2P9J23P7n5r4Q2
4260H9j1n0m1K44j14q2j55J1J47p6L7R2j08Q5n5KK32l47K59p4l4n8j27K54p4Q7
4286A33L8j04N2k41K33j95Q1ok8k3l0J35q5j09K20K9j55J02n3J8j21k7R9L2l7
4311d2M0k3P0J68k17J28j40K4q3J2q1L59k3k42Q8J8M4n4q5Q1O1k65J55oj68L72
4337A91j70k6J85k56o7N3j04K04j34L2J87j3l1m2p6J22J17l04K36m8Kj15qJ47
4361H2M0l8o4L5m0j04R7l4p3J07Nj7J8L2r0RM2M5j90J64l4qj05K94q0k07J36o6
4389d4q4j7J72J44j97L4o4O4l3r5J44j9k1qMN5P1j21Q9j9m7P5j12o4P4J51j68
$$ y = [-70, 0, 49, -160, 10, 95, 18, -93, 190, 4, -160, 129, -95, 142, 141, -44, 74, 55, -73, 34, 54, -121, 75, 94, 64, -18, 142, 3, 176, 12, -68, 137, 12, -85, 77, -33, 71, -6, -25, 15, -128, -31, -123, -44, 79, 156, 101, 7, 89, 78, 28, -13, 231, 117, 35, -120, -109, 38, -38, -1, 91, -17, 68, 13, 15, 247, -100, 159, 85, 51, -7, -134, 120, 46, 133, 171, 67, 119, -122, 111, -84, -3, -9, -37, -60, -90, 45, -40, -149, 71, 100, -55, 47, -6, 12, -109, -136, -37, -5, -42, -2, -25, 45, 213, -4, 124, -16, 8, -75, -63, -144, 215, 192, -50, 38, 56, 100, 46, -39, 42, 103, -162, -7, -13, -181, 191, 21, -5, 180, -76, -143, -90, -194, 10, -124, -92, 95, 82, 51, 9, -67, 55, 172, -132, 104, 56, 58, -57, -65, 82, 122, 84, 20, 55, 15, -89, 8, -26, -99, 8, 13, -4, 14, 46, -44, -35, 7, 52, -138, 26, -8, -16, -121, 173, 93, -114, 22, -44, -128, -145, 27, 171, -26, 8, -56, 8, -25, -120, 24, 5, -16, -24, -20, 35, 106, -15, 74, 55, 8, 83, -29, -93, -19, 132, -36]
4416c6J04R2l06K83j05L7o3q8K18j87pR0j5J67j75j21N0j5K3O5JK2M0q1l0p5J42
4443C0n6l2K1Lj59J17L6m7J41j58J58m7M5k1q0%J0J19J05k31QN7J11m8Pj46oJ06
4471D3k10K70j79N6J54r4m9R2q1R1j16O4N5j69K6J45j33J7o2K2m1o4K10k05J78
4496B0L5o5K11j8l47J57m8N9o7j43O6J93l8Q6q9k64J90N8j54K39k10L6J16o3l8
4521g8K7R1r2L10k66m9pM8l3r4J37M0J1J6m6r6Q1k04K50M9m1k59J52J47j56J08
4547D6O6j52K3r1M2L0j30K09j17k6K25m3m8j51q2K37J2j34J00M9r0j1n1lJ13J53
4573A76j56J7J2j29K7J28j15J83l18K26p8o9K00j78JJ11j41N9p0MJ89k1o7j28
4597a37K17j8J35k30J15j07J52k47L2N2J74j93J3N2Ok6p2P7r3mP4q9J49n0q4J01
$$ y = [-36, 68, 160, -146, 137, 32, 69, 6, -82, 136, -51, -58, 32, 17, 184, 9, -112, -62, -77, -54, 11, 12, 34, 74, -7, -37, -112, 30, -26, -58, -37, -34, -193, -76, -40, -87, 54, -104, 54, 7, 52, 31, -49, -49, -39, 80, 185, -46, -38, 19, 130, 82, 89, -57, -63, 43, -167, 103, -76, -20, 134, 40, -9, 83, 2, 93, -23, 41, 96, -73, -47, 98, -35, -18, -80, -58, -99, -163, 47, -158, 20, 55, -10, 201, 183, -164, -7, -55, 4, -63, -206, -140, 53, 15, 101, 12, -252, -62, -4, -158, 81, -129, -93, 23, -40, -78, -51, 40, -52, 258, -8, -57, -64, -16, -49, -143, -6, 34, 45, 61, 15, -81, 0, -204, 46, 95, 54, -205, -53, 94, -62, 46, 112, -40, -17, -108, -66, -36, -166, 43, -74, -100, 125, 82, 34, -117, -199, 38, 50, -84, 16, 65, -25, -36, -87, -90, 23, 176, 20, 37, 49, -80, -53, 75, -40, 143, -175, 51, -27, -96, 104, -74, -73, 38, -103, -44, -114, -110, 79, 58, -9, -137, 80, 62, 197, -33, 82, -25, 127, -120, -88, -36, 138, -55, -42, 10, 16, -10, -82, -5, -98, -102, -28, -117, 32, -18, -102, -1]
4623aLN2j60J20k6O6j9r9j2J70j45P3r7O9Q2j59J76P0j20K6p2n9M1M9j56J43M1
4650E6k4j28J53n8K8q0pp5N2J74o0N1j70J43k15J55k64M04j00n6J06j39K58k49
4674d5R5qP2j40K02j46j33J04l9O1k1j0K5J24p0N7k03P8j74L4k7J5Q7R1k5r1P0
4701a7J55j81NQ0k69M6J45P9k08N8O4J33j70K6L7Qn2Mo2R7o4p8K04j05L9R4M9
4728A17k50J47R4K8o2k9j02L9j07J70j01j26J63l3K1K3O7K60j32j31m6q1J63j12
$$ y = [-1, 2, 54, -106, 14, -12, 54, 35, -64, -76, 94, -51, 22, -75, -6, 76, -83, 93, 163, 43, 69, -3, -62, -21, 28, -128, 15, 56, 32, -96, 57, -1, 27, -53, -60, -135, -83, 91, 31, 82, -88, 55, -160, -5, -269, 135, 35, -21, 85, -54, 204, -45, 50, 42, 114, -26, 176, 30, -103, 1, -38, 23, 2, -8, 17, 141, 71, 128, -75, 3, -171, -137, -164, -149, -62, 29, 4, -87, -17, 138, -43, -38, 42, -227, -181, -36, 43, -165, -107, -43, 90, -80, -54, -17, -9, -61, -57, -119, -22, -86, -164, 40, -65, -26, 68, 117, -133, 14, 108, 136, 74, 45, -57, -18, -125, 45, -56, -182, -19, -52, -31, -8, 59, 319, 187, 56, 10, -71, 92, -20]
$$ [...]
8191C5
##END NTUPLES=NMR FID
##END=
