##TITLE=1H_Pr AmC3
 CDCl3
 8 sc, 
 26.09.2022
##JCAMPDX= 6.0         $$ Bruker NMR JCAMP-DX V2.0
##DATA TYPE= NMR FID
##DATA CLASS= NTUPLES
##ORIGIN= UXNMR, Bruker Analytische Messtechnik GmbH
##OWNER= root
$$ XWIN-NMR		Version 3.5
$$ Mon Sep 26 14:57:49 2022 Russian Standard Time (UT+4h)  she@DPX200
##.OBSERVE FREQUENCY= 200.1313499994
##.OBSERVE NUCLEUS= ^1H
##.DELAY= (6, 6)
##.ACQUISITION MODE= SIMULTANEOUS
##.ACQUISITION SCHEME= undefined
##.AVERAGES= 8
##.DIGITISER RES= 18
##SPECTROMETER/DATA SYSTEM= spect
##.PULSE SEQUENCE= zg30
##.SOLVENT NAME= CDCl3
##.SHIFT REFERENCE= (INTERNAL, CDCl3, 0, 15.7039)
##AUDIT TRAIL= $$ (NUMBER, WHEN, WHO, WHERE, WHAT)
$$ ##TITLE= Audit trail, XWIN-NMR		Version 3.5
$$ ##JCAMPDX= 5.01
$$ ##ORIGIN= Bruker BioSpin GmbH
$$ ##OWNER= she
$$ F:/spectra/data/she/nmr/H-F/1/audita.txt
$$ ##AUDIT TRAIL=  $$ (NUMBER, WHEN, WHO, WHERE, WHAT)
(   1,<2022-09-26 14:56:19.35 +0400>,<she>,<DPX200>,
      <created by zg, POWCHK disabled, PULCHK disabled
       configuration hash MD5:
       00 E9 B6 7A A2 85 ED C7 34 08 36 98 17 FE 4E 26
       data hash MD5: 16K
       EE B7 3B 41 69 6B 05 C6 E7 50 49 4A E8 5E 68 55>)
$$ ##END=
$$ 
$$ hash MD5
$$ E9 A8 73 3A 52 5F 3A D4 06 35 6E 7E 1D C1 39 89
##$RELAX= 
##$RELAX= 
##$RELAX= 
##$RELAX= 
##$RELAX= 
##$RELAX= 
$$ Bruker specific parameters
$$ --------------------------
##$DU= <F:/spectra>
##$EXPNO= 1
##$NAME= <H-F>
##$PROCNO= 1
##$TYPE= <nmr>
##$USER= <she>
##$AMP= (0..31)
100 100 100 100 100 100 100 100 100 100 100 100 100 100 100 100 100 100 
100 100 100 100 100 100 100 100 100 100 100 100 100 100 
##$AQSEQ= 0
##$AQ_mod= 1
##$AUNM= <au_zg>
##$AUTOPOS= <>
##$BF1= 200.13
##$BF2= 200.13
##$BF3= 200.13
##$BF4= 200.13
##$BF5= 200.13
##$BF6= 200.13
##$BF7= 200.13
##$BF8= 200.13
##$BYTORDA= 1
##$CFDGTYP= 0
##$CFRGTYP= 5
##$CHEMSTR= <none>
##$CNST= (0..31)
1 1 145 1 1 1 1 1 1 1 1 1 1 1 1 1 1 1 1 1 1 1 1 1 1 1 1 1 1 1 1 1 
##$CPDPRG= <>
##$CPDPRG1= <>
##$CPDPRG2= <>
##$CPDPRG3= <>
##$CPDPRG4= <mlev>
##$CPDPRG5= <mlev>
##$CPDPRG6= <mlev>
##$CPDPRG7= <mlev>
##$CPDPRG8= <mlev>
##$CPDPRGB= <>
##$CPDPRGT= <>
##$D= (0..31)
0 1.2 0 0 0 0 0 0 0 0.06 0 0.03 0 0 0 0 0.0002 0 0 0 0 0 0 0 0 0 0 0 0 
0 0 0 
##$DATE= 1664189778
##$DBL= (0..7)
120 120 120 120 120 120 120 120 
##$DBP= (0..7)
150 150 150 150 150 150 150 150 
##$DBP07= 0
##$DBPNAM0= <>
##$DBPNAM1= <>
##$DBPNAM2= <>
##$DBPNAM3= <>
##$DBPNAM4= <>
##$DBPNAM5= <>
##$DBPNAM6= <>
##$DBPNAM7= <>
##$DBPOAL= (0..7)
0.5 0.5 0.5 0.5 0.5 0.5 0.5 0.5 
##$DBPOFFS= (0..7)
0 0 0 0 0 0 0 0 
##$DE= 6
##$DECBNUC= <off>
##$DECIM= 32
##$DECNUC= <off>
##$DECSTAT= 4
##$DIGMOD= 1
##$DIGTYP= 9
##$DL= (0..7)
0 120 120 120 120 120 120 120 
##$DP= (0..7)
150 150 150 150 150 150 150 150 
##$DP07= 0
##$DPNAME0= <>
##$DPNAME1= <>
##$DPNAME2= <>
##$DPNAME3= <>
##$DPNAME4= <>
##$DPNAME5= <>
##$DPNAME6= <>
##$DPNAME7= <>
##$DPOAL= (0..7)
0.5 0.5 0.5 0.5 0.5 0.5 0.5 0.5 
##$DPOFFS= (0..7)
0 0 0 0 0 0 0 0 
##$DQDMODE= 0
##$DR= 18
##$DS= 0
##$DSLIST= <SSSSSSSSSSSSSSS>
$$ [...]
##$SUBNAM2= <"">
##$SUBNAM3= <"">
##$SUBNAM4= <"">
##$SUBNAM5= <"">
##$SUBNAM6= <"">
##$SUBNAM7= <"">
##$SUBNAM8= <"">
##$SUBNAM9= <"">
##$SW= 18.0517283424941
##$SWIBOX= (0..15)
0 0 2 0 0 0 0 0 0 0 0 0 0 0 0 0 
##$SW_h= 3612.71676300578
##$TD= 16384
##$TD0= 1
##$TE= 0
##$TE2= 300
##$TE3= 300
##$TEG= 300
##$TL= (0..7)
0 120 120 120 120 120 120 120 
##$TP= (0..7)
150 150 150 150 150 150 150 150 
##$TP07= 0
##$TPNAME0= <>
##$TPNAME1= <>
##$TPNAME2= <>
##$TPNAME3= <>
##$TPNAME4= <>
##$TPNAME5= <>
##$TPNAME6= <>
##$TPNAME7= <>
##$TPOAL= (0..7)
0.5 0.5 0.5 0.5 0.5 0.5 0.5 0.5 
##$TPOFFS= (0..7)
0 0 0 0 0 0 0 0 
##$TUNHIN= 0
##$TUNHOUT= 0
##$TUNXOUT= 0
##$USERA1= <user>
##$USERA2= <user>
##$USERA3= <user>
##$USERA4= <user>
##$USERA5= <user>
##$V9= 5
##$VALIST= <valist>
##$VCLIST= <CCCCCCCCCCCCCCC>
##$VD= 0
##$VDLIST= <DDDDDDDDDDDDDDD>
##$VPLIST= <PPPPPPPPPPPPPPP>
##$VTLIST= <TTTTTTTTTTTTTTT>
##$WBST= 1024
##$WBSW= 4
##$XGAIN= (0..3)
0 0 0 0 
##$XL= 0
##$YL= 0
##$YMAX_a= 524040
##$YMIN_a= -761040
##$ZGOPTNS= <>
##$ZL1= 120
##$ZL2= 120
##$ZL3= 120
##$ZL4= 120
##$ABSF1= 10
##$ABSF2= 0
##$ABSG= 5
##$ABSL= 3
##$ALPHA= 0
##$AQORDER= 0
##$ASSFAC= 0
##$ASSFACI= 0
##$ASSFACX= 0
##$ASSWID= 0
##$AUNMP= <proc_1d>
##$AZFE= 0.1
##$AZFW= 0.1
##$BCFW= 1
##$BC_mod= 2
##$BYTORDP= 1
##$COROFFS= 0
##$CY= 11.3945322036743
##$DATMOD= 1
##$DC= 2
##$DFILT= <>
##$DTYPP= 0
##$F1P= 2.36226072786647
##$F2P= -0.459571619588291
##$FCOR= 0.5
##$FTSIZE= 0
##$FT_mod= 4
##$GAMMA= 1
##$GB= 0.15
##$INTBC= 1
##$INTSCL= 1
##$ISEN= 128
##$LB= 0.24
##$LEV0= 0
##$LPBIN= 0
##$MAXI= 10000
##$MC2= 0
##$MEAN= 0
##$ME_mod= 0
##$MI= 1.114404
##$NCOEF= 0
##$NC_proc= 0
##$NLEV= 6
##$NOISF1= 3.799351
##$NOISF2= 2.8
##$NSP= 1
##$NTH_PI= 0
##$NZP= 0
##$OFFSET= 15.70392
##$PC= 1
##$PHC0= -18044.97
##$PHC1= 29.60069
##$PH_mod= 1
##$PKNL= yes
##$PPARMOD= 0
##$PSCAL= 0
##$PSIGN= 0
##$REVERSE= no
##$SF= 200.130013532006
##$SI= 16384
##$SIGF1= 3
##$SIGF2= 2
##$SINO= 400
##$SIOLD= 16384
##$SREGLST= <1H.CDCl3>
##$SSB= 0
##$STSI= 0
##$STSR= 0
##$SW_p= 3612.71676300578
##$SYMM= 0
##$S_DEV= 0
##$TDeff= 0
##$TDoff= 0
##$TI= <>
##$TILT= no
##$TM1= 0
##$TM2= 0
##$TOPLEV= 0
##$USERP1= <user>
##$USERP2= <user>
##$USERP3= <user>
##$USERP4= <user>
##$USERP5= <user>
##$WDW= 1
##$XDIM= 8192
##$YMAX_p= 0
##$YMIN_p= 0
$$ End of Bruker specific parameters
$$ ---------------------------------
##NTUPLES= NMR FID
##VAR_NAME=  TIME,          FID/REAL,        FID/IMAG
##SYMBOL=    X,             R,               I
##VAR_TYPE=  INDEPENDENT,   DEPENDENT,       DEPENDENT
##VAR_FORM=  AFFN,          ASDF,            ASDF
##VAR_DIM=   8192,          8192,            8192
##UNITS=     SECONDS,       ARBITRARY UNITS, ARBITRARY UNITS
##FACTOR=    0.0002768,     1,               1
##FIRST=     0,             0,               0
##LAST=      2.2672688,     0,               0
##MIN=       0,             -761040,         0
##MAX=       2.2672688,     524040,          0
$$ Real data points
##PAGE= N=1
##DATA TABLE= (X++(R..R)), XYDATA
0@%%%%%%%Qj6J6j6K4l2M0m8N6p2Q8j12J36j60J94k34K78l27L83m44N15n96O86
30C67p86Q97j021J159j313J481j664J866k089K334k600K892l214L563l944M359
46B287m812N310n854O449p105P828q626R512j0500J1612j2872J4307j5961J7897
60I472k0197K2981k6432L0845l6712M4941n7407P8728j24810L97394l93400n91333
72f65930Q51127J87185l90894q3927J34237j48020J14199J30725j47257j24495
82a43050J72549N1524j14414r8672J16986J87196p0934l17987N8858L58150j8204
93A82002l07873J8715J42261j6306L7434J7074k01441K1166K69882q1104k55853
104a74043J46907J56444j70299k0372J49381j06657q1661J84142J8586j87123
$$ y = [0, 0, 0, 0, 0, 0, 0, 0, 8, -8, 8, -8, 16, -16, 24, -24, 32, -40, 48, -64, 72, -88, 106, -128, 150, -177, 206, -238, 277, -319, 367, -419, 478, -543, 616, -697, 784, -880, 986, -1103, 1231, -1369, 1523, -1691, 1872, -2072, 2287, -2525, 2785, -3069, 3380, -3725, 4103, -4523, 4989, -5511, 6101, -6771, 7536, -8425, 9472, -10725, 12256, -14176, 16669, -20043, 24898, -32509, 46219, -78591, 318803, -74597, -665930, 185197, 372382, -18512, -102439, 31798, -116222, -2023, 128702, -18555, -143050, 29499, 81023, -33391, -132063, -15077, 172119, 101185, -216802, -157944, 200206, 182002, -125871, -107156, 35105, 18799, 56233, 73307, -128134, -106968, 162914, 81810, -174043, -27136, 129308, -40991, -61363, 88018, -18639, -100300, 83842, 102428, -84695]
114h4695K1269J29837k4428o5918j0522K5723N1755m3544r4503Q5106J07994j13254
126a5180p3390J05316K22n1260J05348l080j84327M0058K05716m2145j55856J8674
138d9904N9571N631K0829k6424n0514L7637J6561m8343M3548M9821q4394l8118
150f4099P0100Q758q140L2588o3313n8503J12902N7601j12668k3240P5480k6018
162A448k7435N9055j1991n9694L0138K6229l0697K1426K6321n1648j9968N0744
174A3928J9165j9338k3864k6340L2516N8471m7400o5785N6943M0965n8352l179
186b2270M3046l1106j2233M4593k0227k8366M7476m847n4499M1662M5218n9995
198a1548k3531N3949K728k6892J0981m779j4820K2668O761k1802L343R57j4661
$$ y = [-84695, -63426, 66411, 41983, -23935, -34457, -8734, 43021, -523, -95026, -9920, 98074, -15180, -88570, 16746, 16968, -34292, 71056, 67976, -116351, -76293, 129423, 87278, -68578, -49904, 9667, 15298, 36127, 9703, -40811, -3174, 13387, -34956, 8592, 58413, -25981, -64099, 6001, 14759, 6619, 39207, -24106, -82609, 30293, 87894, -24774, -48014, 27466, 1448, -25987, 33068, 21077, -38617, -8479, 17750, -12947, 8479, 34800, -16848, -36816, 13928, 33093, 13755, -10109, -36449, -3933, 54538, 7138, -58647, -1704, 39261, -19091, -22270, 20776, -10330, -22563, 22030, 1803, -26563, 20913, 16066, -38433, 3229, 48447, -11548, -35079, 18870, 21598, -5294, 5687, 908, -13912, 8756, 15517, -6285, -2942, -1985, -16646]
211a6646K0126J4823l1679q13K7236k4358r323N3270p907p0082J9259O6267k0178
224A9995m3732J2528J5516r62N577j1610o845K2836k720k7733J5535K4102k1232
237A255j1375J3848p109k600K0895p859k5944J0790J7593o486k905m173j1200
250a5270J4804J6896k4349j1978L1707J945l2631J1038L0214j8058k1134K0562
262C746J2791j8908o543J6200N453j4280r896J4257J2734j6720j4867J8523J0875
275A3365k0138o419J8150J762j3275O54O488j573n54K660j984l353J753L819K118
290C473r86m970j844R467N772j2261q440J5528Q700j9964o611K1903L250k2973
304i956r70K1045o01j9360J086J5623l303j3491M182J2008n586j1034N872J1796
$$ y = [-16646, 3480, 18303, -13376, -14189, 13047, -11311, -20634, 32636, 24729, -45353, -26094, 40173, 19995, -23737, -11209, 4307, 3345, 8922, -2688, -9533, 13303, 10583, -17150, -1615, 22487, 1255, -10120, 3728, -3381, -5981, 14914, 7055, -18889, -8099, 9494, 3008, 103, -4070, -15270, -466, 16430, -7919, -19897, 11810, 13755, -18876, -7838, 22376, 4318, -16816, 3746, 16537, -2371, -8914, 7286, 12739, -1541, -11437, 2820, 15554, -1166, -16033, 2490, 13365, -6773, -13192, 4958, 6720, -6555, -5901, 587, -986, -1540, 1120, -864, -4217, -2464, 1355, 3473, 2487, -2483, -4327, 5140, 10912, -1349, -9789, 5739, 14439, -5525, -12136, 9767, 13017, -9956, -10926, 10119, 9518, -9842, -8756, 6867, 3564, -9927, -5745, 6263, 677, -10357, -4485, 7311]
318G311n219j0954O602J0986p019q991Q751P652r703m926Q882L261o200k671L570
333A332L509l071o609L526Q642p096j1204R176J1575j1534j1257J2480R937j3121
347c715p177J2679N186j1428l123J0772K656p325k222O204K771m618m037P107
361C730M615j0835n257J4335L921j6320k398J5601q79j3409K563Q616l691n889
375e297K308M009J08m665k467Q286L533j2373m58J6260l952j7489J0740J5219
389A3762j3731r901J3980M158q174k68k60K15P880n260j1372J0381P025j5189
403f754J615J5491j2574j2823J9164P606j9357k127J2618j375l017J035l209L612
417i5N289j0670J329J8661j1033k0894K0607J5299k3756l443K0279r979j2941
$$ y = [7311, 2092, -8862, -2260, 8726, 1707, -7284, 1467, 9119, -584, -5510, 3372, 6633, 433, -2238, 1332, 4841, 1770, -4839, -1313, 7329, 233, -10971, -1795, 9780, -1754, -13011, -531, 9406, -3715, -10892, 1787, 6973, -4455, -7578, 3194, 5850, -1475, -3697, 2507, 5278, 660, -3377, 3730, 8345, -2490, -7747, 6588, 10509, -5811, -8209, 7392, 6513, -6896, -4333, 4283, 592, -5297, -2989, 1020, 1128, -3537, -6004, 2282, 5815, -6558, -7016, 9244, 5292, -12197, -1457, 13762, 31, -9870, 4110, 8268, 94, -174, -434, -219, 7661, 2401, -8971, 1410, 8435, -6754, -5139, 10352, -2222, -15045, 4119, 11725, -7632, -9759, 2859, 1484, -1533, -498, -3707, -95, 5194, -5476, -4147, 14514, 3481, -17413, 3194, 18493, -5263, -8706, 11573, 1594, -11347]
430a1347J8028L260j5046K739O72l862J5366j050k6661P852K4948j5818j0684
443a1603K0488q037j9226K2339J3821k3367n853J3099o21M576K225j7959M523
456e595K2282j6555j4169K9542j925l6011J6039L0117k2854j4217J8602o875q032
469i651K1177l638k1544Q906M947n696J9429m215l9656J6191M5259k3683l0807
482b2981K5783N750k0384J8159J0924k6510j51J6386p843O445R245k7316l228
495a5721L3901j1322k3279K8639J78m2997K0938M3249k9205k8667K0622L172r47
508a439K0804j8295k9682K7092J8831k1813R807N639l7544J3737N1501k7358m1451
521c0171L1321J4300k5908J4893J3561k8781L9J8026j2122R377J7807l8737j5052
$$ y = [-11347, 6681, 9941, -5105, -2366, -1694, -5556, 9810, 8760, -17901, -10049, 14899, -919, -11603, 8885, 848, -18378, 3961, 17782, -5585, -11438, 1661, 1040, 5616, 7841, -10118, -5595, 16687, 132, -14037, 15505, 13580, -22431, -6392, 23725, 871, -13346, 5256, -1619, -9651, 11526, 7888, -13656, -4750, 197, -5499, 13930, 9715, -29941, -13750, 31509, 7826, -22981, 2802, 8552, -11832, 6327, 17251, -9259, -9410, 6976, -867, 5578, 14823, -12493, -15721, 18180, 6858, -16421, 12218, 12396, -30601, -9663, 33586, 4381, -24286, -3664, -492, -1439, 19365, 1070, -28612, -1520, 17311, -4502, 5305, 10944, -26600, -12863, 38638, 11280, -30171, 1150, 15450, -10458, 4435, 17996, -10785, -10746, 7280, -4842, 4535, 22342, -16395, -31447]
534c1447N1228J932m0101J6580R752l3760K2175M2358m0045l4357L5953J3736
546A4004j3063J2009j4764k5961L2654K2333l3361L0J8447k7853L246M5073k1389
559A1405m0462K7801J3647k3312J9211R841m0473M752L5486j5683p619K1022k8890
572a3274j9426N3888J0992n2695K114K7355j5494R347K4397l5427k1123L8793
584I447P340j8940J1744j1182k5031L3980K4005m0286n802K6837k0870m820M0664
597B7086j5707m1505K3679J9377j9023J2975O766l8949P237M4315j7350k3678
609a4777K0938q509j8878L6836J2319m3873k647K7966o656J732J2379k7938j0273
622b1381L6370l87k4017J4487k671k6203K6960K7518l8638j5511L1951n989j2772
$$ y = [-31447, 19781, 21713, -18388, -1808, 7944, -25816, -3641, 38717, -1328, -35685, 268, 14004, 941, 12950, -1814, -27775, 4879, 27212, -6149, -6119, 12328, -15525, -12279, 32794, 11405, -29057, -1256, 12391, -10921, 8290, 18131, -22342, -17590, 17896, 2213, -5406, 15616, -13274, -32700, 21188, 32180, -20515, -18401, 8954, -6540, 2807, 27204, -8223, -29346, 9447, 16787, -2153, 9591, -1591, -26622, 7358, 31363, -8923, -14725, 12112, -8758, -13578, 27086, 11379, -30126, -6447, 12930, -6093, 6882, 13648, -25301, -18064, 26251, 8901, -14777, 6161, -2348, -21226, 15610, 27929, -15944, -18591, 9375, 2719, 4451, 16830, -11108, -21381, 14989, 14602, -9415, 5072, 2401, -23802, 3158, 30676, -7962, -23473, 8478, 2489, -10283]
635a0283K4577o976l0685J8250J8753j5512N536L861k8483J0695L8919k0325k8451
648b0124K2230M649j7196K0013P996l1954O28K4586o425l609P547j9437m699L0875
662A5080l055k6535J2835P359k0487J3636K3344k6464j7404K5469N554j2755P795
675D372l515j3145J4333Q726j4973O238O524k2038N853L0780j5665k6882J9031
688c61J0920j6047P390Q290j9318j243J7976l743o088M758j0182j916K0569l578
702G427k0760J0718J1422j5368K387J6595j1804j1595J3738L493p280M548l272
715B49q057J2068N217j4729L164J0576j3744k440J9906o093k0506J0074J3773
728I458r838l891M643l749R06O450n197j255N963o557k794J2880j140j4383N905
$$ y = [-10283, 14294, 7318, -23367, -5117, 13636, -1876, 3660, 7521, -20962, -10267, 28652, 8327, -20124, 2106, 6755, -10441, 9572, 17568, -14386, -13758, 10828, 4403, 794, 8341, -11096, -15795, 15080, 12025, -14510, -1675, 5684, -14803, -1167, 22177, -4287, -21691, 3778, 9332, -3423, 4372, 857, -12288, 2045, 10771, -4202, 2036, 8560, -13478, -7625, 23155, 7490, -19392, -361, 10559, -5488, 1902, 10192, -9126, -10369, 7607, 3864, -2224, 2534, -7648, -9564, 11005, 7427, -13333, -2615, 8807, -6561, -4174, 12421, 617, -10978, 2760, 6253, -1027, 3521, 249, -7808, 4260, 9477, -5252, -2088, 8488, -5256, -7696, 12210, 6117, -14389, -4315, 9458, -380, -4271, 372, -3377, -2471, 3979, -1218, -2473, 3490, -3067, -5861, 7019, 5879, -8504, -2599]
743b599J0822q770l321R868l232p843N272L857k321n47l964k190R436J903j3007
758f636J315J1583n871p301Q425K640q952K96P223j244k612l93Q35K798j99m600
774b693K290N442n451m415Q443K790r221m00P783j164o039J468L489r80k613r34
790b205K342J751m033k005N499J517o889n4P498j166p080K543O125k110m652J681
806a238M360q04m007K41N052p76n321J575N071k527n103L208M338m116l805L784
822f8L700l927m206L771L477l116l944L229M047l469l512M419L667m737l008M714
838A037L124m499k693M555K667m353k395M430K145m884k471M986K034n422j753
853c492N263O59n353k8N012n04m944L47M982l10m794K59M909M02n067L41N722
$$ y = [-2599, 8223, -547, -3868, 6000, 2768, -5075, 197, 4054, 1733, 1186, -2778, -4968, 4468, 6371, -6636, -5321, 6262, 391, -6910, 1515, 4155, -4797, -4501, 2722, 1478, -1134, -1527, -692, 2106, 1907, -2693, -403, 5039, -412, -4827, 3616, 6406, -2815, -3215, 4568, 3404, -2635, -1167, 2322, 1342, -1271, -2205, 137, 1888, -2145, -4150, 1349, 2866, -4023, -4077, 3421, 2255, -4825, -2282, 3843, 1733, -2919, -1238, 3122, 2318, -1689, -1448, 3604, 2828, -2493, -918, 4153, 1626, -3477, -269, 4069, -47, -3852, -68, 3632, -295, -4501, -730, 2747, -369, -4313, -1084, 2963, -506, -4018, 401, 4068, -669, -3677, 1037, 4161, -338, -3031, 1524, 4191, -162, -2557, 1873, 4018, -866, -3337, 1649, 3683, -1739, -3492, 1771, 2430, -2923, -2951, 2061, 1557, -3387, -3040, 1942, 1632, -3162, -2903, 2006, 2408, -2659, -2318, 3404]
870C404j81o076P49O483j456n561K168M084k774l243K621K652j698l880Q91M874
886C057j000o630J821O442l117n927M702M471n353k849N506J159l274j000J928
901f4J500n99k622J570M335l637m528O658M152r144k898R441M27p639Q14L608
917A374j154k52p06j000K488l57m296M001M675q528k805J0771k45r837M429O691
933E249o472k216O334k52k914N9j662K958N507o656o285R095K543r131L527O485
949F169j0246l544J2975Q1j0594J799L793j469L227n70p150M393N347p922J955
964a756R176q835q144J3364M172j1906K177O258p706J668Q987o091n854N481k125
979a134n96R695o299j3740J1221J0842j2493k515R241p801l310J3013j512j1866
$$ y = [3404, 3223, -2853, -2104, 4379, 2923, -2638, -470, 3614, 840, -2403, 218, 2870, 1172, -2708, -1817, 3057, 2057, -4573, -2752, 3690, 573, -5354, -652, 3819, -1534, -4383, 1123, 2282, -992, -1992, -64, 1436, 837, -1785, -215, 4120, 483, -4045, 2613, 6765, -2379, -5277, 4164, 4591, -3048, -2234, 1374, 220, -32, -738, -1738, 750, 393, -3903, 98, 4773, -3755, -6560, 4211, 3966, -5871, -1442, 5249, -1223, -3439, 2895, 2643, -271, -212, -1874, 1084, 6591, -65, -6350, 2745, 5288, -3843, -316, 6169, -4077, -7621, 5354, 5435, -5159, -3360, 433, -1036, 2191, 1621, -5529, -1136, 4211, -3711, -1756, 7420, -1415, -9559, 3805, 7977, -3929, -1752, 4506, -3200, -1532, 7455, 1364, -4490, 991, -1134, -1730, 7965, 1666, -12074, -853, 9989, -2504, -5019, 4222, -3579, -6889, 6124, 4612, -7254]
993g254N264L449m338P698J202j4743M161J3780r139n040J2494o680j2064J4929
1007C719P981j5117r73O825o043M174R554j3249p340J3920m91p230J0316l447
1021B599j6908J2053J6291j4313q418J0767l772k475J3464n275j3615R343M769
1034D510q156R440L610k0865K271K2780q166j3344J1388k638j1348J4881Q265
1047A2628j8171k598R839m390M979Q319j7861p558K2053J134j5234Q977K172j6784
1061a2495J0026J8739j5346j1854J2212m14k386J1374p037j5037J2676P928j2323
1074c937O172O977k0456P7K5886o423j9860R326M779q859J0857N052j8107J19
1088h397J2812m860J281Q480j6784p451K5149K233k1114O055Q921j4051O337J6862
$$ y = [-7254, -1990, 1459, -2879, 4819, 6021, -8722, -4561, 9219, 80, -4960, 7534, 854, -11210, 3719, 11700, -3417, -4390, 2435, -3608, 566, 10120, -3129, -10469, 3451, 2960, -4270, 6046, 2599, -14309, -2256, 14035, -278, -8696, 2071, -1701, -4176, 9288, 4013, -9602, -259, 4510, -3646, 5794, 9404, -11461, -9190, 13590, 5424, -7920, 3468, 830, -10518, 4363, 12628, -5543, -8141, 1698, -2692, 2287, 10606, -7255, -14813, 7240, 8374, -6860, 2117, 4289, -12495, -2469, 16270, 924, -10930, 1282, 868, -1518, 9856, 2819, -12218, 458, 8386, -3937, 2235, 9212, -11244, -11167, 14719, 8296, -11564, -2238, 2541, -6318, 4539, 9591, -8516, -8397, 4415, -445, 836, 9316, -7468, -14919, 10230, 12463, -8651, -2596, 6325, -7726, -1389, 15473]
1102A5473j5250j2522J3474K068l500Q960q449j4759J5583J1115j6285J074R305
1115F287j4912j123K3427n732k0759Q416Q321o509P240K131j6396L005J4879o974
1129A301k987R035j1603q469K2145M231k1601J836J1983q587J477J1514j2028
1142a753q855J2540J511n056P299o372j2700J4961J0993j6993k755J2330q535
1155c385l645J6659l795j6260P297Q312n431L451P79j2628M956J4286r368o552
1169e324J0059n148q426J5027M370j7863L10J1467m231j133N720q063m147J1052
1183C670m29p039O745k109j0782J0703J0949j4238o216J2036j062n635Q434j632
1197C395r532N030N733m601K021M04r197M312J1380p880q194R300Q8q318P662
$$ y = [15473, 223, -12299, 1175, 3243, -257, 8703, 254, -14505, 1078, 12193, -4092, -3018, 6287, -8625, -9748, 13679, 7947, -12812, -4396, 3925, -2584, 4656, 6787, -9609, -6604, 8275, 1301, -1686, 7349, -4254, -12723, 9422, 13653, -7948, -6112, 5871, -2716, -1239, 10275, -1753, -10608, 1932, 3443, -1613, 5686, -686, -13386, 1575, 12568, -4425, -7180, 5150, -3385, -7030, 9629, 5834, -10426, -3129, 5183, -248, 3203, 3982, -8646, -3690, 10596, 1228, -5324, 4735, -413, -8839, 6188, 10558, -7305, -6995, 4472, 241, -892, 4828, -3235, -7382, 3670, 3241, -3798, 2947, 838, -9944, 759, 11708, -2530, -8746, 3290, 2228, -3407, 5027, 3395, -6137, -1107, 4626, 25, 2046, 2450, -6747, -2435, 8945, 1065, -7129, 2171, 2259, -6059, 1603]
1212A603M828j0730j644Q368j015j875K247m972n55Q460k298o661O000J337q194
1227e101M794Q132q471n470Q194J533m821K155L00l603L025J517m047K448J560
1242B145o577J812Q449n164o867O278L360n933J073L884l729j212L575m01k49
1257D44P88l181P83N595k787n572M745L054n702k4O009k881m944L683K165j808
1273C67j321k05J15K522j230k974K944J993m672j12N336j030n166K467M025k669
1289C90j784J771P21p34l55l19J574M68l144K14L938q20m562J518L821k800k589
1306b692K837J584k286j460J736J391j461j888J386K299j337k529K210K503k440
1321a47j968K850J731k811j000K897M97k670n03K291O96k313j052K252J075k899
$$ y = [1603, 6431, -4299, -5943, 2425, 1410, -465, 1782, -3190, -3745, 4715, 2417, -4244, 1756, 3093, -5101, -307, 7825, -646, -6116, 2078, 3611, -1210, 945, 1245, -2358, 667, 2184, -1863, 585, 2145, -4432, -2620, 5829, 665, -6202, 76, 3436, -2497, -1424, 2460, -1269, -2481, 1094, 693, 444, 1232, -1949, -1166, 4429, 1642, -3930, 815, 3869, -1833, -1857, 4152, 1271, -3673, 10, 2175, 367, -954, -1159, -1044, 1478, 248, -2726, 218, 2211, -2461, -2573, 2763, 1733, -3433, -966, 3059, 390, -1394, 377, 1098, 364, 9, -310, 1264, 1732, -1412, -1198, 2740, 1920, -2642, -1124, 2697, -103, -2692, 145, 1729, -557, -2017, -281, 1110, -351, -2239, -853, 1446, 109, -2420, -210, 2293, -147, -2115, 735, 2466, -345, -1345, 1552, 2049, -621, -1124, 1167, 1863, -450, -1502, 750, 1825, -1074]
1337a074p56K920P6k944R2K718p5k615k69K837L97k406k39K623j10k536L52K742
1355A733j51k750N29K628n31k655P10K664j291k539J059K354j311k239J094K199
1371A503r35k545J202K389j618k468K045K319k255j783K128J814j737j586J958
1386D31J279j710j509J832K204k104k088K204J833k839j248K906M30k834k74K565
1402A078j18k078m96J748Q29j322j455J624J914l095q56L745L15m027P24L409
1418A939j101j937J199R27m22k61j95O26P92k146j256L811J68m761R06M533k232
1435E90l246K964J115k763J53J597n06j26o42r61K779J379m305j77N017j880l548
1452b560L826J810n417R86M619k096k043R62m51N21K292l233k068M233j34m807
$$ y = [-1074, -1830, 1090, 1166, -1778, -1686, 1032, 957, -1658, -1927, 910, 1307, -1099, -1338, 1285, 1175, -1361, -1009, 1733, 1582, -1168, -639, 1989, 1458, -1197, -487, 2177, 886, -1653, -594, 1760, 449, -1790, -696, 1503, 568, -1977, -775, 1614, -4, -2472, -427, 1892, -363, -2146, -18, 1796, 59, -1527, 431, 1710, 0, -1509, 323, 2527, 423, -1665, 539, 2372, -467, -1715, 1191, 1621, -1213, -1487, 1078, 960, -1118, -1614, 134, 963, -359, -1814, -190, 1724, -1371, -2227, 1518, 1833, -2194, -1470, 1939, 838, -1099, 100, 1027, 605, 344, 149, 775, 1567, -579, -1835, 1976, 2144, -2617, -1711, 2822, 590, -2656, 308, 1423, -1340, -1187, 410, -96, -222, -864, -1825, 954, 2333, -1972, -2149, 2868, 988, -2560, 1266, 3076, -2341, -1355, 3264, 1168, -875, 87, -364, 157, 2449, -784, -2852, 1381, 1247, -3560]
1468c560M273K993o994p89P104q61n040K476P71k465K967J053l246J154J097l217
1484b284L018M627p040l639Q112J089o448K902K167n382R89O004l003l438K449
1499A23j850O62N640m415o354O619L373o909K287N630p852j964R350n50o541K237
1515e14P20k089N010N54p699K685N009n412J013O725p396o351J0396L415q957
1530b891O46M077m844K392N542n725l377N027j753q49P003m401r400Q090P530
1545G067q492r37O179n831k329R889j140q516L108J921k794O173mj0750K715R797
1561F056n925k995P242n601o959J0799M955j0891n63M944l224K846N325q304l696
1576e991Q595j052l915P250k880j1103Q284J0232r377m573O995l769j877Q914
$$ y = [-3560, 713, 3706, -3288, -4077, 3027, 2166, -2874, -398, 373, -2092, 875, 1928, -1318, -164, 933, -2284, 734, 5361, -1679, -5318, 2794, 3883, -2565, 337, 2504, -2878, -1889, 4115, 1112, -2326, 123, -1727, -1065, 4575, 160, -6194, 425, 3798, -3111, -824, 4806, -3046, -5010, 4340, 3790, -2751, -514, 206, -1883, 3127, 3681, -4018, -1333, 3676, -1736, -723, 6002, -1394, -7745, 2651, 6066, -2891, -2245, 1832, -3012, -620, 4922, -803, -4180, 847, -906, -1755, 5248, 847, -8553, -463, 7067, -1425, -2362, 3817, -2014, -4343, 5546, 4406, -4110, -1002, 919, -1875, 4298, 4294, -6456, -3741, 6056, 131, -2864, 4378, -1223, -8182, 2617, 7572, -3319, -3882, 1062, -2162, 684, 6009, -2295, -5991, 2604, 1552, -2363, 4887, 2007, -9096, -812, 9420, 43, -4530, 2465, -1304, -3181, 5733]
1590E733k421r171M140L391l533N268P62j1616K005J2763n073p348O871j674o455
1605f358Q863M763j0663j089O393k889K293M799r323l601J1134m7p509N454K44
1620B464r545O225J0370r251o331O738n26j512O150l626q003O248L972n520L621
1635A474K393j0471J478J2899m220r578N892J970n370N792L396r227k12O572k519
1650B69N89M306q310l727J1532J019r674L227L284o837L046Q072o792n868N872
1665HN99j706M627l866o148O882M666p127J192M687p182o87J0550k590r110L709
1681a496L747l058K553J277o337Q22O118l658q59M134n539l280R061J746r165
1696c934J283M829l867M82N029m426l591M958M61j789K827k280m832O032M466
$$ y = [5733, 3312, -5859, -1719, 1672, -1861, 3407, 4169, -7447, -5442, 7321, 2248, -5100, 1771, 97, -6358, 2505, 7268, -3395, -4484, 1909, -980, 1313, 6112, -3211, -6812, 4322, 4275, -3234, 2220, 2464, -7081, -856, 9514, 263, -6068, 670, 144, -1368, 4782, 1156, -6847, -599, 3373, -2147, 1474, 3867, -6604, -5126, 7773, 3553, -6025, -133, 1837, -3533, 2259, 5655, -3572, -3784, 2788, 269, 858, 5164, -3146, -6873, 4659, 5678, -3996, -769, 2515, -4322, -1276, 6796, 4, -5864, 8, 607, -1099, 3528, -338, -6486, 396, 5062, -2065, -873, 3814, -3368, -4055, 6495, 3905, -5205, -1496, 2251, -807, 1746, 3023, -3314, -2492, 3626, -32, -891, 3243, -2296, -5576, 3485, 5231, -3934, -2651, 2178, -1689, -1207, 3822, -604, -4195, 763, 1224, -565, 2262, -18, -4850, 1182, 5648]
1711E648p352r14N435l443k217O401o77o243J767L474j908J063jm508K410M438
1727C373l893j902M263k268l535N880K253o720m44N081j767j157K477k250j084
1742a693K910l21j645K717j322l788L787L336m986j740M501q81k580K353P27k912
1758a537N61J394o97P63j32k808J797L245l043k323L956J78l553K175K614l000
1774d10j265K388K89o59j73p76L41J866j648j103K277k42k773J632K466k500k097
1791b387K734P90j886J72N35j37J75j98l39J167j19j991J085K275j563k088K060
1808B85J492j929m33J658n50r34K3O24O94r20r19O15J698j669j602K428M69k245
1826a215l16K594o34j884N27J684j77j288K3R53O01j408m0J428J77j838L10J649
$$ y = [5648, -1704, -2618, 2817, -626, -2843, 3558, 2881, -3362, -1595, 1879, -29, 1034, 1033, -3475, -1065, 3373, -520, -2422, 1841, -427, -3962, 1918, 4171, -2549, -2993, 2088, 321, -836, 1641, -609, -1693, 1217, 896, -749, 1968, 646, -3142, 645, 3981, -1005, -2745, 1756, 875, -1705, 648, 1375, -1537, -976, 418, -279, 484, 352, -2456, -659, 2586, -457, -2780, 1176, 1354, -2199, -24, 2590, -410, -1675, 713, 1002, 343, 170, -606, -265, 1601, -47, -1150, 1127, 885, -1888, -256, 2210, -290, -2387, 347, 1137, -749, -577, -42, -179, -4, -202, -541, 626, 507, -1484, -399, 1876, 313, -1775, 285, 1777, -152, -585, 1073, 523, -411, -388, 236, 930, 10, -909, -294, 1404, -265, -1867, 561, 1030, -1215, -1531, 1063, 429, -1455, -928, 756, 579, -709, -686, 267, 868, -540, -580, 848, 1025, -813, -503, 1146]
1844A146l34j539M92J500q40j293O36R73n18j211L44J363o85j201O86J426j107
1861a62j295R83J518o36j494J065J075j048j042J217R40r20j021J517N72j079
1877A90j117J000J127j257q17J068P10j574m59J476O85j874m20J066J023j739
1893i12l40J627M58j445n14J769M03j715j10J620j71j427N58J377n58j020o5J182
1911G17K30j418n12J908k4j926L23J924q07j921J239J482j265q99K19Q21j01l76
1929c86j39R59q1j276L11K471j298j977J479J892k223m23J750l22j618N20J142
1946G81l59k01r13l9J754k08k588J522J849k750o26K871l60k371Q86J720r18o45
1964e95N58m08Q97O34k143O19K011j778j244L420m21l691J361L083k221j496J943
$$ y = [1146, 812, -727, -235, 1265, 425, -868, -232, 741, 223, -988, -644, 719, 34, -1167, -481, 945, -162, -1457, -474, 1044, 408, -1086, -21, 1054, 6, -1036, 181, 1121, 201, -820, 697, 1269, 190, -927, 73, 1200, -57, -874, 194, 904, -670, -1129, 347, 1032, -842, -1262, -196, 827, -912, -1252, 375, 833, -612, -1126, 643, 1046, -669, -779, 841, 670, -757, -199, 1178, 620, -400, -465, 717, 947, -471, -983, 925, 901, -1025, -702, 1222, 415, -1506, -267, 1215, -50, -949, -730, 91, -10, -386, -525, 434, 353, -923, -612, 1859, 561, -1416, 63, 1955, -268, -691, 1059, 737, -881, -361, 781, 422, 221, -692, -731, 1023, 815, -1773, -251, 1598, -1152, -1778, 1093, 733, -1638, -752, 968, 50, -595, -37, -445, 452, 1086, -1057, -438, 1573, -205, -1449, 1971, 1550, -2141, -780, 2303, 82, -1414, 529]
1981E29o38n33J468o16r90J038l39j610L248L49m279O56L864j779k002K802l38
1998H30k682K113J708j956m02M14j214K126J848m008j154M168q67k880L380J51
2014A575m350R57M435k333j793J393j084J43L071j563k739K650J26k325L125J824
2030C112n625o29O073j077l676K429q6k402K938J314l788L69J695j839J560L277
2046C645m951k924N995O33m385K034J584m529J821M404k758k737K341q83K03M088
2062C581k661n033M453K553l984J635K600n463q85O770o29n293K068K55j523L645
2078B089N10n528J126L607k912P31M022n063l498O653K166n626L38K237l090J874
2094c64M093l549k795L271o19n34M541l084n877M700M537m932p84L482l801j136
$$ y = [529, -109, -642, 826, 210, -780, 258, -81, -1691, 1557, 1906, -2373, -1717, 2147, 368, -1634, 1168, 830, -1852, 261, 1969, 13, -389, 25, -1189, 937, 2785, -1223, -2377, 1791, 924, -1956, 1424, 1575, -2775, -1818, 2617, 284, -1509, -116, -1200, -1057, 2014, 451, -2288, 362, 488, -1837, 1288, 3112, -2513, -3142, 2931, 1854, -1822, 607, 521, -1881, 1057, 2371, -1417, -1048, 647, -1192, 368, 3645, -1306, -4230, 1765, 2398, -1987, 47, 1631, -2898, -1077, 3327, 569, -2168, 173, -710, -507, 3581, 920, -4113, 340, 2893, -1091, 544, 3144, -2319, -3204, 3566, 2937, -2356, -288, -33, -1556, 2089, 2599, -2929, -1803, 1804, -1108, -377, 3645, -1418, -4916, 1737, 3903, -1723, -1385, 852, -2238, -364, 3729, 180, -2615, 656, 37, -497, 4044, 960, -4917, -217, 4320, -612, -1396, 2086, -1715, -2851]
2110b851N941m56n548J931J030j386L508J86n998J084N698k959j482M089l434
2125f47l811O439K639o289j34K856k006J497L050m701k177M949o34k150L670j354
2141A197o016M247N376n151k380L537j637j233N012j411m559K150J826j789K645
2156A814L87n923J327O441k781l457L296q42l357M490K437n440p02L065j097J196
2172H54J842m417j534N067j04l612K791m0m533K918M685m177k803L149j83o37
2188g34K550j258l199K423J865k529J962J237m971N20N907j882m411K671P65k315
2204a399K299J032l312j59K164r97O06J503l258j366N031n2l954J688J607l227
2220a794J086L665k787k390K492L05o32J568j469k091K714J431k890P48K018l420
$$ y = [-2851, 3090, 2634, -2914, -983, 47, -1339, 2169, 2355, -3643, -2559, 3139, 180, -1302, 2787, -647, -4458, 1981, 4620, -1669, -1803, 1053, -953, 544, 3594, -1107, -3284, 1665, 1031, -1119, 2551, 1197, -4819, -572, 4804, -347, -2727, 810, -827, -2060, 2952, 1541, -3018, -868, 958, -831, 1814, 2201, -3722, -2395, 4046, 1265, -2192, 1104, 262, -3095, 1395, 3832, -1608, -2310, 755, -342, 854, 2696, -1721, -3255, 1812, 1708, -1904, 887, 847, -3686, -768, 3917, -260, -3063, 86, -97, -734, 1816, 558, -2641, -218, 1647, -882, 1080, 2317, -2654, -2134, 3773, 1891, -2520, 151, 916, -1399, 900, 1932, -1380, -1539, 625, -372, 234, 1737, -1521, -2887, 2144, 2092, -1862, -174, 1433, -1794, -708, 2957, 170, -2220, 272, 577, -55, 1513, 44, -2047, 667, 2098, -792, -44, 1974, -1446]
2236a446j45L893q32l776J716J365j209N86L74j655L00J836j518L55J400k332
2252a088q20L600J60l379R52J936j616l17K043j095j426J183J74j80Q66j390j248
2269a645K528O72k414K06J890j639q78K051K66k347N60J177k36m97K5n14Q92Q98
2287I95j424m9J619r17j421J884O69j974j82J734n14p66L76K59k54N8n02L54P74
2306G19j029j208J616R60j599n51J675r7j230N98P02n58n89M27N95mq26j32Q72
2325C41P57j443j91J247j85j298N33J071q58r57P86O12n70m76L70L30L69r37L42
2344a57O04n71p57R12R51r77p82P22N07n08j36L83K18m91l63L67R30p75q18Q24
2364H3O55r83l80J050L56j348k14R76J03o61j37P20R5o45m66J110Q2r12N8J020
$$ y = [-1446, -1591, 2302, 1470, -2306, -590, 775, -434, 152, 526, -1129, -829, 1007, -511, -156, 1244, -1088, -1908, 1692, 1852, -1527, -575, 1361, -255, -572, 1471, 376, -1050, 133, 307, 127, 993, -397, -1645, 883, 1555, -859, -653, 1237, -402, -1280, 771, 1037, -1310, -750, 427, 191, -306, -281, -795, 97, 995, -429, -478, 1141, 224, -1197, 687, 1356, -618, -800, 934, 420, -346, 30, 289, 35, 93, -409, -55, 719, -310, -1518, 98, 1058, -541, -1092, 583, 486, -744, -146, 556, -2, -591, -164, 431, 427, -399, -531, 341, 1098, -345, -536, 711, 526, -772, -239, 832, -26, -983, -197, 415, -155, -631, -261, 69, 438, -499, -157, 447, -124, -881, 31, 982, 5, -777, -55, 452, -56, -192, 191, 409, -82, -445, -78, 852, 77, -741, 83, 738, -245, -625, 425, 781, -567, -781, 195, 298, -363, -500, 220, 315, -330, -796, 314, 396, -516, -458, 562]
2384E62Rj035J24P70K59j197K36J084n30q85oR83lq99K37P75k82q77K53J024m83
2405A19r45N36P46m59m94L53M54j46p64N72P95n82o96M33J225p73r81O40P47o99
2425H1m48R26J47j198m8P83J5k80o00N81P17o24r42R38Q21j353o00J331L46j143
2445e50J96O44M0l00j78L88J80k98o62Q81M91q38r06J388M74j681O27J069q62
2464A03r82J060L09m37k97q8JQ37m67q51J043M06j696P16J422j041j144J445N85
2483I24j370K09N93k88n5N25q06M06L36j181J76K102j140k159J640J219j736j35
2501g40J494r60q19J449j93n10J54l41j40J544K9k471J499J719k330J19K064j371
2519A96j918K014J403k062J8M82p97J261M92j721k21J322j154m52K467n64k991
$$ y = [562, 571, -464, -340, 430, 689, -508, -272, 812, 282, -603, -609, 374, 371, -528, -291, 484, 202, -675, -422, 602, 119, -826, -290, 456, -3, -497, -144, 310, 164, -600, -28, 767, 185, -511, -78, 1147, 374, -607, 33, 780, 81, -367, 559, 706, -492, -540, 243, 258, -22, -622, -41, 676, 52, -890, 48, 869, -484, -1084, 247, 593, -550, -354, 290, 330, 30, -148, 240, 420, 122, -540, 341, 832, -6, -912, 476, 950, -731, -104, 965, 103, -879, 181, 490, 53, -244, -332, -331, 506, 39, -812, 231, 637, -1059, -343, 1079, 38, -1106, 339, 924, -446, -237, 356, 68, 13, 538, -268, 138, 474, -707, -531, 1571, 431, -1728, -88, 1131, -605, -740, 754, -206, -1025, 424, 231, -279, -125, -466, -606, 938, 967, -1504, -5, 1714, -616, -497, 1567, 196, -1722, 292, 1695, -367, -349, 133, -664, 597, 1089, -632, -853, 469, -685, -1137, 1330, 766, -2225]
2536b225J539K600j801j076J325j077N1K044q11j487J385p24q46K761j08l455
2552a905J003L075j575j619K093o37k141K391J016k258r4P56j149J400J645l234
2568a233p90L411r19j881K827k62l402J292L139j718j624J350j047N49K261j481
2584D72k232K287J07j626K169K81l449L59M098j662k261J679l97j247K419M19
2600A416k703L55J135j416J851J598l504j297M189j95k459J679L05l058J938K723
2616B557k301j652J591p30L03K553j963k711K671J011k294J075J290l503J84M164
2632B245j042k483R90k6o62K279j2l030R08J876j698O86K104l131j452M332K73
2649B157l181P68J175k088J256K063k398j311J867o25l2K355k172l033L414J782
$$ y = [-2225, -686, 1914, 113, -963, 362, -715, -664, 1380, 569, -918, 467, -257, -1103, 1658, 1550, -1905, -902, 2173, 598, -1021, 1072, 435, -1706, 685, 1701, -557, -651, 105, -1044, 356, 2001, -1233, -2023, 1388, 469, -1412, 1415, 1153, -2249, -957, 2182, 464, -1160, 190, -857, -308, 1953, 472, -1760, 527, 634, -992, 1177, 1458, -1991, -1632, 2466, 804, -1457, 222, -175, -1422, 997, 1416, -1287, -932, 203, -1213, 638, 2236, -1268, -2565, 1624, 1429, -1030, 649, 954, -2104, -166, 2557, 256, -1396, 195, -535, -232, 2321, 358, -2353, 318, 1329, -965, 110, 1400, -2103, -1919, 2245, 1203, -1280, -290, -316, -978, 1301, 1289, -1741, -833, 1043, -655, 31, 2135, -996, -2448, 1884, 2157, -1024, -256, 919, -1169, 87, 2150, -248, -1559, 308, -317, -349, 2006, -166, -3199, 215, 1997]
2665A997k903N06J603k520j34L817j203k842J295L15k27J774m00l199J689K259
2681A827j923j94K005j916k318L679J135l500j59J830q49O55J232k357q22K569
2697H94r52n38J964j175k685K897K149l061o71J624j103j27K134p26j858J398
2713A64L51q50J413o7l084J647K438k029j139K008p99j627K037Q91k479J98J249
2730C22o91P25M59j768k42K312p13j337J794o28j916J972J818k101j301J593O6
2747C64n46J147o59j334J235K11j004P21N83k187R37K219j096j975J523K70j157
2764g48Q87O51j389Q9R30m56J91K87j213p2K202q10j378J134N04j625O61J361
2782A206j193q92P91K55j1J81n79k56R30j22o98L12N87j205j00J629n62j123M31
$$ y = [1997, -906, -400, 1203, -1317, -1451, 2366, 1163, -1679, -384, -69, -296, 1478, 1078, -2121, -432, 1827, -96, -290, 1715, -201, -2519, 1160, 2295, -1205, -1364, 466, -383, 272, 1504, -853, -1675, 894, -58, -596, 1368, 193, -2492, 405, 2554, -507, -1178, 446, -657, -784, 1350, 624, -1234, 164, 515, -335, 1078, 1011, -2073, -426, 2012, -17, -1156, 852, 53, -1574, 463, 1354, -1125, -927, 322, -369, 356, 815, -953, -1195, 1117, 404, -933, 861, 233, -1683, 289, 2107, 6, -1295, 298, 364, -182, 965, 306, -1028, 207, 418, -586, 135, 718, -1469, -532, 1687, 591, -1384, 139, 409, -748, 139, 790, -599, -510, 420, -36, 155, 442, -771, -843, 1359, 549, -829, 305, 809, -816, -155, 1206, 13, -879, -88, 167, 156, 337, -242, -498, 432, 310, -388, -76, 511, -694, -794, 835, 273, -850, -419]
2801d19P44n88L75O2j58J57J59n54M49M52j025m3J259k77j541Q05P77q74m01Q06
2821A65k52k48M2L70K32j53p21K37Q48l54q50P39K57k85o82Q65L26p29J42M85
2841D34j83k96k07R1N09k42k07J49L88n08n27P68M20j050J16M36M23o40Q0J55
2861A09M2n24r3P72r8m06l38O89M58p60K1N02n8n44J43O74k77o54K4O03j34l84
2883b33R9M71k75n74K27P44l06p04K81M00j09n59K97M38m00j94K28N12m03m38
2903d98O38L20n42l06N24M57p63j39O63M8n29l56P82j07l58m1J94L24o20J83K44
2924A18K11m99l32N63J1m75j30J024l00m27L8P06j86l40j98K69K34m58k96Q68
2944D01q1q56J11Q87j13q49M91K69l65l7J55J51K0n88Q9P76j15q79K14P10k79
$$ y = [-419, 325, -263, 112, 174, 16, 173, 332, -222, 227, 679, -346, -389, 870, 593, -948, -143, 634, -240, -641, 165, -87, -335, -293, 77, 309, 156, -565, -328, 520, 166, -684, 55, 312, 27, -655, 210, 536, -193, -51, 434, 251, -45, -252, -161, 348, 106, -101, 48, 436, -72, -599, 169, 589, -461, -345, 91, 514, -126, -46, 109, 151, -373, -466, 306, 208, -198, -536, 153, 611, -149, -128, 374, 316, -228, -85, 589, 312, -342, -318, 285, 151, -233, -134, 337, 62, -512, -285, 459, 153, -551, -270, 130, 21, -538, -241, 197, -203, -397, -169, 343, -60, -498, 140, 460, -82, -388, 136, 593, -170, -309, 354, 402, -127, -483, 299, 192, -166, -207, -13, 311, -309, -126, 118, 329, -170, -502, 61, 72, -403, -533, 491, 191, -236, -198, 508, 322, -18, -216, 53, 287, -171, -467, 401, 320, -536, -425, 462, 349, -500, -9, 260, -105, -142, 13, 164, 184, -404, -315, 461, 346, -533, -319, 391, 112]
2965A12p17Q73K93p89p0P30L5o24q3K07M20N7o36m6O70j10p70R30J73j031l19
2986f95J113l22l23K34o1l5J61J20l03N45l90n54P26O21j101m95J167J4r03Q76
3006C95J27p40M4N18k76r5N8r12Q90P90j245n15J373Q6j171Q12P92j521k32J168
3026C46l2o04K97k21L5Q98k43r37O31L85j315Q91R43j335j035J833J2q40J89L05
3046B03o41O10L45r00J14M49p16L80J484j212j682J644R13j706N98P81j197m25
3064i58J761l24r66M79j62l30J886p71j757R69J061j431N02J230j583j033J803
3081C76P51j765L17K60q78J154R65j707j39J247j149M2J815j058k095J715J741
3098A592j730k04Q67j054Q9J607o93j218Q73n21k20J735l75k409J122J943j538
$$ y = [112, -605, 268, 561, -228, -298, 432, 467, -157, -240, -33, 387, 444, -192, -238, 432, 322, -448, 482, 655, -376, -695, 418, 96, -227, 7, -54, -89, 72, 192, -111, 434, 44, -510, 216, 837, -264, -759, 408, 422, -481, 395, 522, -218, -174, 344, 68, -27, 31, -881, 9, 799, -446, -961, 412, 498, -673, 139, 931, -590, -822, 346, 314, -290, 7, -214, -179, 719, 476, -461, 170, 555, -760, 131, 1074, -261, -1296, 537, 549, -291, -102, 203, -438, 172, 517, -383, -269, 180, -536, -156, 1328, 116, -1566, 78, 991, -715, -117, 664, -533, -958, 803, 479, -487, -8, -170, -500, 1386, 615, -1142, -173, 888, -543, -41, 1189, -394, -1427, 376, 1127, -638, -321, -61, -939, 215, 1180, -527, -666, 581, -568, -526, 1289, 231, -1864, -149, 1592, -138, -342, 525, -529, -440, 1167, 474, -744, 129, -392, -612, 1123, 748, -1661, -539, 1404, -134]
3115a34n21J147j132p60J887M33j558L69K16o85J513N62k167m81K401n88j123
3132f21J707p19j894J513J497j620o78R18p52P02J321j392j168J452k49r49J964
3149A032m04k244N70K586j262j061J030n90o74K014P4j804O53K74p36J080R85
3166A523k523l04K371m87j614J494k34j420J152J212j494m29O13n14O46J230j498
3183b76j191J670J50j119R21O09k048M23K352r87j491J127l54j35J250k35j595
3200i29Q08O86j003Q38P19k073l55K204K50j966P42K76q06O10J229j654n14J251
3218C13o43M18P52j382p84J653N80j386L81Q44j392J40J611n90j264P17K24n46
3236c54J067n27j286R48Q37r99p7J025r13r00J815J35j440K65O92m25J12M92r24
$$ y = [-134, -655, 492, -640, -1400, 487, 920, -638, -269, -53, -738, 775, 1337, -830, -1311, 1090, 502, -621, 1086, 367, -1527, -14, 1483, -137, -815, 103, -649, 53, 1374, -18, -1186, 266, 17, -932, 1032, 628, -1616, -1046, 1540, 278, -783, 247, -343, -1017, 997, 1071, -733, -80, 194, -542, 538, 1523, -1000, -1304, 1067, 580, -1034, 460, 226, -1194, -42, 1170, -324, -753, -140, -654, -8, 1222, -276, -1467, 203, 353, -766, 155, 764, -1284, -861, 1491, 504, -987, 140, -214, -349, 901, 666, -929, -121, 565, -438, 400, 1119, -954, -1309, 895, 1145, -821, -79, 197, -609, 1, 1230, -424, -938, 313, -330, 88, 840, -542, -1326, 327, 907, -479, -98, 746, -646, -506, 1105, 515, -749, -32, 192, -354, 713, 186, -1100, -152, 685, -314, -391, 634, -279, -1179, 636, 771, -669, -404, 288, -137, -25, 467, -457]
3255d57L81N19k89m81J243o75j570J938L36j645K52R11o17l71Q92j87o59N10q9
3274e8l78Q75l92j079J005J011j243m58J207m98o65J077J80q30R3N51m03M16j13
3293B98p44K79R50p42j46Q12l73r89Q87N43r99m38Q63k1k25L07m49o6L18m01J84
3314a52K84N8o04M57P97r45n22R19j77m21L27K15j33j68l8L69K51m44l78J50O09
3335D54j56n88M22M87r42J30P40m06m93N50R2j88l25OL96kj33k44M26rm91J58
3357a16O34l99m84M06O12o39k63L54l4R5j3k75R9J77n77J46M42l95j61J97M64
3378B70l43k84K64L35k70j85J44L40j75o10P57J7k2n05L78M33l41m16N17mm52
3399a52k76N54O2k19l70M90K8l68n1L95p2j65j06M14J76m41J3K62o8o85N40J90
$$ y = [-457, -76, 443, 154, -327, 916, 241, -1329, 609, 945, -700, -448, 463, -154, -525, 367, 180, -479, 31, -58, -436, 439, 47, -1032, -27, 984, -259, -717, 490, -8, -673, 404, 584, -246, -153, 398, -5, 411, 298, -446, -167, 783, 41, -105, 707, 334, -655, 232, 775, -224, -662, 201, 180, -45, 262, -187, -253, 65, -336, -152, 132, 190, -414, 43, 840, -105, -627, 292, 115, -306, 21, 236, 103, -65, -103, 266, 517, 73, -305, -155, 454, 298, -290, 132, 619, -323, -193, 547, 141, -352, 198, 290, 102, -223, -217, 179, 177, 44, -200, 226, 217, -274, -116, 518, 119, -365, 41, 653, 14, -249, 105, 71, 166, 153, -122, -23, 154, -423, -277, 165, -230, -391, -194, 270, -73, -357, -93, 242, -28, -213, -69, 271, 96, -514, 243, 260, 238, -267, 111, 544, 203, -213, 304, 300, -152, -428, 126, 188, -31, -401, 89, 117, -251, -302, 93, 21, -144, -250, 164, 340, -101, -88, 174, 106, -579, -39, 151]
3421A51J03j25j70j0L05j92l11O20m71n25K91O94J67p46Q9K53q8k08J41K1R4m45
3443c62J29L16K03m37K26K43j59o81M97M73m83k65M91Mqj51j6J79l54j45M66J34
3465C00l78m64O45K88o40n0N24R7n97K56K49r3l03j71M14J23j47k74L64K89o38
3486b06l7Q41k20n57J04M61k47j75J74l88K17l1j62K76J10n32P2R93k90p89J31
3507b55N95l78j19M12l0m98J99J43l47M50j7o07O96J14n91N3Q19o42k85O75Qj014
3529f19N29K88L6k86j5l71M41K44l69n08J077n17m20J011o2j085L40R16m80m24
3549b74J09J13J14J77l24j72L87k04l39J027K15j141n27J381l36p31N92J20p19
3568e32M03M50l61k72N05o11M28R77j145m19J008k16n09P69J39j123o1J204m06
$$ y = [151, 254, 129, -41, -51, 254, 62, -249, 371, -100, -625, -334, 360, 527, -219, -130, 123, 35, -173, -32, -11, 83, -362, -233, 83, 286, -151, 75, 318, 159, -522, -25, 448, -35, -300, 191, 195, 187, 36, 20, 199, -155, -300, 166, 300, -78, -542, 103, 391, -249, -299, 225, 322, -275, -19, 230, 137, -166, -337, 77, 200, 53, -221, 143, 432, -206, -243, 598, 378, -179, -75, 386, 139, -36, 138, -250, -33, -64, -226, 50, 160, -372, -300, 693, 403, -386, -255, 340, -38, -157, 255, 225, -273, -74, 69, -278, 172, 155, -452, 244, 358, -233, -180, 639, -3, -288, 387, 395, -619, -90, 198, 234, -52, -67, -438, 3, 247, -122, -630, 447, -70, -490, 521, 459, -626, -286, 630, 150, -274, -165, -52, 62, 239, -85, -257, 130, -74, -413, 614, 829, -312, -839, 542, 206, -525, 67, 187, -532, -129, 321, -40, -312, 193, -418, 10, 987, -158, -577, 431, 215, -294, 475, 614, -509, -570, 634, 228]
3587B28k06K02k68l16R05l82p13L23L58o74M47Q82j233l66J071K26j009P09j39
3606D5n40M71O46r00K24K36o62M34R49j117o48J263K05j036M16O68j154j55J577
3625I22m22r18L07k44NR99j07j414P12O70j090L89J104j263m89J407K89r58J76
3644G5j46m67P37M61j245J37R38p12J09J480j389j118J444M66j095M8M38m94j33
3663d66J114q09n13N55l12K6J286n07j543Q33J077j024J54Q96p99o95J354L2q78
3682b19M8O3k50R44K05j365K67R55r47k16J263o38j085J084R08j193M0M1p4J54
3702a5R01j110o12J215m21l17J140l45j643J008R71p85o08J000l99m69J058k28
3720C41r29N67K88m42N87K68j242j23J367m63p65R33k80p18O95Q41j232j24O52
$$ y = [228, 22, 224, -44, -360, 545, 163, -550, -227, 131, -543, -96, 786, -447, -813, 258, 484, -525, 184, 45, -495, -24, 622, -278, -54, 182, -480, -46, 903, -214, -862, 401, 606, -430, -14, 654, -500, -655, 922, 500, -418, -111, -355, -350, 649, 542, -872, -160, 510, -580, -191, 913, -350, -839, 568, 857, -101, 75, -71, -538, 199, 660, -585, -448, 490, -222, -113, 1367, -22, -1140, 304, 770, -325, -277, 161, -333, -466, 648, -161, -674, -119, -431, -405, 881, 374, -1169, -336, 741, -283, -129, 767, -32, -727, 627, 659, -219, -171, -108, -358, 586, 791, -574, -307, 648, -299, -515, 748, 110, -975, 109, 1017, -176, -136, -95, -169, -15, 886, -224, -836, 379, -42, -359, 781, 436, -1207, -199, 772, -13, -621, 379, -20, -489, 569, 341, -588, -21, 267, -175, 412, 680, -562, -685, 682, 219, -546, 387, 107, -611, 84, 925, -307, -431, 221]
3739B21l42M06K31q18k82J184k58r40R60J19j085K96R97l89n97L68k0j90M29j28
3759A62o58M92J46n95N73K98j011N5J071p9j019N47K84n26L86L50m18l03K52k50
3779b43M88J98o80k28R60p6q25L41M74q61K57P77m87m59J47K18r5J91l45j32N54
3800A74R1n14N07L7o40K60M06O6o50j37O98j81q9K31m88K27O8j91J68L25l83m13
3822d28Q70j05m48n9R5L32m38L36J84n85L6M29l54O37n34k40M99O2o67M8P06m24
3844d8l56N71j14k04k82N43j86j40J25O9Q5K7m69L34N43n74k67K86N8qk48N63
3866C08n7m43j13K62Q2q7Jp7L79k47j43K31K93n62j36L40P8k53m5J67K13j40n5
3889dKJ29k69k84O90Rl24J3J29P1l07J12L50m3n05K9K77k5j65K11j21J29K5k12
$$ y = [221, -121, 285, 516, -302, -584, 600, 342, -598, 362, 481, -604, -308, 689, 300, -297, 71, 51, -139, 290, 162, -496, -4, 142, -453, 120, 418, -593, -538, 533, 454, -565, -18, 266, -260, 126, 476, 58, -245, 7, -243, 245, 443, -237, -465, 495, 419, -406, -65, 409, -452, -195, 582, 95, -364, -217, 1, -94, 97, -248, -380, 174, 265, -249, 258, 295, -345, -85, 321, 387, -263, -400, 298, 117, 28, 259, -229, -2, 66, -125, 43, 368, -15, -428, 442, 337, -111, -170, -75, 257, -181, 155, 339, -246, -210, 219, -135, 502, -32, -272, 227, 289, -378, -330, 376, -48, -404, 167, 53, -151, -433, 110, -76, -216, -91, -22, 63, 90, -379, -45, 498, -76, -343, -57, 1, -7, -255, 308, 251, -192, -305, -43, 39, -48, -47, -124, 255, 8, -135, 96, 389, -173, -309, 31, 109, -144, -189, -22, 191, 51, -4, -2, 127, -142, -426, 264, 273, -51, -38, 91, 162, -145, -33, 317, 274, -231, -202, 75, 50, -115, 96, -25, 104, 129, -83]
3913h3K00k48L7R3L40l16l73M35Nj39q1K59j22l36J65K40J1j1k79J73J47k98j50
3936c31M82j04j4l53O41o0l47k5J35M22l86o5k07K23k61K58M7K04m24j1J60L2
3958A6m2k05M55k46J92p5o4L15l62k33L10l8j71k3K51L0l09L3L76j68m97N04J93
3981B42p7k42k3Q8pj34o3N48n09j45L72L58m61k72M89J62m99K0QJ87R3Kj54K16
4005A99j89j90Q8N96o59K6K36N8l89p4L78j40k14J37Q4j9k55M3J53O47o08j57
4027b49O42k35k70Q3L58l50l12N76j40m16J57L99k56K99N3p17J74N48p92J62O47
4048C61l19l4o3L58m76J09J8k6M7K63m07Q0L37o18L33N26k18o20M83L95n29j22
4070a22M24k52m57P01k3l27L55l88q4P21l20q38M24M68n40J16N05l87o61O90N00
$$ y = [-83, 117, -131, -94, -1, 339, 23, -350, 85, 90, -49, -130, 129, 7, -329, -164, 76, 87, 76, -203, -30, 117, -181, -331, 151, 47, 33, -320, 321, 261, -86, -111, 24, 446, 60, -5, -212, 11, -250, 8, 55, 259, -165, -176, -16, 16, -26, -231, 224, -22, 170, 95, 31, 346, -16, -249, 61, 23, -148, -171, 80, 110, -199, -166, 210, 42, -455, 49, 242, 165, -77, -100, -12, -19, -153, -216, 332, -177, -322, 50, 408, -53, -325, 164, 326, -173, -153, -145, 42, 135, 137, -17, 199, 10, -180, -92, 504, -155, -129, 107, 165, -224, -298, 80, -60, -274, -137, -53, -72, -327, -284, -131, 516, -92, -249, 393, 158, -112, -29, 329, -21, -333, 243, 103, -313, -156, 243, -13, 286, 339, -378, -204, 344, -448, -286, 361, 42, 8, -55, 303, -173, -64, -46, -72, -25, 238, -169, -89, 248, -370, -37, 489, 271, -349, 134, 529, 0, -122, 302, 50, -407, 294, 271, -56, 299, -89, -173, 548, 228, -610, -186, 282, -258, -142, 363, -24, -685, 5, 505]
4091E05m97L52n07r5P09oo56Q1L93k97k1O48k92r76K83J096o18m83O81m80k45
4112d25N76p2k17K09r0k28N54L14j350L84P31k38m98M35j5o06N77M99m11j18p1
4133f0m21P35K03r29Q8Q73j76q72R76m6j141J91J195m89m31L24m91Q9R23l16q77
4154f52O97J38l29L90M67j296LJ389n45n24N79k22m16N73K14p66K01K71o32P53
4174B93J42p96l97J164qq25M29J98n61L66N54l23l21On6j10Q53m84q84R32L9m13
4196b02L58M17j069p8J242j29p08J74k16j15Q09j49q28N61K95q70O51L41q87l34
4216g37Q63N76r69o5K68l13M85M25m82k79K14p8Q2M90o75n15J054J72q40K21M64
4237C61o31m1Q08m23o00M51k52L49K25j67n01K25M75l06R7L35l05p94J113J33
$$ y = [505, 8, 360, -147, -242, 467, 461, -195, -114, 279, -18, -39, 609, 317, -659, -376, 720, 102, -381, 300, -180, -425, 151, 79, -138, 71, -19, -247, 307, 621, -729, -345, 386, 148, -350, 85, 70, -536, 41, 540, 129, 11, -60, -481, 254, 457, -472, -384, 489, 313, -559, 417, 371, -770, -579, 616, 127, -304, 20, -471, -382, 541, 225, -652, 45, 183, -146, 244, 711, -585, -582, 807, 262, -262, 317, 95, -321, 252, 466, -300, -99, 172, -460, 293, 435, -361, -758, 406, 398, -427, 2, 200, -361, 5, 559, 236, -85, -79, -135, -245, 608, 124, -760, 172, 211, -202, 156, 573, -496, -574, 668, 539, -169, 5, -211, -326, 483, 334, -494, 67, 362, -508, 143, 484, -403, -737, 126, 702, -267, -332, -64, -377, 108, 533, 51, -228, -14, -92, -10, 480, -195, -710, 344, 516, -324, -103, 361, -270, -311, 497, 74, -526, -75, -327, 22, 247, 80, -421, -196, 279, -27, 70, 405, 100, -694, 419, 552]
4257E52r24J27L69l66N23K4m63m6O07n78k12N70m5m54L71O63p48Q1o0q8mL03Q4
4280B86m50o4K26q9N70k84o28N17L61m10m02O75k98n16O49L35n79K04k77k5N38
4301C39j9l47j16M41m40R8L70j61n34K95M99n27l12O41l43R7J10J1l28M13oj74
4323GJ78N9m5n07R43l02n96M81m2m24o6N55j90l18K82k26M28k89q1J02K22O0m57
4346b26J74M12n77J9M61k32j19P0K11n7j06j59N8L31k23l07L02J17k39J5L78l26
4368b3r9M08j87j10M5n7p2K89j73l69N12%l41q7M27l1m67K23L17k71j35L69R3
4391B61k67k7m9K59P5m25J95O2Jl08K39J88j5m03K7L81m15J09J86J98l51N3J83
4414A57Lj25j92M2mM3O9R5K4m19M30L8O5j94m10M33j04l8j59K01L34l62r5MJ88
$$ y = [552, -372, -245, 124, -242, 281, 305, -158, -204, 403, -175, -387, 183, 138, -316, 55, 718, -30, 51, -9, -97, -101, 202, 286, -164, -228, -2, -91, 479, 195, -433, 84, 445, 35, -367, 308, 10, -506, 143, 478, -101, 103, -174, -199, 339, 320, -27, -143, 298, -142, -44, 326, 165, -369, -74, 425, -102, -414, 227, -116, -19, 91, 102, -226, 187, 181, 7, 185, 244, 199, -308, 635, 333, -263, 218, 176, -248, -314, 241, 51, -267, 15, -211, 217, -72, -153, -51, 171, 231, -226, -52, 360, -217, -198, 263, 31, -88, -18, 193, 136, 30, -129, -71, 260, 37, -270, 32, 149, -90, -75, 303, -23, -122, 286, 99, -11, 34, -23, -95, 194, 21, -348, 164, 164, -177, -264, 163, 132, -335, -112, 205, -66, -201, 168, 261, -6, -33, -82, 177, 252, -173, 22, 84, 85, -223, 16, 204, 189, -214, -187, 194, -221, -112, 74, 272, -79, -26, 157, 160, 35, -157, -115, -119, -76, -7, 88, 112, -307, 123, 161, 226, 32, -378, 55, -49, -87, -246, -45, 289, -73, -168, -164, 24]
4439B4l80J44M96l29J46o8J29j5l16n7L78k55R6J24K07j88l08J86m9K49l17J32
4461B9P9P7m91K14J27L12m48mK87m6j49qK09l06J42r0L72j61l6k48O3j40J66J68
4485A18M7k32ro8J81o3j83J18L5K66n77L83M5k80L07j82L46k35k4K3M4k74l5L08
4509E9q7J11j69M30m30m5K46L40l15l38J94K55l41J66K08k81J8K08k66K18j70
4530A1j51R9J3J57k39K76q3k18j84L05J69o0mj48Q3Ml39L94J88l48l02L35M13
4553C71p46K59L19j40Q2Q4j86j46M6J52j18R5l8l65L88K36n69J20K34J31l45L16
4575A80j98j92L09l7j51L48k4m08k82Q32m61k50N72m04M8K08K06m00k4N37k71
4596A38m0%k52P9M90o36J53P5P3n10M48K21n00j75N86K52m04K34l02k58N59j40
$$ y = [24, -356, -212, 284, -45, 101, 33, 162, 147, -169, -226, 152, -103, -7, 117, 324, 136, -172, 14, -35, 214, -103, 29, 108, 185, -306, -92, 35, 347, -101, -105, 182, 136, -13, -21, 188, -118, 24, -66, 306, 145, 109, -139, -76, -216, -50, 118, 165, -67, -76, -144, 37, -26, -209, -91, -56, 210, -367, 16, 61, -219, 88, -94, 252, 17, -7, 16, 60, -214, -249, 59, -28, 83, -86, 344, -86, -131, 115, 455, 140, -198, -4, 251, -90, 76, 284, 3, 21, 229, -37, 181, 11, -140, -41, -28, 129, -110, 166, 83, -135, -319, -14, 155, 95, 91, -57, 26, 30, -309, 85, 273, -75, -377, -42, 371, -375, -116, 203, 63, 145, 229, 43, -103, -57, 95, -23, 72, 34, -331, 57, 293, -276, -156, 78, 209, -136, 180, -18, -210, 99, 62, -89, 259, 235, -173, -455, 377, -84, -334, 238, -166, -118, 90, 296, -104, -128, 409, 138, 98, 98, -154, -75, 415, -221, -68, 7, 80, -430, 18, 239, -261, -436, 150, 402, -2, 232, -70, -328, 231, 91]
4618I1j75p7M48m91K1N04k09o08P61N1p10O20K63r60Q4P37k46j95J05Mj47L02
4640A73J24o30M67K59l71m1M14m79k92L75L04m20J32m4j52R5K62m45q2O40l17
4661b8J22L88l75o88M55N08m80K01Q2j56j94L79P2k80k8J6J0M40m11o02L91N82
4683D04k94k34N90n84l83P92K0m38L68k03M2L3K95q13K02O55n64k83O63j71o42
4704e45L29N96m40k47M79n24L43L10l22k41L39L5l30O03L5q10J02P89j45o61M63
4725A58l38j96L12J95l91J48L2m8M58J55r44O2Q01k29l44O00k76m59N24L16k96
4746B40n65L75j6O1J46n32K73K39j81m35N00J76n67q4R49o96q9J48j63J60K09
4767A48l46j64L96p5N7J00J9l50k75P03m8l36M26M0m43N07k11k25N8P7k78L77
$$ y = [91, -84, -161, 287, -204, -183, 321, 112, -496, 265, 316, -394, 226, 489, -471, -387, 350, 104, -91, 14, 18, -129, 173, 297, -333, 134, 393, 22, -19, 395, -84, -376, -1, 303, -117, 15, -29, -181, -86, 176, -269, -351, 289, -28, 94, 482, 107, -581, -126, 382, -98, 103, 185, 29, -165, 214, 286, 6, -22, -6, 4, 444, 33, -569, -178, 404, 110, -124, 466, -118, -501, 291, 311, -127, 241, 38, 80, 113, 408, -405, -203, 452, -112, -395, 268, 97, -545, -216, 380, -60, -307, 172, -352, -9, 301, -21, -262, 77, 112, -218, 385, 420, -390, -288, 501, 356, -305, 158, -180, -376, -64, 131, -260, -112, -80, -128, 330, 485, -459, -397, 404, 175, -169, 431, 155, -304, 220, 536, 240, -325, 50, 34, 95, 241, -291, -18, 221, 40, -395, 105, 281, -286, -370, 579, -117, -206, -58, -221, -61, 148, -198, -362, 34, -41, 16, 116, 135, -215, -490, 213, 165, -171, 255, 295, -148, 359, 148, -77, -19, 58, -220, 157]
4789A57N2l87j90O01K8o33Q0L73l65J69K62l42k3N53j61j98K13l35K77r4K81o81
4811c63M64K95n11P4K32j55j18J95Q3l03L5J99j95o8L06k65J54N5j29j15K42j8
4833I4N3l27L59M8m04K72o8J07Lj81J79J23j55m20O83k15k37l9L28o7l88K90J11
4856A49k56J43o1N4r5%j72M6K15jo9J9J19m32J23L88j00P4P5k55j39L58l94O5
4880a46J71j46o9K99j93m09N60J20j88j5L3j37M1J48o1m0%j95L09L2m14P8Q4L47
4904B09n8k65M9J75l65K70L65k45j01k64L47j32q7k45O05j77k20n9K38j84J8K38
4926A12j45l3j27L61M0k56j89Q2Q3K06m0j6j08J26k46qK27p0P9k03N7k0M2L2J59
4951A45K26n53Q2J42p2l1L05j81RJ0L0K9l47l5J94K28q8k88L78K07k54k76j23
$$ y = [157, 209, -178, -368, 233, 261, -372, -292, 81, -284, -115, 147, -195, -218, 335, 174, -24, 189, -146, 131, 37, 318, -363, 101, 396, -115, -41, 191, 36, -82, 113, 196, -107, -72, 127, -68, -136, 170, -95, 59, 114, -15, -130, 112, 94, 147, -180, 179, 227, -177, 95, 27, 134, 137, -44, 135, 258, 103, -317, 366, 151, -86, -125, 203, 136, -252, 38, 149, -107, 36, -25, 29, -66, -66, -238, -192, 23, 22, -47, -28, 91, -341, -218, 170, 70, 144, 219, -36, -175, 183, -211, -146, 25, -121, -190, 109, -84, -493, 67, 187, -1, -16, 17, -120, -79, 69, 8, -32, -32, -227, 82, 114, -300, -222, -138, 209, 151, -114, -65, 110, -255, 15, 380, 135, 34, -230, 117, -15, -102, -347, 258, 81, -139, -198, 40, -144, -126, 112, -33, -66, -193, 168, 208, -48, -237, -155, -72, 134, 94, 78, -30, 96, -150, -158, 69, -1, 78, -125, -68, -88, -46, -14, 145, 371, -182, -100, 42, -30, -61, 244, 63, 72, 82, 112, 141, -206, -241, -47, 181, 93, -195, 183, 390, 136, -140, -263]
4974b63N31j90k19K34J28l65J13P6mm2p5J84k22l32N95J6k55j06O0K11r9K2L6
4997C4J15j09k46L67Lj34k83L04j22J95q6l2J05N8k47j17K83J69m17k0L60k27
5019d7j55N32k24m40n5M75J9j08j73J03L04l62L5J01J01k26j46R4K69l15K26P6
5041H4j8J07l7l2j67o5kpL44j81k58M24l3l61K84j7j23k34L11J52j55k51K15K51
5065B31k36J33nn4m5L0j29K98j01k92J14K17k81mL67j12m2j00j76J42K07k67L7
5088f8K36oj48r1J75R3k86N25n59LJ77j31K35j11j98j8K74J23m04J24J15l28J13
5111a55N21j35l17J4K35j50J32l11J42o4J15O1k76J60N2l18M18J9m76p2O85j75
5133A05m00O08j38n77M37J04n4J22q4j86n4N41m19o8J67p6l53L18L0j23m7M99
$$ y = [-263, 268, 78, -141, 93, 221, -144, -31, 45, 41, -1, -76, 108, -114, -446, 149, 165, -90, -196, -136, 75, -24, -2, 34, 149, 40, -206, 161, 164, 30, -253, 51, -71, 124, 38, 6, 111, 169, -78, -195, 88, 257, -160, -180, 180, -47, -202, 330, 106, -334, -389, 86, 105, -3, -176, -73, 231, -131, -96, 5, 106, -120, -266, -172, 97, -218, 8, 84, 66, 173, 136, 104, -63, -128, -130, -137, 207, 26, -232, 192, 159, -202, 82, 65, -58, -292, 19, 171, 16, -235, -20, 231, -5, 128, 123, 69, 24, 54, -75, 223, 122, -170, -56, 161, -120, -124, 243, 131, 89, -11, -187, -45, 162, -105, -68, 168, 162, 14, -77, 98, 191, -95, 430, -129, -126, 51, -80, 155, 44, -154, -172, 102, 225, -179, -55, 60, -268, -155, 366, 231, -86, -72, 163, 13, 145, -166, -24, -88, 27, 88, -188, -28, 24, -294, 124, 143, -333, -405, 280, 105, -295, 313, 175, -402, 35, 139, 85, 207, 123, -63, -117, 424, 5, -63, 104, 28, -325, -7, 23, -100, -147, 352]
5155C52k09m92L93k21K29K56j66k44K18l8k78L35M58q90K90K65Q6m01l7mk75N01
5177A28J50m18l8K82m65J43O09m38k09M38K63o58K95rLj50L36l7j68J11m12K81
5199C7L65j73n01L00J67k10K21J66m61l96O35k9k74O3p2J93K81j2m55PK77l67
5221b38J85M62m42m27N29K8L0l32J60r9R0K16k40j58J84n1n6L24n5k24L0J35j43
5244i2O9M92m10m53M15M3p9R7k79Q8L68j07m43K77Q9j36j82L03j39l41P63l8p4
5267B31k80K64k82j87M41j13k92J80j73r7N14q9m55R1M83m47J09K23j08j60N7
5288i0R4p4l4r7L6M07m2m18J12J94k5l73M73j78k37M29j28j00j04K13K0k34J84
5311B8r3k50M12j66j60M77j74l84J96M31l26O1j04K75k24K56Kk32n0j41K29j52
$$ y = [352, 143, -349, 44, -177, 52, 308, 142, -102, 116, 78, -200, 135, 593, -297, -7, 258, 344, -57, -94, -98, -373, 128, 278, -140, -178, 104, -361, -218, 391, -47, -256, 182, 445, -213, 82, 73, 76, -74, 262, 225, 57, 168, -244, 37, 402, 229, -272, 28, 195, -15, 206, 372, -89, -485, 150, 121, -153, -90, -162, 31, 312, 300, -155, -148, 129, -238, -53, 409, -33, -460, 69, 97, 127, -205, -45, -144, -54, 162, -78, -236, -52, -103, -159, 165, 110, -114, -84, 51, -92, -23, 469, 59, -394, 21, 64, -15, 82, -197, -109, 259, 152, -291, -14, 75, -61, -243, 60, -79, -420, 343, 305, 231, -49, 215, -67, -254, 187, 74, -218, -38, -211, -308, 206, 117, -338, -247, 236, -211, -102, 121, 13, -147, -90, 4, -70, -104, -201, -165, 242, 200, -218, -106, 88, 63, -310, 163, -15, -252, 177, 49, -51, -155, 58, 78, -156, 28, -65, -315, 97, -69, -229, 248, 74, -310, -114, 317, -9, 52, -52, 223, -1, 255, 257, 25, -25, -166, 63, -89]
5333h9L32k69O0K6J36j56m2j0N7M4k2o8P6j09J73q5R6m63J3L59K13k22Q7k74j86
5358c23J58O43m49KK8j37M54m74M2M3J43K7l89J05L65l72k66N21J20l12r3M25
5380B61k25J18p1Q3j63j9J49nj84J34l35K34J19k39R0n2J49l0p3m5P1j9o0J72
5404F0j35P9j80K38Rl81K98J38j84Q4J85j24j28J72l41L52j83p2n1L11Q7q5n1
5427I8j48J11o3J06K63k80j03J22j24K25j66k04J15j31J47q2K01j34j75K37oN4
5449F3j31KP6j3q7J6J40k11m6K98j84N1k23J97J27J91j01k77R4m20L33J06j02
5472a01J41j18J01M01o47N4J07j6L07j70K34j49m3Qj21P6l33LL71j60j66K22J85
5495A86p4q2k28J88j87K80j03N3j69N8m9J09J02r0J90p8J63k37J79j17J3o2O2
$$ y = [-89, 243, -26, 34, 60, 196, 40, -2, -12, 45, 89, 67, -1, 75, -34, 139, 54, 150, -313, -300, 59, 272, 50, 137, -137, -323, -165, 478, 29, 31, 59, -78, 376, -98, -56, -13, 130, 157, -232, -127, 238, -134, -400, 121, 241, -71, -164, 261, 36, 154, 83, 166, 3, -16, 133, 128, -56, 78, -257, -23, 96, -143, -53, -105, 44, 14, -59, -104, -33, -52, -112, 60, -75, 4, -176, 62, 71, -310, -12, 126, -58, 26, 211, 87, -41, 131, -210, 142, -41, -113, -164, 147, 234, 149, 98, -50, 61, -2, 104, 367, 87, -16, 106, -18, 207, 41, -163, -48, -179, -32, -114, 87, -47, -222, 15, 9, 63, -68, -66, 10, -3, -90, -74, 66, -145, -191, 107, -77, -26, -249, -52, 75, 266, 165, -112, -18, -438, -105, 1, -101, 40, -78, 23, 424, -223, -169, -62, -78, 229, 59, 293, 144, 101, 109, -12, 64, -269, -266, 105, -55, -221, 1, 186, 112, 30, -198, -10, -197, 83, -20, 33, -136, -78, -127, -18, 84, -6, 184, 106, 269, 32, 211, 94, 107, 45, 107]
5518A07J15q0k15J87K21m09L23L7l80p1K61l%r8j50K31Kj56k13L07L7j6K31j0
5542B58l04k44K19k0K58k83L00k14K4J02l72M43j06k16P2J24j25m8m2M13l16l30
5564d07L07j9K2R7J09l49J64J68l08J41L47l90J21K74l87r4J69L54m39J44K20
5585B44k11k3Q8p5j53J37k56K91L16l14k39K63k5OJ23p5j91P2J43m4J00k84K91
5608A84r0j13L16j55L24l40k09J01M3R7m11M87l26k86K92K64r4k26L55l84J76
5629EJ69k52o1L71j50n00M90J36l43l7M31l07N8k88K55K9Q6l07J57J25J46k86
5651g3r2K60n7j12K79o6l92J68J74k7j19K20k40j49N47m09j30K94k87k49P80j33
5673A87l37J26l6p0K27j27k7j40L90Nj48k48J19K3J01P9k9k29L66j71j97J91o3
$$ y = [107, 222, 142, -73, 114, 335, -74, 249, 286, -94, -165, 96, 93, 93, -5, -155, 76, 78, -78, -291, 16, 53, 37, 268, 258, -46, -290, -71, -91, 167, -116, 184, -30, -6, 96, -276, 167, 61, -155, -83, 41, -84, -132, -174, 239, -77, -407, -100, -119, -97, 0, 109, -240, -76, 92, -216, -75, 272, -118, 3, 277, -110, -204, -35, 319, -120, 24, 244, 33, 10, 98, 23, -130, 7, -249, 42, 358, 44, -195, 68, 43, 49, 172, 97, -94, -22, 121, 77, 177, -107, 184, 94, -19, 297, 142, 466, 126, -83, 18, 61, 158, -253, 234, -92, -378, -86, 178, 84, -142, 213, -171, 5, 174, -78, -139, 232, 82, -418, 72, 208, -135, -172, 259, -48, 10, -278, -23, 6, 92, -215, -58, 67, 213, -73, -165, 95, 38, -74, 205, 139, -253, -85, 89, 62, -57, 163, -77, -226, 321, -88, -218, 76, -211, -460, 320, 187, -150, -24, -60, -130, 97, -30, -57, -197, 193, 198, 50, -198, -79, -56, 45, 124, 95, -134, 232, 61, -136, 55, -8]
5696hk70J35K98k4j78O9l1p5L93k01J3J37k07m44L39K17n90J91K98l8n7K5k03
5719b11J01N16j80l12J13nk01J68K58n83K75M8J15Mj27J30l35K60j13k81M46j33
5741d7p6L69O7l99Q9J47l10J33Q0N6l58K06J85J10l15n7K58j07N6j60K3K10p9
5764H1k03J9K24l58p5K33l5K1J30P5k05K86K03m72j17L31l65k3L91j49l09L59
5786D2Q9n42M57J59l1k93L07l50qM84l81J84J50k23J40j29r2j36J71L65n42N5
5808a24K54k11J17k00K45L8j89M0r8J07K65m29P4J16m1L1R6j56j0qK50m53K37
5831d9J80j71J48k87J22K58K0k36j4K7M37m53j52K24o6J57k49J61p8l1M2j14K43
5854A19j65j60K47R3j23j40l8J53k07J47K39q2j84Q0n4K18j9k71N7J22K3n8K14
$$ y = [-8, -278, -143, 155, 131, -47, 22, -9, -84, 309, 108, 121, 258, 51, -393, -54, 163, -427, -236, 62, 24, -33, -8, -211, -110, 406, 226, -86, 27, 22, -179, -11, 247, -336, -61, -13, 102, 106, -21, 109, -226, 34, -79, -360, 86, -47, -123, 246, 313, -86, 3, 150, -160, -27, 53, 109, -249, -43, 142, 252, -63, -120, 138, 31, 87, -73, -50, 160, 81, -122, -103, 121, -237, -312, -79, -114, -93, 37, 112, -93, 193, 396, -76, -193, 138, -227, -250, 141, -8, -317, 42, 131, -411, 46, 205, 174, -119, 188, -162, -170, 314, -67, 117, 267, 44, 184, 55, -37, -173, -2, 363, -179, -124, 130, -81, 36, -164, 81, 119, -70, -30, -128, -21, 244, -185, -111, 5, -36, -5, 91, -65, -75, -83, 167, -286, -49, 131, -40, 108, -179, -57, 201, 221, -15, -29, -2, 435, -18, -170, 54, -12, 145, -104, 57, -21, -52, -10, -124, 119, -46, -206, 41, 134, 11, -129, -167, -14, -221, -74, 165, 83, -101, -21, -75, 143, 124, -147, -90, 32, 55, -3, 211]
5877B11J05m01l0J92qk03J67k02O1j6lOl3O3J11K16m38J55J33Q0rj46j4J16r5
5902A8q7J53j75OL84j38k32J68J13j87J54j61r5K25q0o4l16K51J96k10l25L71
5924c1K27m70K01L38k9j96j57K30m4k30l6N15k46j77L51q8o0k19J66P6j99K78
5946B00Q6l39P3R0q5j31J00j14J13K22k69o7P5J78j22k24K08M1j51q8M42l0k04
5969Dj70r2M64l02J76k22L83j44k75K70m5K9j39N2J88k83l4K90k20R9n4l4m9K30
5993A22j98J12L17m79K20j21K49k40o9K34R7k33J21J4Q0m89l7M70k18q3L67k88
6015e2L8j1j0j35K68k81K06R6k07N9M2K36j0m27J94O2J77j56J81k11j36J75rr2
6039co6L10k59j8J14k41JL11j78K9m9M5k00R8r0K43j33K95l55j07K00mQ7l9j16
$$ y = [211, 316, -85, -115, 77, 69, -134, 33, -169, -108, -124, -127, -121, -154, -91, 20, 236, -202, -47, 86, 166, 157, 11, -3, 113, 18, -69, 84, -91, -85, 299, 161, -71, 97, 210, 23, 177, 16, -79, 146, 66, 2, -314, -63, 133, -77, -402, -31, 196, -274, -73, 265, 236, 40, -117, 113, 69, -161, -197, 318, 72, -105, 246, 158, 98, -121, 45, 121, -78, 200, 286, -53, 20, 110, 25, -106, -6, -120, -7, 215, -54, -121, -46, 132, 10, -214, -6, 35, -116, -204, 238, 208, 4, -166, -258, 206, -96, 80, -142, 241, 97, -178, 92, 47, 76, -63, -11, 177, -106, -140, 150, -70, 29, -25, -59, -108, 122, -76, 36, 353, -126, 94, -27, 222, -18, -87, 147, 244, 11, 132, 146, 226, -263, -300, 170, -48, -131, 236, -52, -14, -25, -35, -170, 98, -183, 23, 119, -88, -29, 13, 249, 239, -188, 6, 68, 245, 89, 270, 59, -77, 98, 89, -3, -69, 241, -18, -36, 78, -163, -162, 149, -29, 0, -49, -4, -204, -106, -196, 47, -86, 209, -146, -253, -53, -57, 30, -9, -125]
6064a25M01M8l33p1J75j78p3M8J39m7r9m8j6L92m0k38N9j12L52k86q5K46J42j
6088B50k07j00J86l07K15r9j0P7p1M9ko9j8P1%o0L71k32q7J4m0J9p2n3J35K44
6114B04k78K2J2K05j37j03j54K13k5j7K70l0j86K72j18j69j64M8J21k86N24l12
6136h8l9L49l43l6J79n2k7J31J64j42j2l24K77J98o7l48N9J27j7j51M5K86m27
6159b58M62k95M0j13M95k80p3l5L6q3R9l0k10J24P0o7J30O1j33k67J75M55l24
6182b1M4k05J31j48N39k58K27m98L65j23L5O2k79J63m7q3j76K17L7l3N7J81k48
6205f1l5k31L73J77k71J6j45J98q4j30J97q2k15L31J45j33k04J17j87K29K35l45
6227a05P9k7J11n0J8J16k71J03Kj29p5J63j38J25Q1j89K31r9J41k40L19n6m45
$$ y = [-125, 276, 324, -9, -80, 95, -83, -156, -108, 31, -16, -115, -163, -179, 213, 173, -65, -6, -118, 234, -52, -137, 109, 251, 250, 43, -57, 129, -178, 37, -62, -72, 5, -66, -17, -19, -88, -106, -35, -35, -95, 276, 44, -43, -29, -69, -50, -122, -175, -40, 204, -74, -52, -40, 165, 28, -75, -229, -16, -41, -58, 212, 182, -4, 268, 150, -19, -183, -135, -14, -300, 224, -88, -127, 222, -121, -157, 22, -30, -57, 74, 238, 96, 84, -240, 37, 235, 168, -180, -121, 6, -11, -162, -117, 169, -258, 204, -91, -51, -164, 331, 51, -22, -57, -21, -104, -5, -35, -245, -121, -51, -118, 12, 73, -60, -327, -152, 303, -21, 23, -182, -51, -199, 340, 82, 309, -189, 176, 53, 88, 150, -129, 34, -13, -96, -272, -55, -18, -51, 6, 187, -61, -96, -327, 46, 223, -48, -32, -177, 21, -63, -193, 4, -78, -293, 38, 183, 50, -154, -37, -224, 5, 240, -105, -26, -53, 58, 8, 26, 142, -129, -26, -24, -153, -228, -65, -203, -78, 3, -186, 45, -54, 87, -153, 166, 110, -335]
6250c35K51K23j17j31J81oj36M3J8l2J2MM3N7K40k43j34l8M3k10L26l1K06k74
6274d0O6m7k24J30j02L10R5j63j94RK65n1L16n01J81r5K06p1n7o8q5P8k1K23l00
6299a40M4oj64J00M41l35j82M46k72j49K16k6n2o2J03J29k66K89j69k41L03j33
6321a26L0o3K01j97Q4J0o7j02K89j39K77m12L4L09J3j74q9l8N6J73J01l08J04
6344c4l40M64R9k73k5Q6r0j7N7J68k51J02J45k3K9l71K80J03j76N3j25J59l0J9
6368IJ64k30N4k7j03J45J59j96o2j38M18k85K37RL3k84J31k9k83K19L9l8l14L02
6392g0P1o5K31k33P4L1j56J23L56l52Q4j07J15J40l99L52o42O90k95O0j72K75
6414A11j54k60K95L4J86j15q2ml29K61J18k08J41j15K73j74q6j15j07L26o0q6
$$ y = [-335, -84, 139, 22, -109, 72, 66, -70, -27, -9, -41, -29, -25, 18, 75, 315, 72, -62, -100, -57, -267, 59, 28, 234, -40, 26, -21, -245, -115, -217, 93, 188, 25, -169, -160, 105, 54, 370, -131, 50, -45, 161, 90, 33, -35, -120, -42, -63, 160, -140, -96, -102, -266, -166, 275, -60, -242, 204, -68, -217, -1, -27, -79, -141, -38, 91, -175, 114, -55, -296, 7, -126, -96, -159, 42, -155, -71, -61, -128, -230, 59, -80, 197, -215, -181, 128, 141, -33, -122, -160, -104, 69, 170, -138, -34, -374, 90, 189, -84, -109, -23, -113, -130, -73, 95, -156, -54, 91, 68, 97, -274, 6, 109, -67, -14, -139, 20, -10, 9, 173, -57, -3, -30, -133, 12, 171, -25, -87, -225, 193, -92, 145, 154, 187, -97, 34, 5, -278, -59, -20, -58, -372, -70, 1, -64, 167, -66, 8, 39, -117, 6, 362, 10, 94, -13, 102, 242, -157, 195, -447, 243, -52, 8, -164, 111, -43, -303, -8, 26, 212, 97, 15, 11, -318, -57, 61, -147, -6, -121, 152, -22, -108, -223, -330, -4, -64, -150]
6436a50P8m0K15j62N6J31k90J92Q2o0P0k13K11k40J39o0J02m5o0j5K98j71O1q6
6460D3J22k51L0J02K12l77J47O9j73k08J41K01J4j41M8r9L81k48mJ93j65J42j86
6483gJ07L18l50k8j17O4j08J8J68k75M99l87Q6J24o9M3J76k63k21K47j04J16o
6506C1P0j43K26j13l5mL2K2j41K68j25K80m20J15J05k63j04K37p2J07j94m0K50
6529H9k8j82M8J18m8m8J41%j96K31l03P4k8Q9n2Oj53J50M38k63j56R5q4J73O4
6554A75l1n5l53L87J22j77J03m17J94L29l06J32m8p0P2J16k53K26k92j7M25l28
6576f6Q8N6j10o1J51j49j11L43k22j06K25k0j61O9K31j23k20J7l4K28j72K8l0
6599a49OK25p0J72k16oJ58L7l78K04Q4l5k1k1J83j73R9j46MK2p9j01J06k3K0K45
$$ y = [-150, -72, -112, 103, -59, -3, 128, -162, 30, 112, 52, 122, -91, 120, -120, 19, -41, 61, 16, -44, -59, 239, 68, 129, 43, 165, -86, -56, 46, 258, -119, 28, 97, -76, -284, -143, 58, 72, -69, -21, -120, 261, 13, 9, 202, 37, 179, -7, 100, 418, 68, 40, -77, -13, -121, -103, 65, -210, 289, -98, -12, 112, 43, 86, 262, -1, -222, 25, -79, 37, 31, 101, -42, 184, 71, 36, 32, 64, 86, -55, 213, 88, 368, -52, 63, 168, -95, -199, 38, -34, 73, -121, -161, 89, 61, -121, -73, 45, -3, -51, 90, 90, -106, 125, -178, -104, -132, -43, -95, -89, -242, -92, 346, 83, -73, 22, -62, 111, 175, 144, 89, -264, 123, 245, 68, 171, -246, -52, 277, -29, 103, 55, -15, 57, 173, -80, 146, -146, -163, 262, -66, 22, 78, -32, -93, 58, -91, -202, 141, -81, -187, 38, 18, -143, -74, 157, 34, -186, -169, -203, 25, -147, -119, -149, -143, 82, 12, 184, -32, -38, 120, 157, -221, -17, 67, 32, 11, -10, 173, 0, 99, -47, -43, -21, -100, -201, -95, -118, -98, 147]
6625A47j56K9r6K7J27O4Jj59p1J66k42K62j35M7l03L38k28K83j54m0K63j70m8
6648d8R8N8J54j67Q8j05J29k56k3J90M7p8j61K2J1l5M6k5L8k3j04M35m32R2j74
6673b23K56J35k20J2N5j58K14j41J29m9k64M99j14j53J4L0k17K43J00l94N27l09
6695b8k1k0K17m02J72J75k89J98l6Rj44J51l49M48l7j99Q4J34Q1j88R5J02j35
6718A8k30L04J28j57P5O7l34K61j84j10J22K29k66J26k37K99k24K1L8J94k63j13
6740b36J96J9J3rj57L20J23m08J74j67J85r9J25k38J96L6o3L3J45k33P5k76L50
6763A04k63L9K35m93K43J27J03j65n2O2N9j49Q5k23m2J63K25l1J87J8k15j73L11
6786A55l6o9j4j82JJ05J75m28K55P1Ok47L04k16K39j30r6J91j65J65j16J06m2
$$ y = [147, -9, 20, -76, -49, 78, 142, 143, -16, -87, 79, -163, 99, -36, 11, -292, 46, -182, 101, -53, -93, 170, 0, -48, 50, 108, 262, 95, 183, 78, 207, -49, -72, 118, 165, 87, -74, -52, -41, -76, -30, -55, -17, -40, -144, 291, -141, -49, -223, 33, 168, -52, -40, 15, -143, 71, -70, 59, 10, -254, 245, 131, -22, -8, 22, -195, 48, 148, -246, 281, -28, -49, -69, 148, -254, -82, 93, -196, 2, -34, -25, -169, -18, -367, 81, 44, -155, -71, 63, 144, -44, 51, 153, 18, -212, 92, 220, 63, 138, 205, -129, 132, -52, -162, -40, 189, -77, 49, -188, 111, -113, -92, -54, 140, -123, -236, -40, -21, -8, -17, -174, 146, 269, -139, 35, -132, 53, -46, 79, -159, 37, 73, 10, 43, 188, -45, 30, -246, 104, -159, -120, 115, -378, -135, -8, 95, -70, -122, -60, -1, -150, -65, -288, -330, -167, 58, 27, 214, 232, 17, -156, 155, 119, 50, 36, -146, -145, -40, 135, -293, -38, 33, 39, -208, 96, -120, 119, -11, -107, 84, -81, 84, -32, 74, 32]
6809C2p0p9L58k89L6J07r9k21J76K77j87m2j29N3j04M81m41K7M98l82J14j57J71
6832A30j88J23j98PL7j86J08M1K00O6j72p9L96j84n5PJ09m08L78m1j81J28j75
6855a37L16k81J69l6q8r6j33L00K02m74L41q8j14J54jl8J9j5L74k10k52m4J01
6878c1J80l29L17j92j26k0K08j35K34k95J7K21p3n6K7%K66l18J94j16j27K29j43
6901f8K62p4j03N2j00Q0j13p9L13j64J25j01p9j04L0j73L42n7j67j41L90j40q
6924g7J36%k56R4KK39r0O5j13J8k78J14o1N4K35l24K12M2l0k26K56N6j31J61N1
6949A49N6j30l0p6J47o0K2j18J81k02J23LN5k14KR3j6k12L96Jk8p4j51K14j92
6974f1q0O1k56L14K00k60K16N0k60j28K63k20J7j10O3J82j08r2L21k53P9M4J99
$$ y = [32, -38, -117, 241, -48, -12, 95, -4, -225, -49, 228, 41, -1, -130, -77, -181, 300, -141, -114, 384, 2, 116, -41, 130, -58, 65, -133, -126, -89, -275, -167, -126, 74, 140, -32, -111, 285, 101, 46, 53, 162, -246, 132, 91, -90, 38, -137, 179, -102, 67, 31, -57, -153, -286, 14, 216, -258, 83, -5, -119, 35, 34, -4, 15, 0, 374, 164, -88, -132, -31, 149, -180, 137, -55, -181, -201, 7, -128, 106, -189, -172, 49, -24, -80, -53, -53, 213, -105, 89, -27, -154, 75, -68, 194, 120, 17, 69, -31, 49, -64, -143, 170, 6, 131, 30, -49, -153, -123, -296, 46, -11, -178, -319, 71, -69, -77, 59, 59, -197, -103, -101, 138, 48, 113, 0, 18, -260, -146, -207, -153, 82, -242, -30, 12, -18, -244, 12, 68, -63, 98, 149, 205, 75, 45, -31, 116, 56, 78, -40, 141, -61, 62, 65, 120, -94, -92, 1, -15, -227, 169, 170, 142, 68, -83, 131, -61, -141, -80, -336, -22, 178, -82, 134, 184, -76, -204, 59, -161, -144, -254, -191, -9, -117, -209, 112, -141, -62, -18, 181]
6997A81j33o9K32N1m58K09L9j7k40LK80n8J54j20k1o4Rj10J58L23l90k67K50P5
7021A7j5R0j3o0q7K30r5j47O6Rr2R3r3J99J3n0j00K15O1m29R4N7j69K41K6Ql2
7048C7J40j48r6L29k42n5J32l14K71j68R2j71K74j58m0J50p1J30j78K04N9k45
7070f8M2P2P1j69n0J36Mj21j10L68q8k4j30m7M65n15M06m13K19N1j09J38m3j98
7094a13M7l5o5j7K98Kk71K59k80J54L77l77J69j25n2n9p4J60J12l4m2r3l0L50
7118B61k38j28L7j06J46K08p8j9o9n1K7L4J14j81r9J93n2j76K12J8l01K46k64
7141b66L44j73J2j67J99J02K22k32k13K96R4l07N6k3k20K07J9j06L36k07j99L15
7163H9k10K85k66N8p1J43Q3j82l1J04k39J58N7ok57L60J2J81k97P2k55l1K78J85
$$ y = [181, 48, -21, 211, 262, -196, 13, 52, 35, -205, -202, 78, 20, 174, 54, 33, -31, -22, -132, 26, 349, -41, -308, -58, 17, 2, 92, 79, 19, -68, 162, 67, -80, -14, -5, -97, -4, -97, 102, 115, 65, -35, 180, 241, -188, -94, -37, -206, 35, 61, 69, 37, 177, 29, -67, 262, 20, -35, 97, -217, 54, -114, -22, -193, 81, -77, -117, 33, -38, 92, -86, 118, 177, -68, -26, 46, 117, -52, -102, 34, 38, -83, -193, 175, 87, 63, -67, -114, 351, -164, 242, -171, 48, 99, -10, 128, 85, -113, -66, -101, -166, -183, 115, 117, -154, 105, -175, -21, 356, -21, 148, 23, -29, -88, -162, -2, 110, 76, 34, -59, -89, 261, 23, -105, -68, -174, -28, 180, 102, 83, 14, -37, -10, 24, 138, -43, -142, 51, -1, -177, 35, 53, -248, -2, -266, 78, -95, -83, -250, -51, 51, 273, 41, -172, 124, 218, -89, -33, -56, -276, -69, -50, -156, 180, -27, -226, 89, -121, 164, -102, -44, -115, 28, 111, -71, -102, 2, -237, -79, -22, -28, -285, 75, 87, 268, -29, 43, -212, -243, 35, 220]
7187B20q9j26j12P8O6o5J41j90q0J93j25K38M0m4l2l8r0k2J23k1j22K4J59j28
7211bj49J17J08j13j06K70j85J81k21J48K32l87J03p6O3l3j91J66P5J78k20j52
7233a94P4K06J5K0P0j99j39O3K35M2k77J94k55J1NK47l98M52k67k03L05R7r5O
7257A5p4j65L14n4R9k02J28rM2J0J17l67Q6k9L2K50k88j57K71j06J42q9rJ42k14
7282a15k5J32m38J77L32o8P8j10J04j57K6J91j51j90J61J01k35l2K60M6m6p9j3
7305e1P4p9J29q1J82p1o0J2r9N1J63Q7k16N5l73P8L06k35K07r7J02j49O9R8l05
7330b03K36j35K43k22J47j29O9j04J18mk23J67K13l62o6L09r9p2L7K75m55K22
7352c8J75k90L78r5j14j71J16j26Q0j9P8L4K2j58L8J51j59j20O2J27K52j49k15
$$ y = [220, 131, 5, -107, -29, 37, -28, 113, -77, -157, 36, -89, 149, 189, 145, 113, 75, -15, -37, 86, 65, -57, -33, 126, -2, -151, -34, 74, -39, -145, 125, -60, 121, -100, 48, 280, -107, -4, -80, -17, -50, -241, -75, 0, 178, -42, -194, -120, 86, 101, 121, 191, -8, -147, -84, 151, 193, -84, 110, -145, -134, -129, 118, -280, 172, -95, -298, 7, 104, 9, 15, -59, -224, 90, 36, 135, -67, 61, 52, 94, 104, 221, -146, -60, -89, -57, 193, -95, -252, 19, -87, 55, -34, -43, 99, -115, -140, -8, -446, -269, 63, -5, 73, -37, 67, -90, -64, 127, -24, -214, -53, 48, -187, -219, 41, 87, 41, -38, -51, 23, -56, 73, -8, 174, 103, 43, 55, -44, 7, 170, 257, 41, 96, -277, -199, 107, -128, 79, -18, 84, -65, 4, 102, -203, 33, -102, 141, -81, 66, -63, 6, -98, 20, 16, -207, -40, 173, -189, -255, 54, -45, -117, -80, 195, -260, -38, 137, -153, 225, 130, 16, -155, -39, -165, -85, -104, -26, 8, 30, -128, -90, 61, -98, -218, -156, -29, 223, 74, -141]
7375a41p1J75P4JKM8O2l35K01K28k41J23k64K60J97m07J24J3j1J64k47k40L12
7398B7J9j81O9J9k1J02k07N8P6N5j18O5k4J96k28j22J52J65k22J24j50J08N4J4
7422C0L37n99Q2M0J97K8k47J60N8j3j13O3j57k6J59m5J02Q3J34k73lM1j53R9M
7447a2J21j80J88J12j06k4k69K52j78O2j14J92k5P0O3l17J34q5J78q5n2j36K27
7470A6J71m17K86j6kK18p3j52J37o3k35J00L90k46j35K5j93K36j34K18j65L7k42
7493b39J27k6k1K46m8L9j0J48J06j62n6j36l7oK0P8j80J51J99j95j84M4K71m90
7517c61O7O9J01J13J76l02O9n2J80k77J72J13J13m0k0k95K84mJ71l40j30R7p4
7540a70L09l55M10l67L58m37J54N1n7K17o8l3k21K90k28m3J01J61j27LJ30J06
$$ y = [-141, -212, -37, 37, 38, 40, 88, 150, -185, 16, 244, 3, 126, -138, 122, 319, -88, 36, 49, 38, 202, -45, -285, 27, 46, -135, -66, -47, -68, 34, -173, -115, -39, 16, -102, -37, -61, 135, -93, -215, -63, 102, -120, 4, -146, -38, 16, 30, 367, -232, -150, -110, 87, 115, -132, 28, 86, 73, -40, 23, -134, -160, -1, -46, 56, 139, 273, 0, -3, 38, -115, -16, -12, 109, -71, 117, 229, 123, 99, -170, 82, -96, -34, -148, 44, 19, 89, 152, -165, -31, -116, 62, -23, -75, -211, 16, 187, -230, 56, 40, 38, 256, 183, 31, 168, 105, -130, -30, 360, 114, -21, 4, -189, 47, -87, 131, -34, 3, -239, -112, -138, -159, 87, 39, 78, 68, 216, 322, 160, 104, -32, -69, -75, -55, 23, -157, -6, 193, -2, -186, -142, 129, -361, -294, -225, -124, -11, 165, -137, -68, -120, 60, -217, -45, 68, 181, 141, 121, -174, 110, 106, 277, -63, -193, -96, -170, 139, -216, 194, -173, 185, -252, -98, -47, -104, 113, 45, 12, -209, 81, -147, -190, -89, 72, -55, -52, 78, 184]
7562A84j85L2r9O6n9j7J98l1r7J13j46K8n2R2p8J56l84J23J70%j33J30m9j40J17
7587f1J6R2J51k05J38j23nM2q6M8K3j13n8NJ42J85k84L13l13J68L3P5k33J18j7
7612E1k57L66j99K45J47l76mp3j38K69r2j0J76k03O1K47l33J76K17m71P2j72M55
7635A54k10p7K18j79R8J14j20j12J8j58M15L4m64K85j42l1L58r6l01K53n4j22
7657a19R8k2n1K63k01J59k11j5L08l08L37l31K63k94J52jl8m6J51j50l1J79j45
7680e3%j26k3p9J60Q4R5K59n48l4J80J5j06Q4J86l4p0J57j92M5r0o9J23k24L43
7705H3M2J00k11k05n2M6J42K97n75M27k28j62J76K04m1j79J82Q5l2j49J20m4K0
7728D6j78r3J39k36M12l1j00Q5R8m83L60o1J9n2J55m7lK93m45L62l1j32L20l08
$$ y = [184, -1, 31, -68, -2, -61, -78, 120, 89, -8, 105, -41, -13, -65, 27, -51, 105, -279, -156, 14, 14, -119, 11, -38, -178, -61, -45, 47, 198, -7, 131, 8, 3, 45, -41, 7, 30, -83, -141, -136, 6, 191, -93, 220, -93, 75, 108, 183, -50, 68, 51, -206, 160, -39, 206, 353, -23, -27, -100, -238, 31, -61, -71, 105, -98, -37, 210, -123, 53, 270, -201, -129, -301, 154, -56, -133, 85, -94, 4, 118, -2, -114, -96, -254, 161, 195, -269, 16, -126, -157, 201, 105, -196, 57, 3, -119, -21, -43, -94, 169, -32, 127, -84, -99, 209, -99, 238, -93, 170, -124, 28, 27, -11, -57, 94, -56, -87, 92, -53, -53, -179, -202, -281, -121, -37, 58, 317, -231, -265, -85, -70, -176, -92, 94, 60, -10, 147, -45, 0, -90, -159, -36, -260, 83, 125, 225, 14, -191, -243, -197, -55, 242, -333, 94, -134, -296, -120, 84, 43, -136, 46, 131, 99, -50, 70, 26, 46, -132, -225, -86, -322, 90, 59, -41, 44, 142, -341, 19, -42, -23, -75, 80, 33, 30, 323, -122, 240, 209, 77, 397, 89]
7752H9r7J29j32pK00Pj87J5K19r3j81Q4k47J37K25J0K43o42J54N6O3M5JN1r2O7
7778A17j52n0q6K8q3K95j15M7o8L22k62Nq7K16j74L7j93K29J23l20K47P8l50J23
7802g3o0J48j76L19r6K6r6k52J92q5L5J63P1m24K09O4k19M89k0p5j19K85l82J02
7826B6N7j14pl3J89j81K75l59J96j31K68n0k79J0J18k28J19L36k1k23m6L1M3q2
7850h6O2O4n7J32k32K07j0j42L37n17Q8j51N33k04J20j45Q3k89K77j55kN3L20
7873B86j23j87j58K13J42l83L17k29R0R3k06M30k24l76L62j17j2J90J44j93j74
7894a15J4K77m73K8M46J70l30J55m13J08oL31Oj05r3J43J3j06p3l52M50M8k16
7917i3p8K33J38l14L51k34k50J26o8L22j32k9K1J23p1r9l3K18l41K32L4mK6q8
$$ y = [89, -8, 121, -11, -18, 182, 189, 2, 17, 236, 143, -38, 46, -201, -64, 161, 171, 414, -228, -74, -18, 45, 90, 91, 142, 50, 117, -35, -85, -171, -143, -226, 69, -46, 1, -67, 255, -7, -2, -89, 127, -47, -10, -203, 26, 149, -171, 76, 154, -196, -73, -133, 15, -161, 158, 62, 88, -8, -260, -68, -153, -118, 45, 116, -308, -99, -35, -254, 235, 215, 140, 21, 306, -76, 26, 83, -31, -38, -71, 118, -63, 212, -147, 49, -82, 186, 136, -143, -133, -15, -243, -124, 212, 191, -32, -78, -47, -4, -86, -24, 40, -17, 115, -117, 90, 80, -62, 275, -242, -154, -305, 228, 24, 144, -1, 82, -207, 70, -85, -87, -34, 286, 163, -24, -182, 31, 173, -210, 107, -122, -32, 61, -145, 285, 61, -315, 47, -70, -82, 108, 252, 59, -115, -101, 176, -297, -269, 177, 347, 17, 172, -241, -133, -139, 192, 198, 93, 0, 143, 156, 50, -23, -375, 75, 123, -93, -171, 62, 200, -114, 237, 3, -247, -121, -189, 133, 1, -28, -7, 116, 45, -54, -87, 131, -210, 22, 56, 52, 78, -10]
7941a0j4o6L5o5K30k13M4k6J84n7NJ96m05M3K58k11o0K23N3k62J22n9K27k2l46
7966a96Pj2J42j29L54J76k51k08Q3l5j56L02j10l48M14o8k15J90O2j5j24L64l00
7989g3m0J0N3K4P3r1J09N4L1k93J78n8K58l41K47j13k15J07K8q8L82o8r2M7l20
8014a91L0J55o8j40M75j12J86l07m4K6k06M05k59L0L6J68k3k67K9N3J00l54K04
8037g4k5K71j35P6J33k45J20n6J09m08K66l2o0L23k65n0o1K44j45o2L28k86k3
8060e7M6L04m46o4L7K62l7l4jP9rP8j86L82n72M56j28j36J01j89Kn1J06J0Lnk2
8087g1p4Q1J61J15k04j31O3K39j27K41j25j14j10k64M76p6k66J91J16J35k89N2
8109A9O9Q3l99P7J66M0O1j49J04J16l76L67k1k72KJ10m8R1k67J56J18p6p4M4M5
$$ y = [-10, -24, -90, -55, -120, 110, -103, -59, -85, 99, 42, 47, 243, -162, -119, 139, -72, -132, 91, 144, -118, 4, -55, 172, 150, -196, -189, -201, -59, -188, 166, 342, 91, -117, -34, -69, -225, 77, -33, -381, 33, -35, -250, -60, 2, -13, -137, 227, -73, -113, -103, -50, -26, 47, -44, 65, 119, 150, -143, 35, -23, 235, -106, 141, 28, -187, -80, -52, -140, 242, 174, 82, 129, -191, -161, -6, -74, -214, 261, 149, 335, 28, -16, 10, -196, 209, -50, -20, 16, 184, 161, -106, -77, -24, 76, -278, -74, -99, 172, 37, 113, 246, 1, 121, 65, 174, -234, 32, 0, -60, 263, -2, -52, -113, 131, -14, -76, 252, -34, -57, -11, 293, -153, -217, -180, 82, 45, 11, 10, 89, 80, 158, -28, 354, -218, 238, 110, -26, 75, -114, -112, -163, -57, -47, -44, -49, -71, -145, -64, 97, 212, 8, -123, -60, 179, 52, 293, 168, 54, -56, -320, 156, 80, -186, 5, 121, 256, -33, 19, 88, 171, -228, -151, 15, 55, 116, -33, 71, 187, -189, 178, 157, -115, -113, -3, -51, 40, -227, -71, 47, -29, -103, -59, -14]
8134a4q7J24J0j41N6j22J5R3J10K3k34N9J36K41m72K58n0j42j2l4K93q6J30R3
8158B47j45j53L7j93K72j37K94k98L2j36jp4K69K7k19K0K57J19J2l46K29j05k29
8181b21K4j3L77k21n3K85l24J02n3J51
$$ y = [-14, -101, 23, 33, -108, -52, -174, -159, -66, 44, 67, -167, -108, 28, 269, -203, 55, 5, -137, -149, -183, 110, 24, 154, 247, 102, -51, -14, -207, 65, -72, 222, -76, -44, -180, -181, -255, 14, 41, -178, -158, 99, 218, 230, -116, 113, 8, -221, -197, -210, 167, -54, -107, 178, -146, -44, -97, 54]
8191E4
$$ Imaginary data points
##PAGE= N=2
##DATA TABLE= (X++(I..I)), XYDATA
0@%%%%%%%%%%Qj6J6j6J6k4L2m0M8n6P2q8J04j20J40j64J89k18K50k83L23l70M20
33B23m76N38o04O76p57Q46r40J043j160J287j424J574j736J914k112K327k562
50a343K821l106L427l783M181m636N153n750O451p283Q288r533J1122j3225J6144
65H928k0467K7516m0873P4431l03437n07138R34800L50280n88089j52474K71662
76E5139o1228J6580J39187j40523j45615J67157P2073j41368p0974J17945J31356
87A39729r1086k59056O9491L49277l3305l48214J9577K33309j3808n2760K2073
98C5227j27433p26K46273m8117k76309J15710K11460j66189r3037J65396m8332
109A3923j18128J54429N0788j92243R300J66551k4727r4408J0754L9434K9283
$$ y = [0, 0, 0, 0, 0, 0, 0, 0, 0, 0, 0, 8, -8, 8, -8, 8, -16, 16, -24, 24, -32, 40, -48, 56, -64, 76, -88, 101, -117, 133, -150, 173, -197, 223, -253, 285, -319, 357, -400, 446, -494, 549, -611, 676, -748, 826, -910, 1004, -1108, 1219, -1343, 1478, -1628, 1799, -1984, 2197, -2439, 2714, -3036, 3415, -3868, 4420, -5113, 6009, -7216, 8928, -11539, 15977, -24896, 49535, -253902, -761040, 173760, 524040, -64049, -216523, 55139, -6089, 10491, 149678, 9155, -136460, 30697, 102770, -38598, -109572, 8373, 139729, 48643, -210413, -140922, 208355, 175050, -173164, -153587, 79722, 65914, 13154, 35227, -92206, -92932, 153341, 105224, -171085, -55375, 156085, -10104, -103141, 62255, 13923, -104205, 50224, 101012, -91231, -81931, 84620, 59893, -34515, -23761, 15673, 44956]
120D4956l1535p8387O0070J02482j05947r9389J13321M1196q1646N2445K4567
131D2133j48385K7747K06590m2928j87194L4045J11037n737j4135j6794m4553
142c8174L2970L9475m4413J2501M9420p0350m8067Q3596K4293m4564J1683k9485
154b1115m8393R3762O3156j17378m2881R8455k42n1500M6526N443o4539K2862
166a5844M5539l2826k915K8524l9601k2608N6627J9866l6846j9604k278K8309
178F343M5920l9903o6424N2056N5182o0428k3786N1892j6795k9666M0678m832
190A0237l9411L5780J2809n3195K4085N1993n3644l4150O0514J3575m1086O729
202e764J1104j3599J7155J1988k5033k125J2307j0265Q999J5677k8258j0778L0820
$$ y = [44956, 13421, -64966, -4896, 97586, -8361, -107750, 5571, 46767, -34879, 17566, 42133, -106252, -78505, 128085, 85157, -102037, -67992, 43045, 37308, 23173, 6379, -38174, -5204, 34271, -10142, 2359, 51779, -18571, -66638, 16958, 41251, -3313, 8370, -21115, -69508, 24254, 87410, -29968, -72849, 25606, 25364, -26136, 20390, 25833, -38706, -15844, 29695, -3131, -6046, 22478, -17123, -39731, 16896, 36762, -84, -19688, -21966, 6343, 52263, 12360, -54064, -2008, 53174, -7254, -31040, 20852, 4057, -25609, 15069, 10237, -29174, 6606, 19415, -33780, -9695, 42298, -11346, -45496, 15018, 28593, -12493, -5764, 5340, -8259, 8896, 20884, -4149, -6274, 6033, -4232, 4767, 20444, -7814, -18592, 12228]
215A2228j1016j9370L9498M47o4104J4640P1243k0605n7179J7112K9242p191l197
228A748n518q474J7993L844k6147J0421K7548j9328j7675J8743K407q050J5454
241A2966l793k5212J0098K2834r835j0960J141n136R088J4485j9819j6053K8006
254G810P325l3364M438L1673j4866k5882K0333J7405j9626p802J8455N692j4829
267c238o786J4268J1450j5318j4272J7566J3048j9921r024J9634L757j6650j43
280e629R255j142l965J642j448l184J742L751j93k672l354J88P478M347j0809
295c993p313J4861Q967j7473p656K1261N760k2691j961K2563K26k0432P01J7319
309A0139k806j4682L716J2130n360j2150N494J0854n769j1591N718J0636o783
$$ y = [12228, 1212, -18158, 21340, 21787, -42317, -27677, 43566, 22961, -34218, -17106, 12136, 4945, 1748, -3770, -12244, 5749, 9593, -16554, -6133, 21415, 2087, -15588, 3155, 5562, -2488, 12966, 9173, -16039, -5941, 16893, 7058, -3902, -2761, -7897, 1191, 15676, -4143, -20196, 7810, 15135, -18229, -13791, 17882, 3016, -22866, -2533, 14872, -4754, -12556, 5899, 11591, -3238, -10024, 4244, 15694, 376, -13896, 3670, 16718, -3203, -12227, 7407, 11164, -5486, -5629, 3626, 2484, -1481, 161, -1287, -4471, -2729, 1022, 829, -1843, -5197, -5009, 2469, 6816, -3993, -11306, 3555, 12522, -4951, -12607, 8654, 14414, -8277, -10238, 12325, 12551, -7881, -7180, 10139, 7333, -7349, -3633, 8497, 3137, -9013, -3519, 7335, 1566, -10025, -4307, 6329, -454]
322d54r758Q558Q795r495n743R668M725p512k364N184L241l171m829L249P610
337G704n001r725P988J1549j1120j1943J1688J0605j3420r375J2203O302j2535
350e080m174J1605K578r084k168O656K509n238k923O002M715q344m606J2875N284
365A0607j5122l092J6185R45j4883J958J0550l616p256K786M451j248m382k170
379d287O374K672j0371k548J4195j412j7128P188J7028j2294j2886J4901P727
392I159j1663j707M438L20M746k131j0089P755J0176j3119l130J5669p345j5036
406a1957J6390J0101k0593n316J6502m1q476J463p70P84N037p594j951J4908n701
421B786k0516J6243J9378k2606r516K3650l696j6651J5462P730j7456L12Q958
$$ y = [-454, -10212, -1654, 7141, -2354, -8097, 1571, 6296, -1216, -3580, 1604, 4845, 1674, -3155, 94, 7704, 2703, -7022, 966, 12515, 1395, -10548, 1140, 11745, -1675, -11050, 1153, 7455, -5080, -9254, 2351, 4929, -4155, -6323, 333, 2842, -2396, -5319, 683, 5398, -2946, -7552, 5323, 10607, -4515, -7607, 8578, 9523, -5360, -3402, 7148, 3532, -3724, -938, 3513, 2265, -2117, -4287, 2087, 4759, -5612, -8160, 6035, 4623, -12505, -5317, 11711, -583, -13469, 1432, 9159, -2504, -4211, 227, 547, 5293, 3162, -6927, 828, 11004, -2115, -5245, 10424, 3079, -11957, 4433, 14534, -6059, -11375, 5127, 5086, -3390, -1927, -2697, -1913, 3124, -4470, -6421, 8487, 2786, -17730, -1487, 17891, -4715, -14231, 9419, 5723, -10928, 4534, 12264, -5192, -4880, 4078]
434D078m324P406J880k2937M386K7613j2517j9145J7819J127k0662J6069J6627
447A7420k4516r800J9514J906m191K452j2114O16K2158j0018j8947K3250P042
460A4772l3970R794L4918k0326k3240K2160L241j3775J5330J784k3843O759J4899
473H503q930O710J254l1404J0036M5021k0919m0461K5883J8673k3748P800J5968
486A4386k4608n142K3827l691n335R675j7737o990L2947l052l0550J9977J2199
499A5906l6963J1589M4355k6859l8253K6282J6816j1626Q942r167k8318K4210
511c086K6829k6204o024J4808k4395M210M7416k1169m9152L0613K9464k9165J752
524d103K0177k4534o250K6605o699n847J6390k5726j7567M7766R242m8816O443
$$ y = [4078, -246, 7160, 9040, -13897, -9511, 18102, 5585, -13560, 4259, 5386, -15276, 793, 17420, -7096, -16896, 2618, 4524, 333, 2785, -9329, -8713, 13445, 3427, -15520, 7730, 14772, -19198, -9404, 25514, 5188, -18052, 4108, 7349, -6426, 8904, 10688, -13155, -6396, 8503, -427, 6283, 7537, -23867, -13831, 31190, 10271, -30190, -4307, 14366, -9382, -1582, 14386, -10222, -15364, 8463, 4772, -563, 9112, -8625, -15615, 17332, 14280, -16270, 3707, 15906, -21057, -9468, 34887, 8028, -30225, -3943, 12873, 1247, 10189, 1022, -27296, -3086, 23743, -2461, -8485, 6323, -18072, -13862, 33554, 12385, -36767, -6154, 23310, -5855, -4103, 16074, -8460, -14710, 11895, 5196, -651, 15739, -9987, -27554, 20212, 29454, -19362, -12919]
537a2919K6085k5683O622L9393l3758m0336M0708K5142k6375m84j170k0990K5665
550A900K7190l5352j2368K7460j3676p044L8689j3611m5430K6672K8674k6689
562c585L160J7177l2342k598M0933j1013k3951J9059j1216k1461M3848J5588n6837
575b3238n165M2423r141q832K1041k4281k4453M0261J6118l1087K173M311j9472
588a9342K4779K6973l9528j6329L5187p533j6025L2646o678m4186K1251L2493
600B3708k3236l407J3217k8184K90M4711j3500l6678J9754Q564k0743K4132J6131
613B4759m3131p340L8738k130j3574J0309j6034j1850L4839O197l2444P520J1334
626G193k1623J6395K8445l5373k2960L7092N041k3361J5972J891k9968J4014K6366
$$ y = [-12919, 13166, -12517, -5895, 33498, -260, -40596, 112, 25254, -1121, -1605, -2775, -23765, 1900, 29090, -6262, -18630, 8830, -4846, -11890, 26799, 13188, -32242, -5570, 23104, -3585, -425, 16752, -15590, -18188, 22745, 11732, -12219, 6840, -4376, -25837, 18011, 33599, -23238, -28403, 14020, 4879, -3953, 17088, -7193, -31646, 8615, 24733, -6354, -4181, 130, -19342, 5437, 32410, -7118, -23447, 11740, 4207, -11818, 20828, 14150, -30036, -8785, 23708, 472, -2935, 10282, -17902, -17612, 27099, 13599, -23079, -3325, 5239, -15504, 8628, 24759, -18372, -25712, 13026, 10896, -2678, 7631, -8403, -20253, 14586, 20783, -11661, -4141, 7193, -14430, 1965, 30410, -4963, -27923, 9169, 14210, -9151, 6821, 8712, -21256, -7242, 19124]
639A9124j8485p500J0815j8178L716L6039j6807l5648K2825J7753k0252Q621J3265
652A5288k8076l172L0465l710j5072P452q697o761K7462R95l0975P543J8011j7278
666f525L116K2876k1675k1662K7771J1170k0063J733M329j1937J0541J2499j6186
679d013j867J2092j4382o26K8388j1182l0381J8349J9941j7849j333J2363j4715
692e215m644K0228j961j3402M906k418m044J6075o99k2350P285J6981j3849m567
706g674J6726p751j5060J4234Q186j1499R96K218o894Q372P706j3806j380J3323
720G697q202o803J7843k434k1331R035J7620j0947q888P315n25j815N465l653
734C77m559N502k034n137R715J579j4428L681J3166p311p109R784l09q609M829
$$ y = [19124, 639, -6861, 3954, -14224, -10508, 25531, 8724, -26924, -4099, 13654, -6598, 2023, 15288, -12788, -15960, 14505, 10795, -4277, 3175, -5522, -12283, 15179, 16174, -14801, -7258, 10753, -6525, -3409, 19467, -2208, -23870, 3901, 15071, -4992, -3259, 1070, -10867, -326, 12173, -4013, -5880, 6212, -8170, -8796, 19592, 8410, -21971, -3622, 16319, -1530, -2863, 9500, -5215, -9859, 10369, 8408, -4994, -88, -2506, -6550, 9525, 8826, -13524, -6239, 10742, -3107, -7674, 9052, 1301, -13759, 475, 8661, -2838, -1842, 376, -6518, 1854, 9560, -4246, -5626, 7697, -505, -7308, 10535, 8101, -13230, -4195, 13425, 2478, -6410, 905, 380, -1435, 4030, 377, -4182, 1320, -714, -5851, 3864, 5443, -8985, -5304, 7862, 551, -6558, 3226, 2917, -5692, -863]
749h63O367m614j618l39j296P213K101j1614o24J2543l607j0201P517M817r656
764c874o65Q236j329n130L86J445J689l91l865J289N417m080m762P616L393r053
780c678q89Q675l29o865J731M661j544k736K2K543J284l202k484M951J869o673
796b664r74P038p52p679J725O879k409n539J943M465q71m034O17M428j93m986
812c006O98O010j655n121L047M625l407m124L905L522m172l785L554M094l474
827G11m284L082L824l443l984L712L324m287l428M447L812m950k641M630K640
842C165m151j968M446K091m398k145M780K472n227j804N233J241n508j12M939
857C054p09m897K14M903p29m686j23M724J02n085r4N689j63o032M19O234r56n519
$$ y = [-863, 5504, 890, -728, -1067, -2363, 4850, 6951, -4663, -5287, 7256, 3649, -6552, 965, 5782, -3874, -4539, 3697, 2368, -2762, -2376, -931, 758, 367, -3498, -2209, 3208, -872, -5634, 1982, 5375, -3678, -4567, 4108, 3779, -3086, -1355, 3306, 1762, -974, -952, 1591, 2875, -327, -2811, 2140, 4009, -2664, -3638, 3400, 2648, -5031, -3306, 3573, 1164, -4375, -2432, 2033, 1162, -2872, -2255, 2173, 1980, -3006, -2308, 3702, 2047, -3074, -27, 4598, 1191, -2933, 972, 4494, 322, -3463, 91, 4185, 711, -3573, -491, 3333, -110, -4094, -382, 2942, -1345, -4773, -326, 3486, -1464, -4105, 525, 3165, -986, -2954, 1492, 3583, -815, -2960, 1820, 4292, -935, -2739, 2494, 3735, -1773, -1885, 3054, 2345, -2552, -2338, 2565, 1836, -2850, -2973, 1751, 1853, -3232, -3326, 2363, 2200, -3832, -3413, 2821, 1865, -3654]
875c654J883M827k349l197K852K815k293k915J468M537j361n771J188O751k702
890B079o466M034N183n460l868N189K103m467j195K431R32o58k044J199L385k456
906g9m332N415M576p620l717R504J797q385O5N674n95k129L85r02J394L43l592
923b198J981M395o258m320J0081J189j0559K174Q404n572m589O782R20m699K32
938b037N72J493M472m351o688Q307N006r457K44Q481p124n418J2017J916j2333
953d900Q42P298j801l92K90n943K391O704o207k329Q962n271r544J1892O589j3280
969d699q42R606n188k025Q967m064p806O471K062l652O653k817j2719R300J3277
984A2524j2730p128J0946k754o557J0748J021j3734L704P967n280K303L114j1882
$$ y = [-3654, -1771, 3056, 707, -2490, 362, 3177, 884, -2031, -563, 3974, 2613, -3158, -1970, 4781, 2079, -4387, -353, 4830, -630, -4498, 691, 2794, -1673, -2868, -437, 495, -163, -2207, -1008, 2377, -79, -4411, 1004, 5580, -2040, -5757, 3747, 5544, -2841, -2776, 2898, 2303, 174, 559, -343, 1051, 1394, -2198, -217, 4178, -2080, -6400, 3681, 4870, -5689, -3515, 4889, -683, -5272, 1510, 2430, -2269, -2037, -1465, 28, 4500, 149, -6539, 1768, 6774, -2683, -2439, 6042, -1082, -6500, 5517, 7433, -4900, -4058, 3240, 1439, 1047, 1337, -4606, -2215, 4489, -1718, -4047, 4915, -356, -9900, 1992, 8581, -4699, -5541, 4065, -1123, -3148, 5819, 1755, -6051, 420, 2482, -1170, 5483, 2666, -10053, -753, 12524, -206, -7334, 3612, 858, -5699, 5049, 6070, -7664, -3960, 4007, -1273, 1030, 4144, -7738]
998g738J146J5478o738r988J1137o64j2341J2064J0060j6153m579J2223l008j183
1012b84Q516r792r222J5128L758j1791N305K187j4617Q225J7696j4629j3303J3422
1026E99K016o465R434j902j4510P504J0889r645K124O727j6051q35K3492n061
1040H316j9080R991N846j1821R833R969j8145n493J5288j379k701O755j2559r246
1054a4426K1592N352k0083L958Q728j3645M473J8800j3774j5920J4532O065p493
1067a841O898k793j4365J0956J2652j3115j319J0050j4016l057K4473l686k3845
1080a3008P718J2797r254L431O894j6100k413J6824k686o609P062r896q431K2309
1094H638N504k4622J900J5457j0195n74J5960j1642j4845J5015Q083q804L673
$$ y = [-7738, -6592, 8886, 2148, -7840, 3297, 2633, -9708, 2356, 12416, -3737, -8316, 3907, 899, -284, 8232, -1560, -10782, 4346, 8104, -3687, 1618, 3805, -10812, -2587, 15109, 480, -12823, 599, 2615, -3850, 5584, 3682, -10828, -3324, 7565, -2080, 44, 6771, -9280, -10115, 13377, 8316, -10764, -773, 5073, -6748, 3085, 13054, -5091, -10584, 4704, 3325, 624, 7379, -5180, -14426, 7166, 12518, -7565, -3607, 5121, -8524, -4051, 14749, 975, -14945, -413, 5652, -1841, 5057, 2264, -12101, -1145, 11507, -1608, -2927, 7123, -6893, -9950, 14523, 10837, -13008, -5290, 7507, -1747, 1684, 8578, -7522, -9935, 6889, 4203, -2406, 4656, -5240, -13671, 8638, 14142, -10480, -8580, 6877, -3318, -3892, 12068, 426, -14419, 596, 8679, -125, 3548]
1107C548k442j3001J2888J4062j6866n872J3134q209n333K0115k984k3451P589
1120f822J5303p940n03M354j3145O20J7435n447r753Q539m339r241J8069O814
1134A3944k3101j278J8067n633n125J0931p981j0600J3616N412r494K906q30j0795
1148i961J0990J3157j7454p754J5477k586q423J2839j91j7508O176J3138o966
1161I34k376L530q883K170J5013p256j1339J0206Q16r444J0628O624j7260k457
1175i094J5585k179o754N526m041n754J0703J972j0090L696K360r132O853J1440
1189A1091j3416q938J3729K568q919N136J941r344L720Q221m962j982K864n955
1203d246K011J1297o774j0380Q925M579r153L903O432r739l336J0205k61n527
$$ y = [3548, 1106, -11895, 993, 15055, -1811, -7683, 5451, -2758, -8091, 12024, 9040, -14411, -6822, 8481, 541, 38, 4392, -8753, -8133, 9302, 3855, -5898, 2641, -1698, -10939, 7130, 13944, -9157, -10435, 7632, 1999, -3126, 7805, -176, -10776, 2840, 8252, -1242, 1664, 834, -9961, 1029, 14186, -3268, -11022, 4455, 1869, -6554, 6285, 6094, -11414, -5238, 7900, 934, -1442, 2088, -6795, -4625, 10388, 3132, -8207, 1999, 2815, -6629, 3999, 10623, -6637, -9094, 6491, 4312, -2442, 3084, -957, -6711, 3992, 5964, -4126, -430, 1930, -7202, -349, 11091, -2325, -11263, 2466, 5034, -3885, 1251, 3192, -6152, -2432, 5789, 827, -1155, 1709, -4246, -2235, 9062, 2288, -8092, 833, 5412, -3741, 162, 6594, -3145, -6481, 3724, 3463, -2064]
1217b064K192k094j693P153m85q180M237M099p452J908R434p234p665R200M054
1232E410o921N27K570l053J510L070l807K62L226m759l39P800l441q349O022N046
1248D774o359j058N012k671k880L950K35j890N38j152k88N153j982n979L980M932
1264D315n614j706O387j489n272L232L858k909j870Q57K33J250j40k870J505K506
1280B273l445j335N087q45n708J816N018k914k609K160J277j278j30N40N79P52
1296A238k207n87L800k03m541J551L995k234k935K697K165k990j435K343Q78j642
1312a07j557R09K158j324k542J968K553k603k029K758J664k871j109K835Q60k392
1328h29n86K495P65k521o45K309J115k615q31K696N82k692m86K737j71k692J12
$$ y = [-2064, 128, -1966, -3659, 3494, 3009, -5171, -934, 3165, -4287, -2379, 7055, -179, -7844, 1356, 5410, -1511, -984, 1586, -1467, 43, 3113, -694, -432, 2794, -1965, -2304, 5496, 2055, -6294, -272, 4774, -1585, -2643, 2369, -302, -3182, 768, 1003, -887, -349, -1501, -1789, 3364, 1382, -4597, -617, 4315, -1299, -3005, 3382, 1893, -3379, -147, 3711, 802, -1068, -211, 22, 1272, 1132, -1738, -233, 2273, -1172, -2507, 2580, 1735, -3973, -2157, 2861, -53, -2662, -502, 775, -503, -633, -93, 486, 1238, -969, -1556, 2244, 2041, -2500, -949, 3046, 812, -2123, 574, 2739, -251, -1686, 657, 1535, -107, -1664, -755, 1403, 79, -2463, -495, 2058, -545, -2574, 184, 1848, -1023, -2132, 703, 1563, -829, -1415, 1080, 1845, -676, -1321, 988, 2103, -512, -1343, 1353, 1935, -757, -1243, 1494, 1323, -1369, -1257]
1345a257K498lk908k0K565m18k296K12K675l5k937L33L281p25k595O08K671o74
1363I75k545J271K442j050k458J200K240j068k324J008K147j489k174J539K181
1378A895k021k340K156J877j954j642J866J303j864j432K083J647j804j889K183
1393F4K650k740j571K923P83l155j4K623j13k438J57J590N61j654j051J264J676
1410A555k480j281L329L76l814K90L747r98k464R47J539r52m05N55J97O11j233
1427d81j023L413M76m191J34M856j915l546K437K079l178l49K460j049o85K3l70
1444i09J307J522l621j070M556o34m214L097K607m717k9M871j211l605J660R73
1460E83k25J776j947k302L210J387m282K128L525n555k402P644l37o385J518K927
$$ y = [-1257, 1241, 1238, -1670, -1690, 875, 457, -1839, -1627, 1048, 1013, -1924, -1591, 1690, 965, -1630, -1022, 1649, 975, -1570, -299, 2143, 1093, -1365, -165, 2075, 1007, -1317, -309, 1838, 349, -1825, -286, 1895, -126, -2466, -310, 1567, -387, -2029, -163, 1140, -724, -2156, -73, 1574, -230, -2119, 64, 2714, -26, -1597, 1326, 2109, -1046, -1060, 1563, 1450, -988, -831, 759, 1320, -334, -1385, -121, 1555, -925, -2206, 1123, 1499, -2315, -2025, 1722, 724, -1740, -793, 746, -206, -611, -56, 141, 752, -481, -1504, 1909, 2385, -1806, -1672, 3184, 1269, -2277, 160, 2239, -939, -1288, 1172, 123, -562, -539, -909, 398, 1920, -1701, -2771, 1785, 1151, -3063, 34, 2641, -2076, -2105, 2766, 1555, -2050, -390, 583, 358, 2134, 187, -2115, 1095, 2482, -1800, 328, 3853, -1702, -4104, 3540, 3203, -3182, -1664, 1263]
1476A263k309Q93K096l689LK976k889J040M398m976m495P813K744p312O65M529
1492B750m142n86O359k734m633L169L39p33L790k819o277N818N300p399m69N953
1508C686n254l543Q866L33q304J586M003k404K500J408o848J220O820m205j702
1523a838N972l914p012R391N398j0854j410P011k612j221N598m378m954N859M93
1538A529l129M635k047q598O622Q823q895m445P684k423m288Q481N29r786K424
1553b884N426k778K171J501r015J289J1425m761o618O831j359p658Q775O068j1429
1568c016l109Q309j431j023M193n711n048R152J412o676M246M90r376N924J1308
1583I644r565p544Q701O92m644O760k30r632L468P094m893Q10L048r141J52J3216
$$ y = [1263, -1046, -153, 1943, -1746, -1743, 1233, -1656, -616, 3782, -1194, -5689, 2124, 4868, -2444, -1779, 2750, -1392, -1978, 4381, 1647, -2986, 183, 522, -211, 3579, 760, -5517, 301, 5601, -1798, -2267, 3686, -1568, -5111, 3755, 4088, -4216, -2630, 1373, -1031, 1469, 2877, -3971, -2751, 4069, -136, -1838, 4134, 220, -6792, 2599, 7997, -2857, -4267, 2744, 132, -1089, 4509, 131, -4823, 1036, 1529, -1600, 3035, 988, -7610, -988, 7835, -1060, -5505, 2179, -244, -4532, 3949, 4478, -5308, -2884, 2542, -236, 1935, 3436, -5579, -4290, 7135, 2374, -4244, 2587, 1228, -6430, 2345, 8413, -3016, -6125, 2184, 753, -270, 3923, -1788, -6836, 2316, 3728, -2948, 1298, 1788, -7588, -1664, 9644, 79, -7465, 1236, 1928, -2716, 4044, 3814, -5818, -2350, 4744, -149, 661, 3709, -5432, -5280, 7936]
1599G936l730j0572O147K744p196N794N750j0660k759R327j374j991L800o145
1613b929m139J1161K018j0379K759M682p712K977J0686q114q896Q341L223m640
1627i62L808j333p783N440O642o385n31M119p299o63J2402k949j1664M570N696
1642C108n082K606M105q367j570Q702j133l482L860m334m565J0431K942j1205
1656c984Q08O873n453J87P711n370p445P146L246m487K102j079n851N513O164
1671F081p709j866O089m408k387R339r90j0727L606P121l986k62K366m804M1O604
1687D108k438l633L789k281m239P987K639r560n23P511k737k569M783k678m648
1702d489M783K392l718J202n1m266M457N110p264k439O693j188m207N496P44o743
$$ y = [7936, 4206, -6366, -219, 2525, -4671, 1123, 6873, -3787, -6546, 2781, 1407, -584, 3216, -2929, -7068, 4093, 6111, -4268, -1509, 3173, -4539, -1562, 9124, 1010, -7886, 455, 3678, -962, 2846, 1513, -6270, -830, 5812, -573, -1104, 3015, -4284, -4947, 7455, 4506, -7158, -2588, 3108, -1974, 632, 4737, -3630, -5200, 3502, 2369, -1113, 2747, -1587, -6152, 4279, 7221, -3984, -3176, 3697, -1756, -1569, 6142, 772, -6673, 473, 3719, -768, 1334, 255, -5596, -83, 6081, -1628, -3494, 2595, -1813, -4200, 5139, 4149, -6578, -2972, 4149, 163, -99, 2267, -2537, -2496, 4108, 1670, -1963, 1826, -455, -4694, 3293, 5932, -3628, -4151, 3360, 623, -1946, 2837, 159, -4489, 294, 2686, -1032, 170, 119, -4147, 310, 5420, -1844, -4283, 2410, 1222, -2985, 2511, 3255, -3488]
1718c488J604N155k205j058O15k784J340M610l265l570M355k61m318M500K867
1733D097o728j196N974q41k769J781o71j741K759O55k442J322M66l375K833L883
1749D007m503k990N257O49m056J930J627k986K66K355j079l47L27j951P36K993
1765B235k206l221L977J079l852J004L085k765j538K798P77k048M49O4M9J282
1781A169j095j305K073R39l098J033K970k665k221K714J310k431m1J177m79m5
1797Ej56j50N77j18j489P59K123j255k726K170J822j675j125J925J27j382L25
1814b43P44M49p45r20Q04J281j078j355J571R22j945o30J941P0k132L82J820l12
1832F24j701L58J235j26j305J41J365J69j678K55J737k05j766N66J423m38j551
$$ y = [-3488, -1884, 3271, 1066, 8, 623, -2161, -821, 3789, 524, -3046, 1309, 1048, -3270, 1230, 4097, -2631, -3827, 2147, 1306, -1463, 318, -353, -2094, 665, 1320, -1122, 200, 666, -2709, 124, 4007, -496, -3486, 1771, 2420, -1636, 294, 1921, -1065, -799, 1556, 477, 130, 457, -1494, -758, 2235, 29, -3192, 785, 1864, -1988, -984, 2101, -664, -2202, 596, 1373, -675, -226, -162, -113, 1169, 74, -1231, 842, 1781, -1317, -284, 2686, 21, -2200, 514, 1824, -607, -648, 529, 50, 5, -151, -301, 276, 158, -1331, -572, 1551, 296, -2430, -260, 1562, -113, -1238, 687, 814, -568, -243, 501, 950, 205, -715, 89, 1370, 292, -1063, 508, 1430, -515, -1145, 796, 866, -1266, -884, 936, 624, -1077, -719, 516, 390, -915, -774, 591, 760, -918, -663, 1074, 869, -897, -331, 1092, 654, -897]
1849h97Q87R21k67j756J131J039l70j304N87J067r19j375R41J354j133j248P37
1866f05J385r42q35Q41J047q57j163J183J038j339q81J271J245j382p34J299N85
1883A156j385o05J574N24j716m87J425M76j501l55J196M46j253m23J572K85j890
1900i61k09J729j62j308K32J361j64j307L08J239K30j355m34J580Q8j518O0J817
1918A226o46j800R28J743j087j376P45O17n68l42K5R61j94j410O64J879j009k059
1936a703J475K060j927j270J904L46j374L91O85k81k00l00K3J513k60k484Q19
1953e83K132j887j327K775J89k868Q44K254j688p31P93k13M84K05j418L52J721
1970A034j092j400K548L32l279O41L469j422k468J886M32j110R82J58j640J096
$$ y = [-897, -10, 911, 644, -1112, 19, 1058, 688, -616, -29, 1038, 119, -1256, -315, 1039, -94, -1342, -605, 780, -162, -997, -156, 891, 34, -1129, 54, 1092, -247, -1128, 143, 1388, 6, -728, 571, 1156, -229, -834, 740, 1264, -452, -939, 486, 962, -539, -894, 302, 748, -505, -928, 644, 929, -961, -1170, 559, 397, -911, -679, 682, 518, -789, -481, 758, 988, -367, -801, 779, 867, -651, -591, 1226, 580, -1220, -292, 1451, 364, -1012, -267, 350, -218, -560, -535, 426, 232, -1178, -514, 1365, 356, -1703, -228, 1832, -95, -1365, 539, 885, -489, -98, 587, 306, 106, -194, -171, 1342, 1082, -1402, -583, 1549, -338, -1665, 1110, 1299, -1569, -725, 1529, -159, -890, -97, -310, 174, 379, -1039, -687, 1034, -58, -1458, 1090, 1422, -1857, -1216, 2253, 831, -1637, 249, 681, -429, 553, 711, -929, 167]
1986A67Q7j445K117P99l986L32M119j117l467K404R29k605J296K239k248r06J262
2003b3p77J291J694l073j563M109L61l628K063J465l954M81M531j847l419K035
2019b54M05q84K408j155l231K377J703k835J343K658m806r47O073k46n131J895
2035f27J839k497J493K150l633l98K916j390R9L032l416l458N588J937n200J90
2051a375L080l467L09N294l073l737K653O44o74K489j417m874L673M190m742o15
2067a642M077l572k155O799j45o364J429K742j636J509J491n122M38M721j907
2082F63j715L294k838m051O262L274p039m90L888k149J45L855l135l578L768J170
2098A324k269K914j436n201L716O000m837k940M314j870k415N665P6o250J454
$$ y = [167, 254, -1191, 926, 1725, -2261, -1929, 2190, 1073, -2394, 10, 939, -1666, -370, 1869, -379, -1285, -23, -800, 491, 2185, -888, -2451, 1658, 2019, -1609, 454, 1919, -2035, -1554, 2977, 1130, -2289, -254, 151, -733, 1675, 520, -2711, -334, 1369, -1466, -123, 2535, -2271, -3218, 2855, 2609, -2522, -627, 1212, -1285, 208, 2358, -1275, -1673, 1243, -147, -48, 2984, -432, -3890, 1698, 3635, -1565, -1375, 1705, -1762, -1453, 3841, 768, -2969, -316, 328, -346, 2143, 726, -4148, -475, 3715, -1027, -1642, 2435, -1137, -3292, 3507, 3362, -3002, -1573, 1169, -467, 1042, 2533, -2589, -2151, 2570, 663, -1052, 2242, -596, -4647, 1615, 4889, -2150, -2640, 1248, -901, -756, 3099, -36, -3614, 154, 1324, -945, 1969, 533, -4668, -952, 5048, 211, -2729, 1585, -285, -2700, 2965, 3041, -3209, -1755]
2113a755L227j692J415P88n450O39O532k296m134L658o83m447N331L618o934j331
2129c514M582o65n64K732l343k857M957J080l831K445L0m941L420O073n317m116
2145c829M521L76k465L259J10n308K196L292k308N87R61m862R76O525k269n233
2161c471L301J436l501K674L110m960j651M669l81r36J549k829k431N449R74m759
2177a757J601J651l843J515M983l778m534L938J819k197J425k26l410K081K848
2192B116k702Q9J908l413p9N788j727n178K276L080k777O51K118l155r28L255
2208A322m63j190J492k129j523M410L53m600J114K504k470M4L394j754l539K898
2224a37J541j716P25l31j922K112K103l292k03K557j941r33L766o31m236J729
$$ y = [-1755, 1472, -220, 1195, 1983, -3467, -2828, 3704, 1408, -2726, 932, 249, -4198, 1133, 4751, -2183, -3514, 1068, 403, -161, 2571, -772, -3629, 1328, 2408, -1423, 1022, 1052, -3889, -469, 5604, 287, -3829, 692, 1068, -1397, 1862, 1972, -3336, -1140, 2152, -156, 431, 1392, -3470, -2494, 4031, 1762, -3471, -170, 1266, -2235, 439, 3549, -1411, -3062, 1607, 1226, 290, 1839, -990, -3421, 2028, 3002, -1757, -156, 1495, -2348, -833, 4150, 372, -4162, -224, 1595, -602, 823, 597, -2813, -732, 2116, -586, -497, 1411, -2002, -2081, 3707, 1980, -3198, -922, 2158, -619, 32, 2150, -1005, -1933, 1322, 859, -331, 1161, -968, -2491, 1919, 2272, -2328, -1214, 1290, -1180, -1136, 2258, 504, -3035, -137, 1404, -312, 413, 82, -1840, 272, 2375, -917, -1120, 1437, -504, -1437, 2329, 1698, -2538, -809]
2240h09K634j195p96P48j424J50K084j415o01J566j568j624L504P22l905K00L387
$$ y = [-809, 1825, 630, -166, 582, -842, -692, 1392, -23, -624, 942, -626, -2250, 1254, 1976, -1929, -1729, 1658]
$$ [...]
8191c
##END NTUPLES=NMR FID
##END=
