##TITLE=1H_Pr AmC2Boc2
 200.13MHz,CDCl3,
 8 sc
 
 30.6.2025
##JCAMPDX= 6.0         $$ Bruker NMR JCAMP-DX V2.0
##DATA TYPE= NMR FID
##DATA CLASS= NTUPLES
##ORIGIN= UXNMR, Bruker Analytische Messtechnik GmbH
##OWNER= pz
$$ XWIN-NMR		Version 3.5
$$ Mon Jun 30 13:55:00 2025 Russian Standard Time (UT+4h)  she@DPX200
##.OBSERVE FREQUENCY= 200.1313
##.OBSERVE NUCLEUS= ^1H
##.DELAY= (6, 6)
##.ACQUISITION MODE= SIMULTANEOUS
##.ACQUISITION SCHEME= undefined
##.AVERAGES= 8
##.DIGITISER RES= 18
##SPECTROMETER/DATA SYSTEM= spect
##.PULSE SEQUENCE= zg30
##.SOLVENT NAME= CDCl3
##.SHIFT REFERENCE= (INTERNAL, CDCl3, 0, 14.3821)
##AUDIT TRAIL= $$ (NUMBER, WHEN, WHO, WHERE, WHAT)
$$ ##TITLE= Audit trail, XWIN-NMR		Version 3.5
$$ ##JCAMPDX= 5.01
$$ ##ORIGIN= Bruker BioSpin GmbH
$$ ##OWNER= she
$$ F:/spectra/data/she/nmr/H-C/1/audita.txt
$$ ##AUDIT TRAIL=  $$ (NUMBER, WHEN, WHO, WHERE, WHAT)
(   1,<2025-06-30 13:53:43.93 +0400>,<she>,<DPX200>,
      <created by zg, POWCHK disabled, PULCHK disabled
       configuration hash MD5:
       00 E9 B6 7A A2 85 ED C7 34 08 36 98 17 FE 4E 26
       data hash MD5: 16K
       71 95 C8 59 DF A4 01 B0 29 85 FB 6B 7D 85 FD E6>)
$$ ##END=
$$ 
$$ hash MD5
$$ 20 31 62 9D 76 E8 63 13 D2 74 6F E5 8A B1 32 38
##$RELAX= 
##$RELAX= 
##$RELAX= 
##$RELAX= 
##$RELAX= 
##$RELAX= 
$$ Bruker specific parameters
$$ --------------------------
##$DU= <F:/spectra>
##$EXPNO= 1
##$NAME= <H-C>
##$PROCNO= 1
##$TYPE= <nmr>
##$USER= <she>
##$AMP= (0..31)
100 100 100 100 100 100 100 100 100 100 100 100 100 100 100 100 100 100 
100 100 100 100 100 100 100 100 100 100 100 100 100 100 
##$AQSEQ= 0
##$AQ_mod= 1
##$AUNM= <au_zg>
##$AUTOPOS= <>
##$BF1= 200.13
##$BF2= 200.13
##$BF3= 200.13
##$BF4= 200.13
##$BF5= 200.13
##$BF6= 200.13
##$BF7= 200.13
##$BF8= 200.13
##$BYTORDA= 1
##$CFDGTYP= 0
##$CFRGTYP= 5
##$CHEMSTR= <none>
##$CNST= (0..31)
1 1 145 1 1 1 1 1 1 1 1 1 1 1 1 1 1 1 1 1 1 1 1 1 1 1 1 1 1 1 1 1 
##$CPDPRG= <>
##$CPDPRG1= <>
##$CPDPRG2= <>
##$CPDPRG3= <>
##$CPDPRG4= <mlev>
##$CPDPRG5= <mlev>
##$CPDPRG6= <mlev>
##$CPDPRG7= <mlev>
##$CPDPRG8= <mlev>
##$CPDPRGB= <>
##$CPDPRGT= <>
##$D= (0..31)
0 0.7 0 0 0 0 0 0 0 0 0 0.03 0 0 0 0 0 0 0 0 0 0 0 0 0 0 0 0 0 0 0 0 
##$DATE= 1751277223
##$DBL= (0..7)
120 120 120 120 120 120 120 120 
##$DBP= (0..7)
150 150 150 150 150 150 150 150 
##$DBP07= 0
##$DBPNAM0= <>
##$DBPNAM1= <>
##$DBPNAM2= <>
##$DBPNAM3= <>
##$DBPNAM4= <>
##$DBPNAM5= <>
##$DBPNAM6= <>
##$DBPNAM7= <>
##$DBPOAL= (0..7)
0.5 0.5 0.5 0.5 0.5 0.5 0.5 0.5 
##$DBPOFFS= (0..7)
0 0 0 0 0 0 0 0 
##$DE= 6
##$DECBNUC= <off>
##$DECIM= 32
##$DECNUC= <off>
##$DECSTAT= 4
##$DIGMOD= 1
##$DIGTYP= 9
##$DL= (0..7)
0 120 120 120 120 120 120 120 
##$DP= (0..7)
150 150 150 150 150 150 150 150 
##$DP07= 0
##$DPNAME0= <>
##$DPNAME1= <>
##$DPNAME2= <>
##$DPNAME3= <>
##$DPNAME4= <>
##$DPNAME5= <>
##$DPNAME6= <>
##$DPNAME7= <>
##$DPOAL= (0..7)
0.5 0.5 0.5 0.5 0.5 0.5 0.5 0.5 
##$DPOFFS= (0..7)
0 0 0 0 0 0 0 0 
##$DQDMODE= 0
##$DR= 18
##$DS= 0
##$DSLIST= <SSSSSSSSSSSSSSS>
$$ [...]
##$SUBNAM0= <"">
##$SUBNAM1= <"">
##$SUBNAM2= <"">
##$SUBNAM3= <"">
##$SUBNAM4= <"">
##$SUBNAM5= <"">
##$SUBNAM6= <"">
##$SUBNAM7= <"">
##$SUBNAM8= <"">
##$SUBNAM9= <"">
##$SW= 18.0517328524113
##$SWIBOX= (0..15)
0 0 2 0 0 0 0 0 0 0 0 0 0 0 0 0 
##$SW_h= 3612.71676300578
##$TD= 16384
##$TD0= 1
##$TE= 0
##$TE2= 300
##$TE3= 300
##$TEG= 300
##$TL= (0..7)
0 120 120 120 120 120 120 120 
##$TP= (0..7)
150 150 150 150 150 150 150 150 
##$TP07= 0
##$TPNAME0= <>
##$TPNAME1= <>
##$TPNAME2= <>
##$TPNAME3= <>
##$TPNAME4= <>
##$TPNAME5= <>
##$TPNAME6= <>
##$TPNAME7= <>
##$TPOAL= (0..7)
0.5 0.5 0.5 0.5 0.5 0.5 0.5 0.5 
##$TPOFFS= (0..7)
0 0 0 0 0 0 0 0 
##$TUNHIN= 0
##$TUNHOUT= 0
##$TUNXOUT= 0
##$USERA1= <user>
##$USERA2= <user>
##$USERA3= <user>
##$USERA4= <user>
##$USERA5= <user>
##$V9= 5
##$VALIST= <valist>
##$VCLIST= <CCCCCCCCCCCCCCC>
##$VD= 0
##$VDLIST= <DDDDDDDDDDDDDDD>
##$VPLIST= <PPPPPPPPPPPPPPP>
##$VTLIST= <TTTTTTTTTTTTTTT>
##$WBST= 1024
##$WBSW= 4
##$XGAIN= (0..3)
0 0 0 0 
##$XL= 0
##$YL= 0
##$YMAX_a= 93558
##$YMIN_a= -110361
##$ZGOPTNS= <>
##$ZL1= 120
##$ZL2= 120
##$ZL3= 120
##$ZL4= 120
##$ABSF1= 10
##$ABSF2= 0
##$ABSG= 5
##$ABSL= 3
##$ALPHA= 0
##$AQORDER= 0
##$ASSFAC= 0
##$ASSFACI= 0
##$ASSFACX= 0
##$ASSWID= 0
##$AUNMP= <proc_1d>
##$AZFE= 0.1
##$AZFW= 0.1
##$BCFW= 1
##$BC_mod= 2
##$BYTORDP= 1
##$COROFFS= 0
##$CY= -3
##$DATMOD= 1
##$DC= 2
##$DFILT= <>
##$DTYPP= 0
##$F1P= 0
##$F2P= 0
##$FCOR= 0.5
##$FTSIZE= 0
##$FT_mod= 4
##$GAMMA= 1
##$GB= 0.15
##$INTBC= 1
##$INTSCL= 1
##$ISEN= 128
##$LB= 0.25
##$LEV0= 0
##$LPBIN= 0
##$MAXI= 10000
##$MC2= 0
##$MEAN= 0
##$ME_mod= 0
##$MI= 1.114404
##$NCOEF= 0
##$NC_proc= 0
##$NLEV= 6
##$NOISF1= 3.799351
##$NOISF2= 2.8
##$NSP= 1
##$NTH_PI= 0
##$NZP= 0
##$OFFSET= 14.38212
##$PC= 1
##$PHC0= -1207.985
##$PHC1= 22.19222
##$PH_mod= 1
##$PKNL= yes
##$PPARMOD= 0
##$PSCAL= 0
##$PSIGN= 0
##$REVERSE= no
##$SF= 200.129724274929
##$SI= 16384
##$SIGF1= 3
##$SIGF2= 2
##$SINO= 400
##$SIOLD= 16384
##$SREGLST= <1H.CDCl3>
##$SSB= 0
##$STSI= 0
##$STSR= 0
##$SW_p= 3205.1282051282
##$SYMM= 0
##$S_DEV= 0
##$TDeff= 0
##$TDoff= 0
##$TI= <>
##$TILT= no
##$TM1= 0
##$TM2= 0
##$TOPLEV= 0
##$USERP1= <user>
##$USERP2= <user>
##$USERP3= <user>
##$USERP4= <user>
##$USERP5= <user>
##$WDW= 1
##$XDIM= 8192
##$YMAX_p= 0
##$YMIN_p= 0
$$ End of Bruker specific parameters
$$ ---------------------------------
##NTUPLES= NMR FID
##VAR_NAME=  TIME,          FID/REAL,        FID/IMAG
##SYMBOL=    X,             R,               I
##VAR_TYPE=  INDEPENDENT,   DEPENDENT,       DEPENDENT
##VAR_FORM=  AFFN,          ASDF,            ASDF
##VAR_DIM=   8192,          8192,            8192
##UNITS=     SECONDS,       ARBITRARY UNITS, ARBITRARY UNITS
##FACTOR=    0.0002768,     1,               1
##FIRST=     0,             0,               0
##LAST=      2.2672688,     0,               0
##MIN=       0,             -110361,         0
##MAX=       2.2672688,     93558,           0
$$ Real data points
##PAGE= N=1
##DATA TABLE= (X++(R..R)), XYDATA
$$ [...]
1774b46L86K15m40mK11k8l74O2K82ml32K24J8m77O84K00l12j04L19k85N6K66l26
$$ -246 140 355 -85 -89 122 94 -280 -218 64 60 -272 -48 -30 -507 177 377 65 -39 280 -5 51 317 -9
1797iQ8P7L2K37n66M60kp27K78K72k72o3Q9j01L61k71m8J15l1L37k63p6K29K54
$$ -9 79 156 188 425 -141 319 317 -410 -132 140 -132 -195 -106 -207 154 -117 -165 -50 -81 256 -7 -83 146 400
1821D00n35L02M8l01J72k12L36l01j69J81J37P0K5k36k42M69j6l9Q1l4J1l52L50
$$ 400 -135 167 215 -86 86 -126 210 -91 -260 -79 58 128 153 -83 -325 144 128 89 170 136 147 -205 145
1844A45K09m80q2L22J95m53q8M90n86K37J86O2p9k55N01l17l27N81r6k01M34m3
$$ 145 354 -126 -208 114 309 -144 -232 258 -328 -91 95 157 78 -177 324 7 -320 261 165 -36 398 355
1866C55m63K76p2J6k46Q1K38l02k23N43l2m81L42J20k31Q3K44Q3j73j08L65l39
$$ 355 -108 168 96 112 -134 -53 185 -117 -340 203 171 -310 32 152 -79 4 248 331 158 50 415 76
1888G6j93RJ87n6o2o1j15J63j49K85j94J04k9K11m53M58p0l04O44l92n0K59o9
$$ 76 -117 -108 79 23 -39 -100 -215 -52 -201 84 -110 -6 -35 176 -277 181 111 -193 451 59 9 268 199
1911A99k0j11j05m7j92K04J61k72j35N66j54l95L64j59o6M04l09K61k59K43q4
$$ 199 179 68 -37 -84 -276 -72 89 -183 -318 248 94 -301 63 -96 -162 242 -67 194 -65 178 94
1932I4l37L18J94j57l28L76ll40RJ00N4n7n1J01j89J28M95m36q5L94k57q2J85
$$ 94 -243 75 269 112 -216 160 157 -183 -174 -74 -20 -77 -128 -27 -216 -88 407 -29 -114 280 23 -59 126
1955A26L3j06k71N18l34K33l56L48k89J3K53n91M41k35L25k70K74k0j84K44r2
$$ 126 159 53 -218 300 -34 199 -157 191 -98 -85 168 -423 18 -217 108 -162 112 92 -92 152 60
1976F0J39l04J05L10j26q5j13j17J03o4kN5j33j28L89l21L30J25l66L29M4k73
$$ 60 199 -105 0 310 184 99 -14 -131 -28 -92 -94 -39 -172 -300 89 -232 98 223 -143 186 230 -43
1998d3K01k52Q5J93m1r3J61o16M07J43l72%K11j68J80j10J9m8J92J36j9k49J6
$$ -43 158 -94 -9 184 143 50 211 -405 2 145 -227 -227 -16 -184 -4 -114 -95 -143 49 185 166 -83 -67
2021f7M13n18L92k05j77j53L6K92k45J00L45l80j33M25M9o16O44p3k50J10J57
$$ -67 346 -172 220 15 -162 -315 -279 13 -232 -132 213 -167 -300 125 174 -442 202 129 -121 -11 146
2042A46J07l39L3J82k03J61r0Q4l38P8K26J10l35M59Om28J05J2K62k42J4K13j73
$$ 146 253 -86 -53 129 -74 87 -3 81 -257 -179 47 157 -178 281 287 -141 -36 -24 238 -4 10 223 50
2065E0O2k70K50M4MR9j72k54K76l80O9p6L30k81J21J92k82K13j08P4K80j22J27
$$ 50 112 -158 92 136 140 239 67 -187 89 -291 -222 -298 32 -249 -128 64 -218 -5 -113 -39 241 119 246
2088B46l52p9L75p5O8P5O1o21K80j21Q1Q5l24J77j89K67K76l37j10L85j95j35
$$ 246 -106 -185 190 115 183 258 319 -302 -22 -143 -62 23 -301 -124 -313 -46 230 -107 -217 168 -27 -162
2110a62M44P8m15J07j44J68o5l75O84m62j97M26j36j97L84r7j78J87Q3J19m38
$$ -162 282 360 -55 52 -92 76 11 -364 320 -142 -339 87 -49 -246 138 41 -137 50 133 252 -186
2131a86l2O14p63K40j4l7l0K96P6l34K23j47k7K36k38K17j57j55M80k44o4J39
$$ -186 -218 396 -367 -127 -141 -178 -208 88 164 -170 53 -94 -121 115 -123 94 -63 -218 262 18 -46 93
2153I3j7j55k3P9Q7K1jj59K3m1K21k63K44q6j63m8J44K02l17m9R6J73J44l8l0
$$ 93 76 -79 -102 -23 64 85 84 -75 -52 -93 128 -135 109 23 -140 -188 -44 158 -159 -208 -112 61 205 167 137
2178A37l36K83J23k24J68j55M1j58k0J5ol8M3J92m17L95L1k9L8O1j21J93k61K69
$$ 137 -199 84 207 -17 151 -4 37 -121 -141 -126 -132 -170 -127 65 -352 43 74 45 83 144 23 216 -45 224
2202B24n8l27K17J59l83J29N21p83m6L53p9M9k73L02j75K26j67k5O11l28l9K2
$$ 224 166 -161 56 215 -168 -39 482 -301 -347 6 -73 -24 -297 5 -170 56 -111 -136 475 147 108 130
2224A30k49L22l24P0o1K04j8m08P2L57r6k44m7R9J92P7k71kJ58J28Oj67P0J54
$$ 130 -119 203 -121 -51 -112 92 74 -334 -262 95 -1 -245 -292 -193 -1 76 -195 -197 -39 89 95 -72 -2 152
2248A52o7j19K07j22k94o0J25J07mp3J96k44J10P1j94M99j95k65M10l59O2k2P6
$$ 152 85 -34 173 51 -243 -303 -178 -71 -75 -148 48 -196 -86 -15 -209 290 95 -170 240 -119 -57 -79 -3
2271cj05K9l1O8R0k09K20J2k75N2k8J98k36K97k24O0O5L4L9l1L39k96k97L61j26
$$ -3 -108 -79 -110 -42 48 -161 59 71 -204 -152 -180 18 -218 79 -145 -85 -20 14 53 22 361 65 -232 129 3
2296Ck36L1L36q9k54J51k6J42k89N03l09j52K61J02j19j56K42k14M56m60R5j23
$$ 3 -233 -202 134 45 -209 -58 -84 58 -231 272 -37 -189 72 174 55 -101 141 -73 383 -77 18 -105
2318a05O0k9M8j64M48j57k19J10r3%J47L66m70l3K20n4j3j31O7o9QJ36j29J31
$$ -105 -45 -74 -26 -190 258 101 -118 -8 -101 -101 46 412 -58 -91 129 75 62 -69 -2 -71 -63 73 -56 75
2342G5k70K44Q3j88r7J34J66k72M13j85k12M37l43n6K81j55q2K1K4J83l77L2j3
$$ 75 -195 49 132 -56 -153 -19 147 -125 288 103 -109 328 -15 -71 210 55 -27 -6 18 201 -176 -144 -157
2365a57m13J44L91l0j64J19P5j18L0M7Q8j89K56Kl7j31K28J21l60P6N8j52J29
$$ -157 -570 -426 -35 -65 -229 -110 -35 -153 -123 -76 12 -177 79 81 44 -87 141 262 -98 -22 36 -116 13
2388A3k95L72p2l61L03p5J52LJ28j74m5K23m90K79J91O5j45k84L23k15o6J29K45
$$ 13 -282 90 18 -343 -40 -115 37 40 168 -6 -51 172 -318 -39 152 217 72 -212 111 -104 -170 -41 204
2411B04j40M9k47rj65L18L8oj94L91k73J49L11m12Q2N6l39J79j19J17jk38O6k5
$$ 204 64 113 -134 -143 -308 10 48 42 -152 239 -34 115 426 14 96 152 -187 -8 -127 -10 -11 -249 -183 -208
2435b08M0K68j82k36J14J67m1jl30L59L02j56p0K25l16K0j00J6J49J96Kj35o9
$$ -208 -168 100 -82 -318 -204 -37 -78 -79 -409 -50 252 96 26 251 -65 -45 -145 -129 20 216 218 83 14
2458A4M1n6k73J35K10j51j10L09j29L22m26J12K63k57M5l7k87J87L3J83l2P7k35
$$ 14 55 -1 -274 -139 71 -80 -190 119 -10 312 -114 -2 261 4 49 12 -275 -88 -55 128 96 173 -62
2481f2O8k26K46n1J84j27J47j47Q5p6j88K53p0j53P6J63j65q3J64k74J30J51J63
$$ -62 6 -220 26 -25 159 32 179 32 117 41 -147 106 36 -117 -41 122 -43 -126 38 -236 -106 45 208
2504B08l70L3L19k53l5J53l8Q1j22j01K32k08J48j03j44O5K97o1j68oJ77k32J26
$$ 208 -162 -129 190 -63 -98 55 17 98 -24 -125 107 -101 47 -56 -200 -135 162 101 -67 -73 104 -128 -2
2527bL1k34L25o3N1O2k11L09J65n26K60j92l8J33p5k24K92P5j14n9L03j34j02
$$ -2 29 -205 120 57 108 170 -41 268 433 -93 167 -25 -63 70 -5 -229 63 138 24 -35 268 134 32
2550C2k52pL73m01K47j90K69J04j76LJ3pk6P8k79J34p0r5L18j87J61j15L4j68
$$ 32 -220 -227 146 -255 -8 -198 71 175 -1 2 15 8 -18 60 -219 -85 -155 -250 68 -119 42 -73 -39 -207
2574b07N6J78j19O8j54J03k0M01l22Pp8J34j99J11P1r4O8r2k38N09j26j21k3J84
$$ -207 -151 27 -92 -24 -178 -75 -95 306 -16 -9 -87 47 -152 -41 30 -64 4 -88 -326 183 57 -64 -87 97
2598I7k37J69j34n5M1J38m6K51l79K29j64j6O2L7k80M30k37k88O28m70K64l22
$$ 97 -140 29 -105 -160 -119 19 -27 224 -155 74 -90 -106 -44 -7 -287 143 -94 -382 246 -224 40 -282
2620b82L78J28k71J21%LL0j66M8J23NM0l69J05J17Q8m32L41L4J84J13j37k34J36
$$ -282 96 224 -47 74 74 77 107 -59 -11 112 117 157 -212 -107 10 98 -334 7 41 225 338 201 -33 103
2644A03j03o0J79%j06P8Q3j5m9O9n4k81J08k14J20L21j98j83J71J33k12J88j37
$$ 103 0 -60 119 119 13 91 174 159 110 179 125 -156 -48 -262 -142 179 -19 -202 -31 102 -110 78 -59
2667e9r8k1P03n06J60q7j03k2k01J86J6K6q6m8j90K84nk8J59k29N0M34l78K38
$$ -59 -157 -178 525 19 179 92 -11 -33 -234 -48 -32 -6 -92 -140 -330 -46 -51 -79 80 -149 -99 335 -43 195
2691A95j47j25J44k75j22N27k63j87J73lK03j95J87r7j49J32j19P6q1J26L04j57
$$ 195 48 -77 67 -208 -330 197 -66 -253 -80 -83 120 -75 112 15 -134 -2 -121 -45 -126 0 304 147
2713A47j65J74m68L38j11Q7L2j16K18j09J56J55j62j29K47l29n5K22q1M01n94
$$ 147 -18 156 -312 26 -85 2 34 -82 136 27 183 338 176 47 294 -35 -90 132 51 452 -142
2734a42L12mR4k15Q6K35l41N6k74L30l2j48n8L21l49K23nl99N84k08O4j92J25
$$ -142 170 166 260 45 131 366 25 81 -193 137 105 -43 -101 220 -129 94 89 -310 274 66 130 -62 63
2757F3J45l97J80J49k27j78K56J05j24J2L5k43K77K4P6j89j10M10k04J10l95J84
$$ 63 208 -189 -9 140 -87 -265 -9 96 -28 -16 19 -224 53 77 153 -36 -146 264 60 170 -225 -41
2779d1o0K78k41K07k29n1J78kp0k50L17j50Q9p5l5QN4r4j10L23m4l6L8J53m2j98
$$ -41 -101 177 -64 143 -86 -137 41 39 -31 -281 36 -114 -25 -100 -135 -127 -73 -167 -277 46 2 -34 4 157 115 -83
2805h3R6O5p6j16k12L17O4q5Q2k68K51j74K60l30K51N0k34K62O4l68K89J5k43
$$ -83 13 78 2 -114 -326 -9 55 -30 52 -216 35 -139 121 -209 42 92 -142 120 184 -184 105 120 -123
2828a23J10J25k31N4p6M1l6L02j88j91J87P4p5j19j36J08lJ88J31k20J81J23m7
$$ -123 -13 112 -119 -65 -141 -100 -136 166 -22 -213 -26 48 -27 -146 -282 -174 -177 11 142 -78 103 226 179
2851A79j53m7O7K6K1j8k01J54m3m5m1J47R0k34P1j13L72l02P4l2O3J35J27l38
$$ 179 26 -21 46 72 93 75 -126 28 -15 -60 -101 46 136 -98 -27 -140 232 -70 4 -28 35 170 297 -41
2875d1P3k28J96o6j90m4L36j37jK52M7k58J87k10J57L9N0k14j12N4K35k28J15
$$ -41 32 -196 0 -66 -256 -300 36 -101 -102 150 197 -61 126 -84 73 112 162 -52 -164 -110 125 -103 12
2898A2ml58O05n52J39k9lk9J03K06j97L08r9j19J16j70J24j52N5nM07l67n8K38
$$ 12 8 -350 255 -297 -158 -187 -190 -219 -116 90 -107 201 102 -17 99 -71 53 -99 -44 -49 358 -9 -67 171
2922A71k37J33J81m67J50J35j72K61M5m65L72j81M9q1J12J34j94K11j88K48j39
$$ 171 -66 67 248 -219 -69 66 -106 155 200 -265 107 -74 -25 -106 6 140 -54 157 -31 217 78
2943G8J57k55l9P0M6k22K05k23J28k40L17j80J53J24j08J07j58K0M83k44m09L58
$$ 78 235 -20 -59 11 57 -165 40 -183 -55 -295 22 -158 -5 119 11 118 -40 -20 463 219 -190 168
2965A68p9k46J74P4k24K07j34J84j30j9J4o4j85L01j38K67l30J31O5Q7j98O9j53
$$ 168 89 -157 17 91 -133 74 -60 124 -6 -25 -11 -75 -260 41 -97 170 -160 -29 36 123 -75 -6 -159
2988a59L84k13j30K87l2l43J33J31n3P1k57J35N2j47L8J8J3l3P4O8J49l03m6M03
$$ -159 225 12 -118 169 137 -206 -73 58 5 76 -181 -46 6 -141 -103 -85 -72 -105 -31 37 186 -117 -163 240
3012B40k51kk15L75k22J68p3j6j24J11j1j78K79l57K82N6k51L41j84m9L8n6K5
$$ 240 -11 -13 -228 147 -75 93 20 4 -120 -9 -20 -198 81 -276 6 62 -189 152 -32 -81 -43 -99 -74
3035g4L07K36m21q3pj04K19k51L96N3l44o6L73k70r7Q2j40J67J8m6O1M5K6j15
$$ -74 233 469 48 -35 -42 -146 73 -178 218 271 -73 -139 234 -36 -133 -51 -191 -24 -6 -52 9 54 80 -35
3059c5l03K03J39j0J53l63L88%l17R3m5J63M02m03j0j32P4k0m0K8J02j95j8R8
$$ -35 -338 -135 4 -6 147 -216 172 172 -145 -52 -97 66 468 65 55 -77 -3 -23 -63 -35 67 -128 -146 -48
3083d8j13K22Q2j29m5k92N63P7j61p0l22K26k7k1l02K63J21q9K24k54L76l40Q3
$$ -48 -161 61 143 14 -31 -323 240 317 156 86 -236 -10 -37 -58 -360 -97 24 -65 159 -95 281 -59 24
3106B4J2K2k05K61j16j45L9J33Q8l66K50K72l78K8Q7K46j51O3j70r9k91M63rk3
$$ 24 36 58 -147 114 -2 -147 -108 25 113 -253 -3 269 -109 -81 6 252 101 164 -6 -105 -396 67 58 35
3130C5J49k24R9j94K81o0n0q6L54j27j77j93K28n9k56K67q4J0K8J33k39M1Q7J3
$$ 35 184 -40 59 -135 146 86 36 -50 304 177 0 -193 35 -24 -280 -13 -97 -87 -59 74 -165 -124 -37 -24
3154b4%L9J85M8m01Q7K42j82n7n5Q8J90j68j29L03j45j65K36n3nL9LR3j6j6n04
$$ -24 -24 15 200 248 -153 -66 176 -6 -63 -118 -30 160 -8 -137 166 21 -144 92 39 34 73 76 169 153 137 -367
3180c67L69j07M14k37k36J0J20r0J79k62K24J55j73J70j74O7m3O8k2M8J1j16q3
$$ -367 2 -105 309 72 -164 -154 -34 -124 55 -207 17 172 -1 169 -5 62 19 87 65 113 124 8 -75
3203g5O7L2k19J76j6j5l3J16N9o4j5j72o7J47J50k20J06q5K63k65K90O0k5j56
$$ -75 -8 24 -195 -19 -35 -50 -83 33 92 28 13 -159 -226 -79 71 -149 -43 -128 135 -130 160 220 195 39
3227C9j18N6M5K62j93k57q8L52k20K55o9R5L8j54j80N8j66J37O5K07j87J11j13
$$ 39 -79 -23 22 284 91 -166 -254 98 -122 133 64 159 197 43 -137 -79 -245 -108 -43 164 -23 88 -25
3250b5j13K57j85j59k1J31K25L9j07Q2j42o9K22k3l9j14M38j92n30M30j98J12
$$ -25 -138 119 -66 -225 -246 -115 110 149 42 124 -18 -87 135 112 73 -41 397 205 -325 105 -93 19
3272A9K06o1l9l72OL44k53J41J6q2RN9j12LJ06N3l5n9L28k74l0L61l8k93R6l52
$$ 19 225 164 125 -247 -241 103 -150 -9 7 -75 -66 -7 -119 -116 -10 43 8 -51 277 3 -27 334 296 3 99 -253
3298b53J82K5r9J20l8Q1R2o7k17QJ01K9qj5L18p2K0k57J36k30K40l4r3Q5J48k65
$$ -253 -71 -46 -145 -25 -63 18 110 43 -174 -166 -65 -36 -44 -59 259 187 207 -50 86 -144 96 62 -31 54 202 -63
3324f3j4P3R6P2j86K22j43j29j4J0J19m2p7j7j66K96j11M2j25l3L33j98J04k41
$$ -63 -77 -4 92 164 -22 200 57 -72 -86 -76 43 1 -76 -93 -259 37 -74 -32 -157 -190 143 -55 49 -192
3348a92J78K81j80K1j41K79l68K9O0K12J14k91j1J79k76J91o2K04k47n4J35J07
$$ -192 -14 267 87 108 -33 246 -122 -93 -33 179 293 2 -9 170 -106 85 23 227 -20 -74 61 168
3370A68n8j27J48j3l36J16K48j49n0q8J40J88l6m2j55k18L93r6K7O5p9Nk42J30
$$ 168 110 -17 131 118 -218 -102 146 -3 -53 -141 -1 187 151 109 -46 -264 129 33 60 125 46 51 -191 -61
3394f1J26o7J2J45j42L2n9q5J62p1j98j12M34n5j47L07n11L45j56l9j9l4L18l71
$$ -61 65 -2 10 155 13 45 -14 -99 63 -8 -206 -318 116 61 -86 221 -290 55 -101 -140 -159 -193 125 -246
3418b46L20l32L13l4j90L38k16L20l93L64k36k12P7J73R9l11K91J7J26k65J73
$$ -246 74 -258 55 21 -169 169 -47 273 -120 244 8 -204 -127 46 145 -166 125 142 268 3 176
3439A76j80j6j54J74J1j64nk05M30p2K90k2j42k21L92m35m7J19J9L59l00Q2j81
$$ 176 -4 -20 -174 0 11 -153 -158 -363 67 -5 285 263 121 -100 292 -143 -190 -71 -52 307 7 89 -92
3462i2j22J59K12j87j29J88J76l62J64rJ24j3M0j04J29j05k72L27j2mn4q7k21
$$ -92 -214 -55 157 -30 -159 29 205 -157 7 -2 122 109 149 45 174 69 -203 124 112 108 54 -33 -254
3485b54M33j96N2J63m65K64K9k0L3j31J36j13J16R2k39J23k2k63mM04l13K44O
$$ -254 179 -17 35 198 -267 -3 26 6 39 -92 44 -69 47 139 -100 23 1 -262 -266 138 -175 69 75
3508G5k02N52m88k29N19k71N9m0l4j67J72J44j05p2L47k25J9q0q6J51k23J94q0
$$ 75 -127 425 -63 -292 227 -44 15 -25 -59 -226 -54 90 -15 -87 260 35 54 -26 -112 39 -184 10 -70
3531g0K81k5j30k24K05j52q7L60o9Pl0k22j39K56L11k05j57L03k13p3j1LQ6k8
$$ -70 211 186 56 -168 37 -115 -202 158 89 96 66 -156 -295 -39 272 67 -90 213 0 -73 -84 -81 5 -23
3555b3O3j48J07M5Q1j71L8r9l6L2J02j32p7L60nl64L22j87K55k42r3K41O9k86
$$ -23 40 -108 -1 44 125 -46 -8 -107 -143 -111 -9 -141 -218 142 137 -227 95 -92 163 -79 -172 69 138 -148
3579a48P9J77m24L09j0K78j27j99j86J13P3K19k96J5K26k99M89l85J72j88J04
$$ -148 -69 108 -316 -7 -17 261 134 -65 -251 -138 -65 154 -142 -127 99 -200 289 -96 76 -112 -8
3600hO6m4J9Kk5q7R2PJ37k55J03k84L57j18l54O34o71K05k5Q8L28k78j74J34K64
$$ -8 58 14 33 35 10 -77 15 22 159 -96 7 -277 80 -38 -392 242 -429 -224 -249 -161 167 -111 -285 -151 113
3625A13R2m01R3J75j12J3r1m1K68j51J50k21J84n0j23K54M7k67J05J01m42M84
$$ 113 205 -196 -103 72 -40 -27 -118 -159 109 -42 108 -113 71 21 -102 152 199 -68 37 138 -304 180
3647A80l95O8K31j94J73j00J64l07K96r8J15J3k54R6J7rj01K32m5l0j4J01j62
$$ 180 -215 -147 84 -110 63 -37 127 -180 116 18 133 146 -108 -12 5 -4 -105 127 82 52 38 139 -23
3670b3k24M9J22J58k1J21j86J77k68P4k0J28l1R2l2p9Pj22l0J75k33L46l87N09
$$ -23 -247 -198 -76 82 61 182 -4 173 -95 -21 -41 87 56 148 116 37 44 -78 -108 67 -166 180 -207 302
3694C02j57k23J74j01N0q0j22q0OK56K4k5r1J29M9j09o4J04p0L9o0j2Jq5K44m7
$$ 302 145 -78 96 -5 45 -35 -157 -237 -231 25 49 24 -67 62 111 2 -62 42 -28 11 -49 -61 -60 -145 99 52
3720E2k08L77n0k55J98j14O9j9P3k00J30j60R6j98M08j26j4Q6k38J21j90J15o7
$$ 52 -156 221 171 -84 114 0 69 50 123 -77 53 -107 -11 -209 199 73 59 145 -93 28 -162 -47 -114
3743a14j75N41j18l43L26j52L38o32L43j83K48p9j12J52l2k71O36m42K1j15L10
$$ -114 -289 252 134 -209 117 -35 303 -329 14 -169 79 0 -112 40 8 -263 373 -69 -48 -163 147
3764A47j67P7q9j01J62n7J93n3k67L92k15q2j94M13r6k76J10L70l02N3j1j97O1
$$ 147 -20 57 -32 -133 29 -28 165 112 -155 237 22 -60 -254 159 63 -213 -103 267 -35 18 7 -190 -129
3787a29K05J97k75j31J39J57l15J86q2M31j35k07r1J43j31j09R5J04R5j89K97
$$ -129 76 273 -2 -133 6 163 -152 34 -48 383 248 41 -50 93 -38 -147 -52 52 147 -42 255
3808B55j41l94L59j72L04j04o0Oj68J39q1l5K55k64M0J58j86K31k56K66j9J8j06
$$ 255 114 -280 79 -93 211 107 47 53 -115 24 -57 -92 163 -101 -61 97 -89 142 -114 152 133 151 45
3831D5L4K90k70j88J20r1R4r1J09j23j55L70nk35k62L37l65K02J40j04K97k79
$$ 45 79 369 99 -89 31 -60 34 -57 52 -71 -226 144 139 -96 -358 -21 -386 -184 -44 -148 149 -130
3853a30J33k38m1L28J0L1LK07o4k83n9K80o36M62l9o8J29J4mM0q9J68j21j00J45
$$ -130 3 -235 -276 52 62 93 96 303 239 -44 -103 177 -459 3 -36 -104 25 39 35 75 -14 154 33 -67 78
3878G8j00M0J34jk66n6N64o29J98J61k77L55j43r7l5J74J89m93K59R4k94J51j93
$$ 78 -22 18 152 151 -115 -171 393 -236 -38 123 -154 201 58 -39 -74 100 289 -204 55 149 -145 6 -187
3901a87N0O4L5L4k36N34l64KO6j99J87j24J07rJ41k78M40k64k88M30k56J70q4
$$ -187 -137 -73 -38 -4 -240 294 -70 -68 -2 -201 -14 -138 -31 -40 101 -177 263 -1 -289 141 -115 55 -29
3924b9K8j62K45l1k31L59l12R3j2J69l98M04k93L42M3k86M2J28Q3l37K76k1j68
$$ -29 -1 -163 82 51 -180 179 -133 -40 -52 117 -281 123 -170 172 215 -71 -29 99 182 -155 121 100 -68
3947f8J86l44Q8M00n88R1J95k39K20K08k17K58j86K6j09q4K22j53J42Pr3J89l79
$$ -68 118 -226 -138 262 -326 -235 -40 -279 -59 149 -68 190 4 30 -79 -163 59 -94 48 55 -38 151 -228
3970b28L43l33N11n37M90m35J28l1J20O8J25r4k43P9l01K96Q9qR3k34L25p0o1
$$ -228 115 -218 293 -244 246 -189 -61 -92 28 96 221 127 -116 -37 -338 -42 47 39 132 -102 223 153 92
3993I2l31K20K58k12n3k13L12M7j34KQ2j15l3K82k81m1R7R9o3J0k94J48N3r1K52
$$ 92 -239 -19 239 27 -26 -239 73 120 -14 -12 70 -45 -78 204 -77 -118 -21 78 15 25 -269 -121 -68 -159 93
4018I3k8l43J91J98Jk28j10L01J5LP6kl60J91J70k61j8O8j6Kj85M29k46j17M92
$$ 93 65 -278 -87 111 112 -116 -226 75 90 93 169 167 -193 -2 168 -93 -111 -43 -59 -57 -242 187 -59 -176 316
4043C16l26K68k93q2J68J90m32M54k17j91L74j19o3K9L5R2Q4k59r6J33J29j05
$$ 316 -10 258 -35 -117 51 241 -191 263 46 -145 229 110 47 76 111 203 287 28 -68 65 194 89
4065H9j12K73l31K83k24K4j50J69K09l27J02j55L37k55J01m9m3Q1j66J76p2J72
$$ 89 -23 250 -81 202 -22 2 -148 21 230 -97 5 -150 187 -68 33 -16 -59 22 -144 32 -40 132
4087A32j24J88l32N3J66k60K12k8O6q9l9j30K09Q0m6j43N1k04J95J25j57j33K22
$$ 132 8 196 -136 -83 83 -177 35 7 73 -16 -55 -185 24 104 58 -85 -34 -238 -43 82 -75 -208 14
4110A4Oj5j28M9J39J79n4l95J68J99k53O7J16j54L26j48k56J71L7k8k7pj34Q0
$$ 14 20 5 -123 -74 65 244 190 -205 -37 162 -91 -24 92 -62 264 116 -140 31 68 40 13 6 -128 -48
4134d8L0R2j30k79K75l9L26o7N6l75J22O9J11J1%j59L2k05J02M07m63L51m19K31
$$ -48 -18 74 -56 -335 -60 -99 227 160 216 -159 -37 32 143 154 154 -5 27 -178 -76 331 -132 219 -200 31
4158C1K42j48j30L13j42j36J28m98K73P3r6J81k13Q1p8K28J79m7M2k29N9J05k80
$$ 31 273 125 -5 308 166 30 158 -340 -67 6 -90 91 -122 -41 -119 109 288 241 283 54 113 218 -62
4181f2q3K98j04k0j29q6L17k08J89K0k05M82p7l34l9J44k84J51J04j26j00M88
$$ -62 -145 153 49 29 -100 -186 131 -77 112 132 -73 409 332 -2 -41 103 -181 -30 74 -52 -152 336
4203C36m71j4J99J70j85j0nl6J1N5r4P6P1m6lj11J26k04K06J2j16M1q2M8q8m7
$$ 336 -135 -149 50 220 35 25 20 -16 -5 50 -44 32 103 57 54 -57 69 -135 71 83 -33 8 -74 -26 -114 -161
4229a61j15L35P4j12m1j47K03M0p8K20j07J4J5k54R6L7m3J95j60R1k40K2M6K14
$$ -161 -276 59 133 21 -20 -167 36 76 -2 218 111 125 140 -114 -18 19 -24 171 11 102 -138 -116 -70 144
4253A44k30M5J06n3r2P8q0M01n00J97j41L70J3l48O1o0o6J62J18n4k99L22Q4j64
$$ 144 -86 -41 65 12 -80 -2 -82 319 -181 16 -125 245 258 -90 -29 -89 -155 7 125 71 -228 94 178 14
4277A4oj3J58j4l17J09K10p0K58k38k12L9J32k27K8J87j28R9R5k09K63q2p8k44
$$ 14 8 -5 153 139 -178 -69 141 71 329 91 -121 -82 50 -177 -149 38 -90 9 104 -105 158 76 -2 -246
4301b46L05M1J97k35n5K6j49J41j01m2K0j52N38j05R5l83J0L23j01l9j11Q6Q8
$$ -246 59 100 297 62 7 33 -116 25 -76 -118 -98 -250 288 183 278 -105 -95 228 127 88 -23 63 151
4324A51l72k5L69lk28M6K9K10l58K95l13J97K05k61J41k08L00M2j19k24k07L39
$$ 151 -221 -246 123 120 -108 -62 -33 177 -181 114 -199 -2 203 -58 83 -125 175 217 98 -126 -333 6
4346Fk76J31J45L7J7J22J86n05Jn5K34J12NJ8j59J07m9O9j97J56mK33j93j62l5
$$ 6 -270 -139 6 43 60 182 368 -137 -136 -191 43 155 160 178 19 126 77 146 -51 105 101 334 141 -21 -56
4371e6K18N8j49j33J91p5q4O9k1j70J80j23L2m3k44K76K66q3k12K40j86P7j01
$$ -56 162 220 71 -62 129 54 -30 39 18 -152 28 -95 -63 -106 -350 -74 192 109 -103 137 -49 28 -73
4394g3J53k52K57l6J03p4K05m23n1R2r4K76k70R4R4j57L66q3j25j12M1L74j81
$$ -73 80 -172 85 49 152 78 283 -140 -191 -99 -193 83 -187 -93 1 -156 210 127 2 -110 -69 305 124
4417A24J3j04l57M33r6J53n3j55k12J93Jl7j17L4M11n4l06L14l41J29RJ67j3k17
$$ 124 137 33 -324 109 13 166 113 -42 -254 -61 -60 -97 -214 -180 231 177 -129 185 -156 -27 -18 149 136 -81
4441h1j81L93j41N7R9K64l30J8k76J47j00L82k75o8J86k42M27j03j19J80l35J02
$$ -81 -262 131 -10 47 146 410 80 98 -178 -31 -131 251 -24 -92 94 -148 279 176 57 237 -98 4
4463DJ91j29Q2j63k05p5M96j58j24K84n02N50j60j04O4p9l34L30r5l5L53k25q9
$$ 4 195 66 148 -15 -220 -295 201 43 -81 203 -299 251 91 -13 51 -28 -362 -32 -127 -162 191 -34 -123
4486a23L08j98p1O4N9j2n9J99k20L32j09J0j09M2m0j36N2j01K34n7J7j90L02k18
$$ -123 185 -13 -84 -20 39 27 -32 167 -53 279 170 180 71 113 73 -63 -11 -112 122 65 82 -108 194 -24
4510b4L8N2R3l08K78p1pq7m6k8R6J3k87L28j04J41J97k48Q9j64J6L8lM9j47K36
$$ -24 14 66 159 -149 129 58 51 -36 -82 -110 -14 -1 -288 40 -64 77 274 26 115 -49 -33 5 2 51 -96 140
4536A40K0k8p4K03l71L63j77j97j20J10J92j60O4J36k75O8L10j66n9k0J52j67
$$ 140 160 132 58 261 -110 253 76 -121 -241 -131 61 -99 -35 101 -174 -106 204 38 -21 -41 111 -56
4558e6K80j92j39J92k62K26J15k00K84j03k88O0J76j2j18p7j9m1J66K16j12m9
$$ -56 224 32 -107 85 -177 49 164 -36 248 145 -143 -83 93 81 -37 -114 -133 -174 -8 208 96 47
4580D7j02K21k85K5K31k14K54l96Q7J29r7L09k90n6K33OJ4k79k9J50K09k34L29
$$ 47 -55 166 -119 -94 137 -77 177 -219 -132 -3 -100 209 -81 -137 96 102 116 -163 -192 -42 167 -67 262
4603B62l30l1j51M04j88%J87l7k84P5J19l6j80L23nk16K77j68J80j95j07K5o6
$$ 262 -68 -99 -250 154 -34 -34 153 116 -168 -93 26 -10 -190 133 128 -88 189 21 201 6 -101 -76 -142
4626a42J21J86j02l02K39J39k6l05J96l0J58l8M7l17J87r7J20j53M8K46k68L5
$$ -142 -21 165 63 -239 0 139 113 -192 4 -26 132 94 141 -176 11 -86 34 -119 -71 175 -93 -58
4648e8o2j22K66o6J04K1P8l96K62j34J41J01k30PK4J45l2mj33R8k44L19K72k63
$$ -58 -120 -242 24 -42 62 83 161 -235 27 -107 34 135 -95 -88 -64 81 49 45 -88 10 -234 85 357 94
4672I4j40j5L54j66l17J22N8j40j1M57j05k43J09P0n2L6k19J1N6L7l5J89P0j7
$$ 94 -46 -61 293 127 -190 -68 -10 -150 -161 296 191 -52 57 127 75 111 -108 -97 -41 -4 -39 150 220 203
4696B03o0j20j52O17l81k19o5J73k21J66L62m04O5k2J00o8Qj3J00k21K08j97J11
$$ 203 143 23 -129 488 107 -112 -177 -4 -225 -59 303 -101 -36 -58 42 -26 -18 -31 69 -152 56 -141 -30
4719c0j38L06j08o4m16M65M6J99l02j98J78m3n2J23j28J23K65L1l25R5JJ44j28
$$ -30 -168 138 30 -34 -450 15 61 260 -42 -240 -62 -105 -157 -34 -162 -39 226 257 -68 27 28 172 44
4742D4k13J75m92P54k87J52j80n8L3j19L03j87J23R8k96L47m5k57N6O0L40j28
$$ 44 -169 6 -486 268 -19 133 -47 -105 -72 -191 112 -75 48 146 -150 197 152 -105 -49 11 351 223
4764B23k08Q4l44K67k4K0Kk8K29j05mj42J62j37k34L14L4Oj35k64J61J21k35L75
$$ 223 15 99 -245 22 -2 18 20 -8 221 116 112 -30 132 -5 -239 75 109 115 -20 -284 -123 -2 -237 138
4788A38r8O2k05L56j85m7L49l13J31j83N6J08O3r6l42L31k1m8j59m7K58j49o8
$$ 138 40 102 -103 253 68 21 370 57 188 5 61 169 232 136 -206 125 104 56 -103 -150 108 -41 -109
4811a09R6N4k16N5L59l10O6PJ09l4k64LO0P5j08M7J9m0R7j9J1o7K56j82K28M1
$$ -109 -13 41 -175 -120 239 -71 -5 2 111 77 -187 -184 -124 -49 -157 -110 -91 -131 -34 -53 -42 -109 147 -35 193 234
4837B34j31l8j56j1Q9P0Q5r9J59j15M0j58JK26o5J26p39L65L73k05m9J05k42K02
$$ 234 103 65 -91 -102 -13 57 142 43 202 87 127 -31 -30 196 131 257 -482 -117 256 51 2 107 -135 67
4861F7O8l67L46L0j63q7Q2L35m63N3k26J16L53n2p4r2j2K6q6k9J93r5Q2J5j66
$$ 67 135 -232 114 144 -19 -106 -24 311 -152 -99 -325 -209 144 92 18 -74 -86 -60 -146 -175 18 -77 5 20 -146
4886a46K04M7N3J10m84M32j60k39J50J40q2j32J79k65L23j89J82j02k40L18j09
$$ -146 58 105 158 268 -216 216 56 -183 -33 107 25 -107 72 -193 130 -59 123 21 -219 99 -10
4907a0k02K50nj75K22m2j3j23J11j43N0K5n5J6P3q7Q2R2J36n5k49J6J26Oj48R9
$$ -10 -212 38 33 -142 80 38 25 -98 13 -130 -80 -55 -110 -94 -21 -108 -26 66 202 147 -102 -86 40 46 -102 -3
4933cmJ13k99K86k61P6J61j22k22K32j7K96k74p9K68r2L0k07Q8%mL9j08Q5K1j19
$$ -3 -7 106 -193 93 -168 -92 69 -53 -275 -43 -60 236 -38 -117 151 59 89 -118 -30 -30 -34 5 -103 -18 3 -116
4959a16J14N6j6J0l84M09k31K5L35l71J59pK33j36J9k06K83k20%O4Q7j09o2l5
$$ -116 -2 54 38 48 -336 73 -158 -133 202 -169 -10 -17 216 80 99 -107 176 -44 -44 20 107 -2 -64 -99
4983i9k25M00K54n8m52R4J37QJ22q2r9o7ll0O5KJ10l3j4j16P7K12q5k4O8r9j84
$$ -99 -324 76 330 272 -180 -86 51 59 181 99 0 -67 -70 -100 -35 -33 77 44 30 -86 -9 203 118 94 162 63 -121
5010a21nL47j58k02L19k75L16k02j06J28k0k4j73K43q6J62r7K4k2P0k35k36J77
$$ -121 -126 221 63 -139 180 -95 221 19 -87 41 21 -3 -176 67 -19 143 46 70 48 118 -117 -353 -176
5033a76J47L4Q5R8l46J16j03L01q9n9j3M8j9K3j68J18q2J07l1L47l08m47M99n6
$$ -176 -29 5 90 188 -158 -42 -145 156 67 8 -5 43 24 47 -121 -3 -85 22 -9 338 30 -417 82 26
5057B6N5k18J87J72j28k2k04J47k2k1M0M9r0L18l64M0L0j95K16j52k6J17P3j07
$$ 26 81 -137 50 222 94 72 -132 15 -7 -28 12 61 -29 289 -75 -35 -5 -200 16 -136 -162 -45 28 -79
5081g9J03q9P2m2P1k03K95l71K02K01k02J1K20j72n5J89j00K9k70M30q5k06J43
$$ -79 24 -65 7 -35 36 -167 128 -243 -41 160 -42 -31 189 17 -38 151 51 80 -190 240 155 -51 92
5104I2j1m6K4k15k0j08N01K2r8j30k53RL45k99K11n4PJ76k12J37J11k12m5K45
$$ 92 81 35 59 -156 -176 -284 217 239 141 11 -242 -233 112 -187 24 -30 -23 153 -59 78 189 -23 -68 177
5128A77j48j58LQ7K50l5k00J57k44k4K23k15L94l03J14j71J34j33J26l2J99k44
$$ 177 29 -129 -126 -39 211 176 -24 133 -111 -135 88 -127 267 -36 78 -93 41 -92 34 2 201 -43
5150d3M33k31m61O3m2J37N0l0K30j55N62m50j8n4l3O0k15K39l1J15q9n9j17K04
$$ -43 390 159 -302 -239 -281 -144 -94 -124 106 -49 513 63 45 -9 -42 18 -197 42 11 126 37 -22 -139 65
5174F5n1l65J29K76K7m85K39K69j03O9j84nM05m35m1K12k5j60K94Rl92K11J43
$$ 65 14 -351 -222 54 81 -404 -165 104 1 70 -114 -119 286 -149 -190 22 -3 -163 131 140 -252 -41 102
5197A02J03k25k23M24N9Q3o0o9J47j32M3m3k52J44k23P8M8J57k47P1J08j29Qj8
$$ 102 205 -20 -243 181 240 323 263 194 341 209 252 209 -43 101 -122 -44 4 161 -86 -15 93 -36 -28 -46
5221d6j26j12L30j18K11J94k97j24L08n1j95Q3j67K23l8j52k9Q3J04n7r0J47l18
$$ -46 -172 -284 46 -72 139 333 36 -88 220 169 -26 57 -110 113 75 -77 -106 -23 81 24 -66 81 -237
5244b37J90O2J68l39J99j72m5J04R1pk7o4K7J26j26M3j63J58q1K11m4k9MM5n9
$$ -237 -47 15 183 -156 43 -129 -174 -70 21 14 -13 -77 -50 76 -50 -7 -170 -12 -93 118 74 45 49 94 35
5269C5K6r6P7k85J60o7K94l48L53j14O9r7j10K49m96L27n7o1J23lj48J32K24k34
$$ 35 61 -35 42 -243 -83 -150 144 -204 149 35 104 7 -103 146 -350 -23 -80 -141 -18 -21 -169 -37 187 -47
5293d7L01K2l7j48j48J69m3r6k0l24N36k05J5M9l02K91r7J03J42j84l9L67l75
$$ -47 254 276 239 91 -57 112 69 -27 -47 -371 165 -40 -25 24 -278 13 -84 19 161 -23 -62 305 -70
5316g0J54j84N4j86K56j43R5j28K45l60J48J38p8J74j76O3j70o1q9L70ql67M87
$$ -70 84 -100 -46 -232 24 -119 -24 -152 93 -267 -119 19 -59 115 -61 2 -168 -229 -318 52 44 -323 164
5339A64n9k56J98p7J0oj63K95j34j03J02o2J50l09J75L9R5k19J94J66l98Kj26
$$ 164 105 -151 47 -30 -20 -26 -189 106 -28 -131 -29 -91 59 -250 -75 -36 59 -160 34 200 -198 -196 -322
5362c22J84J69k69K14K6M4k44J79j05J73P5j27k04K10J61k79NN4L40l44P8J02
$$ -322 -138 31 -238 -24 2 46 -198 -19 -124 49 124 -3 -207 3 164 -115 -110 -56 284 -60 18 120
5384A20k03l8j23o4K48l0N2K24k48M7j9K02k52p3K23k8J54k47J71J14k27j2o7
$$ 120 -83 -121 -244 -308 -60 -90 -38 186 -62 -15 -34 168 -84 -157 66 38 192 -55 116 230 3 -9 -76
5407g6J37k74L23J7m4k37J72O7l56K58L32n02J94J74j96j25K61l0L3j50J1K34
$$ -76 61 -213 110 127 83 -154 18 85 -271 -13 319 -183 11 185 -11 -136 125 95 128 -22 -11 223
5429B23k22J46m8o5P2j64m3Q5K33l22K26k76J49M5j98J94l1N0J53j89O3Ql24J90
$$ 223 1 147 99 34 106 -58 -101 -16 217 -105 121 -155 -6 39 -159 35 4 54 207 18 81 89 -235 -45
5453d5J33k39J89Q4r0J19m1k73L32j2j22m8k5J30N0j85P1j3j35K48k66K84j82
$$ -45 88 -151 38 122 32 151 110 -163 169 157 35 -13 -38 92 142 -43 28 15 -120 128 -138 146 -36
5476c6K59l46j10M35m93K19R6K8P8k52j06p7P18k33l35K5M2jK67j40L0n5J17J1
$$ -36 223 -123 -233 202 -291 -72 24 52 130 -122 -228 -305 413 180 -155 -130 -88 -89 178 38 68 13 130 141
5500A41m4M1p2l05K78o5j49l6L3J60j79J29P9j68J06K04l04L09k28K15k93P7R1
$$ 141 97 138 66 -239 39 -26 -175 -211 -178 -18 -197 -68 11 -157 -51 153 -151 158 -70 145 -148 -71 20
5523B0Kr2K61k84J24Q7l15J13M5N2K72l26OQ9P5q3l6k29OJ66J15l2j74N32m74
$$ 20 22 -70 191 -93 31 118 -197 -84 -39 13 285 -41 -35 54 129 46 10 -219 -213 -47 68 36 -138 394 -80
5548h0Rj04M62j62k09L54m20L20j11j36p9J49j00P3j00L60J0j78K49l73q5n9K05
$$ -80 -71 -175 287 125 -84 270 -150 170 59 -77 -156 -7 -107 -34 -134 226 236 58 307 -66 -151 -210 -5
5571eN0K36l47J79j55J21o2lj67K25k6j34K75p9p7j19J96j07j46K73l63J82J44
$$ -5 45 281 -66 113 -42 79 17 14 -153 72 46 -88 187 108 31 -88 108 1 -145 128 -235 -53 91
5594I1j38RL3r4L08j88P3k20J32j35M45j87k42K16j53O1m3p2K62j07PJ41j94k4
$$ 91 -47 -38 -5 -99 209 21 94 -126 6 -129 316 129 -113 103 -50 11 -32 -104 158 51 58 199 5 -19
5618a9J35j04J41l52K19n3P6p0J34k72J00K86m12lR0q3K01n5oL08l4n65J33N72
$$ -19 116 12 153 -199 20 -33 43 -27 107 -165 -65 221 -191 -194 -104 -187 14 -41 -47 261 227 -338 -205 367
5642C67o38K91j5o3m7N6j9J10j59kO5k1j03K86p9j00K22k27j10L69j83K9k19J59
$$ 367 -271 20 5 -58 -105 -49 -68 42 -117 -119 -54 -75 -178 108 29 -71 151 -76 -186 183 0 29 -190 -31
5666c1oO5P6o6J83m61L42J52l95J79K18l70j64M88r7j48N6Q0QP6m2k13L4K3O1
$$ -31 -37 28 104 38 221 -240 102 254 -141 38 256 -114 -278 210 113 -35 21 101 109 185 143 -70 -36 -13 48
5691D8J09j19k36K30n7n0K50o8k59K12J35l4l62L63L1l42Q4k86K64J51J3N1m0
$$ 48 157 38 -198 32 -25 -75 175 107 -152 60 195 161 -201 162 193 -149 -65 -351 -87 64 77 128 88
5714H8q5J99j05o5R1Q7m05K09K4j62m1JK98k09k61K96Ll47L32L6j54L84k60j47
$$ 88 3 202 97 32 123 210 -195 14 38 -124 -165 -164 134 -75 -336 -40 -37 -384 -52 -16 -170 214 -46 -193
5738a93L13l49J31j77K70J08l51J65Nl0K6J45n6j5j5k8j14M40n64L95J83j83p3
$$ -193 120 -229 -98 -275 -5 103 -248 -83 -78 -108 -82 63 7 -8 -23 -51 -165 275 -289 106 289 106 33
5761C3l8L3J04l58J59L01k78n9L08j21k5Nj74N0L4n0J00k31K25q5o1pN3o8L91
$$ 33 -5 28 132 -226 -67 234 -44 -103 205 84 59 64 -110 -60 -26 -76 24 -207 18 -67 -128 -135 -82 -150 241
5786B41K4q2k56K41k35M2l2k40L12r9J16j27J83k87J91k58J97r7R6L2k9j1Q4k14
$$ 241 265 183 -73 168 -67 -25 -57 -297 15 -84 32 -95 88 -199 -8 -266 -69 -166 -70 -38 -67 -78 6 -208
5810b08O8K37n4Lj17k80N17l8j86N19n73j33J02K87p2pK2n3K8j63r6M00j2k45
$$ -208 -140 97 43 46 -71 -351 166 128 -58 461 -112 -245 -143 144 72 65 87 34 62 -101 -197 203 191 -54
5834e4L12j34k38L55k73k42J37K81m39L46J23nl07J48R2l65J65M2J07j37j5n1
$$ -54 258 124 -114 241 -32 -274 -137 144 -295 51 174 169 -138 10 102 -263 -98 -56 51 -86 -101 -152
5856a52J42j91K24L7k40Q2L95l67J22Q7j37jN6J60k08P3k6K48j19L7j35j30j83
$$ -152 -10 -201 23 60 -180 -98 297 -70 52 139 2 1 57 217 9 82 56 304 185 222 87 -43 -226
5879b26q1K37J77J14m0j56J18k75k3j42L45l58K51K6nJ93n7n3R0l93J31M5K82
$$ -226 -307 -70 107 221 181 25 143 -132 -155 -297 48 -310 -59 -33 -38 155 98 45 135 -258 -127 -82 200
5902B00l25J47J1j60j43K7K00r2J9K35j70J99l53J22J84l8j78J68J76l28p8R0
$$ 200 -125 22 33 -127 -270 -243 -43 -135 -116 119 -51 148 -205 -83 101 63 -115 53 229 -99 -177 -87
5924h7L41l34PJ47j09K19N0k68Q4k34J26J71m47J46L00k56R6j99J95J24j06J53
$$ -87 254 -80 -73 74 -35 184 234 -34 50 -184 -58 113 -334 -188 112 -144 -48 -247 -52 72 -34 119
5946A19q4J01l25J36j5L00n36K28L51k71J26k03J97k2j92K46L3k14M7j15j66K98
$$ 119 35 136 -189 -53 -68 232 -304 -76 275 4 130 -73 124 102 -90 156 189 -25 22 -93 -259 39
5968C9j14n4K54k12N3j73K95J5J04l12K86k42J20J43j00J57m1n98M90nj19J4K0
$$ 39 -75 -129 125 -87 -34 -207 88 103 207 -105 181 -61 59 202 102 259 218 -380 110 105 -14 0 20
5991B0J03q8k6o7J73l02K95k82L26P0k19L4qo9Mrk50Q0K62k36j4K14o1q3J69j86
$$ 20 123 35 9 -58 115 -187 108 -174 152 222 3 37 29 -40 -36 -45 -295 -215 47 -189 -203 11 -50 -133 36 -150
6017a50R3j42J54K30l09J58R4p7J01k48Q0K9J24j33N8r7j5MP2P1q7P4o5j42K56
$$ -150 -57 -199 -45 185 -124 34 128 51 152 -96 -16 13 137 4 62 -35 -50 -46 26 97 10 84 19 -123 133
6042A33q1j28o3K02k10Q0r9L03j76r1K8K0Op1K45j01k18K42J25j15Jj03L7J21
$$ 133 52 -76 -139 63 -147 -67 -166 137 -39 -130 -102 -82 -76 -147 98 -3 -221 21 146 31 32 -71 -34 87
6066H7l16J42O2j27j51K30K00r2M1K5k12K95j63Jk12J71R5j56M7Q4Jj19J71j32
$$ 87 -229 -87 -25 -152 -303 -73 127 35 76 101 -111 184 21 22 -190 -19 76 -80 -33 51 52 -67 104 -28
6090b8J46j20k11J24J57K56m73M27k07l6Q5r3P0m11J78L39o7m27K07J81j57L27
$$ -28 118 -2 -213 -89 68 324 -149 278 71 35 120 27 97 -314 -136 203 136 -291 -84 97 -60 267
6112B67k14M6j91O5J76k0j81J24j64J44k03L10m27L51n5M9j36r5M06k98J43n1
$$ 267 53 99 -92 -27 149 129 -52 72 -92 52 -151 159 -268 83 28 77 -59 -154 252 -46 97 46
6134D6NJ52l06L3R4P5j57l09L06J52l42L21j27K25K1n55L86K4nj40J05K39o0j80
$$ 46 51 203 -103 -70 24 99 -58 -367 -61 91 -251 70 -57 168 189 -366 20 44 39 -101 4 243 183 3
6158Cr0P2j66K93q9J36j86p6m5K8j2r9K57J52j96K20k8j57K3L0l4K1k38K90Ml37
$$ 3 -87 -15 -181 112 23 159 -27 -103 -148 -120 -132 -231 26 178 -18 202 174 17 40 70 36 57 -181 109 113 -224
6184b24J43R6J32l0k65J31m7N5O8k88K67P2j77n2M0j84K98K7o2j1J03k40K77j55
$$ -224 -81 15 147 117 -148 -17 -64 -9 59 -229 38 110 -67 -119 -79 -263 35 62 0 -11 92 -148 129 -26
6208b6l4L82l66J19K73k85k73K69o2j87Q9J53J62k88j23J54Q1j59R1J73j01K07
$$ -26 -60 322 -44 75 348 63 -210 59 -3 -190 -101 52 214 -74 -197 -43 38 -121 -30 143 42 249
6230B49k74n8J52r9n0N1p8K11P2k69RJ6L2j99J05K31k14O6O6J41j29k6l1j15K69
$$ 249 -25 -83 69 -30 -80 -29 -107 104 176 -93 -84 -68 -36 -235 -130 101 -113 -47 19 160 31 5 -26 -141 128
6255A28l78J33K57k52K43k62n0R4N2k2k70O54k03L5k31K57j95J7j59L29q1o3r9
$$ 128 -250 -117 140 -112 131 -131 -181 -87 -35 -57 -327 327 124 159 -72 185 -10 7 -152 177 96 33 -66
6278f6K96j56j05rl7L16l90L73r6j72J86Mn8o4Q4P9k53N3M2j30J56Q9j05l01J58
$$ -66 230 74 -31 -40 -77 239 -151 222 126 -46 140 144 86 22 106 185 -68 -15 27 -103 53 142 37 -264 -106
6303a06J5K23j24p2Rj83K83k8j8J23n60K92p9k6M75m67M05J27k88J86k74LJ94
$$ -106 -91 132 8 -64 -55 -238 45 17 -1 122 -438 -146 -225 -251 224 -243 162 289 1 187 -87 -84 110
6326A10p7J31k42J17M51p50M78or2m9L0J11n1n7J47r6k30j04RK18J45j79L72j73
$$ 110 33 164 -78 39 490 -260 218 212 120 71 101 212 161 104 251 155 -75 -179 -170 48 193 14 386 213
6350B13m25J03N9K17k67K71k22M9n2J65m5j29l5J63K8N5j01m64N67k11M0K0J82
$$ 213 -212 -109 -50 167 -100 171 -51 -2 -54 111 66 -63 -98 65 93 148 47 -417 150 -61 -21 -1 181
6373A81l67R7j73J34j08J95J71k25J50K6Q5l25J24j23J41K4J43k05R3q2J13m1
$$ 181 -186 -89 -262 -128 -236 -41 130 -95 55 81 166 -159 -35 -158 -17 7 150 -55 38 -44 69 28
6395B8L8L9k2m06J68K75j43j3J92l19K04j41J19K20l40J63K7n2K61n32O1L5O0
$$ 28 66 105 83 -323 -155 120 -23 -36 156 -163 41 -100 19 239 -101 62 89 37 298 -234 -173 -138 -78
6418g8K22j33m5J05m3j30J47m8r0J8q7J44O4J27j97J65j55M5m6p4j65L15k13K33
$$ -78 144 11 -34 71 28 -102 45 -3 -93 -75 -162 -18 46 173 -24 141 -14 31 -15 -89 -254 61 -152 81
6442H1l5m2PO9LJ1j63J9L12m79L63r2j10l5o2K35k22j18K79k21J70p0k25J16J20
$$ 81 46 4 11 80 83 94 -69 -50 262 -217 146 54 -56 -91 -153 82 -140 -258 21 -200 -30 -100 -325 -209 -89
6467h9K24P0n9p0J71n46J18M22K2j11j08j8n7l6J99l26k9K49k21j86M46q1J27
$$ -89 135 205 146 76 247 -299 -181 241 263 152 44 26 -31 -67 132 -194 -223 26 -195 -381 65 -16 111
6490A11J2l6j18K40J01l57K67l92m1J00J74J28m58J92n6l1j12L03J53l09L52k58
$$ 111 123 87 -31 209 310 -47 220 -172 -213 -113 61 189 -269 -77 -133 -164 -276 27 180 -129 223 -35
6512c5J90k44J67Q4l65OK09J15k68K74j00%K51k49j78K19j72P0P8j98K24j82q6
$$ -35 155 -89 78 162 -203 -197 12 127 -141 133 33 33 284 35 -143 76 -96 -26 52 -146 78 -104 -190
6535a90L90l21L27k73L2Q5Qk16o9K38J20m4l4o6l9L2K58l00k07L54K1j21qK4J73
$$ -190 200 -121 206 -67 -35 50 58 -158 -227 11 131 87 53 -13 -52 -20 238 -62 -269 85 106 -15 -23 1 174
6560A74j91K44nl36rJ49k8J9p5J48r8k00J36J40k08M42k17M8J7Lj24k15L10j80
$$ 174 -17 227 222 -114 -123 26 -2 17 -58 90 -8 -208 -72 68 -140 302 85 133 150 153 29 -186 124 -56
6584e6Q8j01O3N8k20J93J2P7N0j30P1j7O4k7k05O1M4l75J80J2M0mL52n70N51j10
$$ -56 32 -69 -6 52 -168 25 37 114 164 34 105 88 152 125 -80 -19 25 -350 -170 -158 -118 -122 230 -340 211 101
6610A01k69m6K59L4j26l5j29M45L7m43N5o1o9J93J92K43k21P6j37K4J11l12J61
$$ 101 -168 -214 45 79 -47 -82 -211 234 271 -172 -117 -178 -247 -54 138 381 160 236 99 123 234 -78 83
6633H3k69J40q2K37j96K96j74j47P4l31L42JK44n9k44J5Q0Q5k03%P0j0J06j88
$$ 83 -186 -46 -128 109 -87 209 35 -112 -38 -369 -27 -26 218 159 -85 -70 10 95 -108 -108 -38 -48 58 -130
6657a30K52k63J98j95l5K88k41L00j1l41J16l1J14j34P3K28p2J5l6k74K31p4O2
$$ -130 122 -141 57 -138 -173 115 -126 174 163 -178 -62 -93 21 -113 -40 188 116 131 95 -179 52 -22 40
6680D0J08j33Lj00K73j65M2j49OL84l31qN9Q1k29J61q3O0lK5j17K11J62j59o4
$$ 40 148 15 18 -82 191 26 68 -81 -75 309 -22 -30 29 110 -119 42 -41 19 16 41 -76 135 297 138 74
6705G4K19n84J92j23L26j06N2N1j95K9r2J2k46K31K98lk47QJ71K7r3k05J82M5
$$ 74 293 -291 -99 -222 104 -2 50 101 -94 -65 -157 -145 -391 -160 138 135 -112 -104 67 94 1 -204 -22 23
6729B3K33n22L25p1K67j60k39O8j7K81j78j84J73M3o9l1O4Jk8O6j11K30k78L30
$$ 23 256 -266 59 -12 255 95 -144 -76 -93 188 10 -174 -1 42 -27 -58 6 7 -21 45 -66 164 -114 216
6753B16Q3k40J5j1p4J20J59j85k62L42j61M3K47m17J05P2j20oM4Q8j16K37j92
$$ 216 299 59 74 63 -11 109 268 83 -179 163 2 45 292 -125 -20 52 -68 -74 -30 58 -58 179 -13
6776a3o1J01p5l55K49j5K92r4k04J76o9N9K02j09j97K9l06N28k76K73j88j28J16
$$ -13 -74 27 -48 -403 -154 -169 123 29 -175 1 -68 -9 193 84 -113 -84 -390 138 -138 135 -53 -181 -65
6799f5L3N3p5k21M7K53j08j24K09j86L20P5k9k97J72J01n6j43J13o2J53j08j64
$$ -65 -32 21 -54 -275 -228 25 -83 -207 2 -184 136 211 182 -115 57 158 102 -41 72 10 163 55 -109
6822a09J57J20j36M8O5j64j56K56k0j20j47L31j25J11q0p7JQ6k1j40N4J97k31
$$ -109 48 168 32 80 145 -19 -175 81 61 -59 -206 125 0 111 31 -46 -45 41 20 -120 -66 131 -100
6845a00J05N2k6J11l14Q5L7O7K13k10J6r2k1L70k95L72m59j24K54n8m4J61j0j93
$$ -100 5 57 31 142 -172 -87 -50 17 230 20 36 -56 -77 293 -2 370 -89 -213 41 -17 -61 100 90 -103
6869a03J75n5K8n4L19q00N44p8K3J28p5O0Q1m44K38J79l33P0oJ21J55j60k2J4
$$ -103 72 17 45 -9 310 -490 54 -24 -1 127 52 112 193 -251 -13 166 -167 -97 -103 18 173 13 -9 5
6893Ek59J43j93L90n7p3j9J58j00N6J75k17Mj18O4j06J12K07j53L9o5P9j3o3o3
$$ 5 -254 -111 -304 86 29 -44 -63 95 -5 51 226 9 13 -105 -41 -147 -35 172 19 58 -7 72 59 -4 -67
6918f7J22k59R5K24n0L0NK8j76m4J67k28K39j9j15N9j48JJ80N6j67J19m16K67
$$ -67 55 -204 -109 115 65 95 100 128 -48 -92 75 -153 86 67 -48 11 -137 -136 44 100 -67 52 -364 -97
6942i7m9M2MJ77K01k7j69K3j00j9p0Q1k7K59j92j34K93k59M2j5J06j8J26l09j07
$$ -97 -146 -104 -100 77 278 251 82 105 5 -14 -84 -3 -30 229 37 -97 196 -63 -21 -36 70 52 178 -131 -238
6967b38M75J10m98K02k48J57j11m0Q2J85j32K4J90j66n7J87q1q7j81K04O6r7Q5
$$ -238 237 347 -151 51 -197 -40 -151 -191 -109 76 -56 -32 158 -8 -65 122 41 -46 -227 -23 43 -54 31
6990C1j82n4PL03l30J19R4J7m8P7J38n3l54J81L90l34j06J78n3k76M70k08q4k5
$$ 31 -151 -205 -198 105 -225 -106 -12 5 -43 34 172 119 -235 -54 336 2 -104 74 21 -255 215 7 -77 -102
7014a02P1O2K5j89J23k53J87J35j86R5j44K75j89P7L0Q2N3J4j05K37n07K26k17
$$ -102 -31 31 56 -133 -10 -263 -76 59 -127 -32 -176 99 -90 -13 17 99 152 166 61 298 -209 17 -200
7037b00N1K76M8j16j19K58l40J07R1j81K65Q6k86K8J53k54K8L36j69j42K01j83
$$ -200 -149 127 175 59 -60 198 -142 -35 56 -125 140 226 -60 -32 121 -133 -105 231 62 -80 121 -62
7059f2J81j84j48K09J41l48K87j18J70j03k87j89L67J92J86m58J84j28p3K55R4
$$ -62 119 -65 -213 -4 137 -211 76 -42 128 25 -262 -451 -84 108 294 -164 20 -108 -181 74 168
7080A68k41K44j52mm6j22L77l29K77j90j30J71L4Q8j31j13pR6j02J81j91M9K03
$$ 168 -73 171 19 15 -31 -153 224 -105 172 -18 -148 23 57 145 14 -99 -106 -10 -112 69 -122 -73 130
7103A30J13k78R7l11K05J81K2k88P6l2R7P3P5k81R4k32K24j19J37k7J61j28j68
$$ 130 243 -35 62 -249 -44 137 159 -129 -53 -85 12 85 160 -121 -27 -259 -35 -154 -17 -44 117 -11 -179
7126a79L31l6j73L59k79p6j4Q4J01k31K24k7j10L41k78j50p5K86k43k8M29l1j91
$$ -179 152 116 -57 302 23 -53 -67 17 118 -113 111 84 -26 315 37 -113 -188 98 -145 -173 256 225 34
7149C4j03J16k0J69j79p2j96L25j95K78k30j43j4Q3L71l24L12l67l9Q8K88j6j44
$$ 34 -69 47 27 196 17 -55 -251 74 -121 157 -73 -216 -230 -147 224 -100 212 -155 -194 -106 182 166 22
7172B2k00K97R2k6Q3q9k28J45j60n8Q2o2r4L68j24K9j18q3K73l59K81O1j30k51
$$ 22 -178 119 211 185 268 179 -49 96 -64 -122 -40 -102 -196 172 48 77 -41 -124 149 -210 71 132 2 -249
7196b49K68K44k72P2j8N4k21J37Q9j90L1K69l0l27M7J44m5L2q0K5PN5J64r9o5
$$ -249 19 263 -9 63 45 99 -122 15 104 -86 -55 214 184 -143 -96 48 3 35 -45 -20 -13 42 206 107 42
7221D2p8L75k07n9r7J03k4l94J99p4K68J01j60k35K35k59K33J19L4j54P8j7j07
$$ 42 -36 339 132 73 -24 79 55 -339 -140 -214 54 155 -5 -240 -5 -264 -31 88 122 -32 46 29 -78
7244g8J61Q9r3j74K06k15J67j28K71l37J56L7k64K23J3K91l02j1j1jr3O0l1J67
$$ -78 83 172 79 -95 111 -104 63 -65 206 -131 25 62 -202 21 34 325 23 12 1 0 -93 -33 -64 103
7268A03j38r4n5o9K11K33l28R6J64l43K26m3N0q0J16K33l28Q9pO4j77J14P3k64
$$ 103 -35 -129 -184 -253 -42 191 -137 -41 123 -220 6 -37 13 -67 49 282 -46 43 36 100 -77 37 110 -154
7292a54K74j03Ok15L11N5R5j85m17K75K27n7m05L43j59P5n3K7K68j16L3j54N4
$$ -154 120 17 23 -192 119 174 269 84 -333 -58 169 112 -293 50 -109 -34 -87 -60 208 92 125 -29 25
7315B5n6j03J04n3K20j51K79m11M9j15J41R3n4J15k04K17k15K41l17K68m9j9M24
$$ 25 -31 -134 -30 -83 137 -14 265 -146 -97 -212 -71 22 -32 83 -121 96 -119 122 -195 73 24 5 429
7338D29l12R6l80Q1M3N5L0J41k53j12J09lQ2j06n7J55j54L29m9J8R6k90L5K85
$$ 429 117 213 -167 -86 -43 12 42 183 -70 -182 -73 -76 6 -100 -157 -2 -156 173 124 142 238 -52 -17 268
7362B68l99K16q2j30M93n92R6J77J0o8j39L20j1k84k2L48j74K6K38l77j38J54
$$ 268 -131 85 3 -127 366 -226 -130 47 57 -11 -150 170 159 -125 -147 201 27 53 291 -86 -224 -70
7384g0J11m7O2k9k4j74K44j0j00J92l72j0K56m2j2J89q0L3q6J69j28L8p5k28L91
$$ -70 41 -6 56 27 3 -171 73 63 -37 155 -217 -227 29 -13 -25 164 84 117 31 200 72 110 35 -193 198
7409A98o2q1k94K61j22o2K92l7k05J09k98K35Q4k04M5k5K89j84J18j89L07l23
$$ 198 136 55 -239 22 -100 -162 130 93 -112 -3 -301 -66 18 -186 -141 -166 123 -61 57 -132 175 -148
7431a48K23j0k50Q9k96P64M1k92Qn0n48L63Q0p2J80Oj17q1N7K45j32o3P3k83J49
$$ -148 75 65 -185 -96 -392 372 413 121 129 79 -469 -106 -26 -98 82 88 -29 -110 -53 192 60 -3 70 -213 -64
7456f4J10k47J75K82l51k05L95j68K1l5J6j11J40K95j48j36R4N6j84M2J29n9J23
$$ -64 46 -201 -26 256 -95 -300 95 -73 -52 -87 -71 -182 -42 253 105 -31 63 119 -65 -23 106 47 170
7479A70j80J63j83j01K77j08q6k7k0K22k0j76K13j80R8j39J23k99K37J54k90J07
$$ 170 -10 153 -30 -131 146 38 -48 -75 -95 127 107 -69 144 -36 62 -77 46 -253 -16 138 -152 -45
7501d5rk3K22j87Q3j68J24N6j16j68K26J06k50L65r7R5j98K2k06J80k59K56Q5
$$ -45 -54 -77 145 -42 41 -127 -3 53 -63 -231 -5 101 -149 216 119 214 16 38 -168 12 -247 9 94
7524I4o8J18Nj20K6j58J36p5J34J74K7l90J66Q5p2J98k69r7j40J41K33j09j9m1
$$ 94 26 144 149 29 55 -103 33 -42 92 266 293 -97 69 154 82 280 11 -86 -226 -85 148 39 20 -21
7548b1L29k58j24K59J5j33q1K72j92j54n1K85j24j14K2K16j92l0J02l49N20l16
$$ -21 308 50 -74 185 200 67 -14 258 66 -88 -139 146 22 -92 -70 146 -46 -76 26 -323 197 -119
7570a19J78MJ54q6o5qP3k08J67Lj1l01J7K31o3P1J7j39J47j56L58m91K71k4p7
$$ -119 59 63 217 131 66 58 131 -77 90 93 82 -219 -202 29 -34 37 54 -85 62 -94 264 -227 44 20 -57
7595e7n7k06K8L42n3L4R5J09k00J05r7k39L95k34L00P5o36M63r7j46J84j99q1
$$ -57 -114 -320 -292 50 -3 31 126 235 35 140 43 -196 199 -35 265 340 -296 167 70 -76 108 -91 -172
7618a72J93J32k76Q4J78p5q5K0j32K29m4m3j49J64J07k03O9K34j28j01l10L49
$$ -172 21 153 -123 -39 139 64 -21 -1 -133 96 52 9 -140 24 131 -72 -3 231 103 2 -308 41
7640D1j46J9J54j5L5M5j39k93K25K08l03N16l96O5j21J76j0j77K06J72p6k91k21
$$ 41 -105 -86 68 53 88 133 -6 -299 -74 134 -169 347 -49 16 -105 71 61 -116 90 262 186 -105 -326
7663c26J71K45k36K04m6q9K43jM3L1m06J81r9K21k60q1K53j76j7J05j23N4J03
$$ -326 -155 90 -146 58 12 -77 166 165 208 239 -167 14 -85 136 -124 -205 48 -128 -145 -40 -163 -109 -6
7686fK14l05j07K87k35N8L33k41J24m28O7L71j21o1K2j3P3p3P6J17m2j06L91l05
$$ -6 208 -97 -204 83 -152 -94 239 -2 122 -306 -239 132 11 -50 -28 -41 32 -41 35 152 110 4 395 90
7710I0j03j98M17j27o6l3j15K03J51l13J69j46p1K15q2M17k76J90m18O6J44k39
$$ 90 -13 -211 206 79 13 -20 -135 68 219 -94 75 -71 -142 73 -9 408 132 322 -96 -30 114 -125
7732a25Q8k3j06J40j20m0L42k40L71k22n9L6J57l41K2JK15L7j8j51q6j43K96K8
$$ -125 -37 -60 -166 -26 -146 -186 156 -84 287 65 6 42 199 -142 -120 -119 96 133 115 -36 -122 -265 31 59
7756E9k32L09j38J85j30J85l42J05m0j96J18L48k75K8J93k57j93L47j11J18R7
$$ 59 -173 136 -2 183 53 238 -104 1 -39 -235 -117 231 -44 -16 177 -80 -273 74 -37 81 178
7777A78k02k52K24J76k37j1O1r5R0J51K09j89k34K89p0M8l03J86L2Pj73N6O3n8
$$ 178 -24 -276 -52 124 -113 -124 -63 -158 -68 83 292 103 -131 158 88 136 -167 19 51 58 -115 -59 4 -54
7801e4M7k09J5K63j46L7pK55j43M6J49l30K6n3k29L95m13M32l84K25P2l8j14K39
$$ -54 -7 -216 -201 62 -84 -47 -54 201 58 104 253 -77 -51 -104 -333 62 -351 81 -303 -78 -6 -44 -158 81
7825H1j04K14j83j45K37j54q5R1J19l75J90J76Q6j52p7k71L04L60m36k2M33k23
$$ 81 -23 191 8 -137 100 -54 -139 -48 71 -304 -114 62 148 -4 -81 -352 -48 312 -124 -146 287 64
7847F4l20J42o4L45n7j46k58PN0MK41k26n5L16Lp3K6q4J15p4q1KP4j16K88k40
$$ 64 -256 -114 -178 167 110 -36 -294 -287 -237 -233 8 -218 -273 43 46 -27 -1 -85 30 -44 -125 -123 -49 -165 123 -117
7873a17J23J07k08J54o0J8NJ89k16k20K72J54k89p9J24N7L78k29j11j97K18J61
$$ -117 6 113 -95 59 -1 17 22 211 -5 -225 47 201 -88 -167 -43 14 392 163 52 -145 73 234
7895B34n00K54j36K20N4k54J37L32k76k21p7M18k11M0K08l43K16k41k2K52Q7p8
$$ 234 -266 -12 -148 72 126 -128 9 341 65 -156 -233 185 -26 14 222 -121 95 -146 -168 84 171 93
7917I3o9o8L8p3P9j88K57M2m2n0n6j64K81k25K0r2M34Q0j52J80l07l17K18r6J53
$$ 93 24 -44 -6 -79 0 -188 69 111 69 19 -37 -201 80 -145 -125 -217 217 297 145 325 18 -299 -81 -177 -24
7942b4R8q0k3J09l04Q9J72J83j47MN6j65R1k98P6K97l29qL63k27Oj3L11j66j38
$$ -24 74 -6 -29 80 -224 -135 37 220 73 77 133 -32 59 -239 -163 134 -195 -203 160 -67 -61 -74 237 71 -67
7967f7R1Rj37k40M47k70P8M5J19o7k25J02J56J88k40l0kq6J6K62k59L35m00J72
$$ -67 24 33 -104 -344 103 -167 -89 -44 75 8 -217 -115 41 229 -11 -41 -43 -129 -113 149 -110 225 -175 -3
7991cJ64m9J01P2j74k44L8J89k0o4l2oJ37M8j56K8k35M40o28N31j79J74l44J11
$$ -3 161 112 213 285 111 -133 -95 94 74 10 -22 -28 109 157 1 29 -206 234 -394 137 -42 132 -212 -101
8015a01p4MK27j14K69j51j99J27J11p6J52J9k93J16j6j65k6J90M7P1r4J95r2p6
$$ -101 -175 -171 56 -58 211 60 -139 -12 99 23 175 194 -99 17 1 -164 -190 0 47 118 24 219 127 51
8039E1l2j87L66k55P3rM6Q6l27O3K14j93J31j05K79jj52P2k45J55M1j0rr0J65
$$ 51 19 -168 198 -57 16 7 53 139 -188 -125 89 -104 27 -78 201 200 48 120 -125 30 71 61 52 -38 127
8064A27k78J76q8J12j82j15L11N8Pk62Q1N4J52l10o3J62K23O7k18J15o8k14K53
$$ 127 -151 25 -63 49 -133 -248 63 121 128 -134 -53 1 153 -157 -220 -58 165 232 14 129 61 -153 100
8087A00O3j07j35kK40k10J34Qk80L88j40k77J04j4M8L2m0J73R1o6m77L21J98L5
$$ 100 163 56 -79 -81 159 -51 83 91 -189 199 59 -218 -114 -128 -80 -48 -88 85 176 110 -367 -46 152 187
8111A87j17O9m8j18o1J8K37r0k90L38l11O6kJ60J36j03q6P3J22k72K03J03k01
$$ 187 70 139 91 -27 -88 -70 167 77 -213 125 -186 -120 -122 38 174 71 -15 58 180 -92 111 214 13
8134A3l4Jk60K57q2J03rp4O3J37j90J65RP7j68N4K1l5j32k11L15R2l31J57Jk11
$$ 13 -21 -20 -280 -23 -105 -2 -11 -85 -22 115 -75 90 99 176 8 62 83 48 -84 -295 20 112 -219 -62 -61 -272
8160b72L73Q3j71lj13o4K66j2j36j66J00P26l93k46J78L8j10j78PK22j45J5k5
$$ -272 101 184 13 10 -103 -167 99 87 -49 -215 -115 611 218 -28 150 188 78 -100 -93 129 -16 -1 -26
8183b6J19r6K89l13J32P1j38m9
$$ -26 93 -3 286 -27 105 176 38 -11
8191a1
$$ Imaginary data points
##PAGE= N=2
##DATA TABLE= (X++(I..I)), XYDATA
0@%%%%%%%%%%%%%%Qj6J6j6J6k3L1l2M0m8N6o4P2q8J03j18J34j51J71j94K19k47
$$ 0 0 0 0 0 0 0 0 0 0 0 0 0 0 0 8 -8 8 -8 8 -15 16 -16 24 -24 32 -32 40 -48 55 -63 71 -80 91 -103 116 -131
36a31K78l13L52l92M35m85N38n95O58p29Q06q89R82j081J189j310J445j594J759
$$ -131 147 -166 186 -206 229 -256 282 -313 345 -384 422 -467 515 -566 623 -687 758 -836 923
55I23j945K156k396K673k997L383l852M432n174O162p550R663j3298K1286p3775
$$ 923 -1022 1134 -1262 1411 -1586 1797 -2055 2377 -2797 3365 -4185 5478 -7820 13466 -60309
70f0309N7126R6741j08350k2871M4053L18l7123M8187K9954n9576l1319O5984
$$ -60309 -3183 93558 -14792 -37663 6390 6708 -30415 17772 47726 -11850 -43169 22815
82B2815N416m2960J3880J7233l2505M894L3704j2201m1259K0093M0294k9298l0602
$$ 22815 28231 -14729 -849 16384 -16121 -11227 22477 10276 -30983 -10890 29404 106 -30496
95c0496L9049N749l5681J5977L0059k3217k0634K1550J2432k4291L644L3238k1898
$$ -30496 8553 14302 -21379 -5402 24657 1440 -19194 2356 14788 -9503 -5859 27379 5481
108E481l3308L5563J8145m2295n353M1342K14m4906k330M6802m011m0785J8026
$$ 5481 -27827 7736 25881 -16414 -21767 19575 19789 -25117 -27447 19355 15344 -25441 -7415
121g415K9239k4755j6060K5135J6550j9215j6447J5831P536j2541Q856L518k2713
$$ -7415 21824 -2931 -18991 6144 22694 3479 -12968 2863 10399 -2142 6714 10232 -12481
134a2481K395J7638p157j0349P538O407j0246l252K0814l055k7287J6541K6387
$$ -12481 -10086 7552 395 -9954 -2416 3991 -6255 -9507 11307 8252 -19035 -2494 23893
147B3893j9907j6659J4500M990j0060K754J2212j4717j7007K7277J2072l6787
$$ 23893 3986 -12673 1827 6817 -3243 -489 11723 -2994 -20001 7276 19348 -17439
159a7439n34L4445q712k5460J3343J8866j7103j3703K7659P516l4033K476K9705
$$ -17439 -17973 16472 7760 -17700 -4357 14509 -2594 -16297 11362 18878 -15155 -12679 17026
172A7026r005j3901J0013o56j0473M184J2063o258j2733J0251K110j7674J2749
$$ 17026 8021 -5880 4133 3477 -6996 -2812 9251 2993 -9740 511 2621 -15053 -2304
185b304J8664k1486j2292K1703P531j5213k542J4581k525j4976J3121J0592k0879
$$ -2304 16360 -5126 -17418 4285 11816 -3397 -5939 8642 6117 -8859 4262 14854 -6025
198f025k677J7331o732j0282Q762L589j0544l778J4495M137j7217J585J4455n567
$$ -6025 -8702 8629 1897 -8385 377 3966 -6578 -10356 4139 8276 -8941 -7356 7099 1532
212A532l169P265k501m478R58L394K490n301j737K745l446J801J428o767L914
$$ 1532 -1637 5628 3127 -1351 -393 3001 5491 190 -1547 1198 -2248 -447 981 -5786 -1872
227a872O700q103l783M822N617J080p416l57P211k159j197K901k514o2k33j481
$$ -1872 4828 -3275 -7058 -2236 3381 4461 -2955 -3312 3899 1740 543 3444 930 868 635 -846
243h46M068k520m986N526m47m396J546K85J093l33j524L923j613k699O931j463
$$ -846 3222 702 -4284 1242 795 -3601 -2055 -1770 -677 -1010 -2534 1389 -224 -2923 4008 2545
259B545n548P022J114o642j34L170L030l868n700M431J017l612L071k066k240
$$ 2545 -3003 4019 5133 -1509 -1643 1527 4557 689 -5011 -580 437 -3175 -104 -2170 -4410
274d410N789j709l517M709K260k902j639L257L935o091k404Q723l402p304O326
$$ -4410 1379 -330 -3847 862 3122 220 -1419 1838 5773 -318 -2722 6001 2599 -4705 1621
289A621Q16n409J202K590j688k630K022L325n096Q29Q249o493n530J1362J269
$$ 1621 2437 -2972 -1770 820 -868 -3498 -1476 1849 -3247 -2418 5831 -662 -6192 5170 6439
304F439r686J473O483j274n707J556M714o743q28Q468o742o735J1412O43j0124
$$ 6439 -3247 -1774 4709 3435 -2272 -716 3998 -2745 -3573 4895 -1847 -8582 2830 3473 -6651
319f651K568Q331k033q165N107R006r432m290J2928j917j1130O339N480o352l422
$$ -6651 -4083 4248 2215 -5950 -843 8163 -1269 -5559 7369 5452 -5678 661 6141 -211 -3633
334c633M037K054n826J28O747o577l301J0688j906r119O106O375m815m733M613
$$ -3633 404 2458 -3368 -3240 3507 -3070 -6371 4317 2411 -6708 -602 5773 958 -3775 838
349H38N197n833l466P534j932n430M156M09m666J682K124j585k202R54M286k954
$$ 838 6035 202 -3264 4270 2338 -3092 1064 1473 -3193 -1511 613 -972 -3174 -2220 2066 -888
365h88l323O305P76n202K568K642r13j901r78M503n05o369K657L676l697j851
$$ -888 -4211 2094 2870 -2332 236 2878 1965 64 -914 3589 3084 -3285 -628 3048 -649 -2500
381b500Q02J282R38k875Q47J283k204L793N50n181L082M987m000k791K997L182
$$ -2500 -1698 -416 522 -2353 -1506 -223 -2427 1366 1916 -3265 -183 4804 804 -1987 1010 4192
397D192l306m474N754J628p955J957N450n362j582N010o66l525O37M555j494m223
$$ 4192 886 -3588 2166 3794 -4161 -2204 3246 -2116 -3698 1312 646 -2879 -2242 2313 819 -3404
413c404N934J469p853L777P560p515m706P158K714o636l208O485M27p169L586
$$ -3404 2530 3999 -3854 -77 7483 -32 -4738 2420 5134 -1502 -4710 1775 2202 -4967 -1381
428a381M055o493J430N642m712k070N718J691n439j300P245m8q793M459N822p587
$$ -1381 2674 -3819 -2389 3253 -1459 -3529 2189 3880 -1559 -2859 4386 4338 -4455 4 5826 -1761
444a761j704O623j779n037J557L671j752l889L957J512n241L245M457n688k26
$$ -1761 -3465 3158 1379 -3658 -2101 1570 -182 -4071 -114 1398 -3843 -598 3859 -1829 -2055
459b055N761j599l875J476M230j428o258L301M296m925j009K157j815M24J668
$$ -2055 3706 2107 -1768 -292 3938 2510 -3748 -447 3849 -1076 -2085 72 -1743 -1319 349
474C49j494n33K67K119R65k945J497K276k892N88K162j110j053l21L87J699k936
$$ 349 -1145 -1678 -1411 708 1673 -1272 225 2501 -391 197 2359 1249 196 -125 262 1961 -975
491i75j320L441j743j934J396J021J02j540l02L463q80j726K913j579q72L111
$$ -975 -2295 1146 -597 -2531 -1135 -114 -12 -1552 -1854 1609 729 -997 1916 337 -535 2576
507B576l98l314N95K116P6l725l06M966l198l593N232k24l885K302J873j278j142
$$ 2576 2178 -1136 -541 1575 1651 -2074 -2380 2586 -612 -4205 1027 803 -3082 -780 1093 -185 -1327
524a327K059K000l490o42N241k386l359M273l39m567K046K884k070l616J792L670
$$ -1327 732 2732 -758 -1400 3841 1455 -1904 2369 2030 -2537 -491 2393 323 -3293 -1501 2169
540B169l722k020N302r42l748L472J008k115J390J340j554j734K139K675m228
$$ 2169 -1553 -3573 1729 787 -2961 511 1519 -596 794 2134 580 -1154 985 3660 -568
555e68k134M970j162l915K745J59k283R65J641l90j898M98L127j585j381L461
$$ -568 -2702 2268 1106 -2809 -64 95 -2188 -1223 418 28 -1870 -1372 1755 170 -1211 2250
571B250j551j969L235j03k445J001Q62r05j697M70K279k090j736K634o68j136
$$ 2250 699 -1270 1965 1862 -583 418 1280 375 -1322 -852 1427 -663 -2399 235 -433 -1569
587a569K503q66j530K088K54l93m52M71J192j668m55K583j751j560K288j045j173
$$ -1569 934 68 -1462 626 880 487 35 506 1698 30 -425 2158 407 -1153 1135 90 -1083
604a083Q63k38m37j93LJ131p18K5J523j649R11K214k138q30K129n22Kq72o25J364
$$ -1083 -220 -458 -895 -1088 -1085 46 -672 -647 876 -773 138 2352 214 -616 1513 991 993 121 -504 860
624H60q44q03N85j115R10J040k258P04J923j725j9J230l13M19l18K62M37j232
$$ 860 16 -787 -202 -1317 -407 633 -1625 -921 1002 -723 -742 488 175 594 276 538 975 -257
642b57J093J178k879O26J166k445P50J835k162o68J134J219r91j776K693J485
$$ -257 836 2014 -865 -239 927 -1518 -768 1067 -1095 -1763 -629 590 -401 -2177 516 2001
658B001l423J236J991k192M68J581j398n98R17P67j534j650K943P7m201J799L029
$$ 2001 -1422 -186 1805 -387 81 1662 264 -334 583 1350 -184 -1834 1109 1186 -3015 -1216 1813
675A813l118k47K311k42j674P67K212q67k067K124J294l386J397K165l288K07
$$ 1813 -1305 -1552 759 517 -1157 -390 1822 955 -1112 1012 2306 -1080 317 2482 -806 -599
691e99J953j227k005O90K720j400l263K717J914k937Q23K017j209j65P46k83l83
$$ -599 1354 127 -1878 -1188 1532 132 -3131 -414 1500 -1437 -614 1403 194 29 775 492 109
708A09J86J662j218k566K168J338l136M06J888j464o57N06Q75l09q28J216O84
$$ 109 295 1957 739 -1827 341 1679 -1457 -1051 837 -627 -1284 -778 97 -212 -1040 176 860
725H60j847J053P08o27Q78j66j203P73M43p09L05j717J251O93j983J71R26k54
$$ 860 -987 66 774 147 1025 859 -344 429 872 163 468 -1249 2 695 -1288 -1117 -191 -445
743d45O68r64j55K164j158j060J835k35n05L68J29J39m54m90Q35j333l21J844
$$ -445 223 -741 -896 1268 110 -950 885 650 145 513 642 781 327 -163 672 -661 -982 862
761H62j479q20J782n24j479J127J338o20j450J188K590k574j242L110k53k651
$$ 862 -617 -1437 345 -179 -1658 -531 807 187 -1263 -75 2515 -59 -1301 1809 1556 -1095
777a095J458N87j101m9N22m19j759J466K042k804j474M175p91k665J943J484j288
$$ -1095 363 950 -151 -200 322 -97 -1856 -390 1652 -1152 -2626 1549 758 -1907 36 1520 232
794B32r26J224J508k156m77K594j799j528K375l15k055J103O85j257p02J444R50
$$ 232 -694 530 2038 -118 -595 1999 200 -1328 1047 732 -1323 -220 465 -792 -1494 -50 900
811I00k139l14L409j392k112K315Q11j290J74J31L0P5m56M29j085j48J588j493
$$ 900 -1239 -1553 1856 464 -1648 667 1478 188 362 493 523 598 142 571 -514 -662 926 -567
829e67j133K068m14p61L88N6M54r0o74J647k81n43P78o16L39J09j323K85J258
$$ -567 -1700 368 -46 -807 -419 -363 91 1 -673 974 693 150 928 312 651 760 -563 -278 980
848I80j543j63M23o7J51q01R4J237p89J35P37j062J448O32j824O1J734n12j215
$$ 980 -563 -726 -303 -370 -219 -1020 -926 311 -478 -343 394 -668 780 1412 -412 -351 1383 871 -344
867c44J93R78J54k224O60J501j911r0J506j226j29J096k64k76M5J018m3j182J321
$$ -344 -151 827 981 -1243 -583 918 -993 -1083 423 -803 -932 164 -100 -376 -331 687 644 -538 783
886G83M60k093R99J484j854m64P59k93J22q11M10N14q31P17l8j428J806R15j786
$$ 783 1243 -850 149 1633 -221 -685 74 -219 -97 -908 -498 16 -815 -98 -136 -1564 242 1157 -629
905f29L19J450l40p90J59N91L8j245R95J38j416M92P81j883N42J101j101K27N85
$$ -629 -310 1140 800 10 169 760 798 -447 548 686 -730 -238 543 -1340 -798 303 -798 -571 14
924A4L00r17p1J811l01j935J508R51j577L26N08m83n6L0m98K82p56J298p08j465
$$ 14 314 -603 -674 1137 836 -1099 409 1360 -217 109 617 134 78 108 -390 -108 -864 434 -274 -1739
944a739J825Q50k207P90J155m80n7J14N26k72o03Q05l2j668J221J96j233Q17K51
$$ -1739 86 936 -1271 -481 674 194 137 251 777 505 -98 707 675 -993 228 424 -809 8 259
963B59j012K91J25M84q21m1J784l74j496R54J027r03K84m05j19N05o2o57J24j92
$$ 259 -753 -462 -337 147 -674 -715 1069 695 -801 153 1180 277 561 156 37 542 480 -177 -53 -245
983b45P40r35q45J545N7j292R91k4n41P88l75M62K74m51J88J40n11P26m89o25
$$ -245 495 -440 -1285 260 317 -975 16 -8 -549 239 -136 326 600 149 337 477 -34 692 203 -422
1003d22J360j038j100J353n1m46m6J6L91k46m10Q13l07RJ086j066m24J807m55
$$ -422 938 -100 -1200 153 102 -344 -390 -374 17 -229 -639 174 -133 -124 962 -104 -528 1279 824
1022H24j059L58K30J4p22m17J510j500m77J708p06o59J321l58p17P50N94o49k69
$$ 824 -235 123 353 367 -355 -772 738 -762 -1239 469 -237 -896 425 67 -650 100 694 45 -224
1041b24O78Q33j852QK560j686j604J541N35j254j34K53L65j052N79J274j316j21
$$ -224 454 1287 -565 -557 2003 317 -1287 254 789 -465 -599 -346 19 -1033 -454 820 -496 -617
1059f17J899j145j289J883J72p30q8L70L44j222J41J388j098p37J105p31m86O20
$$ -617 1282 137 -1152 731 903 173 85 455 799 -423 -282 1106 8 -729 376 -355 -841 -221
1077b21j27J42M4J42L55o58K95J101q91l30J077n07o38L50k02N76n31p54Q35J69
$$ -221 -348 -206 -162 -20 335 -323 -28 1073 182 -148 929 422 -216 134 -68 508 -23 -777 58 227
1097B27o06l13J45N16K50q61K50R86r32N50N40q41M9M06o3j44k20M88m67j041
$$ 227 -379 -692 -547 -31 219 -642 -392 594 -338 212 752 -89 -40 366 303 159 -61 427 -40 -1081
1117a081J024N57j759O15J214q93m52N74K93k4m86O73O76j398O14J006j552O08
$$ -1081 -57 500 -1259 -644 570 -323 -775 -201 92 68 -418 255 931 -467 147 1153 -399 209
1135B09R21j318m50P80L90o92j157J275M82j331K04J317j031K3Q84o46L47j00
$$ 209 1130 -188 -638 142 532 -160 -1317 -42 440 -891 -687 630 -401 -378 506 -140 207 107
1153A07K26K03q66J098l26j114Q28N17j572L14L78j16k51j02N65L23q95O64O4
$$ 107 333 536 -330 768 442 -672 156 673 -899 -585 -207 -323 -574 -676 -111 212 -683 -19 45
1172D5k93Q04j05j113J231K77r27j33K73K31k93m78O57j84o53L64M92p48N80J6
$$ 45 -248 556 451 -662 569 846 -81 -214 59 290 -3 -481 176 -8 -661 -297 195 -553 27 43
1192D3o97R53K13r19N20N5M56m91m54J191l91r40Q94l9o83%K2J58k7o2j4r3QJ199
$$ 43 -654 299 512 -407 113 168 624 133 -321 870 479 -461 433 394 -289 -289 -267 -109 -136 -198 -212 -305 -297 902
1216I02p94o51J021j22m98L10L19j45l22j6K69j66n53P32o35o84J430n23r05Q28
$$ 902 108 -543 478 356 -142 168 487 342 20 4 273 107 -446 286 -349 -1033 397 -126 -1031 -203
1236b03L04n19M49J04K50l56j91J091n14j099J084l0o25L64k71j32j32K84m6m01
$$ -203 101 -418 31 135 385 29 -162 929 415 -684 400 370 -255 109 -162 -294 -426 -142 -188 -589
1256e89J77P66n25o91J392k22l93M51n6j57J25l32M89k65j99N12q62J1P90q50
$$ -589 -412 354 -171 -862 530 308 -85 366 310 153 278 -54 435 170 -29 483 -379 -368 422 -428
1276d28l24J156m13o03L48M8L41k70Q6N86n06J84L19q29M39Q11q58m77Q24l17
$$ -428 -752 404 -9 -612 -264 -216 125 -145 -59 527 21 205 524 -305 134 945 87 -390 434 117
1296A17k76m75J58P45r03L40P50r91K67J089p21m97P70L67l02k40J30P0p97M3
$$ 117 -159 -634 -476 269 -634 -294 456 -535 -268 821 100 -397 373 740 438 198 328 398 -399 -356
1316c56J108j237p1J224p78r02Q52P5r8j75M1P81o19J07P89r67K63J005q61m10
$$ -356 752 -485 -556 668 -110 -1012 -160 -85 -183 -358 -317 464 -155 -48 741 -226 37 1042 181 -229
1336b29M06M0Pm79j92O83p64L5N51m94L04L67q26N42M13l44Q7O5o6J29m48J56
$$ -229 177 217 224 -255 -447 236 -528 -493 58 -436 -132 235 -591 -49 364 20 107 172 106 235 -213 -57
1358e7O13q56N76J1n42J4K09n10K62L55o11K77P0M50k6q31J165n5j001Q03L43
$$ -57 556 -300 276 287 -255 -241 -32 -542 -280 75 -536 -259 -189 261 235 -596 569 514 -487 316 659
1379F59n27j62L36L3m18k99M52j98m76P80K28j398N98P36q62K81N83q0j41p0P56
$$ 659 132 -30 306 339 -79 -378 74 -124 -600 180 408 -990 -392 344 -518 -237 346 266 125 55 811
1400H11l09q90P10L60j059J68N19p68L53N8j44j56nO50qo36O37L84j081K84O78
$$ 811 502 -388 322 682 -377 -209 310 -458 -105 -47 -191 -347 -352 298 290 -346 291 675 -406 -122 556
1421E56m09R1J22k19o3k72N23k85m86P80m92m16N66k53j45l3M41Nj37J27r8M07
$$ 556 147 238 360 141 78 -194 329 44 -442 338 -154 -570 -4 -257 -402 -435 6 11 -126 1 -97 310
1443C10m75K27L50o53O07k30m94K97L61n14k16K58J47o7l47N20k34k24O62k17
$$ 310 -165 62 412 -241 366 136 -358 -61 300 -214 -430 -172 -25 -92 -439 81 -153 -377 285 68
1463F8l63O96l4k65K24j42L9j73o2L41j67n75P39m03n73O36p8l53N04l28Q8J99
$$ 68 -295 401 367 102 326 184 223 50 -12 329 162 -413 326 -77 -650 -14 -92 -445 59 -269 -181 18
1485A8J04O8k35J54M69k22p28Q80k4p47R9J57Q8m34L24P7m64j68P72k03n61R46
$$ 18 122 190 -45 109 578 356 -372 508 484 -263 -164 -7 81 -353 -29 48 -416 -584 188 -15 -576 370
1507C70j67m10N88N0k24j94J53K44o39N7L46o1o08P57kp08M57j92QN8O2J38m43
$$ 370 203 -207 381 431 207 13 166 410 -229 -172 174 113 -495 262 260 -448 9 -183 -175 -117 -55 83 -360
1530c60P04N81q01n7L89k10k63L24q8o0q7k52m4K4P4J82l27J78L8k42L46J38k5
$$ -360 344 925 124 67 456 246 -17 307 219 159 72 -180 -224 -200 -126 56 -271 -93 -55 -297 49 187 162
1553A62k74K67q1J95M6l52N44o98K37J10l65q1O32l92k18k6L92j46j62J10M40
$$ 162 -112 155 74 269 315 -37 507 -191 46 156 -209 -290 342 -50 -268 -294 98 -48 -210 -100 340
1574C40l73L47J23o26L8P47p22N0K42k58K14j28J88j74n45M87L49n50k3L15k06
$$ 340 -33 314 437 -189 -151 596 -126 -76 166 -92 122 -6 182 8 -537 -50 299 -251 -274 41 -165
1595a65k9K45J30K8k14J8L12l01J67L61p52j55M85j72l30R0J89k13K44p7L85n90
$$ -165 -194 51 181 209 -5 13 325 24 191 552 -200 -355 130 -42 -372 -282 -93 -306 -62 -139 246 -344
1617c44L87M02o62M09K9l09J36L81j85l9%n0j02j42l9J72m50K89K03l20K07Oj64
$$ -344 43 445 -217 192 221 -88 48 429 244 205 205 155 53 -89 -128 44 -406 -117 86 -234 -27 -21 -185
1640a85L7M20pk55o8N53m51R2J44M8n15J70l1k87K53j37P0k62K61L93l93j84L67
$$ -185 -148 272 265 10 -58 495 44 136 280 328 -187 -17 -48 -335 -82 -219 -149 -411 -150 243 -150 -334 33
1663C3L30m95L38J17j99j22J6M94l82n4L31j75l90Q7M2m89N20J5j04L1j26M82
$$ 33 363 -132 206 323 124 2 18 512 130 76 407 232 -158 -71 -29 -518 2 17 -87 -56 -182 300
1685C00o13M3N44J68o30M99P7l31O0j08l16K27L03m6l89k5K44K76q36N28J14m56
$$ 300 -313 -270 274 442 -188 311 388 57 117 9 -307 -80 223 177 -212 -237 7 283 -553 -25 89 -367
1707c67N50PQ2m4k02M61l43r6K86k08m21J25n8O8K11k06m6K7J92K21l10o7K19
$$ -367 183 190 272 228 26 487 144 48 334 126 -295 -170 -228 -160 51 -155 -201 -174 18 239 -71 -138 81
1730H1k92j24P30j15q4L70m92l00N60k55R1K09o06j82l4l4P28n31k07O58m32l6
$$ 81 -211 -335 395 280 196 566 74 -226 334 79 170 379 -227 -409 -443 -477 251 -280 -487 171 -261 -297
1752b97N39mk46j08L14Q5m15L61J41m24k06Q26p10k76N69l54k19J93K37J33n02
$$ -297 242 238 -8 -116 198 283 -132 229 370 -54 -260 566 -144 -420 149 -205 -424 -231 6 139 -363
1773c63L44j1k44M37N5Om15M97k0j63n27P47q9q73O09j7j71j56P28o82M4K74p3
$$ -363 -19 -30 -274 163 218 224 -191 306 286 123 -404 343 254 -619 -10 -27 -198 -354 374 -308 -264 10 -63
1796f3K91k72m4R3K1O4K81k88J41J35m03L6J66n63L53k5j39M0o7J21J49j05J53
$$ -63 228 -44 -88 5 26 90 371 83 224 359 -44 -8 158 -405 -52 -77 -216 -176 -243 -122 27 -78 75
1819G5ok38J64J94m13M9N36m52J07N1J54q3m11M14R3l01p6J72m56K43M27k83J5
$$ 75 69 -169 -5 189 -224 -175 361 -91 16 67 221 138 -273 141 234 -67 -143 29 -427 -184 243 -40 -25
1842b5J0K94k92j77K25J72k60K51K37n85M27k19O6j39k33L74q6l60K37n8j34N69
$$ -25 -15 279 -13 -190 35 207 -53 198 435 -150 277 58 124 -15 -248 126 40 -320 -83 -141 -275 294
1864B94J4k17l2R9k38n7j22M40Q8l45J6K26n58M95j26m08J05O1K33l8k59K59J35
$$ 294 308 91 59 158 -80 -137 -259 181 269 -76 -60 166 -392 103 -23 -431 -326 -265 -32 -70 -329 -70 65
1887F5k40L75r0k3j4J18j95K79l08K3j92J4K88j65j41J32K3l76M17k98M9L74j15
$$ 65 -175 200 110 87 73 191 -4 275 -33 -10 -202 -188 100 -65 -206 -74 -51 -427 -10 -308 -259 115 0
1910@J10N8k39j29N25k87K24l25l60N98k08n53O43q2P3l24j11L73K5j0J30k25
$$ 0 110 168 -71 -200 325 38 262 -63 -423 175 -33 -586 57 -25 48 -276 -387 -14 11 1 131 -94
1932i4k42N02m9l86M43J45k05N4l21K37j02M0k9l0j22L52l69n9M03l83J33J27
$$ -94 -336 166 117 -269 174 319 114 168 -153 84 -18 22 -7 -37 -159 193 -176 -235 168 -215 -82 45
1954D5j6q3K13rL20n71J51K41k5l34K03j00M4j35jL8k4j08L1r6pK89l43J86J43
$$ 45 29 -54 159 150 470 -101 50 291 266 -68 135 35 79 -56 -57 -19 -43 -151 -120 -216 -223 66 -277 -91 52
1979E2k6j09K10M8k72J76k44K72k42K60J90l15l39N21l40j13L69m0j46K3q3L87
$$ 52 26 -83 127 175 -97 79 -165 107 -135 125 315 0 -339 182 -158 -271 98 58 -88 -65 -148 239
2001B39J16l79K65L3l11L67l11kP9r6j82J9K2O1J5J40p4j70j69N02k83k10O00
$$ 239 355 -24 241 274 -37 330 19 17 96 0 -182 -163 -141 -80 -65 75 1 -169 -338 164 -119 -329 271
2024B71l31n3N24k83k70M3P8k4r3J83o0j70J32N9l13J40K17q8L0Nq5K71j16n3
$$ 271 -60 -113 411 128 -142 -99 -21 -45 -138 45 -15 -185 -53 6 -307 -167 50 -38 -8 -3 -88 183 67 14
2048A4J85k77o3J20J12k22J76j41P4j39PJ10l50L31J01j57J66p8j16M5L14l9r2
$$ 14 199 -78 -141 -21 91 -131 45 -96 -22 -161 -154 -44 -394 -63 38 -119 47 -31 -147 -102 212 173 81
2071H1m9M7l0k03J49L12m87K09J56k51O5J16m00K91p9p2K95l5N5j65k95L89L67
$$ 81 32 79 49 -154 -5 307 -180 29 185 -66 -1 115 -285 6 -73 -145 150 115 170 5 -290 99 466
2094D66o79M15l46J30o5J97j92j8J4K28Q9o07M47j45k1O01k89r7J03k14o3J1p2
$$ 466 -213 202 -144 -14 -79 118 -74 -92 -78 150 239 -368 79 -66 -87 514 225 128 231 17 -46 -35 -107
2117a07J95Ok04L07j46l76L61J43l73M75l67j3N7rJ42k06J50N4P7k65R8j2J34
$$ -107 88 94 -110 197 51 -325 36 179 -194 281 -86 -99 -42 -51 91 -115 35 89 166 -99 -1 -13 121
2140A21j11j61J8J72p2m0J61o6N4j06j01J83j23j89L48j61K75l52JK06Jj85Q0
$$ 121 10 -151 -133 39 -33 -73 88 22 76 -30 -131 52 -71 -260 88 -73 202 -150 -149 57 58 -127 -47
2163d7K58q2J10k47k41L14O7j90l6k65J97J89j08J74J48j33P7K03o67K43o0J66
$$ -47 211 129 239 -8 -249 65 132 -58 -94 -359 -162 27 -81 93 241 108 185 388 -279 -36 -96 70
2185G0J44l1j14j73J29Q0j82q7L21k17L4o7K11j01J23M4K0k51J86j87J59n1K56
$$ 70 214 183 69 -104 25 105 -77 -164 157 -60 -26 -93 118 17 140 184 204 -47 139 -48 111 60 316
2208C16k07l52M79k16Qj33Q6n2K21r9J82k88J5o0N6K68m11J38j96L91R2k08J1
$$ 316 109 -243 236 20 28 -105 -19 -71 150 51 233 -55 -40 -100 -44 224 -187 -49 -245 146 238 30 41
2231D1N1p5k50K92k5k76J22J74j36k15M42l88K82o2L00k05l68J93J85q0J60o8
$$ 41 92 17 -233 59 34 -242 -120 54 -82 -297 145 -243 39 -23 277 72 -296 -103 82 2 162 94
2253I4J08p8P4k09l4j14l0L45l37J8M58m31J06K59n4j15j6K99j91k11J59J77l89
$$ 94 202 124 198 -11 -45 -159 -189 156 -181 -163 295 -136 -30 229 175 60 44 343 152 -59 100 277 -112
2276a12L46L9o96M35k9p3Q1J20l82K28M9J9rk22O1K85n5j06K97k75P7L5O5k9p8
$$ -112 234 273 -423 12 -17 -90 -9 111 -271 -43 6 25 16 -206 -145 140 85 -21 276 1 78 113 178 149 71
2301G1j02Q0K8J27k54j93J59J49N8k86K8r7J96n2L72l58K30j70J80k99K72j78
$$ 71 -31 49 77 204 -50 -243 -84 65 123 -163 -135 -232 -36 -88 284 -74 156 -14 166 -133 139 -39
2323c9m6j06L00l98K60k02L81j12k77L66j55j22o1K06j54q8N67k51M38k10j71
$$ -39 -85 -191 109 -289 -29 -231 150 38 -239 127 -28 -150 -211 -5 -159 -247 320 69 507 297 126
2344A26m5k80J01L60q9k24J81l13L03j87J08NK6k31L93k30K59j83j76K72l91N4
$$ 126 81 -199 -98 262 173 -51 130 -183 120 -67 41 46 72 -159 234 4 263 80 -96 176 -215 -161
2366a61K23O7m20P17n82l8J82k0j3l0j41L40r1n0R0k7n6j9K18j81N3J23N1l43
$$ -161 62 129 -291 426 -156 -194 -12 -32 -45 -75 -216 124 33 -17 73 46 -10 -29 189 8 61 184 235 -108
2390a08J03q8O3j09L93l20J22Rj92J44r2J4k6P4J1K37l15K35j39J96k84p8L53
$$ -108 -5 -93 -30 -139 254 -66 56 65 -127 17 -75 -61 -87 -13 -2 235 -80 155 16 212 -72 -150 203
2413B03m03N0L21n02L65J1q9k46K87k0j55L16r7n3k9J50q2L10k52j99L27l21Q8
$$ 203 -200 -150 171 -331 34 45 -44 -290 -3 -23 -178 138 41 -12 -41 109 27 337 85 -114 213 -108 -20
2436b0o2r4m4J37Q6K85l52K11p7j64P0J71o7k47M44j72j00o8J11K3J1j73J13r5
$$ -20 -82 -176 -220 -83 3 288 -64 147 70 -94 -24 147 80 -167 277 105 5 -63 48 71 82 -91 22 -73
2460g3J35j65l86K49k08J50kK79j58J01J16l30M32j00m7MO8nJ00n79N23j52k30
$$ -73 62 -103 -489 -240 -448 -298 -300 -21 -179 -78 38 -292 140 40 -7 -3 65 60 160 -419 104 -48 -278
2483b78L53O7o9k94MK98k08J5J11MJ0J14%J61k66J9rj02j04M47m26R3j6J01j17
$$ -278 75 142 73 -221 -217 81 -127 -112 -1 3 13 127 127 288 22 41 32 -70 -174 273 -153 -60 -76 25 -92
2508i2L28q9m33N8J23M0j7L61j91j02m5J70L5k85K72K2m51L12p1Q6j40j02K0L87
$$ -92 236 147 -286 -228 -105 -65 -82 279 88 -14 -59 111 146 -139 133 155 -296 16 -55 31 -109 -211 -191 196
2532A96p9l08J10O6o6J46q8j27J88j41oK48J97m58K28l5J21k14N7L30l25n7q6
$$ 196 117 -191 -81 -15 -81 65 -23 -150 38 -103 -109 139 336 -122 106 71 192 -22 35 365 40 -17 -103
2555a03K61M5k72J29k78J08K28j49q8J01J93k50J17j70J3k1K49L7n9k93Q0J09
$$ -103 158 203 -69 60 -218 -110 118 -31 -119 -18 175 -75 42 -128 -115 -136 113 150 91 -202 -122 -13
2577a3J7j70R5j14J53N04l33k29K44n4o8Q9O3j67k63P55n75j2P2j27j30j8KL15
$$ -13 4 -166 -71 -185 -32 472 139 -90 154 100 32 121 184 17 -246 509 -66 -78 -6 -133 -263 -281 -279 36
2601C6k49J35J67j72L50j84K13o13M67k24J77J62n29L3K8K98k29j38K0K84J49
$$ 36 -213 -78 89 -83 267 83 296 -317 150 -74 103 265 -264 -231 -203 95 -134 -272 -252 32 181
2622A81m89J57P3l7K05J92l92J53J62l01K61n2J97k99p7L53l32r8K7K09k11J6
$$ 181 -308 -151 -78 -115 90 282 -110 43 205 -96 165 113 310 11 -66 287 -45 -143 -116 93 -118 -102
2644a02m7K62k27o3K79J09m33L77j61J86l41L84k00Kk0j94O7j4L17k05L4m9P5
$$ -102 -149 113 -114 -177 102 211 -222 155 -6 180 -161 223 23 25 5 -189 -122 -136 181 -24 10 -39 36
2667C6k09M20o9j02n4J18R2j16j41J3j5N9N5j35J06j40K02k94O7Ko5O3K4N4Nj76
$$ 36 -173 247 178 76 22 140 232 116 -25 -12 -27 32 87 -48 58 -82 120 -174 -107 -105 -170 -107 -83 -29 -24 -200
2693b00O8J6J30L30l09k2N8k37J87k72K54j42O1k24J36Q4J15j54J23K6j3k4j59
$$ -200 -132 -116 14 344 35 13 71 -166 21 -251 3 -139 -78 -302 -166 -82 33 -121 2 28 15 -9 -168
2716a68J48JK83o1l4k02K95p24O36m19J35K0j3j99j31M47l2Oj02L01m90L60K7
$$ -168 -20 -19 264 203 169 -33 262 -462 174 -245 -110 -90 -103 -302 -433 14 -18 -12 -114 187 -303 57 84
2739H4j15o9m1j7m5j32N34k27j37K17j28j40K79K42l52N8L3p2q4J33j17L00k37
$$ 84 -31 -100 -141 -158 -203 -335 199 -28 -165 52 -76 -216 63 305 -47 11 44 -28 -112 21 -96 204 -33
2762c3K67K1j27O0j11o9J63p0k03oO9o1K81k37J96j09M0j30L08j54k19J57j94
$$ -33 234 255 128 188 77 8 171 101 -102 -108 -39 -100 181 -56 140 31 71 -59 249 95 -124 33 -161
2785a61J17o8P1J58O8q4mj71K93J37n58J53K46k39mL37k29n6K01j50rk59N73l08
$$ -161 -44 -112 -41 117 185 101 97 -74 219 356 -202 -49 197 -42 -46 291 62 6 207 57 48 -211 362 54
2809E4K91m70L94l55j0L78k32l8k88N52j66k15k1J90k60M29k86j9N1J39p3K40
$$ 54 345 -125 269 -86 -96 282 50 12 -276 276 110 -105 -126 64 -196 233 -53 -72 -21 118 45 285
2831B85nl16k42L64J46l2k12K5k%j09j78J10K55r3P5l5j29J02Q7j09L30j02k24
$$ 285 280 -36 -278 86 232 200 -12 13 11 11 -98 -276 -166 89 -4 71 36 -93 9 96 -13 317 215 -9
2855im2J61k66K32l5j04J22r1m5J25m80K93N14m10o7J73q9Q5jj46j79K89l1K51
$$ -9 -51 110 -156 76 41 -63 59 -32 -77 48 -432 -139 375 -35 -102 71 -18 67 66 -80 -259 30 -1 250
2879B50k28J28J96m05R6M2n1r6K0J66J67ok39j15j61K64%lp6J04j16l7MK72l65
$$ 250 22 150 346 -59 37 79 28 -68 -48 118 285 279 40 -75 -236 28 28 25 -51 53 -63 -100 -96 176 -189
2904a89J97J49k08K56Q3m39K20L4j83l0K51l34PJ07nK27k20J29j23J29j25N4J49
$$ -189 8 157 -51 205 288 -151 69 103 -80 -110 141 -193 -186 -79 -84 143 -77 52 -71 58 -67 -13 136
2927A36j23J72j58j97m9J23q2K15m8q1K5K5K4K02l23Q9n8j18M19j91Qo4j6P0j92
$$ 136 13 185 27 -170 -219 -96 -178 37 -11 -92 -67 -42 -18 184 -139 -50 -108 -226 193 2 10 -54 -70 0 -192
2952a92K61r5J50L9k85J58k42K18O8L2M9j89M17l66J84L4o6j64K73j21k65J71
$$ -192 69 -26 124 163 -122 36 -206 12 80 112 161 -28 389 23 207 241 175 11 284 163 -102 69
2974F9n2j79O8O3J05k03l5K53k45K56j30J65j18k85K97J97J46k34K2l32K92k42
$$ 69 17 -162 -94 -31 74 -129 -164 89 -156 100 -30 135 17 -268 29 226 372 138 160 -172 120 -122
2996a22J55j80K38j11M0m3j40K89j20J42j35j82K97P7k98L41K4j67m64J95J01
$$ -122 33 -147 91 -20 20 -23 -163 126 6 148 13 -169 128 205 -93 248 272 105 -359 -164 -63
3017f3q1k2K68k1l86M73j90m7J05P6j6j15L5r2L04k48K69l79J72P7l12J43J05
$$ -63 -144 -166 102 81 -305 168 -22 -69 36 112 96 -19 16 -76 228 -20 249 -130 42 119 -193 -50 55
3040E5l91L62J21J27l75J16J08j10j45L17j42K63m47J02J56Q1j46l23J24J02j04
$$ 55 -336 26 147 274 -101 15 123 13 -132 185 43 306 -141 -39 117 198 52 -271 -147 -45 -149
3061a49M5R2J1j48K72k49mJ18K14l75J05K1p9K89J18J96k75k0j67j30n8J48r9
$$ -149 -104 -12 -1 -149 123 -126 -130 -12 202 -173 -68 -47 -126 163 281 477 202 182 15 -115 -173 -25 -124
3084a24K10k9j36K52j42q2J06k7O9kj6O2J4j76J41j34j3r2l1k2K10Q6l48O8Q3
$$ -124 86 57 -79 173 31 -51 55 28 97 95 79 141 155 -21 120 -14 -27 -119 -150 -172 38 124 -224 -156 -73
3109g3q4K36lj24l50N60r2j01k2K96k62j11P7l2J43l02o2N52k48mQ7L7N9j12J43
$$ -73 -157 79 76 -48 -398 162 70 -31 -53 243 -19 -130 -53 -85 58 -244 -306 246 -2 -6 81 118 177 65 208
3134B08P3l04j75K78q9N9L6r9k6K40k43J11lo4k22K31j02J14k07J47Q8J44k0j29
$$ 208 281 -23 -198 80 -9 50 86 -13 -39 201 -42 69 66 2 -220 11 -91 23 -184 -37 51 195 175 46
3158D6r3J33N0O6j24J00k18j1kJ62j2nk0L9L6j69J09L76l83K54l16n10L42J51
$$ 46 -47 86 136 202 78 178 -40 -51 -53 109 97 92 72 111 147 -22 87 463 80 334 18 -492 -150 1
3182Ar9K71K40k86k9k01Q0J10l61K11M8o5l2P9m6j27K91Q3j38k07K04q8L34k43
$$ 1 -98 173 413 127 98 -103 -23 87 -274 -63 -15 -80 -112 -33 -79 -206 85 168 30 -177 27 -61 273 30
3206C0J67l57M21j94j6O8j6P6J64l50l32K94P4K50L5j69J48j62j36k52K72o4L6
$$ 30 197 -160 261 67 51 119 103 179 343 -7 -339 -45 29 279 314 145 293 131 -5 -257 15 -49 -13
3229a3L4j13j7K44l8j69n6L72lj80l06J52M69l92k7j26J13L0l7K57K2j20j09J09
$$ -13 21 -92 -109 135 97 -72 -128 244 241 61 -245 -93 376 -16 -43 -169 -56 -26 -63 194 216 96 -13 96
3253I6j35j60K1j1J08Q7l8j13L26k76K63l47Q4Q5ko6l1r7J23p7R9N4J49j88k42
$$ 96 -39 -199 -178 -189 -81 6 -32 -145 181 -95 168 -179 -95 -10 -12 -78 -109 -206 -83 -160 -61 -7 142 -46 -288
3278b88K32m7J29R8k56J12j77M0J79L1J87k44Q4j09K06j58k83L99k53J87K24r8
$$ -288 -56 -103 26 124 -132 -20 -197 -157 22 53 240 -4 80 -29 177 19 -264 135 -118 69 293 195
3300A95k73n8K46j6l8N1k79J19L14j83j55r1J62j59n5J85k1K06q3l6j60J33k62
$$ 195 -78 -136 110 94 56 107 -172 -53 261 78 -77 -168 -6 -165 -220 -35 -56 150 67 31 -129 4 -258
3323b58M59j64j26o1M14q9k95m1r9L9L70l87M02j18j51J38k5k23K01k76L04P4
$$ -258 201 37 -89 -150 264 175 -120 -161 -260 -221 149 -238 164 46 -105 33 8 -215 -14 -290 14 88
3345H8k20K76k21j90K30K7P2r0k0j68M53j70j4j3j44m0n8K48j3j86J76j5j35m1
$$ 88 -132 144 -77 -267 -37 -10 62 -28 -48 -216 237 67 53 40 -104 -144 -202 46 33 -153 23 8 -127 -168
3369a68L09L3n38K58J81k27J4K91k13P7l7Q2j25P0J80j30M85l35l6j58qJ57j87
$$ -168 141 174 -364 -106 75 -152 -138 153 -60 17 -20 62 -63 7 187 57 542 207 171 13 5 162 -25
3392b5%q3J12j53K80l47J35J83M8l98J87p5K96j02j37K75k33j60L43J49j74m08
$$ -25 -25 -108 4 -149 131 -216 -81 102 150 -248 -61 -136 160 58 -79 196 -37 -197 146 295 121 -287
3414b87J93K25k25L02l00R4J58k93j01O3oL17j31R0l19J92J5l56K41k2K71R1m5
$$ -287 -94 131 -94 208 -92 2 160 -133 -234 -171 -177 140 9 99 -220 -28 -13 -369 -128 -150 121 212 167
3437A67k82j9K36k75K84m05J69J04j70J33J15j06oP3l2o6j62O4J86j48m7L32N7
$$ 167 -115 -134 102 -173 111 -294 -125 -21 -191 -58 57 -49 -55 18 -14 -80 -242 -178 8 -140 -187 145 202
3460B02l36J04O6l2l0J59l13L68j67J5j34j66K20kJ83k68J33J17m83K74N02j56
$$ 202 -134 -30 36 4 -26 133 -180 188 21 36 -98 -264 -44 -46 137 -131 2 119 -364 -90 412 256
3482B56k90K21j17j03o2j2J98j13j9l30N52k15K33r9j51J28q4l0J40K21l70J88
$$ 256 -34 187 70 -33 -95 -107 91 -22 -41 -371 181 -34 199 100 -51 77 -7 -37 103 324 -46 142
3504A42K0k25K74l35L57m1j48p5L49k93M1N1k43J47j39J91j80K11J42m69K48J23
$$ 142 162 -63 211 -124 233 192 44 -31 318 25 66 117 -126 21 -118 73 -107 104 246 -223 25 148
3526A48p5k4Q3k49K35j26k9J98l72J00K8j78M29mp1j3J24k61J06L70m78R0L11
$$ 148 73 49 132 -117 118 -8 -37 161 -211 -111 -83 -261 168 164 93 80 204 -57 49 419 -59 31 342
3549C42l45J94q7j58j7R2o0K00j87r5K65l20R2J81j15L54l93J61k5j1j86K40k27
$$ 342 -3 191 104 -54 -71 21 -39 161 -26 -121 144 -176 -84 97 -18 336 -57 104 79 68 -118 122 -105
3572a05J4m9M95k11j00JK31l23j92K17j23K52m41K28l2K61j63n4j01J37K9K68
$$ -105 -91 -140 355 144 44 45 276 -47 -239 -22 -145 107 -334 -106 -138 123 -40 -94 -195 -58 -29 239
3594B39l35K06p9Q6k5k8N0J17j33o9K33j62k08L35j71l7m6l26J75J53P8J41l67
$$ 239 -96 110 31 117 92 64 114 231 98 29 262 100 -108 227 56 19 -27 -353 -178 -25 53 194 -173
3617a73J26J02m28M54l1M9l48K88R6k5R1l15J85j98L11j73J29NP5m09j14N39m73
$$ -173 -47 55 -373 81 50 99 -249 39 135 110 201 -114 71 -127 184 11 140 145 220 -189 -303 236 -237
3640b37J55O9J32J19m20K49q5n4j57J87mK64N0j94k53K03J45j31n9J27j59NJ05
$$ -237 -82 -13 119 238 -182 67 -18 -72 -229 -42 -46 218 268 74 -179 24 169 38 -21 106 -53 -48 57
3663E7M8n60K70R5K38k95r4J41J62J41j54l96K89N4N6j00J84j45N7J61l34J84
$$ 57 105 -455 -185 -90 148 -147 -241 -100 62 203 49 -347 -58 -4 52 -48 136 -9 48 209 -125 59
3685E9j32K21m5k0j68o0L57k37l1l87L46q7R0M6M7J18q0n3l8J79Qk55j00L15L9
$$ 59 -73 148 103 83 -85 -145 212 -25 -56 -443 -97 -184 -94 -48 -1 117 37 -16 -54 125 133 -122 -222 93 132
3710A32j01q2O9J33Q9l83M70m60K50j39O8p0j14J92K58l24J26j90K0m5K35j57
$$ 132 31 -51 18 151 240 -143 327 -133 117 -22 46 -24 -138 54 312 -12 114 -76 -56 -101 134 -23
3732b3Nq5P9J14j0j83K08q4l04K10M7oj42K60j30L47j83M6j73j23m6J03j27N15
$$ -23 -18 -103 -24 90 80 -103 105 21 -283 -73 -26 -32 -174 86 -44 303 120 166 -7 -130 -176 -73 -200 315
3756C15l37L5q2j17M15o1p2j82O2J4P7j19L8L0r3j28J04P2Kj6O1l40N62j83Q8
$$ 315 -22 13 -69 -186 229 168 96 -86 -24 -10 67 -52 -14 16 -77 -205 -101 -29 -27 -43 18 -322 240 57 145
3781A45N2k83l65L13O6M3l1q9J22k6p8K42j46p9KJ30l7K52j88Q2k89N5K49q8p6
$$ 145 197 -86 -451 -138 -72 -29 -60 -149 -27 -53 -131 111 -35 -114 -112 18 -19 233 45 127 -162 -107 142 54 -22
3806b2m0P1O9l0j4P4L24k73l30K53l58L46J62l47K03k7q7J34k09R7j28K02L1K01
$$ -22 -62 9 78 48 34 108 432 159 -171 82 -276 70 232 -115 88 61 -26 108 -101 -4 -132 70 101 302
3830C02k52lQ1k63J53J10lK60j00l74K2K94k95J44n4o6P0J08l42J32O0j07R1j38
$$ 302 50 47 128 -135 18 128 125 385 285 -89 -67 227 -68 76 22 -44 26 134 -208 -76 -16 -123 -32 -170
3854a70P9J12O1l7O4K7k19j38J61L8ok16J2K08J23J35j32k13J28j16J56j0n4K30
$$ -170 -91 21 82 45 109 136 -83 -221 -60 -22 -28 -244 -232 -24 99 234 102 -111 17 -99 57 47 -7 223
3878B23j75j4k43M05Q5l03K24l22j26K04q3n5K36j71L81l90J77k07K14l24K10
$$ 223 48 34 -209 196 281 -22 202 -120 -246 -42 -125 -180 56 -115 266 -124 53 -154 60 -264 -54
3899e4k41Q3N4K66k87K96k58N2K18j10j9Q1j57J20R1j1N4r6q3J22j87ok6K1J7
$$ -54 -295 -212 -158 108 -179 117 -141 -89 129 19 0 81 -76 44 135 124 178 82 -1 121 -66 -72 -98 -77 -60
3924f0P3l0O1q3j4J71L3k98L06L6j35J47j59O4j54K81l31K97j50k08K53j85Mj51
$$ -60 13 -17 44 -39 -53 118 151 -147 159 195 60 207 48 112 -42 239 -92 205 55 -153 100 -85 -81 -232
3948b32K32j82L97j17K3j33j02K18j3l6K44k64O5J5J25j20l54P1l9M25ql80K12
$$ -232 0 -182 215 98 121 -12 -114 104 91 55 299 35 100 115 240 120 -234 -163 -202 223 215 -165 47
3971D7J1Kj50Q8j36K14r1k00J35J18k73L85l9j09j47L02p6l58M66r7M7k61k0K80
$$ 47 58 60 -90 -2 -138 76 -15 -215 -80 38 -235 150 111 2 -145 157 81 -277 189 92 139 -122 -142 138
3995A38l60p6K92k7K81qk31N9R2J35l93K09l55J79o4L47j76O6N4k74Q4q4P3J58
$$ 138 -222 -298 -6 -33 248 240 9 68 160 295 -98 111 -244 -65 -129 218 42 108 162 -112 -28 -112 -39 119
4019A19j10p0n3j80L70J49k28r7K12j05J55j14j89K39q6K07l15K24r5l0L0L0n8
$$ 119 9 -61 -114 -294 76 225 -3 -100 112 7 162 48 -141 98 12 219 -96 128 33 3 33 63 5
4042El43K82M6j10k05O39m11j7O9J16J34k76K8N3J01l0j85Q6n2p3J54nk61K01
$$ 5 -338 -56 -10 -120 -325 314 -97 -114 -45 71 205 -71 -43 10 111 81 -104 -18 -70 -143 11 6 -255 -54
4066e4J09L09k68l66M80j25J5q1j9M3m0j18R8o4K17k27J23R8k23O7P5l4L3j35
$$ -54 55 364 96 -270 210 85 100 19 0 43 3 -115 -17 -81 136 -91 32 130 -93 -26 49 15 48 -87
4090h7n5M03k68p6P1L6K40p3j61r2J79l24J44J64M6N0k38j21K89j39J49l20j43
$$ -87 -142 261 -7 -83 -12 24 264 191 30 -62 117 -207 -63 101 147 197 -41 -162 127 -12 137 -183 -326
4113c26K91J85n6j0k29K31J28M5j39j52K4O6m2j21K76k63M3J84k06K45l8j11o0
$$ -326 -35 150 94 84 -145 86 214 259 120 -32 -8 58 16 -105 171 -92 -49 135 -71 174 136 25 -35
4136c5P2j25J76O5k90L44m6j03J2l09K52j67N2k5r2O2j56L15o8j50L67Q6m13K53
$$ -35 37 -88 88 153 -137 207 161 58 70 -239 13 -154 -102 -127 -219 -157 -313 2 -66 -216 151 237 -176 77
4160G7J12n38L02J56l9j21N2P2k9j28k6J71J80j62Qm9J71mk9j60K11k50J2J04
$$ 77 189 -349 -47 109 70 -51 1 73 44 -84 -110 61 241 79 87 38 209 205 176 16 227 -23 -11 93
4184I3k32L67m40K76j19r1p7J94L06l99K10l00j9L24n1%j90n7J17J90l41K30O9
$$ 93 -139 228 -212 64 -55 -146 -223 -29 277 -122 88 -212 -231 93 42 42 -148 -205 -88 102 -239 -9 60
4207F0k19J43k8RL26k95Q4n7k16q9L19Or1R6q4K43k06k56K85j07J43J37J5n1k09
$$ 60 -159 -16 -44 -35 291 -4 80 23 -193 -282 37 43 -48 48 -36 207 1 -255 30 -77 66 203 218 167 -42
4232d2J55J30k35jJ97l91K29m8K7j99K60k45LJ08j57K38n7M8j55J47M3m07O09
$$ -42 113 243 8 7 204 -187 42 -6 21 -178 82 -163 -160 -52 -209 29 -28 20 -135 12 55 -352 257
4255B57k3k50p5j73M20k2K46n08J23k9j21R2j62L8J05m9J48l49M13j25Q5j47q9
$$ 257 234 -16 -91 -264 156 134 380 -128 -5 -34 -155 -63 -225 -187 -82 -131 17 -332 81 -44 41 -106 -195
4278a95L33k02K4ol5N6J07l7j81J73R1j0N0j18K2j91K31j72r5pq2K44J11nk12
$$ -195 138 -64 -40 -46 -81 -25 82 45 -136 37 128 118 168 50 72 -119 112 -60 -155 -162 -244 0 111 106 -106
4303a06J40jJ26j69L3K37k64M3J82j68j82k09N50k94L14k67N8Q8k46k7j06o8M44
$$ -106 34 33 159 -10 23 260 -4 39 221 53 -129 -338 212 -82 232 -35 23 111 -135 -162 -268 -336 108
4326A08o7jL74l84J77k42J1J29k3j34K77k23M9o9j98J01j7j54J28o3L95j84k5
$$ 108 41 40 414 30 207 -35 -24 105 82 -52 225 2 51 -18 -216 -115 -132 -286 -158 -221 174 -10 -35
4349c5j79L40k66O4j21L22k37J31j85K07p9J79j42l6j23jQ8k0L57m67o8K68l2
$$ -35 -214 126 -140 -76 -197 125 -112 19 -166 41 -38 141 -1 -37 -160 -161 -73 -93 264 -203 -271 -3 -35
4372c5J42j88K15l25k08J37N92l45l66O57k85J74j08k0l4Q2r3j08J38J72j89r9
$$ -35 107 -81 134 -191 -399 -262 330 -15 -381 276 -9 165 57 37 3 85 -8 -116 22 194 5 -94
4394i4r2R6K07o6Q3j26j2rN7P8l02K97j82R6l29J65J65k91K44pJ33J32j92k37
$$ -94 -186 -90 117 51 134 8 -4 -13 44 122 -180 117 -65 31 -298 -133 32 -259 -15 -22 111 243 51 -186
4418a86M42j71l90K07J78l38K35R7K6m4J5Q5j28J38j83k38J74J82J38k07P6o7
$$ -186 256 85 -305 -98 80 -258 -23 74 100 56 71 156 28 166 -17 -255 -81 101 239 32 108 41
4440D1J00j32m6L60n06J76K40m57K32J4j06K29L9j36K3j40J15j56M07m45l0L1
$$ 41 141 9 -37 323 -183 -7 233 -224 8 22 -84 145 184 48 71 -69 46 -110 297 -148 -178 -147
4462a47L40m81L11J63k00K2p0K78r4Q8k58K8k8J78j2j77M2j67L31k43J10l02J69
$$ -147 193 -288 23 186 -14 8 -62 216 122 210 -48 -20 -48 130 118 -59 -17 -184 147 -96 14 -288 -119
4485a19O2J28l31K53K62k44K83l4l19P1Q2l22M6K72j68j34j27K67K8K05j44j77
$$ -119 -57 71 -260 -7 255 11 294 260 -59 12 94 -228 -182 90 -78 -212 -339 -72 -44 161 17 -160
4507a60J84p5R9o7l6n0j28L76p5p0J15l60o5J16N8m4K89L6k43j88J88L0j4L16
$$ -160 24 -51 48 -19 -55 -105 -233 143 68 -2 113 -247 -312 -196 -138 -182 107 143 -100 -288 -100 -70 -84 232
4531B32k93j73K24q6Q9J6J05k25p8K04qk14L67l2k0q2N3k59K92k07L3J1J19r4
$$ 232 -61 -234 -10 -96 -7 9 114 -111 -189 15 7 -207 160 128 108 26 79 -180 112 -95 -62 -51 68 -26
4555b6k19J53K21r6q1o0M4j2K62j4j64l79K92P8j36L70n30Q1J83J71j71K58n70
$$ -26 -245 -92 129 33 -48 -108 -64 -76 186 172 8 -371 -79 -1 -137 233 -297 -216 -33 138 -33 225 -345
4578c45N17J9j74l00J17j12K68J1k9LJ48P7k78P2J31m05J36j02M63k33K86q3P
$$ -345 172 191 17 -283 -166 -278 -10 1 -28 -25 123 200 -78 -6 125 -280 -144 -246 217 -16 270 187 194
4601A94J35m11K61k78J45l6o2j24R6J02j56Q8L4l2J53M7l3l61J59J92J04j35j44
$$ 194 329 -82 179 -99 46 10 -52 -176 -80 22 -134 -46 -12 -44 109 156 123 -238 -79 113 217 82 -62
4624f2M54p31K09K13k80K15Q6k56K40J3j39L11p6r2j48J14j89O0J51n7M7N7K6
$$ -62 392 -339 -130 83 -197 18 104 -152 88 101 -38 273 197 105 -43 71 -118 -58 93 36 83 140 166
4647A66l9j98M6k0J64l27K88Q1nn20K91J33m4jo1J68J61l31N5j8j84J71L17l81
$$ 166 127 -71 -25 -45 119 -208 80 161 156 -364 -73 60 16 15 -46 122 283 -48 7 -11 -195 -24 293 -88
4671h8j0P6j73M3K09k17J92j35J0qK80m16j20M30L3j98R8j68J95M0N8k99J40j73
$$ -88 -98 -22 -195 -152 57 -160 32 -103 -93 -101 179 -237 -357 73 106 -92 6 -162 33 73 131 -168 -28 -201
4695b01J00L63k40j0m3J96j42l52L62J36k01Pj31p1L77k03O6Kj01j99M03oq6N6
$$ -201 -101 262 22 12 -31 165 23 -329 33 169 -32 -25 -156 -227 150 -53 13 15 -86 -285 118 112 26 82
4719H2k14M8N8j00L47k12OJ24q6k12mJ23p5k3K12p8j1P4K6j8OJ55j17l6p2k05
$$ 82 -132 -84 -26 -126 221 9 15 139 53 -159 -163 -40 -115 -138 74 -4 -15 59 85 67 73 228 111 75 3 -202
4745b02L99k4k4k5J5j8k65mK63p2k9q2j36O31k47j63j80Q2K81j29Q1j09l9j13
$$ -202 197 173 149 124 139 121 -144 -148 115 43 14 -68 -204 427 180 17 -163 -81 200 71 152 43 4 -109
4769a09M4K26k23K97k02Q7j15k89K50P0o7R9K20k02J79j16j15j59N8J40O9j26
$$ -109 -65 161 -62 235 33 120 5 -284 -34 36 -31 68 288 86 265 149 34 -125 -67 73 142 16
4791A6J25k12r5j0K02n9J49O7k18K37k31J90j47J54j57j40K75l23oR3p5L73l41
$$ 16 141 -71 -166 -176 26 -33 116 183 -35 202 -29 161 14 168 11 -129 146 -177 -183 -90 -165 208 -133
4814a33K41j48n2J37K4j76k69O30n8k98L7L38l24L80l75r8oO4L52q7j62j2LR4
$$ -133 108 -40 -92 45 69 -107 -376 254 196 -102 -65 273 -51 329 -46 -144 -150 -86 266 179 17 5 8 102
4838A02j35k4K1j5K21Q7j80K8k00o5J29L19k54j01J42J17N6j99j89J16k52J41
$$ 102 -33 -57 -36 -51 170 257 77 105 -95 -160 -31 288 34 -67 75 192 248 49 -140 -24 -276 -135
4860a35L04j95k15J52J98j03O7j73Rj16m3L35m1L5j14jJ18o4J8j71L62p6n3L7
$$ -135 169 -26 -241 -89 109 6 73 -100 -91 -207 -250 85 44 79 -35 -36 82 18 36 -135 227 151 98 135
4884A35j03j38k33J87L27j11n9K20l67K08r4P6k3j57O5K39l70J98Pq8R6M4O8j33
$$ 135 32 -106 -339 -152 175 64 5 225 -142 66 -28 48 25 -132 -67 172 -198 0 7 -81 15 59 127 -6
4908fL65j49k74K37k04J70j90J6k80K08J69o7M7k60J67j54N0J33J26j4n7O3j71
$$ -6 359 210 -64 173 -31 139 -51 -35 -315 -107 62 -5 42 -218 -51 -205 -155 -22 104 90 33 96 -75
4931g5M4P4j48j27K76p4j21K21J4k3j58J01J00j61p0J04kJ15J69m85K19k4L44
$$ -75 -31 43 -105 -232 44 -30 -151 70 84 61 -97 4 104 -57 -127 -23 -25 90 259 -226 -7 -31 313
4954C13k32J44k49j33J05PK50k27q9J61J1j26n6K92k78J57L7k08l9J67rJ34l3
$$ 313 81 225 -24 -157 -52 -45 205 -22 -111 50 61 -65 -121 171 -107 50 87 -121 -160 7 -2 132 99
4977I9k2M7Lj93J4J28J74k71J53k28r4L02r8k24J11OL9n6O2J16L6K78j85j23p9
$$ 99 77 124 127 -66 -52 76 250 -21 132 -96 -190 112 14 -210 -99 -93 -54 -110 -48 68 104 382 197 74 -5
5002eJ14l7j46J97j60PK12k59K11k38J33K62qj34j75K40o2N4lj32k13J61m4k0
$$ -5 109 72 -74 123 -37 -30 182 -77 134 -104 29 291 283 149 -26 214 152 206 203 71 -142 19 -25 -45
5026d5J33L6k59K27k85Q3J88J8l6j50R7KJ66p8p8j53J20L1J32m70M32j51K97j87
$$ -45 88 124 -135 92 -193 -110 78 96 60 -90 7 9 175 97 19 -134 -14 17 149 -321 111 -40 257 70
5050G0r7j18K11K79l76j39K16k22J76j24J33R7r4j00N6L2j45J32j1q9K47k1l3
$$ 70 -27 -145 66 345 -31 -170 46 -176 0 -124 9 106 12 -88 -32 0 -145 -13 -24 -113 134 113 80
5073H0m2J36p5j0o1O3n6N8j48Q6P9p8J45J4N1l80K30k67J05m0J32j05K22n7q4
$$ 80 38 174 99 89 28 91 35 93 -55 31 110 32 177 191 242 -138 92 -175 -70 -110 22 -83 139 82 -2
5098bk0J20j22J98j34j79K26j56j77p9K82K17j83K7rj47K77o5j10JK38j55j86
$$ -2 -22 98 -24 174 40 -139 87 -69 -246 -325 -43 174 -9 18 9 -138 139 74 -36 -35 203 48 -138
5121a38J74Q4k1J76k58J17k58J98o6L8j57K70j54j88Q8Q8nJ9L99l50N3j65p1j99
$$ -138 36 120 99 275 17 134 -124 74 8 46 -111 159 5 -183 -95 -7 -12 7 406 56 109 -56 -127 -326
5145c26M66k29J25q5k08N40j43P2l41P9J22m26L84J7K50l23l4K85j55k25J40J72
$$ -326 140 -89 36 -49 -257 283 140 212 -129 -50 72 -354 30 47 297 -26 -60 225 70 -155 -15 157
5167A57l43O5J94J21m17K43j71J35R1K8r4P4j43J86k69J95j56Q4P0l0j93M17j40
$$ 157 -186 -121 73 194 -223 20 -151 -16 75 103 9 83 -60 126 -143 52 -104 -20 50 20 -173 244 104
5190A04j96J67l51J50J70k14R0J13p9l41M53j72j00K39j49Q9p4J09RJ09k44m9
$$ 104 -92 75 -276 -126 44 -170 -80 33 -46 -387 66 -106 -206 33 -116 -27 -101 8 17 126 -118 -167
5212a67J30j80J78K27j52k44J66L4J18l57K35q3K45m4j35J1o8J93k34K7M8K2P1
$$ -167 -37 -217 -39 188 36 -208 -42 -8 110 -247 -12 -95 150 106 -29 -18 -86 107 -127 -100 -52 -30 41
5235D1p3m0L5K19l82J12Q9K5L6mj48k22K81l9P2R7q5J89k70O5J4n5J61j00o7J02
$$ 41 -32 -72 -37 182 -200 -88 1 26 62 58 -90 -312 -31 -70 2 99 14 203 -67 -2 12 -43 118 18 -49 53
5261E3r7j41K50m7J5j74K32k73M25j86J98j69J19k62j52K69k25K93j36MJ7P2n3
$$ 53 -44 -185 65 18 33 -141 91 -182 243 57 255 86 205 -57 -209 60 -165 128 -8 -4 13 85 32
5284C2J17m17K56q0M7ll5n9L45l83J88K67k50j02J67k97M3J19Q5r7K86p7j62M0
$$ 32 149 -268 -12 -92 -45 -48 -83 -142 203 -180 8 275 25 -77 90 -207 -164 -45 40 -57 229 152 -10 30
5308C0n8r8N1K93k76l9l7J09O0r1J12k18R9L58n81L77j43p0L7J19j23J03q9K93
$$ 30 -28 -126 -75 218 -58 -97 -134 -25 35 -56 56 -162 -63 295 -286 91 -52 -122 -85 34 -89 14 -75 218
5332B18k7l48J27J1o4nK90j17p9P2q2j72q8K24J1K21J55l62J22l67L02r1l2M9
$$ 218 191 -157 -30 -19 -83 -88 202 85 6 78 -4 -176 -264 -40 -29 192 347 -15 107 -260 42 -49 -81 -32
5356c2O1j14L75k00p2j7k48J40K18j09nk06L1K33J79r4m40N58j65k20J05lj69
$$ -32 29 -85 290 90 18 1 -247 -107 111 2 -3 -209 -178 55 234 140 -300 258 93 -127 -22 -25 -194
5379a94M35p9j44O8M2k24oj50J10J25k5J31J07k20J04r1K01j8j96R8q6K9o2j29
$$ -194 241 162 18 86 128 -96 -102 -252 -142 -17 -42 89 196 -24 80 -11 190 172 -24 74 -12 17 -45 -174
5403a74P4J88o9j96J87q4J44m5p9l5K20k30J23k0nj11K3K09k5j44j92J79J79j29
$$ -174 -100 88 19 -177 10 -74 70 25 -54 -89 131 -99 24 4 -1 -112 -89 120 95 -49 -241 -62 117 -12
5427a2Mk8L8j35K21k14J70j84L81j28j82J96k40j72L46j52k92K37M54l83Q9n0
$$ -12 -8 -36 2 -133 88 -126 44 -140 241 113 -69 127 -113 -285 61 -91 -383 -146 308 -75 14 -36
5449c6j98K13K56k08p9K13q7j27j57K85j74J74l31J68J07k94K33K70r3j63k48
$$ -36 -234 -21 235 27 -52 161 74 -53 -210 75 -99 75 -256 -88 19 -275 -42 228 135 -28 -276
5470b76J94L17k65O3k19J79j35K23k15J69k54J99R9Q3m18K77J11k82J73pj23L03
$$ -276 -82 235 -30 33 -186 -7 -142 81 -134 35 -219 -20 79 162 -256 21 132 -150 23 16 -107 196
5492A96j69j23l02M78q4L84l50N1J8OJ8K7o2j48K07l55J87p9K74l29N2J25j10
$$ 196 27 -96 -398 80 -4 380 30 81 99 105 123 150 88 -60 147 -208 -21 -100 174 -155 -103 22 -88
5515h8J85l58L11N1Jm0k37J5K11J29ok85M4J05J0KJ9k11Q0L2j11k34N58l13L19
$$ -88 97 -261 50 101 102 62 -175 -160 51 180 174 -111 -67 38 48 50 69 -142 -62 -30 -141 -375 183 -130 189
5540A89j32L4j07K3K43j83l47L36J63j83m0l43K82K10k90J65k26M56k06j77J27
$$ 189 57 91 -16 7 250 67 -280 56 219 36 -4 -347 -65 145 -145 20 -206 250 44 -133 -6
5561fkj2m3J6L8K80k5l31l07M62P6j57j88J73Q0j60L0l8L06j39k86M42j70J01
$$ -6 -8 -20 -63 -47 -9 271 246 -85 -392 70 146 -11 -199 -26 54 -106 -76 -114 192 53 -233 209 39 140
5585A40r9j53L46q0k24k4o1M19j10l97M45j33Lo0J32j56L63k06l29K40p2J56o1
$$ 140 41 -112 234 154 -70 -94 -155 264 154 -243 202 69 72 12 144 -12 351 145 -184 56 -16 140 79
5608G9Q8k49J14j35J34n9o3J3k1K12k24J64j35J18K0J51k48M7J07m3r3J88j24
$$ 79 167 -82 32 -103 31 -28 -91 -78 -99 113 -111 53 -82 36 56 207 -41 6 113 70 -23 165 41
5631D1r2K30l07J81k88M50j84l05L45r8jJ44Qk09K34k32Q2j30J25J06k21K26j71
$$ 41 -51 179 -128 53 -235 215 31 -274 71 -27 -28 116 124 -85 149 -83 -1 -131 -6 100 -121 105 -66
5654f6J72k20Q1J01k87J91n6p2K40j55r2k2K41L3o9P3l77L81j51j2m3J02O8l9
$$ -66 106 -114 -33 68 -219 -28 -84 -156 84 -71 -163 -185 56 89 20 93 -284 97 -54 -66 -109 -7 61 22
5678B2N8J31n06N34l12N4P2N7j92m9K16j95L88k49K5P5J16k28N4O4J42l19p6J6
$$ 22 80 211 -295 239 -73 -19 53 110 -82 -131 85 -110 278 29 54 129 245 17 71 135 277 -42 -118 -102
5702a02J63J38m47M03k04k84%J60%P3l8M3J71l5l11L95k17K05j91L08l14j8L16
$$ -102 61 199 -248 155 -49 -333 -333 -173 -173 -100 -138 -95 76 41 -270 125 -92 113 -78 230 -84 -102 214
5725B14l94K17J25j32rl3L2k36J64j62P9J89r3K24n6k1j00rP9n1j52L82k23L46
$$ 214 -180 37 162 30 21 -12 20 -216 -52 -214 -135 54 -39 185 129 108 8 -1 78 27 -125 257 34 380
5749C80l71nj33J09J41oJ4j59P0J73m22q4K43J65m7j83J68m4k25J20J63j58L01
$$ 380 9 4 -129 -20 121 115 129 -30 40 213 -209 -293 -50 115 68 -115 53 9 -216 -96 67 -91 210
5772B10q6o0j42j57K61M8k06L62k78K50j52l4K6r4j10L28l08J99L9k77K81j30
$$ 210 124 64 -78 -235 26 74 -132 230 -48 202 50 16 42 -52 -162 166 -142 57 96 -181 100 -30
5794c0K58l35J02l28N9K91j53k1J26o1J04l0K11NLj74k42L3K80j36j4j13M47l57
$$ -30 228 -107 -5 -333 -274 17 -136 -157 -31 -92 12 -18 193 198 201 27 -215 -182 98 -38 -52 -165 282 -75
5818g5J11m6Kj37lJ01L96m56K08Lj79o8R7J66l72K46j77J9K54o2P0k41j2K54j71
$$ -75 36 -10 -8 -145 -148 -47 349 -107 101 104 -75 -143 -46 120 -252 -6 -183 -164 90 28 98 -143 -155 99 -72
5843g2M2K8o3N4m5J04p2j76R3K37j79k57K37J19k36L61j52J04J7l83LK09N8k32
$$ -72 -30 -2 -65 -11 -56 48 -24 -200 -107 130 -49 -306 -69 50 -186 175 23 127 144 -239 -236 -27 31 -201
5867b01J15j6k22N13k28LN6k16J67R5j07q0K58p3Q2j12j08J27o4J41k48K10j77
$$ -201 -86 -102 -324 189 -39 -36 20 -196 -29 66 -41 -121 137 64 146 34 -74 53 -11 130 -118 92 -85
5890h5K15m6k72qq4L28j59J42j9n9r7L89J44n11K03k18K31k98J65J96L6j65M4
$$ -85 130 84 -188 -196 -280 48 -111 31 12 -47 -144 245 389 -122 81 -137 94 -204 -39 157 193 28 72
5913G2k31P1p7JL3M8o1N5L9Q1j03J00Qo4K09M4l88J47O6O8j58oJ43p5p6K1L0M4
$$ 72 -159 -88 -165 -164 -131 -83 -144 -89 -50 31 -72 28 36 -28 181 225 -163 -16 50 118 -40 -46 97 22 -54 -33 -3 41
5941D1P2l65J86j07J27no4J24k2K07j36j49J27q3J15K32j78m93R0L97p6k21K70
$$ 41 113 -252 -66 -173 -46 -51 -115 9 -13 194 58 -91 36 -47 68 300 122 -371 -281 116 40 -181 89
5964H9k14L86m40J78Pj06J15nO1j05j46K74j84p0L00m74J76R2k57M70l23p3K14
$$ 89 -125 261 -179 -1 6 -100 15 10 71 -34 -180 94 -90 -160 140 -334 -158 -66 -323 147 -176 -249 -35
5987c5J79j30LK6n7J06j60p7M62j54q5k3j72N1k01J24J68Q4r4j16N93k02j23k16
$$ -35 144 14 17 43 -14 92 -68 -145 317 163 78 55 -117 -66 -267 -143 25 109 15 -101 492 290 167 -49
6011d9K0J83k36K02j38j94O4m1L75j68m2K08k35K52n6k57K12j42O1Q8p9o7n7K04
$$ -49 -29 154 -82 120 -18 -212 -148 -189 186 18 -24 184 -51 201 145 -112 100 -42 19 107 28 -39 -96 108
6035A08M8j41k89L86o8m2r2J14J1%j73J10Q9j35Q5Q3j6k05J46K12j83r6P6j43
$$ 108 156 15 -274 112 44 2 -90 24 35 35 -138 -28 61 -74 11 94 78 -127 19 231 48 -48 28 -115
6059a15J96j22j70J95J25l24J72n1m1J52q8Q6l5J83j91p7J06Q6l22K5K96Q3j93
$$ -115 81 -41 -211 -16 109 -215 -43 -94 -135 17 -71 15 -20 163 -28 -105 1 87 -235 -210 86 169 -24
6082b4Lm3l3L05n2j67q8j10O1n4L71l83L53j71k44M33o4R7k44J50k30L66J71l35
$$ -24 -21 -64 -97 208 156 -11 -99 -209 -148 -202 169 -214 139 -32 -276 157 93 190 -54 96 -134 232 403 68
6106F8j05J95j07N6j37l6P5k17K79r8R4q7Rm3j06m4J66j46K13p3R3J3k12p1K40
$$ 68 -37 158 51 107 -30 -66 9 -208 71 -27 67 -20 -11 -54 -160 -204 -38 -184 29 -44 49 62 -150 -221 19
6131A9J41k40Jm1J21j22O7k6k0R2J07r8J79n24Q5J37nJ66qJ51j98J15l0p5J11
$$ 19 160 -80 -79 -120 1 -121 -54 -80 -100 -8 99 1 180 -344 -259 -122 -127 39 31 182 -16 99 69 -6 105
$$ [...]
8191a04
##END NTUPLES=NMR FID
##END=
