##TITLE=1H_Pr AmC2
 200.13MHz, DMSO,
 8 sc
 
 8.10.2025
##JCAMPDX= 6.0         $$ Bruker NMR JCAMP-DX V2.0
##DATA TYPE= NMR FID
##DATA CLASS= NTUPLES
##ORIGIN= UXNMR, Bruker Analytische Messtechnik GmbH
##OWNER= pz
$$ XWIN-NMR		Version 3.5
$$ Wed Oct  8 15:38:27 2025 Russian Standard Time (UT+4h)  she@DPX200
##.OBSERVE FREQUENCY= 200.1313
##.OBSERVE NUCLEUS= ^1H
##.DELAY= (6, 6)
##.ACQUISITION MODE= SIMULTANEOUS
##.ACQUISITION SCHEME= undefined
##.AVERAGES= 8
##.DIGITISER RES= 18
##SPECTROMETER/DATA SYSTEM= spect
##.PULSE SEQUENCE= zg30
##.SOLVENT NAME= DMSO
##.SHIFT REFERENCE= (INTERNAL, DMSO, 0, 14.3821)
##AUDIT TRAIL= $$ (NUMBER, WHEN, WHO, WHERE, WHAT)
$$ ##TITLE= Audit trail, XWIN-NMR		Version 3.5
$$ ##JCAMPDX= 5.01
$$ ##ORIGIN= Bruker BioSpin GmbH
$$ ##OWNER= she
$$ F:/spectra/data/she/nmr/H-C/1/audita.txt
$$ ##AUDIT TRAIL=  $$ (NUMBER, WHEN, WHO, WHERE, WHAT)
(   1,<2025-10-08 15:37:02.20 +0400>,<she>,<DPX200>,
      <created by zg, POWCHK disabled, PULCHK disabled
       configuration hash MD5:
       00 E9 B6 7A A2 85 ED C7 34 08 36 98 17 FE 4E 26
       data hash MD5: 16K
       1E EB A6 CF CD 79 AB 54 45 41 B9 DF FB 9B 99 25>)
$$ ##END=
$$ 
$$ hash MD5
$$ D0 82 ED 4F 29 EF 8B 7A 34 82 BF 0C 8E 7A 18 77
##$RELAX= 
##$RELAX= 
##$RELAX= 
##$RELAX= 
##$RELAX= 
##$RELAX= 
$$ Bruker specific parameters
$$ --------------------------
##$DU= <F:/spectra>
##$EXPNO= 1
##$NAME= <H-C>
##$PROCNO= 1
##$TYPE= <nmr>
##$USER= <she>
##$AMP= (0..31)
100 100 100 100 100 100 100 100 100 100 100 100 100 100 100 100 100 100 
100 100 100 100 100 100 100 100 100 100 100 100 100 100 
##$AQSEQ= 0
##$AQ_mod= 1
##$AUNM= <au_zg>
##$AUTOPOS= <>
##$BF1= 200.13
##$BF2= 200.13
##$BF3= 200.13
##$BF4= 200.13
##$BF5= 200.13
##$BF6= 200.13
##$BF7= 200.13
##$BF8= 200.13
##$BYTORDA= 1
##$CFDGTYP= 0
##$CFRGTYP= 5
##$CHEMSTR= <none>
##$CNST= (0..31)
1 1 145 1 1 1 1 1 1 1 1 1 1 1 1 1 1 1 1 1 1 1 1 1 1 1 1 1 1 1 1 1 
##$CPDPRG= <>
##$CPDPRG1= <>
##$CPDPRG2= <>
##$CPDPRG3= <>
##$CPDPRG4= <mlev>
##$CPDPRG5= <mlev>
##$CPDPRG6= <mlev>
##$CPDPRG7= <mlev>
##$CPDPRG8= <mlev>
##$CPDPRGB= <>
##$CPDPRGT= <>
##$D= (0..31)
0 0.7 0 0 0 0 0 0 0 0 0 0.03 0 0 0 0 0 0 0 0 0 0 0 0 0 0 0 0 0 0 0 0 
##$DATE= 1759923421
##$DBL= (0..7)
120 120 120 120 120 120 120 120 
##$DBP= (0..7)
150 150 150 150 150 150 150 150 
##$DBP07= 0
##$DBPNAM0= <>
##$DBPNAM1= <>
##$DBPNAM2= <>
##$DBPNAM3= <>
##$DBPNAM4= <>
##$DBPNAM5= <>
##$DBPNAM6= <>
##$DBPNAM7= <>
##$DBPOAL= (0..7)
0.5 0.5 0.5 0.5 0.5 0.5 0.5 0.5 
##$DBPOFFS= (0..7)
0 0 0 0 0 0 0 0 
##$DE= 6
##$DECBNUC= <off>
##$DECIM= 32
##$DECNUC= <off>
##$DECSTAT= 4
##$DIGMOD= 1
##$DIGTYP= 9
##$DL= (0..7)
0 120 120 120 120 120 120 120 
##$DP= (0..7)
150 150 150 150 150 150 150 150 
##$DP07= 0
##$DPNAME0= <>
##$DPNAME1= <>
##$DPNAME2= <>
##$DPNAME3= <>
##$DPNAME4= <>
##$DPNAME5= <>
##$DPNAME6= <>
##$DPNAME7= <>
##$DPOAL= (0..7)
0.5 0.5 0.5 0.5 0.5 0.5 0.5 0.5 
##$DPOFFS= (0..7)
0 0 0 0 0 0 0 0 
##$DQDMODE= 0
##$DR= 18
##$DS= 0
##$DSLIST= <SSSSSSSSSSSSSSS>
$$ [...]
##$SUBNAM0= <"">
##$SUBNAM1= <"">
##$SUBNAM2= <"">
##$SUBNAM3= <"">
##$SUBNAM4= <"">
##$SUBNAM5= <"">
##$SUBNAM6= <"">
##$SUBNAM7= <"">
##$SUBNAM8= <"">
##$SUBNAM9= <"">
##$SW= 18.0517328524113
##$SWIBOX= (0..15)
0 0 2 0 0 0 0 0 0 0 0 0 0 0 0 0 
##$SW_h= 3612.71676300578
##$TD= 16384
##$TD0= 1
##$TE= 0
##$TE2= 300
##$TE3= 300
##$TEG= 300
##$TL= (0..7)
0 120 120 120 120 120 120 120 
##$TP= (0..7)
150 150 150 150 150 150 150 150 
##$TP07= 0
##$TPNAME0= <>
##$TPNAME1= <>
##$TPNAME2= <>
##$TPNAME3= <>
##$TPNAME4= <>
##$TPNAME5= <>
##$TPNAME6= <>
##$TPNAME7= <>
##$TPOAL= (0..7)
0.5 0.5 0.5 0.5 0.5 0.5 0.5 0.5 
##$TPOFFS= (0..7)
0 0 0 0 0 0 0 0 
##$TUNHIN= 0
##$TUNHOUT= 0
##$TUNXOUT= 0
##$USERA1= <user>
##$USERA2= <user>
##$USERA3= <user>
##$USERA4= <user>
##$USERA5= <user>
##$V9= 5
##$VALIST= <valist>
##$VCLIST= <CCCCCCCCCCCCCCC>
##$VD= 0
##$VDLIST= <DDDDDDDDDDDDDDD>
##$VPLIST= <PPPPPPPPPPPPPPP>
##$VTLIST= <TTTTTTTTTTTTTTT>
##$WBST= 1024
##$WBSW= 4
##$XGAIN= (0..3)
0 0 0 0 
##$XL= 0
##$YL= 0
##$YMAX_a= 529128
##$YMIN_a= -620440
##$ZGOPTNS= <>
##$ZL1= 120
##$ZL2= 120
##$ZL3= 120
##$ZL4= 120
##$ABSF1= 10
##$ABSF2= 0
##$ABSG= 5
##$ABSL= 3
##$ALPHA= 0
##$AQORDER= 0
##$ASSFAC= 0
##$ASSFACI= 0
##$ASSFACX= 0
##$ASSWID= 0
##$AUNMP= <proc_1d>
##$AZFE= 0.1
##$AZFW= 0.1
##$BCFW= 1
##$BC_mod= 2
##$BYTORDP= 1
##$COROFFS= 0
##$CY= -3
##$DATMOD= 1
##$DC= 2
##$DFILT= <>
##$DTYPP= 0
##$F1P= 0
##$F2P= 0
##$FCOR= 0.5
##$FTSIZE= 0
##$FT_mod= 4
##$GAMMA= 1
##$GB= 0.15
##$INTBC= 1
##$INTSCL= 1
##$ISEN= 128
##$LB= 0.25
##$LEV0= 0
##$LPBIN= 0
##$MAXI= 10000
##$MC2= 0
##$MEAN= 0
##$ME_mod= 0
##$MI= 1.114404
##$NCOEF= 0
##$NC_proc= 0
##$NLEV= 6
##$NOISF1= 3.799351
##$NOISF2= 2.8
##$NSP= 1
##$NTH_PI= 0
##$NZP= 0
##$OFFSET= 14.38212
##$PC= 1
##$PHC0= -2281.327
##$PHC1= 14.59224
##$PH_mod= 1
##$PKNL= yes
##$PPARMOD= 0
##$PSCAL= 0
##$PSIGN= 0
##$REVERSE= no
##$SF= 200.129724274929
##$SI= 16384
##$SIGF1= 3
##$SIGF2= 2
##$SINO= 400
##$SIOLD= 16384
##$SREGLST= <1H.CDCl3>
##$SSB= 0
##$STSI= 0
##$STSR= 0
##$SW_p= 3205.1282051282
##$SYMM= 0
##$S_DEV= 0
##$TDeff= 0
##$TDoff= 0
##$TI= <>
##$TILT= no
##$TM1= 0
##$TM2= 0
##$TOPLEV= 0
##$USERP1= <user>
##$USERP2= <user>
##$USERP3= <user>
##$USERP4= <user>
##$USERP5= <user>
##$WDW= 1
##$XDIM= 8192
##$YMAX_p= 0
##$YMIN_p= 0
$$ End of Bruker specific parameters
$$ ---------------------------------
##NTUPLES= NMR FID
##VAR_NAME=  TIME,          FID/REAL,        FID/IMAG
##SYMBOL=    X,             R,               I
##VAR_TYPE=  INDEPENDENT,   DEPENDENT,       DEPENDENT
##VAR_FORM=  AFFN,          ASDF,            ASDF
##VAR_DIM=   8192,          8192,            8192
##UNITS=     SECONDS,       ARBITRARY UNITS, ARBITRARY UNITS
##FACTOR=    0.0002768,     1,               1
##FIRST=     0,             0,               0
##LAST=      2.2672688,     0,               0
##MIN=       0,             -620440,         0
##MAX=       2.2672688,     529128,          0
$$ Real data points
##PAGE= N=1
##DATA TABLE= (X++(R..R)), XYDATA
$$ [...]
1824A06j50j10K10k16K35k12M40n15K03R0j69J70j15L01m98o2M36l33P4J06J17
1845A08k22J55K53j53q2k5p7j36K07J18m02L15j67p5J45K77k95j84K23r0j1M10
1867B92k74L3j00J34p0p4Q5j31O8K32n5k82M69k33O5j93r6o4Pl9N17l39k04M61
1891B09j75k8N31n48l19M06J33j36k87J71k2N1nj15L8K13Jpj04L7j19K8n3J17
1915A7j26M5J88l39L91j05q3N6J36k97M9J40k84p5M53j19q6N2n1L19l93K84l7
1938A35k41j78N12j86q7K15j65j02K54j16j49K82k29K02k53K64o8j62j95L80l00
1959a87K77J84n56J18K12m3J39k99J62J96l48l6J20p1M23k11N0j26J05k29oJ44
1981A8Lk07J70J37j43j09K83j51j9k68pN8J55L5N0K06m54L17j52J58Q1j35O9Q3
$$ plain form
1824 106 -44 -154 56 -160 75 -137 303 -212 -9 81 -88 82 -33 268 -230 -292 144 -189 -115 -9 108
1845 108 -114 41 294 141 59 34 -43 -179 28 146 -256 59 -108 -183 -38 239 -56 -240 -17 -107 -118 292
1867 292 18 51 -49 85 15 -59 26 -105 -37 195 140 -142 327 94 159 -34 -130 -194 -187 -226 291 -48 -252 209
1891 209 34 6 537 -11 -330 76 209 73 -214 -43 -65 -14 -19 -134 -96 117 118 111 7 44 -75 -47 -100 17
1915 17 -109 -64 124 -215 176 71 -12 44 180 -117 -68 72 -212 -287 166 47 -39 13 -38 281 -112 172 135
1938 135 -106 -284 228 42 -45 170 5 -97 157 41 -108 174 -55 147 -106 158 90 -72 -267 113 -187
1959 -187 90 274 -282 -164 48 5 144 -155 7 203 -145 -181 -61 -132 291 80 130 4 109 -120 -126 18
1981 18 21 -186 -16 121 -22 -131 152 1 -18 -286 -293 -235 -80 -45 5 211 -243 74 -78 80 161 26 95 178
2005A78j85j39K05j82p7Q7j15J49j55M82j42l77J90J61k95p8N76l13J20l4m9o8
2027f1J85L7j45l85N89o31K38J36j0k8L45k92K54l12K29K0k49M42k03j98j5K23
2049A69o31L19M39o46R6M10k77J85L10m98pJ9J85j36j15K83Q6l12J00J64m60L30
2071A3L12m50J22J81j58n1j9M05l42k2L32k11j87L02m99J02M34k51j21P5J95k68
2093a06J93pJ71m54K71K65n75L37J57k98j39K77j57O0k07K81q2n4K02p3k83Q2
2115a39L30l18J89K04l04Q3O6Q8l60J22J63n12J99M22k91k52N68j55k85M04m6
2136A76m61L13J03l37L65N5k25j89K4M51m44N9K55n23M57J55p6l02J68p3J57o7
2158D1J43m45L13L7k86j63L98Pn48N61J77l16K8L8Q1k70j98N18k33k95N45k7k79
$$ plain form
2005 178 -7 -146 59 -123 -200 -113 -228 -79 -234 248 106 -271 -81 80 -215 -293 283 -30 90 56 7 -61
2027 -61 124 161 16 -369 220 -411 -173 -37 -47 -75 270 -22 232 -80 149 169 -80 362 159 -39 -54 169
2049 169 -462 -143 296 -350 -254 156 -121 64 374 -124 -131 -112 73 -63 -178 105 191 -121 -21 143 -317 13
2071 13 325 -125 -3 178 20 -31 -50 355 13 -9 323 112 -75 227 -272 -170 264 13 -108 -33 162 -106
2093 -106 87 80 251 -203 68 333 -242 95 252 -46 -185 92 -65 -5 -212 69 -13 -67 135 62 -221 -139
2115 -139 191 -127 62 266 -38 45 111 199 -161 -39 124 -388 -189 233 -58 -310 258 103 -182 222 176
2136 176 -285 28 131 -206 159 214 -11 -200 -176 275 -169 -110 145 -378 79 234 158 -144 24 -49 108 41
2158 41 184 -261 52 89 -197 -360 38 45 -503 58 235 -81 -53 -15 66 -204 -402 116 -117 -412 133 106 -173
2181a73M75l78o4M5K66j68J68k0r9j30L6J36m86N47J39n58J06M40m37J9K19l37
2203b54K35J19M4K28j38k29kl39N81rp52O06q2j36J36K29k61j59L38l43K51j41
2225g8L63l40J6M81l95k02P31p57p5N31j69j99J34K15k41o4m8K37n01M54K78l79
2247hL1J95k59j48K77K18j68l97K61q3p8O6L48m89K47L06o28K52K65k79J74j12
2269ij11K3Q1Q5j57j3N30j16o32N74k30M1m9L1J04j00Lp7m3J27L82n76J52K82
2293C02l92K44P6j94Q3m8l14M02j08l9j10K70k12l7j74L72o0k38L42K11p09K46
2315h7M4L4J03J52M2m63L35m1J0l19QR0k25N13m41J08N06k96l06r8K34o7K0J43
2339aM48n52N5J53N5k55O7K5j45L33j71k9l7J9M8k37L74j41j6j20J28P1J93jl48
$$ plain form
2181 -173 302 -76 -140 -95 171 3 171 151 52 -78 -42 94 -392 155 294 -264 -158 282 -155 -136 83 -254
2203 -254 -19 100 144 372 234 5 3 -336 245 236 -516 90 8 -128 8 237 -24 -183 155 -188 63 -78
2225 -78 285 -55 -39 442 47 -155 576 -181 -256 275 106 -93 41 256 15 -49 -97 140 -361 93 371 -8
2247 -8 23 218 -41 -189 88 306 138 -259 2 -81 -159 -93 255 -234 13 319 -309 -57 208 -71 103 -9
2269 -9 -120 -97 -16 69 -88 -101 429 313 -319 255 25 66 17 48 152 52 55 -22 -65 62 444 -132 20 302
2293 302 -90 154 230 36 119 71 -243 159 51 12 -98 172 -40 -77 -251 121 61 -177 165 376 -333 -87
2315 -87 -43 -9 94 246 288 -175 160 119 129 -190 -182 -92 -317 196 -245 -137 369 73 -233 -331 -97 -164 -144 -1
2339 -1 447 -105 -50 103 158 -97 -30 -5 -150 183 12 -17 -54 -35 13 -224 150 9 -7 -127 1 72 265 264 -84
2364h4K40j00m0n6P8N2N9k26J67n5l5K98m46j47O16m58J33j22K15n5j11L53m56
2387a80M03l57O2m4J41N7L9p7j04J85l2k25r7K78J07l17LL7K30L20p61L83q8j66
2411b03L58j94j32L50l74K78J21j64K74j79J02Jj2n25L61m1J37n1l52M85m28j07
2433b95P22o31j04N72m91M96k31L4j80K53k75L96k14k09L07k73K00K25k45k44
2453a87J98k09K28q6J40j03P1l92L20R2k69M2j05L85K2k56P9K56j91p8l22M53
2475H8q9j65K10j67kJ07O3l64N36l22k9J28K14j68K81m58K19l54K10K11j52MJ1
2498A2l4p8M51o74N86k95K11k97L28r5jk55L0J78o62O89P8k39K9J07j7j08J28
2521G2j13j76M08m30R6L38j6j91l28O12Q6m73L22k1k50J67j13N7O7k19Q1K54k15
$$ plain form
2364 -84 156 56 16 -40 38 90 149 -77 90 35 0 298 -148 -295 321 -137 -4 -126 89 34 -77 276 -180
2387 -180 223 -134 -72 -116 25 82 121 44 -60 125 93 -132 -229 49 156 -161 -158 -121 109 429 -332 51 -37 -203
2411 -203 155 -39 -171 179 -195 83 204 40 314 135 237 238 226 -299 62 21 158 107 -245 240 -188 -295
2433 -295 427 -204 -308 264 -227 269 38 72 -108 145 -130 266 52 -157 150 -123 77 302 57 -187
2453 -187 11 -198 30 -56 84 -19 52 -340 -20 72 -197 -155 -260 125 147 -109 -30 226 35 -43 -365 88
2475 88 -1 -166 44 -123 -125 -18 45 -319 217 -105 -134 -6 208 40 321 -137 82 -272 -62 149 -3 1 12
2498 12 -22 -100 351 -323 263 -32 179 -118 210 115 114 -141 -111 67 -595 94 172 -67 -38 69 52 -56 72
2521 72 -41 -217 191 -239 -143 195 179 -12 -340 272 358 -115 207 186 -64 103 -10 47 114 -105 -24 230 15
2544A5j19qK27M9k65q7K09Q6j44O5J27j58J52j41r4K21L6k97j66L98j01k21L60
2567A44m6m75M20L30l15j72K30K30k60j13J04p3l50P60l12r8P9J37n69K97L44
2588B92l45J59k63L73l79J63j06J17L6J24n40K87L17k17j73K75l18J10L6l6k2
2609a10j53M06P0n43J37J90k69J60L09o8j42K43k86J30J42K4o59J93M70m09lJ29
2631c9j23j05M60J43k02M0j4m64J82J21k40J01J55N7k34L15m7k43r4O03l48J06
2653A30j4p0j09j3L12k87k7l9K27q2J70n4j41j64J70R1m17N32j07j60j17K32k45
2676a82J93J2j52p9L48J93k30l0l39K84QK64m4m18PL6P1J78k47j93L50K71l3m34
2700a66K06j36K82j91L12j68j70j5q1mO7J75m93L83P4l69M26P5j95n5L44j1m25
$$ plain form
2544 15 -104 -112 115 164 -101 -188 21 107 -37 28 155 -3 149 8 -86 135 171 -126 -292 106 5 -216 144
2567 144 98 -377 43 373 58 -114 116 346 86 -27 77 4 -346 414 102 4 83 220 -349 -52 292
2588 292 -53 106 -157 216 -163 0 -106 11 47 171 -369 -82 235 18 -155 120 -198 -88 -52 -88 -110
2609 -110 -263 143 213 -330 -193 -3 -272 -112 197 129 -13 230 -56 74 216 240 -419 -226 244 -165 -168 -39
2631 -39 -162 -267 193 336 134 174 160 -304 -122 -1 -241 -140 15 72 -162 153 106 -137 -231 372 24 130
2653 130 116 46 -63 -76 236 -51 -78 -117 110 28 198 144 3 -161 9 100 -317 215 108 -52 -169 63 -182
2676 -182 11 23 -129 -208 140 333 103 73 -266 18 26 290 246 -172 -165 -129 -58 120 -127 -320 30 301 268 -166
2700 -166 40 -96 186 -5 307 139 -31 -46 -127 -131 -64 111 -382 1 75 -294 132 207 12 -43 301 290 -135
2723a35J07J64k59j05L88l4m97M73J64j76L8j93l9O6o4J07J25k9J96l01q6L13
2745B23Mk88J37j48m39P50om28j01P15n50o0J06K55j08J36r4l23M1L84k07k60
2767b61J04K55j36Q1Q3q0p3j02P8q0M12j71j95j19J90j96J12j42J65J44M4P8j24
2790F7NJ99k07j18L09k10k00J29j12M20k61J80k46k4L8J75k85N6l3M8O1j62p7
2813b48L57k54n4J89J41k53l7K46LK87n41L61j52l15M90l88L07Lj69k42J49rK91
2836A62J19l42L88m34q6K18Kk81L30j15R8J65r4k85jL23j01j52K77j15l78M13
2858A11q5o4J5M13p15J92K39j34P3j46o6L53j73kJ58k16K42j58K27l34K65q3k73
2881a61L04j43o2LN4Q3k3J79j08j0k05K54o1J14j70QJ0J00N3l42J48mj50R8K76
$$ plain form
2723 -135 -28 136 -123 -228 160 126 -371 102 266 90 128 -65 -104 -38 -102 5 130 101 297 -4 -90 223
2745 223 227 -61 76 -72 -511 239 233 -195 -296 419 -131 -191 -85 170 62 198 104 -219 -178 206 -1 -261
2767 -261 -157 98 -38 43 126 46 -27 -129 -51 -131 281 110 -85 -204 -14 -210 -98 -240 -75 69 113 191 67
2790 67 72 271 64 -54 255 45 -155 -26 -138 282 21 201 -45 -69 -31 144 -141 -85 -118 -70 -9 -171 -248
2813 -248 109 -145 -199 -10 131 -122 -159 87 90 377 -164 197 45 -270 220 -168 139 142 -27 -269 -120 -129 162
2836 162 281 -61 327 -107 -193 25 27 -254 76 -39 59 224 130 -155 -156 167 66 -86 191 76 -302 111
2858 111 26 -38 -23 390 -325 -133 106 -28 45 -101 -167 186 13 11 169 -47 195 37 264 -70 195 112 -161
2881 -161 143 0 -62 -59 -5 78 55 234 126 116 -89 165 104 218 48 56 66 166 219 -123 25 21 -129 -31 245
2906B45m30K4L05m37J92K03k31K33l51K76j54k4M8J73l03K88j55r3N9K23p0r6
2928g5J32R8k08j18K87j68J97j53J6k89K67L57n19K37j41k21M48k88J37k56M31
2949A71Q3n14K48L21k79p2q7r0L65K2k20o2K90o5l05J22J66n2k80K02K37m52L16
2972F5J77j93K47%l61K52o6k51lN2j6k06N05k81J00l7Q8k49R7J78j51j27P5j84
2996b89J63n0J50L19k95r7j18J96K88l54rL0J39q3n1J53j64j78L61k30J62L2j44
3019f9K13k88K77M0j07MJ38l27J99J26m24K64j28J31L80o43L19j81K42m0k3L4
3041A37K8j80M9m6RJ60j53j02J43P7j62K83l73K93j66j66K67k68j14N40j76j35
3063e5K43k92J51k62K25o5K08k39J04j90Q7j36K53J6k1m9rK21l69M75k91j48K85
$$ plain form
2906 245 -185 -161 144 -293 -101 102 -129 104 -247 29 -125 -149 -101 72 -231 57 -98 -191 -132 91 21 -75
2928 -75 57 155 -53 -171 116 -52 145 -8 8 -281 -14 343 -176 61 -80 -301 147 -141 -4 -260 171
2949 171 254 -260 -12 309 30 -42 -129 -219 146 168 -52 -114 176 111 -194 -72 94 42 -238 -36 201 -251 65
2972 65 242 49 296 296 -65 187 121 -130 -133 -81 -97 -303 202 -79 21 -16 72 -177 -80 98 -53 -180 -105 -289
2996 -289 -126 -176 -26 293 -2 -99 -217 -21 267 -87 -96 -66 73 -10 -61 92 -72 -250 111 -119 43 75 -69
3019 -69 144 -144 133 173 66 70 208 -119 80 206 -218 46 -82 49 429 -214 105 -76 166 126 103 137
3041 137 165 -15 34 -12 -3 157 4 -98 45 122 -40 243 -130 163 -3 -169 98 -170 -284 256 80 -55
3063 -55 188 -104 47 -215 10 -55 153 -86 18 -172 -85 -221 32 48 27 -22 -31 190 -179 296 5 -143 142
3086A42J02k55K09k95J03o5j01M53k60l01N53j94j50J36q7l43M73j05j27K35l10
3107a87K21L05l30L6j12m5K95k71j15J18R1Ln9L4J06P8k61K52k98K51o4k62J55
3130e9J15k44j00J87N6j58J80j19J88k11K91K15n48M22j44j09K42j44l00N83l17
3151B6J0j79j14K96l90K75J69j08J70r6k22J58m9K3rJ79p4m17M86k9m43K93J01
3174E6K8j81J11J93m69L86R5l37L05K2Lj87J05j95L52Mk64M1O5J86l13j82J18
3197e8J24l43L45j45j33K87J32k77J69m0k2j35R3L94l42k26K26J17j92J30j48
3218d4j87LL15m1j20J56k45k76N04O0l22K51j74k93K83N93m42p4L4M2k16K14J20
3241A41l16j7J19K99l06o1L30l75R4M12l59M5o9k0M1l1Oj33J00K05k60J60K14
$$ plain form
3086 142 244 -11 198 -97 6 -59 -160 293 33 -268 285 91 -59 77 -10 -353 120 15 -112 123 -187
3107 -187 34 339 9 45 -67 -112 183 -88 -203 -85 6 9 -50 -16 90 168 -93 159 -139 112 48 -214 -59
3130 -59 56 -188 -288 -101 -45 -203 -23 -142 46 -165 126 341 -207 215 71 -38 204 60 -240 343 26
3151 26 36 -143 -257 39 -351 -76 93 -15 155 59 -163 -5 -54 -31 -40 139 65 -352 134 105 -338 -45 56
3174 56 84 -97 14 207 -262 124 219 -118 187 209 212 25 130 -65 287 291 27 68 133 319 6 -176 -58
3197 -58 66 -277 68 -77 -210 77 209 -68 101 61 39 -96 -3 391 49 -177 49 166 -26 104 -44
3218 -44 -231 -228 87 46 -74 82 -163 -439 65 125 -197 54 -120 -413 -130 463 21 -53 -19 23 -193 21 141
3241 141 -175 -192 -73 226 -80 -141 189 -186 -92 320 -39 6 -63 -83 -42 -73 -67 -200 -100 105 -155 5 219
3264B19l77j91L21J7n8J22M6j16J9O3o9j02n3J76k42r1M21m2kN7N2m87M15M8k69
3289a23K54N4k66O9J62p3l29L74k00K34p6ql16K06J99j07q4M7J07l23J79L12n91
3312b99M59L9q5j96M3M5M2j57L12j7m58K23J46m41J40L15k36J89l2k17N01n27
3334b11K50J26k54J97k1r2L14m75r4L86k34J3k5K86Kk35Q4n8J84q9Q5o8k04O22
3358D89o94j08N44l97N3K5J41J15m6k81J91k09PJ32j96Q0L25k48qJ41j62k1R9
3381b8J5J29k60P4P6r0%J65m86M88L0k45J08K72j71j69L08m4k35K7P1PJ17k28
3405f9o8L01l69J37L1L43m00j6R7l9K13l91K28O2n5K85k79j32K13j18o6J49j75
3428a18j14k2L33J96l20J30L6k1Rl7l5p1P8p9k07K02q9J82kk8j42L76l37Q1o0
$$ plain form
3264 219 -158 -349 -28 -11 -69 53 99 -17 2 65 -4 -106 -159 17 -225 -316 105 63 61 118 170 -317 98 146 -123
3289 -123 131 185 -81 -12 150 77 -252 122 -78 156 80 72 -244 -38 161 54 -30 17 124 -199 -20 292 -299
3312 -299 160 199 114 -82 -39 6 48 -109 203 186 -272 -49 97 -344 -204 111 -125 64 32 -185 316 -211
3334 -211 39 165 -89 108 87 -5 309 -166 -260 126 -108 -95 -120 166 168 -67 17 -41 143 54 139 71 -133 489
3358 489 -205 -313 231 -166 -113 -88 53 168 122 -159 32 -177 -170 -38 -234 -154 171 -77 -85 56 -106 -127 -28
3381 -28 -13 116 -144 -70 6 -84 -84 81 -405 83 113 -132 -24 248 77 -92 216 172 -63 -36 35 42 159 -69
3405 -69 -137 164 -205 -68 -37 306 -94 -110 -13 -52 161 -230 -2 60 5 290 11 -121 92 -26 -92 57 -118
3428 -118 -232 -254 79 275 -45 85 121 100 109 72 37 -34 44 -35 -242 -40 -129 53 51 23 -119 257 -80 1 -59
3453e9oK84n29L87q8k21K15M3j92K66k99J8M01j54j29L2o0K1J58p5P8j27N9oj85
3478a68j17J54L7K87Mn58K81J76m18L76r3m0J8r1O6J33J96p2j09L4K52l48J2K6
3502C8k20L5K21q4m9P3m3K70k77K73j10j03k16J05J70k52K14O4r1j0r8L37m17
3525a70K7L38j44L08l39j77J18J56l01L27j5j59J05q8n2J27k76O34k78K2l7o4
3547F2j53J84L5l11M49n48K26K75L1q8j85J30M2p5M3L84n33l57M68K9j15P8j10
3570c9K28j87j1L6l00M47m4l43K39J60l39r5L01m2ol3K67j91r9J23k42N2K41q6
3594C7l6o5o8k18N63j16j19n7K39j8k42M26j78j80J0J53k65J3J67l8j01N3n9K1
3618g8N2j27J29rJ68k17L34m10J38j47N39j60m14J60L88l27l86K75N7l5j40K83
$$ plain form
3453 -59 -65 219 -310 77 -11 -232 -17 26 -166 100 -199 -181 220 66 -63 -31 -91 -70 88 13 91 -36 23 17 -168
3478 -168 -285 -131 -94 193 197 -361 -80 96 -322 54 -39 -79 -61 -152 -86 47 243 171 62 96 348 0 12 38
3502 38 -182 -147 74 -10 -59 14 -29 241 -36 237 127 24 -192 -87 83 -169 45 109 18 8 -90 247 -170
3525 -170 -143 195 51 359 20 -157 -39 117 -184 143 128 -31 74 -14 -66 61 -215 419 141 163 126 62
3547 62 -91 93 128 -183 266 -282 -56 219 250 162 -23 107 149 74 117 501 -32 -389 79 108 -7 71 -39
3570 -39 189 2 -9 27 -273 174 130 -213 26 186 -153 -248 53 11 5 -28 239 48 -51 72 -170 -118 123 37
3594 37 1 -64 -132 -350 213 97 -22 -79 160 142 -100 326 148 -32 -22 131 -134 -121 46 8 -93 -40 -99 -78
3618 -78 -26 -153 -24 -33 135 -82 252 -158 -20 -167 372 212 -202 -42 346 19 -367 -92 -35 -70 -210 73
3640G3j0j63p9O3j79J25R9k05L63j28j07K60j38j28j88N48r9k19K84j32J7m2r1
3663g6R7k8k7R0K5mp9j29J52K35j01j07J12j05j77K94r4j98K87J4l27J97L66k83
3687A34ol06K23M0J96j81k34J20J35R1m42L84Om98Q5J92J8J80n1l4k83J95q0P4
3711d2q9K65k11J53q2J51j89K48O7q3k40m5o6J61J10J31j86j81L49j21k8Q8l75
3734b15L44k32K61k50J57j09n6k49K29K81k90O8k53K29R9M0NJ63k36L5q7j38L31
3757A27K8m1j80l1l8k9J38p0k05K92j73j35L73J2k66K5J65k53R2K87k21P4j20
3780a49J85k29M33k17N9J80J5j15l31M54j79J1p3j01j28L97k04m2L9J43k38J43
3802E3k57L64k44J1J25mj75K40k57J25J94j05k5M4J8r7J5q7j00J20L0L19l1k51
$$ plain form
3640 73 63 -100 -179 -116 -295 -170 -71 -276 87 -41 -148 112 -26 -154 -342 206 107 -112 172 40 57 15 -76
3663 -76 21 -7 -34 56 81 77 -2 -131 21 256 155 48 160 55 -122 172 78 -120 167 181 -146 51 417 134
3687 134 128 -178 45 85 281 100 -134 -14 121 212 -230 154 160 -338 -253 -61 -43 137 86 52 -231 -36 -116 -42
3711 -42 -131 134 -77 76 -6 145 -44 204 271 188 -52 -97 -163 -2 108 239 53 -128 221 100 72 160 -215
3734 -215 129 -103 158 -92 65 -44 -100 -349 -120 161 -129 -61 -314 -85 14 54 59 222 -14 21 -66 -204 127
3757 127 155 114 -66 -97 -135 -164 -26 -96 -301 -9 -182 -317 56 68 -198 -173 -8 -261 -169 118 -103 -29 -149
3780 -149 36 -193 240 23 82 262 277 162 -169 285 106 117 44 -57 -185 212 8 -34 5 148 -90 53
3802 53 -204 160 -84 -73 52 48 -127 113 -144 -19 175 70 45 89 107 10 25 -62 -162 -42 -12 307 276 25
3826B5l9k58K00J01j30r2J56J87J07o84L80L21j34K0j1j44nJ5j29L45l15J66J3
3849I5r0N3J50p15O95k30N7R4j65K05q4q0M9K81l32J09k77J01J26k4m2J08q9k07
3873b12K52NL8l09L03J43j73q4K46j38l6J15l2L0j57J32K21l50m47N76j38j07
3895a22J19mo8J43j59M18n28P5M54l34L3j85m0N8L01l66K21K7k19L49k17j91K16
3918a9Q9q4j1k63K85J17j02K26J08k49O7J39l46K55l06J94k08K65j69O1p4j8N4
3941A1O5j05q3J49j59J19J17N0j56M9j5l6m3O3M7j52j3O0J49l9j17N9o8K27k77
3966i8M7K74k78o0M91n60M1L10k03P2p5m4J40l22J90L8ok3J16j98L18k5l87M40
3990A98Q5n23K50J87L1n64J11J60K29j99j09n9K84j0k16K29k06M0JP0Q6N3j0k45
$$ plain form
3826 25 -14 -272 -72 29 -101 -193 -37 150 257 -427 -47 274 140 160 149 5 0 15 -114 231 -84 82 95
3849 95 5 58 208 -507 188 -42 15 109 -56 149 65 -15 34 315 -17 92 -185 -84 42 18 -24 84 -5 -212
3873 -212 40 45 83 -226 77 220 47 -37 209 71 35 150 118 148 -9 123 344 -6 -453 123 -15 -122
3895 -122 -3 -7 -75 68 -91 327 -201 -126 328 -6 27 -158 -198 -140 161 -205 16 43 -176 173 -44 -235 -19
3918 -19 70 -14 -25 -288 -3 114 12 238 346 97 164 303 -43 212 -94 100 -108 157 -12 49 -25 -43 11
3941 11 76 -29 -112 37 -122 -3 114 164 8 57 42 6 -37 26 73 -79 -92 -32 117 78 -39 20 -48 179 -98
3966 -98 -51 223 -55 -115 376 -184 -143 167 -36 36 -39 -83 57 -265 -75 -37 -43 -66 50 -148 170 145 -242 198
3990 198 283 -240 10 197 228 -336 -225 -65 164 -35 -144 -203 81 71 -145 84 -122 -82 -81 -11 75 128 118 -127
4014a27L8j47M29j24N7j33M6j47K66l41o2J49R8o4J81j29J40j27KK9J77k78Q1
4037A4N1l5q8l6L20k23r0J19J17j46J42q3k00K04k52L27r7J6J94j73j66J32NO4
4061A16j01J58l52K06N6j03k5K12j34k45K38Jl12L83k36O9j83K26R6j96K72j80
4083c4j88L34j24J02M6K6j78J82n5k21J57j04j20J08J22J01k32J13np5Q6k73K01
4106c1J9j14L14J3j43J08p8l44K96J49l54RJ61k10N9J07J36j37R9J24j83Q0N8
4129A38J3L6L42n59l29M68j69K56k60mJ90j4l12K67J39k47K46k29L4l9J08j71
4151i6J06p4l6k7L90j12J20p1R9m50N20l11QO6j03J2q0Q1J08l08M41l52k62L40
4175Ik07J88k80K26K34n21M50j18j18k4K75J25l81J09j61m6K18J55r8j18L05k9
$$ plain form
4014 -127 -89 -236 193 69 126 -7 39 -108 158 -183 -245 -96 2 -62 119 -10 130 3 5 34 211 -67 14
4037 14 65 30 -58 -94 226 3 -87 32 149 3 145 62 -138 66 -186 141 44 60 254 81 -85 47 52 116
4061 116 15 173 -179 27 83 -20 -45 167 33 -212 26 27 -285 98 -138 -69 -252 -26 70 -126 146 -34
4083 -34 -222 112 -12 90 136 162 -16 166 111 -110 47 -57 -177 -69 53 154 -78 35 30 -45 41 -232 -31
4106 -31 -12 -126 188 201 58 166 88 -256 40 189 -165 -156 5 -205 -146 -39 97 -40 59 183 0 80 138
4129 138 151 187 529 -30 -359 109 -60 196 -64 -68 122 108 -204 63 202 -45 201 -28 6 -33 75 -96
4151 -96 10 -64 -100 -127 263 151 271 200 299 -151 369 58 66 132 29 41 -39 42 150 -158 283 -69 -331 9
4175 9 -198 -10 -290 -64 170 -351 99 -19 -137 -161 114 239 -142 -33 -194 -240 -22 133 35 -83 222 193
4197A93k2j78r7l1jK62k67r6K85j22k20L44l38M22r3j1l1p0K48j42o9K13O3l99
4221a57Q7j92J92J20O3j29L0J81j72k3k16J62O1k27k5O0L91r8j76o8L4O1j43J31
4245e3o3j16K31Ql9MJ11J9k07N1m7J16P7k5j22J72P5j47M4j20J91j8k42k30K39
4270i1J06r5O4K41k03J85l77L04r5P6m9j20K75j57L58m09Q5L3j95M16m77q1M52
4293B46k09J85o0k00J20j46J78k47J10j42kR2L72k7k61O1k4j8j61M22l45J31j3
4316F2r7J90n4j79k11M61m33K06j22K10j82J14O5k55L04n8J03L4p5K84k99k39
4338a71K49O4k57L58k8k28j65L75l6o6J7k29n3K3L87m77NN48l87K39n40N68k64
4361f8L05k47m2k7J21O4n7J93j4o9K98n54j80M45Nk71J7J01J03q9m4r6P1L1J15
$$ plain form
4197 193 171 -7 -104 -135 -136 126 -141 -237 48 -74 -294 50 -288 134 41 30 -1 -71 177 35 -34 179 242 -157
4221 -157 -70 -262 -70 50 113 -16 14 195 23 0 -216 -54 7 -220 -245 -185 206 108 -68 -136 -102 -41 -184 -53
4245 -53 -116 -232 -1 7 -32 -28 83 102 -105 -54 -101 15 92 67 -55 117 192 45 89 -31 160 142 -100 -330 -91
4270 -91 15 -80 -16 225 22 207 -170 134 39 115 66 -54 221 64 422 13 98 131 -64 352 -125 -206 246
4293 246 37 222 162 -38 82 -64 114 -133 -23 -165 -167 -75 297 270 9 70 46 28 -133 289 -56 75 62
4316 62 -35 155 101 -78 -289 172 -261 -55 -177 33 -149 -35 30 -225 79 21 124 158 83 367 68 -171
4338 -171 78 142 -115 243 215 -13 -178 197 161 95 112 -117 -170 -147 240 -237 -232 316 -71 168 -372 196 -68
4361 -68 237 -10 -52 -79 42 106 49 242 228 159 457 -97 -277 168 173 -98 -81 20 123 34 -10 -106 -35 -4 111
4386A11l33L04L2j38K57k28J4r1J04o8l5p4J46n0K8m9J29J9k86N6M0K32l2j32
4410d4p5k1J94P8o7j52M07l14jK79l03M5J73k13r7R3O0p5J77j79mm3K27j17j07
4435g9K00k00J84k36L2J35j40J76k54J92Q3J49j28j8p4J04k89K45j81J08k90L28
4457D7L3j55jr3K05l74M33j32%r5P7J31M9J05l07M94l52j73K57j62o1R1j19K76
4481A74l44n6J03O6K78j52j22Q2J7m9M3k60J04N23n41L13l27n8N27j29j99q0k1
4504a08L26k82o9J08M6p6j31J40r4J58J27k18J21k69K13J30P2l8m1j71j79J76
4526e9K21k72R1k61L93k28R3J65l76J62J04K6j09P7JJ60l48j33M18n3j8q3J7k29
4550b41K51R6j54J14k14K24o9M4j32K59j52P6nk7J15k63K3L0J67J1j75K73j58
$$ plain form
4386 111 -222 82 114 -24 233 5 19 -72 32 -36 -71 -145 1 -49 -21 -70 59 78 -208 -152 -112 120 88 -44
4410 -44 -119 -140 54 132 65 -87 320 6 5 284 -19 26 199 -14 -111 -18 42 -33 144 -35 -39 -82 145 28 -79
4435 -79 121 -79 105 -131 -99 36 -104 72 -182 10 93 242 114 96 22 126 -163 82 -99 9 -281 47
4457 47 80 -75 -76 -169 36 -338 95 -37 -37 -132 -55 76 125 230 -77 417 65 -108 149 -13 -74 17 -102 174
4481 174 -170 -226 -123 -57 221 69 -53 29 46 -3 40 -220 -116 407 -134 179 -148 -206 321 192 -7 -87 -108
4504 -108 218 -64 -133 -25 21 -55 -186 -46 -140 18 145 -73 48 -221 -8 122 194 156 115 -56 -235 -59
4526 -59 162 -110 -19 -280 113 -115 -22 143 -233 -71 33 59 -50 27 28 188 -160 -293 125 72 54 -29 -12 -241
4550 -241 10 106 -48 66 -148 76 7 51 -81 178 26 102 97 70 185 -78 -55 -25 142 153 -22 251 93
4573I3k92K92j99J36KK52m58J24N9M0j76J0P9J44j6nj37K10l28Q7R1k20J55K68
4597B11j89k31K33M0n0k65J77K99j53l2m7j87P5m5L9J42k23J71J13M9n6l22J36
4620a15q1L94j88m6R7j33j76%L26j12p3J84o8N1N7r3R9l1j47j2J27k09J26oJ06
4645G7j04J01m01M08k21J35j67K14k50O24n26R1R6n9j92k6J13K25q9j64J8n1o0
4668b08M96l67L4r5J58j41K41k82J20P2K7N9j09j61K48lk0j30J7J53p9j98KM2
4692a24O8J27m0n0J0J1k4J98k63J91O4j14m5r0L98k31j17j08j56L85N6j35j42
4715a31J76K01k51k4o5p5M12k71J24j07L54m46l5J6q3P0M21o16L38p7Pk5K43j20
4739C6j66K10j8k14J96J69m80J83J82k97J15J73j20J29J16m59q3K03J66K59p5
$$ plain form
4573 93 -199 93 -106 30 32 284 -174 -50 9 49 -127 -117 -38 106 90 85 -52 158 -170 -83 8 -212 -57 211
4597 211 22 -209 24 64 14 -251 -74 225 72 40 -7 -194 -119 -164 -125 17 -206 -35 78 127 71 -251 -115
4620 -115 -196 198 10 -36 61 -72 -248 -248 78 -34 -107 77 9 60 117 24 123 92 -55 -67 60 -149 -23 -29 77
4645 77 -27 74 -327 81 -140 -5 -172 42 -208 416 -110 -19 77 18 -174 -200 -87 138 49 -115 -97 -148 -208
4668 -208 288 -79 -45 -140 18 -123 118 -164 -44 28 55 114 5 -156 92 89 69 -61 -44 109 30 -168 -166 -124
4692 -124 -56 71 31 -19 -9 2 -22 176 -87 104 168 54 9 -81 317 86 -31 -139 -295 90 146 11 -131
4715 -131 45 246 -5 -29 -94 -169 243 -28 96 -11 343 -103 -138 -122 -205 -135 286 -330 8 -69 -62 -87 156 36
4739 36 -130 80 62 -152 44 213 -267 -84 98 -199 -84 89 -31 98 214 -245 -328 -125 41 300 225
4760B25j71L5q0m3o3J31j55K01R0n6k91K01k05K03K06k54K2j39j5J21n0N1K0R1
4784G5Q9k08M7N0j5q0KLp7P0L2J87j78j21N4K0r8L56k59O8Q7l61K46L1k48L34
4810A06k59J71m07M45M6O1j84Or2N6K40j34j37K44l9j3K29n77K09j19J33K7j11
4833i9J63l00L01k03Q1J06j17p1K19r4j5j3P4p4J80j93j43k37N25j25l9J77j85
4856h2o2J28J01p5N6m7L7J40k06l7K48k48L54m72m1K56Q8j36J57k02K24k49j43
4879b11L72j19k77Q0L67k53O2N4qJ38l43K9Pk22L50L4Qj52J68N7m84K09J66l48
4903c16K18M66l67J29j10l0j94J77Q4j83J94Jl6p9l3M3J78j09J46j03j15j40J3
4926a66J71L3p2J29l62L13p7R9p1J18k06K88j43j69k5j68O56k4j85o5r6j54M72
$$ plain form
4760 225 54 89 9 -34 -97 34 -121 80 170 114 -177 24 -181 22 228 -26 -4 -143 -158 -37 -87 -36 -16 75
4784 75 164 -44 3 53 38 -42 -40 -37 -114 -44 -12 175 -3 -124 -70 -50 -148 208 -51 17 104 -257 -11 20 -228 106
4810 106 -153 18 -389 56 102 163 -21 -15 -107 -51 189 55 -82 162 123 110 339 -238 -29 -148 -15 12 -99
4833 -99 64 -236 65 -138 -57 49 -68 -139 80 -14 -29 -42 32 -42 138 -55 -198 -435 90 -35 -74 103 -82
4856 -82 -144 -16 85 10 66 19 56 196 -10 -47 201 -47 307 -165 -206 50 138 2 159 -43 181 -68 -211
4879 -211 161 42 -235 -155 212 -41 21 75 67 205 -138 -109 -102 -324 26 60 68 -84 84 141 -343 -134 32 -316
4903 -316 -98 368 1 130 20 -10 -204 -27 57 -126 68 69 33 -46 -79 -36 142 33 179 76 -39 -179 -166
4926 -166 5 38 -34 95 -267 46 -31 68 -3 115 -91 197 54 -115 -140 -308 348 324 139 74 -22 -176 296
4949B96l11k27J88K50P1j31l47P3J98j77K91nj06j03j90J85M2Q3o7p5J43j25J1
4972c3m15J88M52l02o5K20M6J21j20n21M04K14k54L90m08J23q0K61k36L01k20
4993F6p1j18LQ4j5J9J08j28r0J41lR5J73j79k28J53j18n1L19k63RR8O2R5k51L48
5019B58k5j90qj53K03k31J39r3p8L42j49P8n99L68M7mj46J08P9O8J07P7j47j53
5043a02pJ98m6j80K35l08K37PR7NL6m17M08j19j95K56j12J80m2J06j48j11o0K13
5067A31R9j39j1r6q8m9RR2N0j2j84l5L58j49L6q0J7O5K00l50K6K67q9J03l86J07
5093a08K94k21K59k41j92K08M6k13J15NJ99l13Q6J34M7Rq7J29m6KJ57j58o0k21
5117a70L04KM4l95L42j89j37K83k12k75J46J64l3Q4j8J16j80%O8J11n2L8j15P8
$$ plain form
4949 296 -15 -242 -54 196 267 136 -211 -138 60 -117 174 169 63 -40 -230 -45 -3 80 13 -62 81 -44 -33
4972 -33 -448 -260 192 -110 -175 45 91 212 92 -429 -25 189 -65 325 -83 40 -40 221 -15 286 66
4993 66 -5 -123 -120 -36 -51 -32 76 -52 -142 -1 -4 91 264 85 -143 10 -108 -159 160 -103 -94 4 66 161 -90 258
5019 258 233 43 35 -118 85 -146 -7 -100 -178 164 15 93 -506 -138 -91 -95 -241 -133 -54 14 121 198 51 -102
5043 -102 -109 89 43 -137 98 -210 27 34 131 136 172 -245 163 44 -151 105 -7 173 131 237 89 -22 -82 131
5067 131 230 91 80 -16 -104 -153 -144 -52 -2 -14 -198 -233 125 -24 12 -68 -51 14 214 -136 -110 157 68 171 -215 -108
5093 -108 186 -35 224 -17 -209 -1 45 -168 -53 -48 151 -162 -76 58 105 114 27 156 110 112 269 111 51 -170
5117 -170 134 136 180 -215 127 -62 -199 84 -128 -403 -257 -93 -126 -42 -60 56 -124 -124 -56 55 3 41 -74 4
5141DM2J17j35k04K95o3k9J96k29K9L35q1k66Q5L6M1j7k45K31j35L5J06k91j00
5165b43M36j52j41P9k91K88j9j8R4Q7j57J89q9N3k0l3K65k79J42j88N6J28k72
5188h5j28J26N1q9J09J19j4l22K36q0J7K71k33L1j33L2L01k51r8j20K13K02m61
5211c06J92J33l6j78N33n81K22N0l45K28L41j63j71L43m48J23J95k08pj91J51
5232a23m5K66m5k06K03j6j09rL62j79k77L82k09o4J36N9o4L0ml4O3p1J77k12k5
5257a4l3j75K11J55j33L2l09L50R3j99R8N2j55J3K05Qk47j79L54j25K14l23J90
5280H3J85k34K15l26O0J74j51J1q0M1q9r5L2J43l5J9R3L0k13l1O1K39k36M4j66
5305b26J28K36k5j81J22P6k29l1J09K4n4k2J02P6l79J50L54k69N3k55K84l40L49
$$ plain form
5141 4 46 163 28 -176 119 56 27 223 -6 23 358 277 11 96 132 173 156 -89 142 7 42 148 -143 -243
5165 -243 193 41 -100 -21 -312 -24 -43 -61 33 120 -37 152 63 116 96 63 328 49 191 3 59 187 -85
5188 -85 -213 -87 -36 -125 -16 103 89 -233 3 -77 -60 211 -22 9 -124 -92 209 -42 -140 -260 -47 155 -306
5211 -306 -114 19 -17 -195 338 -243 -21 29 -316 -88 253 90 -81 262 -186 -63 132 -76 -83 -274 -123
5232 -123 -168 98 53 -153 50 34 -75 -84 278 99 -178 204 -5 -69 67 126 62 92 88 54 117 46 223 11 -14
5257 -14 -47 -222 -11 144 11 43 -266 84 177 -22 76 128 -27 -14 191 199 -48 -227 127 2 216 -107 83
5280 83 268 34 249 -77 -17 157 6 17 -63 -22 -111 -206 -174 -31 -66 -47 46 76 -137 -168 -107 132 -104 -60 -226
5305 -226 -98 138 113 -68 54 130 -99 -130 -21 3 -51 -73 29 105 -274 -124 230 -39 14 -241 43 -297 52
5328E2l46K79M8j12J18k21K71j98j6j45M70j58l8j75K90k07K55k32j86P9p2L27
5350H3j7J47k80Q3l1j54J89J61j68l3j17J22k13K05K21k75jJ83j27L52k6o09M76
5373A71j90k04M19j31j96Q9J37N6k20J29j2j12J75J54k83l1K59n26L12p9j34M0
5395a77qL02k59R5o2j16N0K56k17N01n15K14l3j75L03j70N2r5L0r5K99K5l1k72
5419i8K00n7k05K05j62m6K69K3j74R6O8p7j5j00J62j12M5j01q3M8J74R5k42R7
5443A0j36J77j97J00J33j70l0n6L28O0l49J16k6J09q0J96k89j9j5K48o9Q4m09
5466b84K48l8K6R7j03J18O4O8l58K00R8J42k90L4K9P3o3P4k20LP5J94%l2k10J73
5492A18m35K61K1L0J82m77M48j55L7p9J04K85k80J0k05J25M1K3J03k74L32j06
$$ plain form
5328 52 -294 -15 33 -79 39 -182 89 -109 -125 -270 200 42 4 -171 119 -88 167 -65 -251 -172 -244 83
5350 83 66 213 -67 16 -15 -169 20 181 13 -20 -137 -15 -228 -23 198 -77 -78 105 -22 330 304 -305 171
5373 171 -19 -223 196 65 -131 -42 95 151 -69 60 48 -64 111 265 -18 -49 210 -316 -4 -83 -217 -177
5395 -177 -185 117 -142 -47 -109 -225 -175 81 -136 365 -150 64 31 -144 159 -11 41 -54 -24 -119 180 205 174 -98
5419 -98 102 45 -160 45 -117 -163 106 129 -45 51 119 42 27 -73 89 -23 22 -79 -162 -114 60 155 -87 10
5443 10 -126 51 -146 -46 87 -83 -113 -169 159 219 -130 -14 -40 69 -11 185 -104 -123 -138 110 41 125 -284
5466 -284 -36 -74 -48 49 -54 64 128 196 -162 38 136 278 -12 22 51 124 61 135 -85 -82 -7 187 187 155 -55 118
5492 118 -317 -56 -35 -5 177 -300 148 -7 30 -49 55 340 60 70 -135 -10 31 54 157 -117 215 109
5514A09J17j97P0r8k62K59J44Mk49J16j11o8K0k17M04K54l19K55k49p1L26l20
5536h3J24m7j41J56j4j16R8J9J68r5k19M01j91r7pJ11j52J93L7j80L79l37K47
5559B54j71m8L0j30J74l8J11n06J88Q6j55O3K45n6jJ57m13J20N64l01q8K0l57
5582b52J92k9K3J62j03R7m1J78l62L7P3r9lJ3J4r4L19J34k79j69O8P0K0n5J46
5607F0j6PM8lN3M4q6q3K34j75pNj80j50K62O3l94M98j83j28J85o5J0p0J53k23
5633a41L72l68J35n8J11R6J21k25k07M03q6k88L22p4j51J50j65k73K21L65q4m7
5655A29k32L78j97k06L4J48j49K54l94J63J35m1M1K04l33Q4k30J47N1J08j72j36
5677b14K16J07q8j67n8p9M75k44K45k01J9j73J01O4J54k76N0jj4J19OJ54l46M18
$$ plain form
5514 109 226 29 99 1 -261 -2 142 146 -103 13 -98 -166 -146 -363 41 295 -24 231 -18 -89 237 -83
5536 -83 41 -6 -147 9 -5 -121 -23 -4 164 69 -150 251 60 -37 -44 67 -85 108 145 -35 344 7 254
5559 254 83 35 65 -65 109 71 182 -324 -136 -50 -205 -142 103 47 46 203 -210 -90 474 173 85 105 -252
5582 -252 -60 -89 -66 96 -7 90 49 227 -135 -98 -25 -124 -127 -114 -100 -194 125 259 -20 -189 -121 -51 -31 -86 60
5607 60 44 51 99 96 149 193 107 24 258 83 76 81 -99 -249 13 76 -318 180 -3 -131 54 -11 -1 -71 82 -141
5633 -141 231 -137 -2 -60 51 147 268 43 -164 239 153 -135 187 113 -38 112 -53 -326 -105 260 176 129
5655 129 -103 275 78 -128 -94 54 -95 159 -235 -72 63 22 63 267 -66 18 -212 -65 -14 94 -78 -214
5677 -214 2 109 21 -146 -204 -283 192 -52 193 -8 11 -162 -61 3 157 -119 -69 -70 -84 35 41 195 -151 267
5701B67k35j63K89k42J55J17k07K09j55J25k86K27p2n7k5J01j10k84J97K23K4
5722I8k86K37jk4J68k95K29k6M8N6l97J58j35K59m71K69K85o9k85J68q1K28R4
5745B27j53r2j17L12l31M63k77j23R5K21n0k63K7n1K09j07J97j28j00p6l4K17
5767F6O3j71N0k2J52N5k96o2J26K39j30Jo5k84K96j57L43j81J64j58J46j43j25
5790i3R2o0r8K96k51P2j4o8K47j95r8J84Q1j02m8O5Q4J13j42m1L9N3p8J42j21
5815E9K12m79K78k13K29l6P4k66q5K73Q1l22J84P8r4k9J44o7L2L7l15L02J78l99
5839a44j0J59k55p2O26n36K03J71j04j4k28L14j13J82l56K41Q0j03J32q6l29J78
5861f4o8J6K13N7r8J15j43o5Q1m9qmN1p5J38j3J02r3r3M7j82K18k38O4Pl4L79
$$ plain form
5701 267 32 -131 158 -84 71 188 -19 190 35 160 -126 101 29 -28 -53 48 -62 -346 -149 74 98
5722 98 -188 49 48 24 192 -103 126 100 148 204 -193 -35 -170 89 -382 -113 172 103 -182 -14 -95 133 227
5745 227 74 -18 -135 177 -154 309 32 -91 4 225 175 -88 -61 -112 97 -10 187 59 -41 -117 -151 66
5767 66 129 -42 8 -14 138 193 -103 -165 -39 200 70 71 6 -278 18 -139 204 23 187 29 175 32 -93
5790 -93 -1 -61 -159 137 -114 -42 -56 -124 123 -72 -170 14 95 -7 -55 10 94 207 65 24 63 116 38 180 59
5815 59 271 -208 70 -143 86 50 124 -142 -227 46 127 -195 -11 67 -27 -56 88 21 53 90 -225 77 255 -144
5839 -144 -154 5 -250 -322 304 -232 -29 142 38 24 -204 110 -3 179 -177 64 144 41 173 87 -242 -64
5861 -64 -132 -116 97 154 56 171 28 -37 44 -5 -13 -17 34 -41 97 84 186 93 0 47 -135 83 -155 -91 -84 -118 261
5888B61l45L5J42l32N46m48R9j40J5P7j23J65r3K01j08J64J97j86l2J88k02M4
5910A25k78J01J59j10N5J41k21KR8J51l59K13j59J27q3M4J50j32p6r6J66J67k23
5933c8o1J32J18j81o3J72l7k67J27K76k28J04R8j22j77K30o1j74MK1J71j70l6
5956a62J15M0j83J06J57mm11K71j4jK37k00r5M7m1J47k20L4J84Kj61K27k98J73
5980e0lJ4j3Q7l2OJ3j77L8K4k11L20J75l01m9J72n8q2L65l10J16r3J85j60J23
6005I9n5M4m4%j4o8J0K5j29M32k53O8n62N68j23J75l09L07l54n0M15l09J14j09
6029a22K43k96K24N8j11J84j77L0Jj13J98j60L74n79L07K22k30j35rP3P4K62m50
6052a32J97m4L3NNmR4j76Q0j78J69J2j16K78m13O8L0J23j26Q9QJ5J65j07J03M2
$$ plain form
5888 261 -84 -49 93 -239 307 -141 -42 -182 -167 -90 -213 -48 -141 60 -48 116 313 127 95 283 81 125
5910 125 -153 -52 107 -3 52 193 -28 -26 72 223 -136 77 -82 45 -38 6 156 24 -52 -148 18 185 -38
5933 -38 -99 33 151 -30 -93 79 42 -225 -98 178 -50 54 152 30 -147 83 22 -152 -148 -127 44 -126 -162
5956 -162 -47 -7 -190 -84 73 69 -342 -71 -85 -86 151 -49 -144 -97 -138 9 -211 -177 7 9 -152 75 -223 -50
5980 -50 -53 -39 -52 35 3 9 22 -155 -117 -93 -304 16 191 -110 -159 13 -45 -127 238 -72 44 -49 136 -24 99
6005 99 44 88 44 44 30 -38 -28 -3 -132 300 47 115 -447 121 -2 173 -136 171 -183 -233 182 -127 -13 -122
6029 -122 121 -175 49 107 -4 180 3 33 34 -79 119 -41 333 -246 61 283 53 -82 -91 -18 56 318 -132
6052 -132 65 21 54 59 64 60 154 -22 58 -120 49 61 -55 223 -190 -122 -92 31 -95 -6 2 17 182 75 178 220
6078B20m9k03J46lp3L5O4J14j99RN1J81j38p3r1R7m03K81J4J1O2j02q2K3J54k0
6104B6j69M31l48K10p9Pj49j71L89j3k04K05k75J20q8J03n7J10k0p6j86J49J4
6127g1P2K8l40J15J10K68n1j53K7j26J71j23J24K39l84K48l07j4K47Qk14J85k17
6150a58N9K4J17q7Ln3l3M55k54l8l9j58j6K44J0J10J08l71L12k76j45J91P6j65
6174h4qJ60JR7l44J04K84l96R3K75j3M1j89Oj16J48j86J93K14j12J01k83O5m5
6198Fo2J28k40K19j2O8J09l61J62l28L23L7m0j79Q2N50l34n0j35J5J20l26K37
6221a1j08Q3j6r2J03L09j32j71J99P2p9l08M15m07J25n5kJ28p1K6j72J34K13j65
6245A8j50J50j41K61M8j98p8P4J03P6k63R5J48O5Q1p7j87K64l16L6Pj27Q1M0o6
$$ plain form
6078 220 171 -32 114 111 38 73 137 251 52 61 112 293 155 82 -9 88 -315 -34 -20 -9 53 -49 -131 -108 46 26
6104 26 -143 288 -60 150 71 78 -71 -242 147 134 -70 135 -140 -20 -108 -5 -62 48 28 -48 -234 -85 -71
6127 -71 1 29 -311 -196 -86 182 131 -22 5 -121 50 -73 51 290 -94 154 -153 -167 80 88 -126 59 -158
6150 -158 -99 -75 42 -45 -42 -95 -128 327 73 35 -4 -162 -178 66 76 186 294 -77 235 -41 -186 5 81 -84
6174 -84 -92 68 69 166 -178 -74 210 -186 -93 182 169 210 21 27 -89 59 -127 66 280 168 269 -14 51 6
6198 6 -56 72 -168 51 39 107 216 -145 17 -311 12 49 9 -170 -88 462 128 78 -57 -42 78 -248 -11
6221 -11 -119 -36 -52 -144 -41 268 136 -35 164 236 157 -151 264 -143 -18 -73 -75 53 -18 8 -164 -30 183 18
6245 18 -132 18 -123 138 186 -12 -90 -16 87 163 -100 -5 143 208 289 212 25 289 -27 9 16 -111 -30 10 -56
6270e6q8P1j5n7J25k24M74j74j12l2L1J25J94n12J94K12k43J33j67J40m1k01K0
6293b03L87k91r2J86Q8J19j04R3j39j16M5N8k3K22l69rK01k69M48M0l5q2k76M9
6317g2Q8j7pM7Q5P6l05K14q4J26j25J23q6m8n0R5m8o8J57l27L40j96K66j51l4
6342aj26L73k81M1K4L3kk4k44K79J07l54K02n6q1K26m19L94j24J00J36j68o6j25
6366a56J18m3O5p2m6o6K46R5j08k56K65l31R0M4K26k90K0K90L5m2j69K16m08K47
6390c0J20m14L25j38L21j01m6p3n1K19q5m8Kj04R0k24L73j40r1J75k86m2K71Q4
6414A07J00l9m56L25R2J06j92j35J65P6l37L39j63j00L48k52j11M1K30j01qp9
6436d4K82p2Q6j54K5k02K9J15k5J1j02K00j17L8m3j09pK12j63M0QO8ql3r6J17
$$ plain form
6270 -56 -144 -73 -88 -145 -20 -244 230 56 -56 -88 -57 68 262 -250 -56 156 -87 46 -121 19 -22 -223 -203
6293 -203 184 -107 -199 -13 75 194 90 183 44 -72 -27 31 8 230 -139 -148 53 -216 232 272 237 155 -121 -72
6317 -72 16 -1 -8 39 124 200 -105 109 25 151 26 149 63 15 -35 60 12 -56 101 -226 114 -82 184 33 -1
6342 -1 -127 246 -35 6 30 63 61 37 -207 72 179 -175 27 -29 -110 116 -303 91 -33 67 203 35 -31 -156
6366 -156 -38 -81 -16 -88 -134 -200 46 141 33 -223 42 -289 -199 -155 71 -219 -199 91 126 84 -85 131 -277 -30
6390 -30 90 -324 1 -137 184 83 37 -36 -87 132 47 -1 1 -103 -13 -237 136 -4 -95 80 -206 -248 23 107
6414 107 207 168 -288 37 129 235 43 -92 73 149 -188 151 -12 -112 236 -16 -127 -86 144 43 35 -44
6436 -44 238 166 252 98 123 -79 -50 65 40 51 -51 149 32 70 27 -82 -89 123 -40 0 8 76 68 35 -61 56
6462E6j47K4J00rj19R8M4m9J44l03K31k60J90k70K54L3j80K19O9p4j73K63l5N2
6486A58j31Jj6J23j82j91J23L71k87J56L6M6N2k01o9K1Rk4K05k74p8J96k4N8J48
6511B26l91K46J6Q9l38M01j91k12k07L52j9j21L7J55J12j96K10k88O1K0Q7k11
6533a62L71l72K34l17J63P3jj5J43j61j63K41j21oK7J37m49K03J31J52j55J76
6555A29m00L19j22K45l20J69K02r3k08L05j99J5R6j80j90K11P4j1K03j35J68p3
6577B05p5r9k76K78j5r3K56k59k1Q1J2j62j47J89K79n9r4j91K21K13l64J44o6
6600d3R7K74l73J1j84J67l0l1J54r8On9K30j72n9N7J63j98Q4m9J76k47J2J62K
6625E2q4L21l33k04M66k39j1K08m7k9j04M3k11K12j49M01m38PJ0J65N3J1M3l49
$$ plain form
6462 56 -91 -67 33 24 -95 3 47 -2 142 -161 70 -190 0 -270 -16 17 -163 56 125 51 -122 141 106 158
6486 158 27 28 12 135 -47 -238 -115 256 -31 125 161 207 259 58 -11 10 19 -5 200 -74 -152 44 20 78 226
6511 226 -165 81 97 186 -152 249 58 -154 -361 -9 -28 -149 -112 43 155 -41 169 -119 -58 -38 49 -162
6533 -162 209 -163 71 -246 -83 -10 -11 -26 117 -44 -207 34 -87 -93 -66 71 -378 -175 -44 108 -47 129
6555 129 -271 48 -74 171 -149 20 222 129 -79 226 27 42 138 -42 -232 -21 53 42 245 110 278 205
6577 205 130 31 -245 33 18 -75 181 -78 -99 -18 -6 -168 -315 -126 153 94 0 -191 30 243 -121 23 -43
6600 -43 54 328 -45 -34 -218 -51 -81 -112 42 -56 -50 -109 121 -51 -110 -53 110 -88 -4 -53 123 -124 -112 50 52
6625 52 -32 289 -44 -248 218 -21 -32 176 129 100 -4 39 -172 40 -109 292 -146 -139 -129 36 89 100 143 -206
6649b06J60k73L87j60Q4O3o4j66L59j05k25K24J19n00K74J32m0m8q8J88p6p7K71
6672B33l17j40rL01q2j86J05L6L21k93l2O5L3P0j51p1J42j68J44K84l78J93l00
6695b00J7L12J60l25K11j49p5R8j11j20L25q0n7J35n5n4k2K07m13K73J24l26J84
6718E9O4J00o3L9j58j46j11L92j73J26k72K85r6k21L76j85r5K9Q6l0L0L1q7l4
6742e4K09l06K77O7j25l93K74J20j93J80l10N59j27k81o6K53k23pJ08J93q7j59
6764i1J75k56K59J27n1O3p0j11K16l06J46Q1j86k36K27M3o0r3J17N6j01r7R2L8
6788a8K90k37nq9o7Q7j96L22k09K18q8L9j56J75j24K09L33l95j89J95k57J37K15
6811A90l10j00J30L22q0j81J57n1l08L56L0l06K54J43l76K21l2O3k77K80L0k19
$$ plain form
6649 -206 -46 -319 68 -92 -8 55 -9 -175 184 79 -146 78 197 -303 -29 103 63 15 -73 115 39 -38 233
6672 233 -84 -224 -233 68 -14 -200 -95 -59 262 -31 -63 2 35 105 -46 -117 25 -143 1 285 -93 100 -200
6695 -200 -183 129 289 -36 175 26 -49 49 -62 -182 143 63 6 141 86 32 10 217 -196 77 201 -125 59
6718 59 123 223 160 199 41 -105 -216 176 3 129 -143 142 46 -175 201 16 -79 -50 36 6 36 67 -20 -54
6742 -54 155 -151 126 193 68 -325 -51 69 -124 56 -254 305 178 -103 -169 84 -139 -146 -38 155 68 -91
6764 -91 84 -172 87 214 163 226 156 45 261 -45 101 182 -4 -240 -13 30 -30 -123 -6 50 -51 -148 -56 -18
6788 -18 272 35 30 -59 -126 -39 -235 87 -122 96 8 47 -109 66 -58 151 484 89 -100 95 -162 -25 190
6811 190 -120 -220 -90 232 152 -29 128 77 -231 125 155 -151 103 246 -130 91 59 122 -155 125 155 -64
6833f4j05k7n4l5L8J03L80k29J20k84J82q3L5m2k3rJ43j7M1r3J56j65k0R1j27
6858h8Q3j97q7K09J04j08j45K74K10l46J33K61q7q0l6j65K37L8p0j43K74k80O
6881cL2J62O4k70k25J76J59O7k92J00pL24m06J34J23n37N38m43K14K6J70j52J21
6904G5l0o2o7J67j44M9J42j9j1K10m05l1L54l39K29o5l4k03K77k9K1j22P2J74
6928B09l44k4J93J50k06QJ75r7j36K24l5J74l35r6J67M2k47L84k85j05K21j13
6950g6K09j25Q1j91J77J72k99j66K14J87l51L8j12j44L27o8l4K20L8K62j89P6
6972B46m13J69O8l9o6K9j47K95l13J29N1q2J25K40L5l57j87L08p2O2j25K57m7
6995A66j12j72O0p3J97l09L83r5Q4j53J3K26k99K23m6n5j75K11J16j74j46L09
$$ plain form
6833 -64 -169 -196 -250 -285 -247 -144 236 7 127 -157 25 -58 -23 -65 -88 -97 46 29 70 -23 133 -32 -52 39 -88
6858 -88 -5 -202 -289 -80 24 -84 -229 45 255 -91 42 303 216 136 100 -65 172 210 140 -3 271 -9 -3
6881 -3 29 191 255 -15 -240 -64 95 162 -130 -30 -37 287 -119 15 138 -399 139 -304 -90 -64 106 -46 75
6904 75 45 -17 -84 83 -61 -12 130 111 100 310 -95 -126 228 -111 118 53 19 -184 93 64 85 -37 35 209
6928 209 -135 -159 34 184 -22 -14 161 64 -72 152 117 291 -44 -140 27 69 -178 206 -79 -184 37 -76
6950 -76 133 8 89 -102 75 247 -52 -218 -4 183 -168 -130 -242 -386 -59 -127 -161 59 97 359 170 246
6972 246 -167 2 70 31 -35 -6 -153 142 -171 -42 9 -73 52 292 327 -30 -217 91 19 81 -44 213 166
6995 166 54 -118 -58 -131 66 -243 140 45 129 -24 -11 215 -84 139 93 38 -137 74 190 16 -130 179
7017A79j22p5j47q6J98M11k14Q3k45O1o2r1J62j28O5K31r2J2k04kK5R5J52k17
7041a1J48k81J13O3j10J60l27L19j67K74j92k0ml5J80N4j35r7j28r3L53Q6k01
7064e1m8J14k42K09N5k29L41o3k81K87j4k1J93j61J4O5L3k75R2J7k12M90j62j25
7088B6K54k32K49k87L14l06P3j31p9j40L8L98j44j68J31l7o1K13k16L44j96Q6
7110A29k66j8Q1K6j33K45k70M81l61O6j59J88%Q3l0J26l61K01l5N0K06j43j31
7133b5l7l16O64j80j86J66k25L04j02p9M3L02k99J41o4J49l01J13k47p0J87j0
7155g2k1J13l0l9J50RO6k00m6M53k71N3j89k0J87k58K93qk44K31l59J17J87j10
7179hJ14o8m9J6k3j37Q3J52o7n1p3r1M7k7J62NRk16J98n3R6j19K67j67o8q1J26
$$ plain form
7017 179 57 -18 -165 -251 -53 358 144 227 -18 43 -19 -110 52 -76 -11 220 128 140 -64 -66 -41 54 206 -11
7041 -11 137 -144 -31 32 -78 82 -245 74 -93 181 -11 -31 -35 -70 110 164 29 -68 -196 -289 64 150 -51
7064 -51 -99 15 -227 -18 37 -192 149 86 -195 92 78 57 250 89 103 168 201 -74 18 35 -177 313 151 26
7088 26 280 48 297 10 324 18 91 -40 -119 -259 -221 177 33 -135 -4 -41 -102 111 -105 239 43 129
7110 129 -137 -155 -74 -48 -181 64 -206 275 -86 -20 -179 9 9 92 62 188 -173 28 -7 43 249 106 -25
7133 -25 -62 -378 286 106 -80 86 -139 165 63 -16 27 329 30 171 107 256 -45 68 -179 -249 -62 -72
7155 -72 -93 20 -10 -49 101 110 176 -24 -70 383 112 165 -24 -44 143 -115 178 170 -74 157 -202 -85 102 -8
7179 -8 106 38 -11 5 -18 -155 -72 80 13 -38 -111 -202 -155 -182 -20 -15 -6 -222 -24 -77 19 -100 167 0 -68 -149 -23
7206b3l94O76k66j24K83l5k81K74J21k17K1J30m25L60L4k9j59J80k15K27K2l29
7228a69K41n1R9j23J50j81K36k38J27k06K38n6j17n4J84J53m77M57j85J37q1k94
7250b10L50k0o6l0l6O7N9o9o6J24q8J66j43o2k77L29m6J84l51L19r7k45J65m1
7274h4J27O8o1J57j54n3j76K4K12j85K00mJ42l24J22J42j12j9r7K48j4j5k14L01
7298B31l64M01j96j6k8j24J17l1j5O2k55K85k92L22O0r7J7r8M9r1J80n7J69k06
7322B3m7L0k3l2l2J61q3J58j21j23R9j06K01j34j71K38P6k73J46l7K96m60L86
7345A72r3j9j81P8K01k69j6j7J62j19M2L13l62J52J34r2J52k37J56Q5m47L98l10
7368a17J59o1J2K14j27m3l8J99m26J64O9R7r5K9j6o7n4P2J39o0k3N7q0j6P6k2
$$ plain form
7206 -23 -417 259 -7 -131 152 117 -164 110 231 14 35 165 -260 100 134 105 -54 126 -89 138 160 -169
7228 -169 72 21 120 -3 147 -34 202 -36 91 -115 123 67 -50 -104 80 233 -244 213 28 165 84 -210
7250 -210 140 120 54 24 -12 55 114 45 -21 103 15 181 38 -24 -301 28 -18 166 -185 134 37 -208 -43 -84
7274 -84 43 111 50 207 53 0 -176 -152 60 -125 75 71 213 -111 11 153 41 22 -75 173 159 144 -70 231
7298 231 -133 268 72 56 28 -96 21 -10 -25 37 -218 67 -225 97 157 60 77 -21 28 -63 117 60 229 23
7322 23 -24 6 -17 -49 -81 80 -3 155 34 -89 10 -96 105 -29 -200 38 114 -159 -13 -50 246 -214 172
7345 172 79 60 -121 -43 158 -111 -127 -144 18 -101 -59 254 -108 44 178 86 238 1 157 242 -205 193 -117
7368 -117 42 -19 -7 207 80 37 -1 198 -228 -64 5 102 7 36 20 -47 -101 -29 110 50 27 84 4 -12 64 42
7394D2j7rr8m3n7L36K3k01J44l07m8L48m1j69K92l63L54N3lk90K96O1l68j76M12
7419A71j64J07j30O6J82J18o07M6M28k50K53k36nK01q3l7j70n6m9L68q8j18O2
7442Iq1J83ll72M1L85k42K16l17m4K02Q3N4J7k05p0J60N4J47k48J45j90J23J28
7466A75j90j57P0J45O8k86M7K04K80n81L43K6jj13j74J17j62M33m14L81k20l0
7488c9L8j06J33Q5j41k00K86M0J7k15L27j45j21j08M86l23j08J04j18K78k7q6
7510E7J14K7j48P2k37q8M1J4K53K28l70L61l83j22J73K08m59J15L64j92Kj57k5
7533a52J64M3K0j66Q3N3O6j04J43n48L05l6J99m6k02J77j01L13r2m5j97J67j91
7556a47P7O6K2J89q6J06o0n1k41J24K9P2o5J58l18J32Jn8J9J01jo7m3p8L26k75
$$ plain form
7394 42 25 16 -82 -125 -182 154 177 -24 120 -187 -235 113 72 -97 195 -168 186 239 236 -54 242 303 -65 -241 171
7419 171 7 114 -16 50 232 350 -257 -211 217 -33 220 -16 -21 180 97 60 -110 -166 -215 153 65 -53 9
7442 9 -72 111 108 -264 -223 162 -80 136 -181 -225 -23 60 114 131 -74 -144 16 70 217 -31 114 -76 47 175
7466 175 -15 -172 -102 43 111 -175 -128 76 356 -225 118 144 143 30 -144 -27 -189 244 -170 211 -9 -39
7488 -39 -1 -107 26 111 -30 -230 56 96 113 -102 225 80 -41 -149 337 14 -94 10 -108 170 143 57
7510 57 171 198 50 122 -115 -203 -162 -148 105 333 -37 324 -59 -181 -8 200 -259 -144 220 28 30 -127 -152
7533 -152 12 55 75 -91 -8 45 111 7 150 -398 -93 -129 70 24 -178 -1 -102 211 119 74 -123 44 -147
7556 -147 -70 -4 18 207 121 227 167 116 -125 -1 28 100 35 193 -125 7 8 -50 -31 70 69 2 -41 -119 207 -68
7582f8L2J15r5J3R7k81K97k67J90N5j66j18K33j07J18K13m46K68j03J34j40K36
7604B10l01k12K84J67j11O8R4rk79jJ3P3J41k09J81m1J4J5l15L11k08N22m92J65
7628H0K11l09L3jk7l11M66m5j03k56O01m92J64N8j46j30K05P4j23j39Q1J8K05
7651A14k90L16k74J78k31K28l94M09Pj70J10L00n3l75q5M73l25k28J20J32l7J28
7673E3j95K31l8K7q5N5j15P1Ok1j23j08J85r6k8M23q5j67L6k1o2J7J70k54J68
7698D4kl5J71k23q7L1j20K02j28M9J42q2J0k03J49M9j61J01J40J8q9k29J52J46
7722D5J24l70Q7o3Q7k5J34Q1k0j4o5O8J65j45k75L27k27J76k62jq6M88n61J57
7746a75J89nO2j67L20k81J46j83r2K58R4l0n0j81N3K24j8j00k3R1j78J13n3l3
$$ plain form
7582 -68 -36 79 -16 -3 94 -187 110 -157 33 88 -78 -196 37 -70 48 261 -185 83 -20 114 -26 210
7604 210 -91 -303 -19 148 37 105 199 190 -89 -90 -77 -4 137 -72 109 68 82 97 -218 93 -115 407 -85 80
7628 80 291 -18 15 14 -13 -324 142 97 -6 -262 339 -153 11 69 -77 -207 -2 72 -51 -190 -109 -91 114
7651 114 -176 140 -134 44 -187 41 -353 56 63 -107 3 303 250 -125 -210 263 -62 -290 -170 -38 -75 53
7673 53 -142 89 51 78 -7 48 -67 4 10 -11 -134 -242 -57 -153 -181 242 157 -10 26 5 -57 -40 130 -124 44
7698 44 42 7 178 -45 -132 -101 -221 -19 -147 -98 44 -38 -28 -231 -82 -33 -194 -93 47 65 -24 -253 -101 45
7722 45 169 -201 -114 -177 -90 -115 19 100 80 66 1 69 234 89 -186 141 -86 90 -172 -173 -259 229 -332 -175
7746 -175 14 9 71 -96 224 -57 89 -94 -186 72 166 136 86 -95 -42 182 164 64 41 132 -46 67 14 -19
7770a9M9O0j04o8R8Jq0p8J33k26J45K55k2J84n17L49k16j31K35k81O8J86K38n39
7794b80K29k26K43j43L10J34j73m6J69r3k08k1M4K25l90L06l24L10O8r5Q9n6L9
7817A11q8k37K36r2L03p9k20j97L8K82k34J29L7L3j27N9J18k86K82l28K16J60
7839A16L6l15J55P6k56K85l32L87j30K40r8j52Nj27L24j45M6r3j94K19o1k0r7
7862a31K2J00j66J08q0J50L4k47K02jL51l03j89J80J5J19k21J46l09O1N13l23
7884C1J42q4J7Q4n2k53Op0J62L02r4l11n3K41N9M4k21J80n7K35k38J07k79K34
7908A32j70J85R7o6j72K74j20o6J30k03J34J1k03M8P3k15L13N8k42P3O3J38k63
7931IMJ08m36J32J61K8j57K86L5r2j82O9J29j25O0Q9J19j74J54l25M5M06l52L55
$$ plain form
7770 -19 30 90 -14 -82 16 17 -63 -141 -8 -234 -89 166 144 328 -189 160 -56 -187 48 -233 -165 21 259 -280
7794 -280 -51 -277 -34 -177 133 267 94 48 217 124 -84 -105 -61 164 -226 80 -244 66 134 39 128 72 111
7817 111 23 -214 22 -70 233 154 -66 -263 -225 57 -177 -48 -11 22 -105 -46 72 -214 68 -260 -44 116
7839 116 152 -163 -8 68 -188 97 -235 152 22 262 164 12 17 -110 214 69 115 22 -172 47 -14 -34 -131
7862 -131 -109 -9 -175 -67 -147 3 37 -210 -8 -9 342 39 -150 30 45 164 -57 89 -220 -159 354 31
7884 31 173 89 106 190 138 -115 -109 -179 -17 285 191 -120 -173 68 127 171 -50 130 73 308 70 177 -102 132
7908 132 -38 147 244 178 6 280 160 94 224 21 155 166 -37 11 84 -131 182 240 -2 71 134 272 9
7931 9 13 121 -315 -183 -22 6 -151 135 170 78 -104 -35 94 -31 29 118 237 63 217 -108 -63 343 -9 346
7955C46n74J96k03L62j55j12L4M50r7j12j61j55L15m54P7Q3Q8j61L2J12K03r0
7977B4K0k16K86O4j30m2j09J37k45L43j82M3o3J59J51k37j05L64k99o9R1J9N7
8000F1j07L8j74K49K19k38K3j11j24K69n4N4k15q2K8J63Rp4Q3lk20L08j58k30
8024b86N55r9k57K3J1p3M8J44j62q1J19K3n4j5K94m21K72j87J03K00l65L39j02
8047B9j96J46R0o7J69j35k06J20K4J2J55k53L9m8L36k61j58J55J13j5j37L9L1
8070a8N4k34K5K76j31J52k21Q3j51M82m18K33j79J86l65J96j02q9J90Q0M9j40
8092d2Q5j15J27J85o3j11q7Mr3O1p9R6K9Qj39L35k95N5n3j28J34J71j58p6K28
8117G9q9J03j19j86L46j05P5j60l0L39l47O3k04Q7K8k0K71j18k89M8J70j30J18
$$ plain form
7955 346 -228 -32 -235 127 -28 -140 -106 344 247 135 -26 -181 134 -320 -243 -160 -72 -233 -201 -89 114 24
7977 24 44 -172 114 178 48 6 -103 34 -211 132 -50 -7 -70 89 240 3 -102 262 -37 -106 -15 4 61
8000 61 -46 -8 -182 67 286 48 71 -40 -164 105 51 105 -110 -192 -164 -1 8 -66 17 14 -206 102 -56 -286
8024 -286 269 170 -87 -64 -53 -126 -78 66 -96 -177 -58 -35 -89 -104 190 -231 41 -146 -43 157 -208 131 29
8047 29 -167 -21 69 2 171 36 -170 -50 -26 -14 141 -112 -73 -121 215 -46 -204 -49 64 49 -88 -49 -18
8070 -18 36 -198 -173 103 -28 124 -97 -14 -165 317 -101 132 -47 139 -226 -30 -132 -221 -31 49 98 -42
8092 -42 43 -72 55 240 177 66 -21 -17 -110 -49 -128 -32 -3 5 -134 201 -94 -39 -92 -220 -86 85 -73 -149 79
8117 79 -10 93 -26 -212 134 29 104 -56 -86 253 -94 -31 -235 -148 -120 -140 131 13 -276 -228 -58 -188 -70
8140g0nJ79k6J2K9l70M48k65k3J95P2j23k17L55Q8J0m47K44N9mQ0j71k33K88j72
8165f7K13k17J67k84K09l37K60O2L2R2k39oJ66lP1m19L78r0J18oj84K05Q0k86
8189h5K52j60
$$ plain form
8140 -70 -75 104 78 90 119 -251 197 -68 -91 104 176 53 -164 191 279 289 -158 86 145 141 221 50 -183 105 -67
8165 -67 146 -71 96 -188 21 -316 -56 6 38 130 -109 -115 51 48 119 -300 78 -12 106 100 -84 121 201 -85
8189 -85 167 7
8191G
$$ Imaginary data points
##PAGE= N=2
##DATA TABLE= (X++(I..I)), XYDATA
0@%%%%%%%qQqJ6j6K4l2M0n6P2q8J04j23J47j76K08k48K96l44M00m64N34o15P05
31C76q05R15j036J172j322J485j665J864k081K316k574K859l169L506l875M277
47B243m716N197n724O302o940P650q439R316j0302J1423j2705J4185j5921J7989
61I558k0501K3631k7651L3036m0658N2346p2734J18328m06163J59598P00338k87651
73B41477l06753p3654J09128L9233P8046m5934j08595m8196J06595O6682R272
84F7301j01556m1132J66511R3186k50154j45071J39559J08338R796O9629k4159
95I2248j74413n2629J75439N0002j40235j6930Q6883k636j5839N974K0793K4416
107E3073o6819p5179O7440O2766o6489j2339J25931R441j80006k2304J65296j1540
$$ plain form
0 0 0 0 0 0 0 0 0 -8 0 -8 8 -8 16 -16 24 -32 40 -48 56 -67 80 -96 112 -136 160 -184 216 -248 286 -329 376
31 376 -429 486 -550 622 -700 785 -880 984 -1097 1219 -1355 1504 -1665 1841 -2034 2243
47 2243 -2473 2724 -3000 3302 -3638 4012 -4427 4889 -5413 6010 -6695 7490 -8431 9558
61 9558 -10943 12688 -14963 18073 -22585 29761 -42973 75355 -330808 -171210 529128 241477
73 241477 -65276 -138930 -29802 9431 87477 41543 -67052 -115248 -8653 58029 67301
84 67301 -34255 -75387 91124 184310 -65844 -210915 -71356 36982 46778 116407 92248
95 92248 -82165 -134794 40645 90647 -49588 -66518 20365 17729 1890 7864 28657 53073
107 53073 -13746 -88925 -21485 41281 -25208 -37547 88384 97825 -82181 -104485 60811 49271
119D9271j09335N7859M6016p5096j7169Q4738N9861o4833j17171j964J00025M1970
131E4172o8239j9660J09541O225j49819j1177R7227j4285j3741N4623k7080p3608
143e5821K8929Q8463o659q6108k3011L2732K5133K3720j8428j7424L9240j0877
155A9889m7167J5941n391l1162N6108P2755m7581r2272K1952P5536k5151l6292
167b2835L8545r398m7717J8959M4653K8157j9515o5690r089M6727O665j9903J5582
180E141L2932l0923n3910M3135M6450n3074k2657M0563O414j2541n224n467J1019
193A858J5401L678k4803l7213J4194M2147J6851p492l9377j4193M4046j760m0594
206b7257J7099L2546j0300k4798M463K3881j2639k0109K2723N709k3194j31R524
$$ plain form
119 49271 -60064 -2205 43811 -31285 -48454 36284 96145 31312 -85859 -87823 12202 54172
131 54172 -14067 -33727 75814 82039 -67780 -78957 18270 3985 -9756 44867 17787 -55821
143 -55821 -26892 61571 54912 -31196 -54207 -21475 3658 27378 8950 -8474 30766 19889
155 19889 -27278 -11337 -16728 -47890 8218 80973 33392 -58880 -36928 38608 13457 -22835
167 -22835 15710 6312 -41405 -22446 22207 50364 30849 -34841 -43930 2797 9462 -10441 5141
180 5141 38073 7150 -46760 -3625 42825 -10249 -32906 7657 14071 1530 -3694 -9161 1858
193 1858 17259 20937 -3866 -41079 -26885 15262 32113 24621 -14756 -28949 15097 13337 -27257
206 -27257 -10158 22388 12088 -12710 -8247 15634 2995 -17114 5609 11318 -11876 -12007 -2483
219b483J4043R004j9912j1200L269l004J2791R246r795o910m364J5689J1799k6196
233h023n295K0430q461r654J1799J3139k026k2147k031K0938q076r965J1489J870
247C987J950l992j3230R766Q905o745K196l740p029J562N842J4723p247k0551
261a3603J5149R144k1911J625J3832K440J203p002o601r57N66J3588J705j3046
275c868R51j919K658J3993j2352p373J6814q055j3902J0902J1216m228j1138N041
289a260J0788j3608m870J3208m796J479P032j5092J355J4085o368m630J517p30
303a890O08M27O034k123r162J0262j818j6247J6309J1526j8059k869O971J862
317A831J912n107k106M687K427j058j1136J876J9646q605j3409J2477l043p092
$$ plain form
219 -2483 11560 20564 652 -10548 -7279 -10283 2508 11754 1959 -4951 -9315 6374 18173 -8023
233 -8023 -13318 7112 -1349 -11003 796 13935 11909 -10238 -12269 8669 593 -9372 2117 3987
247 3987 5937 1945 -11285 -1519 7386 641 2837 -903 -7932 -6370 -528 14195 6948 -13603
261 -13603 1546 10690 -11221 -9596 4236 6676 7879 877 -5724 -6681 -6115 7473 9178 -3868
275 -3868 -2917 -4836 -2178 11815 -537 -7910 8904 849 -13053 -2151 9065 4837 -6301 -1260
289 -1260 9528 -4080 -8950 4258 -538 941 7973 -7119 -5764 8321 1953 -2677 -1160 -1890
303 -1890 -1282 -855 5179 3056 -6106 4156 2338 -13909 2400 13926 -4133 -7002 -31 1831
317 1831 3743 -1364 -3470 1217 3644 2586 -8550 -6674 12972 4367 -9042 3435 392 -6700
331f700J0668q98o270M213L155l953p779O584J0540j1802l122R888o885N76P525
346E740r335K137Q608q903m361N592N201l011o745P656J322j1039Q364N042j2039
361e771N711M837r344L213M943k359k339j215L125j315j994Q227m950p458J0780
376D091k747p584J0102J17o377J761M97K57j571J976M966p707k642R224n804j994
392c435Q288m911j606N007n726j838N321L144k210o948M433N145r580L922P357
407F363r542K029N301p837R50O457j043m579j927O726M73p964N408J228n991P779
423C831j054r990Q201M303q308N31M364L60m767K33O584m780k894Q528p391l430
439e679J2868m795r249Q254J689n266O75L407m35m349L859J766r278O878R285
$$ plain form
331 -6700 3968 3070 -3200 1013 4168 215 -7564 -980 9560 -2242 -5364 4524 -2361 -1785 5740
346 5740 -3595 -1458 7150 -1753 -6114 -522 4679 1668 -5077 2579 3901 -7138 1226 6268 -5771
361 -5771 -60 4777 -4567 -1354 3589 1230 -1109 -2324 801 -514 -2508 5719 769 -6689 4091
376 4091 1344 -6240 3862 3979 -2398 -637 -140 117 -1454 522 5488 -2219 -4861 4363 -1441 -3435
392 -3435 4853 -58 -1664 3343 -2383 -4221 1100 4244 2034 -4914 -481 4664 -4916 -994 6363
407 6363 -3179 -1150 4151 -3686 -2736 3721 2678 -1901 -3828 2898 3371 -4593 815 2043 -3948 3831
423 3831 2777 -7213 988 5291 -3017 -2486 1878 2238 -2529 -2296 4288 -492 -3386 5142 -2249 -5679
439 -5679 7189 2394 -6855 1399 3088 -2178 -1503 1904 1469 -2880 979 2745 -6533 345 9630
454I630j3599j420R747o568m09Q217l863n647K357L477k543j184P307m936r674
469i108J1991K858j1560P713L149j1460M916P823o657m285N541K506p478K559
483a492R673j0407n054J3239n024o784J2054l487j0685P876N229o024j157N179
497C136l054o855R231N810j3534K208Q960j1101K207J2365r507o234P806J93m671
512c040M155N597r164o129J2551K59r623R388K49j2593Q500O140r998J723P464
527E479n919n857P113N745q996j350Q537p722j024J2962q075r547J1654J5p562
542d547O452L268q581k848R573J719q458M689K381j2283P057J1835j1395l763
556d901Q326m897k932Q240J249p879j789O767j868l120R428m657j1769R983N604
$$ plain form
454 9630 -3969 -5389 4358 -2210 -2619 5598 1735 -3912 -1555 1922 -621 -1805 5502 566 -9108
469 -9108 2883 5741 -5819 1894 5043 -6417 -1501 6322 -335 -4620 921 3427 -4051 -1492
483 -1492 8181 -2226 -7280 5959 935 -5849 6205 2718 -7967 -91 5138 -886 -2043 3136
497 3136 82 -6773 2458 8268 -5266 -3058 5902 -5199 -2992 9373 -134 -6368 1438 1631 -3040
512 -3040 1115 6712 -2452 -8581 3970 4229 -5394 3994 4243 -8350 150 6290 -3708 -1985 5479
527 5479 -440 -6297 816 6561 -2435 -3785 4752 -2970 -3994 8968 893 -8654 3000 3015 -4547
542 -4547 1905 5173 -3408 -6256 3317 5036 -3422 1267 3648 -8635 -1578 10257 -1138 -4901
556 -4901 3425 -1472 -4404 3836 5085 -2794 -4583 2184 316 -2804 6624 1967 -9802 181 5785
571E785q470L981K219q522J263Q030m46o307J196L445o149K346R928q614o184
586f499R593k210m272P651j585q091K407O174q19l422K085l55o632O094P229r192
602a844m93M960o695J527Q351l537n203J639J734j317K37N717m107p322P094J879
618B620n222N208L73q201K905N603k450j463P46K36k765J431N857m625m345N754
634A662k011j981O353k365n507K963J870o44J58O16q22l762L124M200m511J22
650e35L077o650J392P038k803l058J133l65n73R73L757j901n122L365J845l596
666b023M178P60o846K548L460k036P1Q39j156j397Q24L679k712k799M598j734
682B54l149N813j223m388L318M59j755P01J182q45k473J805L322m068q5M027m922
$$ plain form
571 5785 -2685 1296 3515 -5007 -3744 4286 3840 -2467 -1271 2174 -3975 -1629 8299 -315 -6499
586 -6499 3094 884 -3388 4263 2678 -5413 -3006 3168 2349 -1073 1012 657 -5975 119 7348 -1844
602 -1844 -2337 2623 -4072 -2545 5806 2269 -2934 -1295 439 -878 -641 5076 969 -6353 741 2620
618 2620 -2602 2606 2979 -5222 -2317 3286 836 -627 119 355 -2410 -979 4878 253 -4092 1662
634 1662 -349 -2330 4023 1658 -3849 -886 984 340 498 1114 292 -3470 -346 3854 -657 -535
650 -535 2542 -4108 -2716 4322 1519 -1539 -406 -771 -1344 -371 3386 1485 -3637 -272 1573 -2023
666 -2023 2155 2915 -3931 -1383 2077 41 112 951 -205 -1602 -778 2901 189 -2610 1988 254
682 254 -2895 2918 1695 -2693 625 1084 -671 30 1212 367 -2106 -301 3021 -1047 -1132 2895 -2027
699b027p45N846k288k463K214l74j407R14K091l06l979K353J849m157L707K189
715C417n961J183L231k967Q63J964j588j739J120K314k363j294M373k248l502
730c197N199l86m570L851Q29l362J722R93j058j381J460K084l465N21L427m395
746a728l56N118l093k073L852j593k000K417O94j265j195J996k7k817L022J365
762B317n047K448K495m017J555K608k894r94K118M32j381n77K689j555k488M410
778B119j195l593M181k60l359K547N00j695M40R52k35j285O17J792k927O19L207
795B425l685k82L852k756j020K982j048j078L96M81M8j702K576K77l456K236J509
812A755l791K002J948k881K93J628r88J09Q2O10o70j343K412q46j853K779m54
$$ plain form
699 -2027 -2772 3074 786 -1677 537 163 -1244 -330 1761 1455 -2524 -171 1678 -2479 1228 3417
715 3417 -2544 -1361 1870 -1097 -234 1730 142 -1597 -477 1837 -526 -1820 2553 305 -3197
730 -3197 2002 1616 -2954 897 1726 -1636 86 1079 21 -1360 100 2184 -1281 -760 2667 -1728
746 -1728 -2084 3034 -59 -2132 1720 127 -1873 544 1238 -27 -1222 774 747 -2070 952 2317
762 2317 -2730 -282 2213 -1804 -249 2359 -535 -1529 589 1021 -360 -937 1752 197 -2291 2119
778 2119 924 -2669 1512 1252 -2107 440 940 -755 -315 637 402 -883 -266 1526 -1401 -782 2425
795 2425 -1260 -1542 2310 -446 -1466 1516 468 -610 -214 267 315 -1387 1189 1466 -1990 246 1755
812 1755 -2036 -34 1914 -967 -674 954 -34 75 157 767 97 -1246 1166 320 -1533 1246 792
829G92k680K627j79j858J804J38j015N8M58O75j318l94K658k187j060L090j534
846G5j183K262j146m06M22j04M87q07R4J027j487P51J444k284P94J182k009P96
864i2Q01j385O88Q5j84N17j294J382J89j660J339L07j884J737m1j655J484nm28
883i9L30p37P76j73q38J567k99j704K106o09j167J496p11n26N65l33R24m06o38
902d76J221j286j79J715j833M09J590j772Q9J499j073L4q3k23J050j482P12J096
920A008k011P19J634k215O83R35j699J171K08m63M32j163J052K33j554K086o31
937D25j681J823J91j645J324o2j031Q21k33J84j44m14J221j357j05K054j547j050
955a226K142j153q28K118o22r37J21K96L78r11N02R01k245J102J867k436O30J581
$$ plain form
829 792 -1888 739 560 -1298 506 644 -371 -313 145 820 -498 -892 1766 -421 -1481 1609 75
846 75 -1108 1154 8 -398 24 -80 407 -400 -306 721 -766 -15 1429 -855 -61 1121 -888 -92
864 -92 709 -676 12 97 -87 430 -864 518 707 -953 386 693 -1191 546 505 -1150 334 329 -99
883 -99 231 -506 270 97 -741 826 527 -1177 929 320 -847 649 -62 -588 -23 -356 568 162 -476
902 -476 745 -541 -720 995 -838 -429 1161 -611 -522 977 -96 -62 -145 -368 682 -800 -88 1008
920 1008 -1003 -284 1350 -865 -182 753 -946 225 433 -30 402 -761 291 524 -1030 1056 425
937 425 -1256 567 758 -887 437 375 -656 165 -68 116 -28 -442 779 -578 -683 1371 -176 -1226
955 -1226 916 -237 -1065 1053 431 -506 -385 -89 289 -622 -120 781 -1464 -362 1505 -931 -301 1280
973A280j986K70J177p27m31K06P27j73p68J513m95k234K241N66k318J895K31k279
991a305Q84Q46k32j84J63J34j159j67L129k042j301K295j111j445K539k40j545
1008g41N62L25J6n61J098n2k049Q99J999k473M08J930k650L64K080q25o26M11
1026A15J1n13k10K138o76k287J572L87k214K491J027l299Q61J218r63L74N42n89
1044a5j040L21K115j287j082K138j557j396L342l39k365J443j15j092J007J185
1060A263p86k034J401J191j801J131J698l383N2K869j328r18J573q34j236Q00
1076c42J633j037j529J747n04j518L018K64l743J903R71j945J224R88j412r61
1092a243J095J220j438l3J642k142q29L659j076k206K102p48j511K236P98j707
$$ plain form
973 1280 -706 -436 741 14 -417 -211 516 343 -425 1088 593 -1641 600 1166 -1152 743 974 -1305
991 -1305 -421 425 193 9 172 306 -853 -1020 2109 67 -1234 1061 -50 -1495 1044 804 -741
1008 -741 -179 146 162 -399 699 647 -1402 -503 1496 -977 -569 1361 -1289 -925 1155 330 -296 115
1026 115 126 -387 -597 1541 865 -1422 150 537 -1677 814 1841 -1458 -597 621 -342 32 574 -15
1044 -15 -1055 -734 1381 94 -988 1150 -407 -1803 1539 1200 -1165 278 163 -929 78 1263
1060 1263 477 -1557 -156 1035 -766 365 2063 -1320 -1268 1601 273 -645 928 94 -1142 -342
1076 -342 1291 254 -1275 472 -32 -1550 1468 1732 -2011 -108 863 -1082 142 1130 -282 -1243
1092 -1243 -148 1072 -366 -399 1243 -899 -1728 1931 855 -1351 751 3 -1508 728 1526 -181
1108a81o06J048M67j691J727J086l713J398K289k645K70K283k374p34J860L05
1124G89j336J85R52j258l33K633o33k775K229M54k772K355J122k948L84J549m00
1141A97o55R18L39k277M16K688j850p58K452j731j484K936K34k433Q75O45j048
1158e36k7J973n39k361J499R52j900J110J438k755j02K635j432p31J908n31j782
1175a181N65J685q17j297J892j073j338K624J65k557J112J206j864P16J221o21
1191D38j407Q37P94j382M18J558k100k02K586j311j352K167j003j156J310P28
1207I23j101n59J235j70j357J693M10k141N70J674j747K94J194j509j59J159l4
1224C75n69L00Q32j111o13J418n03j063J558j70j367J361K53j001K40K71l02m16
$$ plain form
1108 -181 -787 261 728 -963 764 1850 -1863 -465 1824 -821 -551 1732 -642 -1376 484 789
1124 789 -547 -362 590 -668 -1001 1632 999 -1776 453 907 -1865 490 1612 -1336 -952 597 197
1141 197 -458 460 799 -1478 -1062 1626 -224 -982 1470 -261 -1745 1191 1425 -1008 -133 512 -536
1158 -536 -563 1410 871 -1490 9 961 -939 171 1609 -1146 -1248 1387 -45 -776 1132 601 -1181
1175 -1181 -616 1069 252 -1045 847 -226 -1564 1060 1225 -1332 -220 986 -878 -162 1059 438
1191 438 -969 -132 662 -720 -302 1256 -844 -1046 1540 229 -1123 1044 41 -1115 195 923
1207 923 -178 -737 498 328 -1029 664 1074 -1067 -497 1177 -570 -276 918 -591 -750 409 375
1224 375 -194 106 938 -173 -786 632 129 -934 624 454 -913 448 701 -300 -60 211 -91 -507
1242e07P11L88j243R5J839j553m4J400j196m90J158l88p39O31l1j20l79O99K16
1261D47r57L06Q47j336J038L67j391O57M67o07K20K96j56o64K17Q91o85l91O73
1280B39j83n42J027k83p99P80j37r8J54j73OM6l95P80n86R3M42m75l60R15o22
1301a71Q1M43o90J51J30j76L28k89N5K18k63j4N10p62M78R5l51K74j83j05N24
1322B83j91k09L24l38l6J82K29k50J79k67L04l10j50M54n79L53J34p04N56L18
1342B82n93N33j34m08O27m23J92o2n81P98l08j97O57n41MN74n73j65M87j5k09
1363e5K11Oj84r4J47K90r25N55Q06r88r8O13l38P6R7k87J22K95k09r6l6L66j81
1386I3o65P43k0q34J054l9q41O58j3j58l1O9O6k32l0M62j88m74N86l82p9O92l17
$$ plain form
1242 -507 204 592 -651 -556 1283 -270 -314 1086 -110 -600 558 170 -569 62 31 -89 -468 231 447
1261 447 -510 -204 643 -693 345 712 -679 -22 445 -162 58 354 198 -466 -249 642 -43 -434 239
1280 239 56 -486 541 258 -541 239 102 4 158 -15 -9 37 -358 422 -164 -71 371 -104 -464 451 -171
1301 -171 -90 353 -337 -186 -56 -232 96 -193 -138 80 -183 -197 313 -449 29 124 -227 47 -136 -241 283
1322 283 92 -117 207 -131 -167 15 244 -6 173 -94 210 -100 -250 204 -375 -22 112 -592 -36 282
1342 282 -311 222 88 -320 307 -116 76 14 -567 231 -77 -274 383 -158 -154 420 -153 -318 169 154 -55
1363 -55 156 162 -22 -116 31 321 -604 -49 757 -231 -329 284 -54 22 119 -168 -46 249 40 -56 -92 274 93
1386 93 -572 171 151 -683 371 332 -509 149 136 -22 -53 16 82 -150 -180 282 94 -380 206 -176 -255 437 120
1409A20n98O11j73K0L13k54K37o70L89J43l46L87J65p06M12K69o42K54L73k90
1429A4j35J16J22o4o2L86j09n78N00J46q47P19j19l89J42J39o4O6J20K67m62k63
1451c55P96k23o05Q05n13q5N26n33Q3R4J42j33r0j36N13n96M30j84k24K57K15
1472A84o90K84N00m3l43NK49k31j13L24n9k41K47L28p14O44r4n09K66K85l62J45
1494F2k38L79j19R3n1j40m23P97k58p26J304n52k70L91Q3m22j41L57P8o90N51
1515F5K52l80J71L14l58m05N63k87j05K53k79J06K94K78j69m72K33J45m41Q99
1535F77m55p42M20L43p27N86J10j55p8j15M37j82l78N52p15K51Q44l49m94K37
1555F7K7r2R7L52m97k19j0M40n65L69O35r53J49O99l97m21N21m73j87M17M15k31
$$ plain form
1409 120 -478 133 -40 -20 293 39 276 -394 -5 138 -208 179 344 -362 50 319 -323 -69 304 14
1429 14 -121 -5 117 53 -9 377 268 -310 190 336 -511 208 89 -300 -158 -19 -83 -17 103 370 -92 -355
1451 -355 441 218 -387 418 -95 -180 346 -187 -104 -10 132 -1 -91 -227 286 -310 120 -64 -288 -31 184
1472 184 -506 -222 278 235 -108 -103 146 -85 -198 126 67 -174 73 401 -313 331 237 -272 -6 279 -83 62
1494 62 -176 203 84 177 126 -14 -437 360 102 -624 680 128 -142 249 332 -90 -231 126 204 -486 65
1515 65 317 -63 108 422 64 -341 222 -65 -170 83 -196 -90 204 482 313 -159 74 219 -222 677
1535 677 222 -520 -100 243 -484 102 212 57 -21 -136 301 119 -259 293 -422 -171 673 324 -170 67
1555 67 94 2 99 451 -46 -265 -275 165 -400 -31 604 -349 -200 499 102 -319 202 -271 -458 -41 374 143
1577A43k48K07l47m4P62Nq99L61M39p06L76L48n20j29N59k05k81L35J89m09l45
1598d09Q62j81n12L99m01q2L93o4k97L90L8k37j17M57N7p71M07N65q12K23L10
1619B18m09j04M76k6o2Kj29k4l27N04J91l92K85ol27L64J9n07J40K41o9j7L15
1642C56Q2n93L19J13k16l8N80p50k97J065m27m26L24J30n09K69K27j51l19L00
1662C9J43l87K69L70p07K59M18l32j37K08r1k60J49J49j38m11O14k47j41N49j62
1683A54n26N97j74j45q0K52l2j94L8K86l19J74J17k56R8L86n31R7L41l33k9J13
1705C4J60n83K28J94k13j51M42K69m57j52L45j95K38k2l90rN94m30j7j63M93m81
1727b66j12Q92m80k00K55k09K74q3l86M84kK06l77J26j93P1O2j52J02Rl9k29K70
$$ plain form
1577 143 -105 102 -245 -289 473 478 -421 -60 379 -327 49 397 -123 -252 307 102 -179 156 345 -64 -409
1598 -409 453 272 -240 159 -242 -324 69 5 -292 98 136 -101 -218 239 296 -475 -68 497 -315 -92 218
1619 218 -191 -295 181 155 93 95 -34 -58 -385 119 310 -82 203 197 -130 234 253 -254 -114 127 58 41 356
1642 356 438 -155 164 277 61 23 603 -147 -444 621 194 -232 92 222 -287 -18 209 58 -261 39
1662 39 182 -205 64 434 -273 -14 404 72 -65 143 52 -208 -59 90 -48 -459 155 -92 -233 316 154
1683 154 -372 225 51 -94 -174 78 46 -148 -110 176 -143 31 148 -108 -10 376 -155 -58 283 -50 -79 34
1705 34 194 -389 -161 33 -180 -331 111 380 -77 -229 116 -79 159 137 -253 -262 332 -98 -115 -278 215 -266
1727 -266 -378 514 34 -166 89 -120 154 71 -315 169 167 373 -4 122 -71 0 62 -90 12 21 -18 -247 23
1750B3j74L28k36o2k5K73j5r3r2L31k68q3K60j68j76K53Ql69K07j81J35Q7J54
1773A17j19k0j27R7P1O0j09j11N0J12J75K2k72o8k4q1L62l7k44N35m95n9L93k20
1797Hk06M67j40p1j96J31J77k12j10J21k9L31k53l71J41K50k5K8M2j3l24K21J84
1820A51l12q7N2N01k58p7J20j33j2N0k71j34M83q4RkJ77n35L42P2j65M0K74j79
1844B2o2M96n35K6J29K47k48j50K52j79no0N3M7j5N72p65j77M25P6j84J46K02
1867C13n97J04L42l24j5N72m04k04L03j83j42K06J56Nj02m2rj06o9L32k41O0L43
1890B98m18j31K30lJ74n6j95J43k23J89j0R8oj17m9J04J34m67J91M30n41K86J26
1913A87l58K96o7mo3r2J00J41m65O33j02l46J87O4j68J59j44J51l58P6N11k56
$$ plain form
1750 23 -151 177 -59 -121 -146 127 112 19 -73 258 -10 -93 167 -1 -177 76 84 -285 -78 -259 -124 -37 117
1773 117 -2 -22 -149 -52 19 79 -30 -141 -91 21 196 218 -54 -122 -146 -227 135 98 -146 389 -106 -165 228 8
1797 8 -198 269 129 58 -138 -7 170 -42 -152 -31 -60 271 18 -353 -212 38 13 41 83 70 -254 -33 151
1820 151 -161 -248 -196 305 47 -30 90 -43 -55 -5 -276 -410 73 -11 -2 -4 173 -362 -20 52 -113 -73 201 22
1844 22 -40 456 -79 -53 76 323 75 -75 177 -2 -7 -67 -14 33 18 590 -175 -352 73 149 -35 111 313
1867 313 -284 -180 162 -162 -177 395 -9 -213 90 -93 -235 -29 127 132 30 -12 -21 -127 -196 136 -105 -45 298
1890 298 -120 -251 -21 -24 150 94 -101 42 -181 8 -2 96 90 -27 -76 28 162 -305 -114 316 -225 61 187
1913 187 -171 125 58 54 -9 -101 -1 140 -325 308 206 -140 47 111 -57 102 -42 109 -249 -173 338 82
1935H2j93K68l47J32N19o67j26N59m24J65j62K25j38J24Q0k49J00P4J46m90N78
1956B56K15l74K9k21j0r5K11m5L29l95J19J46l62L31p1j19K26l4pj7n4nP0n3j57
1981h7K57j63M9m8K5l61K72k58L87k2j6J0J28K5j37K3J3n3j71L36k38J26Q8l96
2005b11R6J47J30m63M13p3R8j26k15L76j85n9J96l41M00k4k75K17Q4r2j25o3K74
2028A79o4j1j13J35k53L78j78l89M53J45l04K27j8rm16L25m9j21J62J32m03M9
2050a43J33l5k03J90o9J67j62k28J60o2M90r5j84K90J37o04K3L28k48J01K13n7
2072A42k95L21m5k42p9J94N3l09L68K17n12L30k14j05J32jk5N5J24j38n2L04p4
2095A49m54K91L84n24k68P02l33K4M04m95K01l26M36j87j75K53K18r14M87L19
$$ plain form
1935 82 -111 157 -190 -58 461 -206 -332 227 -197 -32 -194 31 -107 17 97 -152 -52 22 168 -322 256
1956 256 471 97 126 -95 -105 -200 11 -34 295 -100 19 165 -197 134 63 -56 170 136 129 112 58 53 123 70 -87
1981 -87 170 7 56 8 33 -328 -56 -314 73 51 35 45 173 198 61 84 97 44 -127 209 -29 97 185 -211
2005 -211 -115 32 162 -301 112 39 137 11 -204 172 -13 -72 124 -217 183 159 -116 101 185 93 -32 -95 179
2028 179 115 104 -9 126 -127 251 73 -316 137 282 -22 205 187 178 -238 87 38 -83 79 211 -192 -143
2050 -143 -10 -45 -248 -58 -127 40 -122 -350 -190 -252 238 143 -41 249 386 -218 -195 133 -115 -14 199 142
2072 142 -153 168 123 -119 -198 -4 49 -260 108 325 -187 143 -71 -176 -44 -45 -70 -15 109 -29 -81 223 149
2095 149 -305 -14 370 -154 -422 280 -53 -29 375 -120 81 -245 191 4 -171 82 300 -614 -127 192
2115A92n91N28J38p36K19M33j50k14K98n8j50j77J15K12n45O35O8k65K41J22m39
2136a24M00j03L6m65M15Rn88O07J03m90K45J2j65l12N19k41l2L7J99m1j0m9j97
2159b35J09P5q1l9N17K7q48M72K13l71j11N21j83k39l1L01l32oQ2L09m93M94j02
2182D9k86L52k4k44K17m4j25q2J60O9k82M09R8k96k73M82o4n50N64k99Ok7J66
2205b4N8k23K52P7k68J74L55o03J95J75n52N93n7p4j83K83o2k8j05J2K25k26J92
2228A86j52n0k38L06m83M39K0l15J18L44r9l96L79Q9m39J43M05j39l49M18m0l11
2250a64K34Oj42N5r2K22q6K02M7m11J07M0k35J61L62m62q8L53Q2L7l54O4j29j82
2274c73M72j87kK50k3m03P17l12k70L48j21M6Qq3oj09l73N21p6j50L86k88j37
$$ plain form
2115 192 -399 129 267 -469 -250 183 33 -181 117 59 -91 -268 -153 59 -486 149 217 -48 193 315 -124
2136 -124 276 173 209 -256 159 168 -420 187 290 -200 45 57 -108 -420 99 -142 -174 -137 62 21 11 -38 -235
2159 -235 -126 -51 -132 -171 346 373 -475 -3 210 -161 -272 249 66 -173 -204 97 -235 -241 -159 150 -343 151 49
2182 49 -237 115 91 -153 64 20 -105 -187 -27 42 -240 169 267 -29 -302 180 116 -434 130 -169 -163 -190 -24
2205 -24 34 -189 63 140 -128 46 401 -202 -7 168 -384 209 152 78 -105 178 116 88 -17 -5 220 -6 186
2228 186 34 -16 -254 52 -431 8 28 -287 -169 175 76 -320 59 148 -291 -148 257 118 -231 187 147 -164
2250 -164 70 76 -66 -11 -103 119 33 235 282 -129 -22 18 -217 -56 306 -156 -244 109 191 228 -126 -62 -191 -373
2274 -373 99 -88 -90 160 137 -266 451 139 -131 217 96 142 150 67 61 -48 -421 100 24 -126 260 -28 -165
2297a65J45J9k76K18J21j53J6K43N1l94J32L16o27K04K40l98N2L98n0j44J38j57
2319g1j11N2K59j63l08P31k86r9j7p5j71J72K24O5o2q9K08o89K40J38P5j71J17
2342c1k3MK39j26j16L44l70M0k2K34r2O6m7m8k07K50J71k65R2P4l63L70m3j1J55
2367B75m08K3K14k1p8k2J13qJ31l87K10om1j3P1J81nj81o1M7n2K10j3o11O11l98
2393b19L48J43m47K5l1K29J1Pk34K65j43q4K93m3m8L1j30p9M02n38K37L6j33N6
2417d6J4P4R1k52K14J77n68L72K25j46j44j15J03J11l31M71k77k72N57j8m62L59
2439A37j40k52K52o3rP3O2k8J10k31K83l70J04N6J28k63L09m18K13L18l24J38
2461H5k64L20k56K44L8K28n13J35M9o1nM6q0p5j22L35j21N8k19o3J84Kn4j5L7
$$ plain form
2297 -165 -20 -1 -277 -59 62 -91 -75 168 219 -175 -43 273 -354 -150 90 -308 -256 142 92 -52 86 -71
2319 -71 -182 -130 129 -34 -342 389 103 4 -13 -88 -259 -87 137 202 140 51 259 -430 -190 -52 23 -148 -31
2342 -31 -54 -50 189 63 -53 291 -79 -39 -61 173 81 147 100 52 -155 95 266 1 93 167 -196 174 131 120 275
2367 275 -133 -110 104 83 5 -17 96 88 219 -168 42 36 -5 -18 53 234 229 48 -13 34 -18 192 179 -432 179 -219
2393 -219 129 272 -175 -150 -181 48 59 66 -168 97 -46 -130 163 120 72 103 -27 -106 296 -242 -5 31 -102 -46
2417 -46 -32 42 133 -119 95 272 -296 76 301 155 11 -104 -1 110 -221 250 -27 -299 258 240 -222 137
2439 137 -3 -255 -3 -66 -75 -2 60 32 142 -89 194 -176 -72 -16 112 -151 158 -260 -47 271 -53 85
2461 85 -179 141 -115 129 167 395 -118 17 66 5 0 46 -34 -109 -231 104 -17 41 -178 -241 -57 -55 -109 -124 -87
2486h7q6P9J32R0L11k64pn5m8LJ07j87j64L64n3j73M93k38k50JlN6O5K34m23N
2512i8j25J39kJ3M43k45k27Q5J05k07K10k62K48o3J01k98J33M8N7k10K04P3m87
2535c65M09p4K5j75KK73l69K82j5R6n7L4r9O4M39o25j02O82n08J70q2R1r0k36
2559b30n5O48l69k36K86k97L28J49l41J41R7l37q9K94j20K50j53O3j29n3N63l89
2581B1n05K08M39m88M29k12J0l9J90P3j7m7j72ok07N97m35O8L07j30l22O57l23
2604I6j77N5k8k20M0J66J85k82N23j7m90R4N0k74J51O7j11KJ49k08P5K29K07j81
2628A01m33N24n1m44K37Ro1J68j1J28j31l40M66m10K65M43p02m3Q37n58k58L77
2650A13o3k23J69n9j95M17l74J23m4M4L55l06K06O7m21K0O1N1L40l94J27k14L6
$$ plain form
2486 -87 -173 -94 38 128 439 175 168 113 65 68 175 -12 -176 188 135 -38 455 217 -33 -32 -35 21 86 320 -103 -98
2512 -98 -223 -84 -86 -73 370 125 -102 -17 88 -119 91 -171 77 14 115 -183 -50 -2 55 -155 49 122 -365
2535 -365 44 -30 -5 -180 -178 95 -274 8 -7 89 32 66 -33 31 470 -155 -257 425 -83 87 5 96 6 -230
2559 -230 -285 363 -6 -242 44 -253 75 224 -117 24 121 -216 -305 -11 -131 119 -34 29 -100 -153 410 21
2581 21 -484 -276 163 -325 104 -108 -98 -137 53 126 109 62 -110 -116 -323 274 -161 -93 214 84 -238 419 96
2604 96 -81 -26 -54 -274 -234 -68 117 -165 358 341 -149 -55 -5 -279 -128 -61 -172 -170 -21 -229 -154 75 282 101
2628 101 -332 192 141 -303 -66 -57 -118 50 39 167 36 -304 162 -248 17 460 -242 -285 552 -6 -264 113
2650 113 50 -173 -4 -63 -258 159 -215 -92 -136 -92 263 -43 163 230 -191 -171 -110 -59 281 -113 14 -200 -164
2673a64M20k19k02J79J82k80J76J20m61K97Pk70K24J69j02p8r6L35k41J4L64n07
2695a33K3K23J34n63K84M4Qj17J65p8j3J36r6r1K12K12l39k18M50l34J4L29k04
2718D8j31M3K18J65n47J34mk30K02K30j50J38l90Q8J44K92k97P8j60L7J85k12
2740a19J91p9KK32j48j37Q3k26J4M05l14Q4K43j52j11j42K60L23n31K31j43L7
2762CK9K61j55l80J15O1L68m63K59ml45N07k78j99L27J06m72L93j24l63M11k97
2784b40J10M43l36M51j52l58P0J04J7o1L30k79J54M8l83Q9m1K82l85k2J57n4K30
2807A74J66k34l29J9M86o35N71j69Q7k5J1l49J39K14j59J25l4J54l59k9N35l18
2829D1N4r9l0Q9l2K73m05J35J3J38m52L40k77O2K84j91J73j66J81k15n2j32J02
$$ plain form
2673 -164 256 37 -165 14 196 -84 92 212 -249 48 55 -215 9 178 76 -2 -98 237 -4 10 374 -133
2695 -133 -110 113 247 -316 -32 12 20 -97 68 -10 -23 113 17 -74 138 350 11 -207 243 -91 -77 252 48
2718 48 -83 -40 178 343 -204 -70 -74 -304 -102 128 -22 116 -274 -186 -42 250 -47 31 -129 -92 93 -119
2740 -119 72 -7 -5 227 79 -58 25 -201 -187 218 -96 -12 231 79 -32 -174 86 409 -122 109 -34 3
2762 3 32 293 138 -242 -127 -66 302 -161 98 94 -251 256 -22 -221 106 212 -260 133 9 -354 57 -240
2784 -240 -130 313 -23 428 276 -82 -12 92 109 48 378 99 253 301 -82 7 -34 248 -137 -159 -2 -56 174
2807 174 340 106 -223 -204 282 -353 218 49 136 111 122 -227 -88 126 -33 92 58 212 -147 -176 359 41
2829 41 95 -4 -34 55 23 296 -109 26 39 177 -275 65 -212 -150 134 -57 116 -50 131 -84 -136 -268 -166
2852a66P0K19O3m73M54k9l52K30L4O5j50R7QO0J00j54J35m85M66j15N7k32J55
2875E7M0n99M95j89K94k27K78J2n4j1j22j37L63l6j89j3K05m66J64K91j54k1J68
2898A49O9j54K5J79m94K4K96k6O2k63N4J5k2K75k39K19j37O6o8l15L07k35J83
2921c0J77m75J96L99k68j20Q0N6R9q0m2J05l23K75J09l80M75l01K64k62j43J39
2943e0J51j76QO6K37j69J34k48L06j35j48j26L11l37J71J09j66K94k05j54l33
2964d60O21m7J76k89J61k67K6J47k41J83L7M8j43J00l4p5m7K63L4j77k14J10q0
2987a68K64j90NJ59j12J98rk62k16L26k35M30l58J78R2j28L4j0l3Q7O0J8j09J82
3011B03k22q2p9J93N9l02J64J99k30P0k0j34J27M7L3r0Q6J33J84l06k58L50k83
$$ plain form
2852 -166 -96 123 186 -287 167 138 -214 16 50 115 -35 62 70 130 230 76 211 -274 192 77 134 -98 57
2875 57 97 -502 -7 -196 98 -129 149 161 107 96 -26 -163 200 164 -25 -38 167 -299 -135 156 2 -19 149
2898 149 218 64 89 268 -226 -202 94 68 130 -133 -79 -64 -86 189 -50 169 32 98 30 -285 22 -213 -30
2921 -30 147 -328 -132 267 -1 -121 -41 15 114 34 -8 97 -226 49 158 -222 253 -48 216 -46 -189 -50
2943 -50 101 -75 -67 -1 236 67 201 -47 259 124 -24 -150 161 -176 -5 104 -62 232 27 -127 -460
2964 -460 161 114 290 1 162 -105 -79 68 -173 10 47 95 -48 52 18 -57 -104 159 193 16 -198 -88 -168
2987 -168 96 -94 -89 70 -42 156 147 -115 -331 -5 -240 190 -168 10 102 -26 8 -2 -35 52 112 130 21 203
3011 203 -19 -101 -180 13 72 -230 -66 133 -97 -27 -47 -181 -54 -7 26 -64 22 155 339 33 -225 125 -158
3034a58M5K22j72kj40K56K7r3n4K68k39J95j81O8M1j3O4Q0r4l03J10n7m0K28L5
3059I3p7J74l5qk72m1K94j18m6J73l19P6q9K02j4k62M32j17j27K42l30J38L8P4
3083H1k28L68nk52m1L1L2j4j85J17M4Qn3N11n69M23l18J5j30J64j1l71M55R8m5
3108A25k47M03k02j92K72j19k34O66k92j97K5L06l48j71L30k28J39oj30K2j62
3129b40M41j59j27K67l35K61r4KK3M1p2j36Q2mJ92k41J19j11j59L48r1Q4j95K99
3153A95l20n1L95j71k24J18O8j20P5J98r5k62K29Jr9Q9J80n33PL55o4l57M22K62
3177B98n35J82K54j73K64k34j89J62Kj61Rk58M05O0l05N12m25k64N69j62J1j76
3199a54J21l31N01J7R5m47J75K66k35n8O2J12l71K83nj83J65l0k5L6J63l23J48
$$ plain form
3034 -158 -113 109 -63 -65 -205 51 78 -15 -69 199 -40 155 -26 42 83 70 134 214 120 -183 -73 -130 -170 58 93
3059 93 16 190 155 147 -125 -166 128 10 -36 137 -182 -106 -195 7 -7 -269 163 46 -81 161 -169 -31 7 81
3083 81 -147 221 216 -36 -77 -46 -14 -28 -213 -96 -52 -44 -97 414 -155 268 -50 -35 -165 -1 -12 -383 72 170 125
3108 125 -122 281 79 -113 159 40 -194 472 180 -17 8 314 -34 -205 125 -103 36 30 -100 -78 -240
3129 -240 201 42 -85 182 -153 108 14 16 39 80 8 -128 -46 -50 142 -99 20 -91 -250 98 7 91 -104 195
3153 195 -125 -176 219 48 -176 -58 10 -110 -35 163 68 -194 35 36 -63 26 206 -327 -320 35 -29 -386 36 298
3177 298 -237 -55 199 26 290 56 -133 29 31 -130 -121 -379 26 86 -219 293 -132 -396 173 11 22 -154
3199 -154 -33 -364 137 154 249 -198 -23 243 8 -50 12 124 -247 36 31 -152 13 -17 -42 -6 157 -166 -18
3222a8j01L63n61M06J54l47j62N28l36K6k5m6K1m1L47j03j19P3m5j36L79j11l33
3245a87P8M01n24K00k9RJ05K25k11j69pL85m14K29j16Q0kj06K72m92K00o1L61
3268B27j04J00k54J96J77l13j95m7O8J54k0P0j55J57p1j6l7n5K56q7j17NK72k17
3292fJ26j30k07P9L20k05K57k65j25L01k7J43l57k1J03j40K00K3m14L35K3R9N9
3315A71m9jl04K05p9k2K16j0K43o95K87N9J3k05R3L20j6j47J03k08R7J34k95j44
3339b34M56O7j05p7j71q1J59J06l08J79m14N00o4K26j75j7j18K90m27L34Q2k67
3361e9qL4j59J7J51m0J46r3K96k22J78l84j33L20p5L1k38N6J92P7n9M8j20J55
3385A11j28J25K7j71l53M41k67K36J68j23k87L31k39K31j33K88n60J89M51l11
$$ plain form
3222 -18 -119 244 -317 89 243 -104 -266 262 -74 -48 -73 -119 -98 -139 208 105 -14 59 14 -122 257 146 -187
3245 -187 -109 292 -232 -32 -61 -52 53 278 67 -102 -109 276 -138 91 -25 55 53 -53 219 -273 -73 -134 227
3268 227 123 223 -31 165 342 29 -166 -213 -145 9 -11 59 -96 61 -10 -26 -63 -118 138 51 -66 -61 211 -6
3292 -6 120 -10 -217 -138 182 -23 234 -31 -156 145 118 261 -96 -117 -14 -154 46 69 -345 -10 13 112 171
3315 171 122 121 -183 22 -57 -79 137 127 370 -325 -38 21 34 -171 -78 242 226 79 182 -26 71 205 -90 -234
3339 -234 222 289 184 107 -64 -145 14 120 -188 -9 -423 77 13 239 64 47 -71 219 -208 126 208 -59
3361 -59 -67 -33 -192 -175 -24 -64 82 -11 285 63 241 -143 -276 44 -31 0 -238 -182 10 87 28 76 -44 111
3385 111 -17 108 135 -36 -389 52 -215 21 189 66 -221 110 -129 102 -31 257 -303 -114 337 26
3405B6j80K02q3k07J83L9J12j2k33r2J68K28j33NJ65j27j74Q4J14j54j20J62L7
3428A0K0or0j59K72k7k68K66L4J51m45L13j71J44L4M2n9j10J49r4j65J01r8K18
3452F2k08O66m89n5K83n13M74Ml07j21K52j1J81j47k87k4J58O2J75l08J36J65
3474A48o9J01l06J16P4j40k35L18J93j23j3p0L27j08j25j69j34J4J09K3m7J26
3496A0P2j2R9j92J20j59J01m4J1J72Q5k95j34K36k48L6J14j01J79L7m04K23L38
3519B44m34K01m2N0J87m72K65K63n21K16l18L03J79m77J83L34m0N3j97K43j33
3540H7j59m6K45j02p1J16q5L8lj5P7j80M3K76m25J78L18j61j14l0k42M26j54k75
3564b58L40j17J47k6J19k45k7j80N2L7qJ54j72K85j06k8K17j04O6M7j5J66j56
$$ plain form
3405 26 -154 48 -35 -242 -59 -20 92 80 -153 -245 -77 151 18 23 188 61 -113 -29 85 -69 -189 -27 10
3428 10 30 24 -66 -225 47 20 -248 18 52 203 -242 71 -100 44 78 120 61 -49 100 6 -159 -58 -156 62
3452 62 -146 520 31 -24 259 -254 220 224 -83 -204 48 37 218 71 -216 -240 -82 -20 155 -153 -17 148
3474 148 79 180 -126 -10 64 -76 -311 7 200 77 64 -6 321 213 88 -81 -215 -201 -92 -69 -116 10
3496 10 82 70 169 -23 97 -62 39 -5 6 178 263 -32 -166 70 -178 -142 -28 -129 50 87 -317 -94 244
3519 244 -190 11 -31 19 206 -266 -1 262 -259 -43 -361 -58 121 -356 -173 161 121 174 -23 220 87
3540 87 -72 -118 127 25 -46 70 -15 23 20 5 82 -98 -55 221 -204 -26 292 131 17 -13 -255 171 17 -258
3564 -258 82 -35 112 86 205 -40 -67 -247 -195 -158 -166 -12 -184 101 -5 -33 184 80 146 193 178 344 188
3587A88k17k25L41l20L00N6m8k40K76r7L24l37J76j50N3J40k07j1o5O0M2J02l04
3610a63r5N9J85l36M03r7n0J32K2j61J36J9k79J49K61K38m07k16K67kj73J01j39
3633a46o7J54J99k49N09o53L93l70J77K43l75K20j78p7j3K12J9K20k83J71k31
3654a25M51l46N5J36k15j30OL67j10j87J65J21k13P3l1J76q9k56L32k02L08m67
3676a81J48J36p2r7n9L10J27k67p2K52j46k0O1L7k74J98Pl9r6J73j26K28k22j03
3700i7L0Q3P7l12J74L4K8r9N10n83L02k37n8Q0K79j92k38J54O7J6J7k48K05J87
3724A79l11L07k66k16N46n30L65K4o5O1k06K72q1J88l14P5l59L59J51l13K97n3
3746A10n45L72r8q7M64k36L21m34j69L69j00J43P4k93J79l5q7R1L49o64K4L58
$$ plain form
3587 188 -29 -254 87 -233 67 123 75 -165 111 14 338 1 177 27 80 220 13 2 -63 -3 39 141 -163
3610 -163 -258 -199 -14 -350 53 -44 -94 38 60 -101 35 54 -225 -76 185 423 16 -200 67 65 -108 -7 -146
3633 -146 -213 -59 140 -109 400 -253 140 -230 -53 190 -185 35 -143 -220 -233 -21 -2 218 -65 106 -125
3654 -125 326 -20 35 171 -44 -174 -168 199 89 -98 67 188 -25 48 17 193 104 -152 180 -22 286 -181
3676 -181 -33 103 31 -66 -125 185 312 45 -27 225 79 59 120 157 -117 81 88 49 -47 126 0 228 6 -97
3700 -97 -67 16 93 -219 -45 -11 17 -82 428 -155 147 -90 -148 -68 211 19 -219 -65 2 18 35 -213 -8 179
3724 179 -132 175 -91 -307 239 -291 74 98 33 94 -112 160 79 267 -47 28 -331 28 179 -134 163 110
3746 110 -435 -63 -161 -248 216 -20 301 -133 -302 67 -33 110 184 -109 70 35 -52 39 388 -276 -252 106
3768A06l31M44l68L26j63L1K3j95k3K02J58l29j2K45k04K00j45j9M3k17K03R8
3790G3j14n5J71n9L87l63j88L22j28nN7K03k96k9k16L37j0k34J36l4J63J92m16
3813a06QR2m4J3j29M9J31k94L68p4N4lJ0Pn8m61M70K23k22k31K8K39k52J3L4K14
3839G9J5k15M0j38L49p3j89J64j30J63n7Pl3J64j77k43J07Q7m7MJ39Q8l04K83
3863H3r9R5J85m59J41N9n0j97K46j70J56J7N3l1j03J69l4k63K02J38j42k6p8P9
3887b9j7p2M34m33K63k08oJ66k31L43k93N5j09J43kn3L5%J05k03J80J63k18K87
3911C00k67O9L1j12J48l73L39k90L19l03K87p0j22K75k63J91j29J14J43q5j4j67
3933B1M4k1J60J02k70K52l56Mj5K64j39N7k11N8K50l06J53j93J36J57q8m4J92
$$ plain form
3768 106 -225 219 -149 177 14 45 68 -127 -150 52 210 -119 -131 114 -90 110 -35 -54 -11 -228 -25 73
3790 73 -41 -96 75 16 403 40 -148 174 46 41 98 301 5 -24 -240 97 87 -147 -11 -45 118 310 -106
3813 -106 -98 -6 -50 -37 -166 -117 14 -280 88 14 68 65 75 82 24 -437 33 256 34 -197 -169 70 -182 -169 -135 79
3839 79 94 -121 -81 -219 130 57 -132 32 -98 65 8 15 -18 146 -31 -274 -167 -80 -127 -123 16 104 -200 83
3863 83 -16 79 264 -195 -54 5 -45 -242 4 -166 -10 7 60 29 -74 95 61 -202 0 138 -4 -30 -108 -29
3887 -29 -46 -118 316 -117 146 -62 -68 98 -133 210 -83 -28 -137 6 4 -49 -14 -14 91 -112 68 231 13 300
3911 300 33 102 133 21 169 -204 135 -155 164 -139 148 78 -44 231 -32 159 30 144 287 202 188 21
3933 21 65 44 204 306 36 288 -68 -64 -79 185 46 103 -108 -50 200 -106 47 -146 -10 147 59 15 207
3956B07k34p0O3K55k03Pk9K05k31K9R0j63p8L27l28J53l0R6l6R9j27j08p5K19
3980C8K15m56M7L15m98M28J5j91K08o1j20m8k2L01kk55R6R9j76J16j36K3J80n5
4004F1J89n0m4j3j99K57n2j40J08l11P1N2K24m50K91O5m7KJ44k90K84k69L02j34
4028E1j37l1J36J98l45j9J87J93JJ15j44l75J82r0J58j0m5j84K03l1q4j47L29
4051A11j38J26j97L5j69K8m1K79m8o8r0K07J2j97J81J34j01r8J06k02J88k4q6
4074e2nJ43k32J74r3O7J63j0P4k74j09R6j21K51j3r1m2O1L95l86Q2K12k77J04
4098A17l56M36R2l14o4j25L00o4K4L7r0qK78k75J34L6k27Q4J0j12P2lQ9J09J12
4123B92m03J00P7j53LM1N6J14N1r1L4l6p4l3m0J44Q1k24J91j43l4L3o2m7K27J86
$$ plain form
3956 207 -27 -97 -34 221 18 25 -4 201 -30 -1 89 -74 -152 175 -153 0 -30 66 30 129 2 -106 -181 38
3980 38 253 -203 -156 159 -339 89 104 -87 121 60 -60 -108 -130 171 169 -86 10 109 -67 49 -87 -64 116 61
4004 61 250 200 156 143 -56 201 149 9 117 -194 -123 -71 153 -297 -6 59 12 14 158 -132 152 -117 185 51
4028 51 -86 -117 19 217 -128 -147 40 233 234 349 205 -170 12 -78 80 70 25 -159 44 13 -71 -218 111
4051 111 -27 99 -98 -63 -232 -204 -245 34 -14 -82 -172 35 47 -150 31 165 64 -34 72 -130 58 34 -52
4074 -52 -57 86 -146 28 -65 2 165 155 229 -45 -154 -58 -179 72 59 -32 -74 -13 382 -4 78 290 13 117
4098 117 -239 197 289 -25 -89 -214 86 22 46 83 -7 -15 263 -12 122 158 -69 15 25 -87 -15 -18 71 180 292
4123 292 -111 -11 66 -87 -84 -43 13 127 178 87 121 85 11 -22 -62 82 163 -61 130 -13 -47 -14 -76 -123 104 290
4149B90k95J03j21j40K50k40Q7J37k51K78j37J02k18J28q7L2N1j5n7K25j56M6
4171A2Kr1J45j69K02p4q8K84q0l11J74P1K17m09J30J91n38L36j74K93r7j83J73
4194A6r4j04J57qk15K17L14m25K91k5O4l82J81Q1j03j26N03k62j27K48Mj54O3
4217A14j75j0J73l32J64k28M10r5q8J2J11k56J0N29p09K50J05K13n7n9r3o7j40
4240b18L23p2n59P43l68L6K15K5k93J02N7M6K9k2j5lJ80j80l5RK5m4L4k25K79
4265F9r8l9P8O6j80K17K34l50j4J30k40N5J13J13l63l7J81j29l6q8L80l4mp0K04
4290A58Lo5q8j41QK08o6j63R3K64k21K12k10M6j8l8L40l20j13Q4q3L21k06j9q1
4315i5J98j92K02j17j03K6n5L69j99q5j10J81K3r0rJ22M9j27k06J32M2j32J70
$$ plain form
4149 290 -5 98 -23 -163 87 -153 -66 71 -180 98 -39 63 -155 -27 -114 -82 -31 -46 -103 122 -34 12
4171 12 14 -77 68 -101 101 27 -61 223 143 -168 6 77 294 -115 15 206 -332 4 -170 123 26 -157 16
4194 16 -78 -182 -25 -33 -248 -31 283 -142 149 124 188 -194 -13 68 -35 -161 342 80 -47 201 205 51 114
4217 114 -61 -71 102 -230 -66 -294 116 21 -67 -55 56 -200 -190 339 -370 -120 -15 198 141 82 -11 -78 -218
4240 -218 105 33 -526 217 -151 -115 100 125 -168 -66 -9 37 66 44 29 26 206 26 -9 0 25 -19 15 -210 69
4265 69 -29 -68 10 76 -104 113 347 -3 -17 113 -127 -72 41 154 -209 -246 -65 -194 -230 -318 62 28 24 -46 158
4290 158 161 96 8 -133 -125 83 17 -146 -53 211 -10 202 -8 38 20 -18 322 2 -111 -27 -110 211 5 -14 -95
4315 -95 103 -89 113 -4 -107 -81 -136 233 34 -51 -161 20 43 -47 -56 66 115 -12 -218 -86 -44 -176 -6
4338fJ0r9P2J02k24n1J37rj64M12r6k4j69L13r9o0L5j82m9j3K6K12o2N8k97K45
4364A8j7n1K3k57L10L2j71K51k27o2K10J40j22k21PJ99o3K47k79n5K63k10N8J57
4388A80r1Nj15nJ24N3j32J00j45N0J29l18K12qj71J5M0J0K9J81J1k08J98k38L65
4413B71n71L67j78P9J50p3j75J82q0K3J42j40L9n1L15l86N9j8J53p6m8O9k7r4
4437f8K68p7l3j79j79L21j75J58M2m8k3jK1l3K30j48Jl31L79j87J24j39P8R9j56
4462e6J8K89k06n1j13j23J96j5R3k3k07K11o6J34j83L83j13j43J2J43k34o0L00
4485A86k50j64o8K53J02pP2j34k59J65J8K29l02K82k14K48o3j87L00j93q0J27
4507F1j09J9L5R7l44K01m8R4J51m6j85M8Q6j20R6J4J9O6L0k96P1L2j83K52j25
$$ plain form
4338 -6 4 -95 -23 79 -145 -196 -59 -68 -232 180 84 60 -109 204 105 45 80 -102 -151 -164 -138 74 12 70 -227 18
4364 18 1 -50 -27 -284 26 58 -113 138 -89 -151 59 199 77 -144 -137 62 -1 246 -33 -88 175 -35 23 180
4388 180 89 94 -21 -26 98 151 19 119 -26 24 153 -165 47 39 -132 -117 -77 -67 -38 143 154 -54 144 -94 271
4413 271 -300 67 -111 -32 118 45 -130 52 -28 -5 137 -3 36 -15 300 -86 -27 -45 108 32 -16 53 26 -68
4437 -68 200 123 90 -89 -268 53 -122 36 78 30 7 6 27 -6 224 76 77 -254 125 -62 62 -77 1 100 -56
4462 -56 -38 251 45 -6 -119 -242 -46 -61 32 9 -198 13 -53 81 -102 281 168 25 37 180 -54 -114 186
4485 186 -64 -228 -296 -43 59 52 124 -10 -269 -104 -86 143 -159 123 -91 157 94 -93 207 14 -66 61
4507 61 -48 -29 6 103 -241 -40 -88 6 157 111 -74 -26 60 -60 36 50 69 135 165 -131 -60 -28 -211 41 -84
4532h4Q2j95M26l42M0k66K79k7K80l85K12R2k01k91N06k58m1P7J42r2J34k08O1
4555e9Pq0K73p3q9K05k95q5K86j00j01mj17K06J49l51K21j35M2K00j80j45K49
4578B4m9j17NJ12pK88l67N8k52K22R1j45p7L04M8r0j75k0L26Kj90M4J44l66J32
4603e5o2L33l28j5J29k9l05M03M2n0M8k93L92l26K38m8o4j23k03K13P6j12K35
4626I6l0j60n2JJ54j30kJ98k08J62p4J62j4K14o7j71j70P7O2j63M38k73k93K90
4650D7J91l56K3J84L0J61k47j16O5m57M82n5J15R7k73L97k01j23j01O9J55j03
4672a6L44j79M3m12J69J21j83j39M3O63n27J72r0J22o2Pl41L96j96K4jp2M06l62
4696g0l0J60j49M3R0k34L41m6k50J00j00K51k76M4p4j59M51j29L1J98k07L6l06
$$ plain form
4532 -84 -2 -197 229 -113 -73 -339 -60 -87 193 -192 20 112 -89 -380 126 -132 -173 -96 46 -46 88 -120 -59
4555 -59 -52 -132 141 68 -21 184 -111 -196 90 -10 -111 -115 -232 -26 123 -228 -7 -142 -100 100 -80 -225 24
4578 24 -25 -142 -137 -25 -32 256 -111 -53 -305 -83 8 -137 -214 90 138 48 -127 -147 179 181 -9 35 179 -187 -55
4603 -55 -117 216 -112 -127 2 -27 -332 71 113 63 111 -182 210 -116 122 74 10 -113 -316 -103 -27 -139 96
4626 96 66 -94 -146 -145 9 -121 -123 75 -133 29 -45 117 103 317 250 79 -91 -14 48 -115 323 50 -243 47
4650 47 238 -118 -95 89 119 280 33 -83 -18 -475 7 -48 67 164 -109 288 87 -36 -137 -68 87 -16
4672 -16 328 149 192 -220 -51 70 -113 -252 -209 454 -73 99 9 131 69 76 -265 131 -65 -41 -42 -114 292 -70
4696 -70 -100 60 -89 -46 44 -190 151 105 -145 -45 -145 106 -170 -126 -200 -359 92 -37 -6 192 -15 21 -285
4719b85J33N41o79K39J85k84MM3J53p5N2j18o4J86K01m29K85l07K28J25j81M07
4741C60n26K44n7N1o1J5j81J25J92p1m06M36j74J88j91L45k65k28J73J46R3l70
4763a62M05k41J74k63L83j59j69jk4K39l89K18j47M40k38R8l59K65Rk2j16j89
4785b48L26j28N1l16K93l6J17j69J44k0o2J24j20J3n7M7N7J09J71j59j19J54k60
4808h8J57k04J16R8j75N1n3O6M9Q5m75L51O4k1L8k4K10m3j15J62k38P8j58L02
4832B33R5l02o9J6j82k4M24O0j39n8j24J5J60k25J85k43L52j10j91L34j66K7m2
4855B6l41M39j78J87j55oJ47mo5J8j19K83k30K5j09J86P1oR2j56j3k0J68l91J65
4880A4r1L20j71qJ10j12k08J49N2j09R1JJ82k71O6L1j60N7J9j81M09J52j11O2
$$ plain form
4719 -285 -152 389 -290 -51 134 -150 -146 -103 50 -25 27 -91 -155 31 232 -197 88 -219 9 134 -47 360
4741 360 -166 78 21 72 11 26 -155 -30 162 91 -315 121 -53 135 -56 289 24 -204 -31 115 208 -162
4763 -162 243 2 176 -87 296 137 -32 -33 -57 182 -207 11 -136 304 66 164 -195 70 79 57 -59 -248
4785 -248 78 -50 1 -315 -22 -58 59 -110 34 14 -48 76 -44 -31 -88 -41 16 125 296 137 18 172 -88
4808 -88 69 -135 -19 79 -96 -45 -98 -32 17 102 -373 -22 42 21 59 35 245 202 87 249 11 89 -69 233
4832 233 328 26 -43 -27 -209 -233 191 251 112 54 -70 -55 105 -120 65 -178 174 64 -127 207 41 68 26
4855 26 -315 124 -54 133 -22 -28 119 115 50 68 -51 232 2 27 -82 104 175 169 261 105 92 72 240 -151 14
4880 14 -77 243 72 64 174 62 -146 3 55 -54 37 38 220 -51 15 46 -114 -57 -38 -219 190 342 231 293
4904B93m48J80O4r1k37J16o0L03j88K57k65o0P1J27m5k1j86J14O7Mn3l4J32j05
4928f5p8K19j58N1q2L12q8k4k00Q0j69K90Pk34K01j83k43J65J27K9K4m2ML59k68
4953C4J06l06j24N36k27L23l95R6J13j23k37L01k4j27p8j73K02J84K8j37j29J78
4975B1l63K80j27K30J2j83J59K2r7j0N9q4K67j78M3L9j20R3j3j46M09k61l8N7
4999G1O1k95L2j7L60K4l34p2L30m9Lj66l5l36M32j05l9K01j43k6j7p2L94k71m11
5024d80K02K17N7n0K64k38O1K4q6K2J72j53n4L6P8R9p8j77K08K4j44J72m35M76
5048B17j51j90M5K49l16J03J66l10L32j79K4L04k38m4k32J48K49j5Ol04J27k9
5070c8J84n1mm13L10j26L73l22L20p0j4j36j11L8k3K47J1J86n03P3J13O5j88K83
$$ plain form
4904 293 -155 25 89 -2 -239 -123 -183 120 -68 189 -76 -136 -65 62 17 -4 -190 -76 -9 -5 -58 -92 40 -65
4928 -65 -143 76 -82 -31 -113 199 111 87 -113 -33 -202 88 95 -139 62 -121 -364 -199 -72 -43 -19 -61 -57 302 34
4953 34 140 -166 -290 246 19 342 -53 43 156 33 -204 97 73 -54 -132 -305 -103 81 109 -28 -157 21
4975 21 -342 -62 -189 41 53 -130 29 51 -46 -56 3 -81 186 8 51 90 -30 63 50 -96 313 52 14 71
4999 71 132 -163 -131 -148 212 236 -98 -170 160 111 114 -52 -87 -423 9 -96 -135 66 -77 -103 -120 -192 202 -69 -480
5024 -480 -278 -61 -4 -54 210 -28 33 57 -29 -7 165 12 -42 -6 72 171 93 -84 124 148 4 176 -259 217
5048 217 66 -124 -79 170 -146 -43 123 -187 145 -34 -10 294 56 12 -220 -72 177 162 168 -136 -9 -38
5070 -38 146 95 91 -322 -12 -138 235 -87 233 163 149 13 -98 -60 -83 164 175 361 -142 -69 44 109 -79 204
5094B04J7j13j88KK23j26j00J16j31K90j69j45M45m80K66Q9l95J56j79N7K54Q0
5116A73n19L89r4r4M74j54k91K39K16k86j04m8%L10k58NJ94j86P0M3q6K26r3j9
5140A07k10L3q6K35m0M7k75J82ko2N8J30N3Op3j24j12J79L88o18K70o9O4k26m2
5165a87N27o28R6L36j33K34j83r5m8l0k2j29K62P7l4M8k47n3N6L39o3K3K6k77
5189a05J28k3J08m8K0l3p8p1r7K92N4j0J94l35k70L02j01R6J46j02L0m0j32j25
5213b00j35M34k42L66k55P2L02j18n18N63l02J96k46J14k03Q0J24o3J44n2l5l1
5235eO4n7J45K14k35k8p8k06K21J97m47J90%M8j5K4l8j87J09J35P7k69J74l0J40
5260A43j5k23J21j14M0M1m3n8n8J42j61J32Lj76O0K65ml43M37k10k69K98j42J72
$$ plain form
5094 204 221 108 -80 -78 145 19 -81 35 -96 194 25 -120 325 -155 111 200 -195 -39 -218 -161 93 173
5116 173 -346 43 -51 -145 329 175 -116 123 339 53 -51 -99 -99 211 -47 -42 152 -34 36 79 -7 219 126 107
5140 107 -103 -70 -156 79 39 86 -189 -7 -9 -71 -13 117 170 176 103 -21 -133 46 434 -184 86 17 81 -145 -187
5165 -187 340 -288 -192 144 11 245 62 -33 -81 -111 -133 -262 0 77 43 91 -156 -209 -153 186 123 146 172 -105
5189 -105 23 0 108 60 80 47 -31 -102 -199 93 147 137 331 -4 -274 28 -73 23 169 67 97 57 -75 -200
5213 -200 -335 99 -143 223 -32 40 342 224 -294 269 -33 163 -83 31 -172 -92 32 -31 113 61 26 -5
5235 -5 59 2 147 361 126 98 20 -186 35 232 -215 -25 -25 23 8 32 -6 -193 -84 51 128 -141 33 3 143
5260 143 128 -95 26 -88 -48 -7 -50 -108 -166 -24 -185 -53 -50 -226 -166 99 95 -248 189 -21 -290 8 -134 38
5284C8j26o0J97j26K0K8l1l3j08Q6J43J36k40J70k98K1P1k51M88n6j69J68J07
5307A75l04J42j51k5J38K08j58k75M26k98L99m32L51l8j51j40K68j51j6R0k32
5328a74K81k21M1m1j67K96O5o2M3l13K50j56J70J94r0k07K61j76p8m9j87L59J74
5351B13l80J95J42j68l09K65R7j91p7M9l1K68j70J22k94M18p8R8j43Mo4k9q1N2
5375i2O46m87m7KR4j73j01J87J12J8m9j34p8j6K77l51j07L34j45J72j44k71J71
5398a82J42P9J58j75J00mK5j22Q6k6K5j67K7L24k15k17K83k73L18j92j42J03K4
5421b1k48P7J63j79K99J39k77J40k53J00K40n55N12q5j04R9N1k38K39l4j92L32
5443B05n1k03P2J09o7k18K99r9K60m15K72l6p2r5K22l64J27k07L31k1k4K05m61
$$ plain form
5284 38 -88 -148 49 -77 -57 -29 -60 -93 -201 -115 28 164 -76 94 -204 -183 -112 -363 125 69 -100 68 175
5307 175 -129 13 -138 -163 -25 183 25 -250 176 -122 277 -155 196 158 7 -133 135 -16 -32 58 -174
5328 -174 107 -114 -73 -114 -281 15 80 18 61 -252 -2 -158 12 206 116 -91 170 -6 -84 -133 -320 39 213
5351 213 -167 28 170 2 -307 -42 55 -136 -213 -164 -195 73 -97 25 -269 149 71 169 26 30 -34 -63 -144 -92
5375 -92 554 67 20 22 116 -57 -158 29 141 159 110 -24 -102 -118 159 -192 -299 35 -110 62 -82 -353 -182
5398 -182 -40 39 197 22 122 118 143 21 107 81 106 -61 -34 290 75 -142 141 -132 186 -6 -148 -45 -21
5421 -21 -269 -192 -29 -208 91 230 -47 93 -160 -60 180 -375 137 52 -52 47 98 -140 99 65 -127 205
5443 205 154 -49 23 132 65 -153 146 47 307 -108 164 128 56 -39 183 -181 -54 -261 70 49 25 230 -231
5466b31M26l37K52k30Q5M0p7O5l26M41P9j68k7K03j02m35M99k60m3J94l24L31
5488E5k0Km0L4l37M00q9n6J32J93l16L44k57l32M69m58M05k26p6R3j9j11J63Q1
5512C4pJ8k19L29j94q9L3K07m7ql2O3l3m0O3J20m20L8P8R5j3K1N9r6Q7k18K20
5539D9P4j39m2j45M89k45k23P3J45n3j36q4N03k45j48J33J53m94M67o3Q8l43N77
5562C91k97K7r4J47k38J86j58LJ76L6m19J23M3J63J30l48K23j05R2j29m9o4K4
5585a37J63n6j5K59l20l8L24k48J84p9J52J0o6k64R9L22k20m5p4m3J0K86l06J5
5609h7J5O3j41L27l15M0J75j25q6R%K40l35L87j68k73L03j41K63k21J18J0l32
5632b74M97j58p8J41L5Q5l91J56J41j61O8j96Q9J21p8n8J81k05R3Kj3K18n9K5
$$ plain form
5466 -231 195 -142 110 -120 -35 5 -72 -7 -333 108 187 19 -8 195 93 -342 157 -103 -146 48 -276 55
5488 55 35 37 -3 31 -306 94 5 -51 81 274 -42 302 45 -287 182 -276 129 -97 -173 -80 -99 -210 -47 34
5512 34 27 45 -174 155 -39 -128 -95 112 65 57 25 88 55 15 78 198 -222 -184 -106 -11 -24 -3 56 -40 47 -171 49
5539 49 123 -16 -58 -203 286 41 -182 -109 36 -17 -153 -237 266 21 -127 6 159 -335 132 69 157 -186 391
5562 391 94 121 27 174 -64 122 -36 -33 143 179 -240 -117 -74 89 219 -129 94 -11 81 -48 -97 -161 -137
5585 -137 26 -30 -45 214 -106 -144 180 -68 116 37 189 199 133 -131 -32 290 70 25 -49 -92 -82 204 -102 -87
5609 -87 -72 -9 -150 177 -138 -98 77 -48 -134 -125 -125 115 -220 167 -1 -274 29 -112 151 -70 48 58 -274
5632 -274 223 65 -13 128 163 248 -143 13 154 -7 61 -135 -46 75 -3 -61 120 -85 8 10 -3 215 156 181
5656A81l24K84J1l7k19K26o9L69l81j81Q5j08K17j41K12l06P0Ko4K37k69K91k95
5679b09r3K58J75k04N4N7k4j07J79k23K1J54k28Q7J19K21j35k54p7K4M64p6q1
5702A02M8j11j19m3O9K54j72o8J82k34K41k81J15r6k2Q9j00L25r5M3k36J04J42
5725A37n5k16J10o2R1K07k12r4Q2l8m2M7l2j2J06O7j41K91k2m8j49p6j09L84k6
5750A88K37n46k9K39L4k95q5J17j82J98M61l44JL5p5k23K92P0J58l5j40Q6p9N5
5774A38p6mJ29j64ro8p3L66l0j79j75l48M34K15k15N3k1J36j70pj40K00J83k79
5798a04K8q4J85j6P6k25op6K17r2J0O0j54J42J43O9l27J47J37o9k84J59Mj23R4
5823h9K03o8L20l50k16J0K01o2l6K49j77k41M93k54n4P2R2M7j73K1m6j68M49j57
$$ plain form
5656 181 -143 141 152 115 -104 122 53 422 41 -140 -55 -163 54 -87 125 -181 -111 -109 -173 64 -205 86 -209
5679 -209 -302 -44 131 -73 -19 38 14 -93 86 -137 -116 38 -190 -103 16 237 102 -152 -229 -205 259 183 102
5702 102 150 39 -80 -123 -54 200 28 -40 142 -92 149 -132 -17 -113 -135 -46 -146 179 84 127 -109 -5 137
5725 137 82 -134 -24 -86 5 212 0 -94 -12 -50 -92 -45 -77 -89 17 84 -57 234 212 164 15 -61 -170 214 188
5750 188 425 -121 -150 89 123 -172 -257 -140 -322 -124 337 -7 -6 29 -46 -269 23 93 251 216 76 162 83 138
5774 138 62 58 187 23 14 -54 -127 239 209 30 -145 -493 -59 156 -59 -6 -27 109 -61 -68 -208 -8 175 -104
5798 -104 -76 -160 25 9 85 -140 -146 -222 -5 -97 -87 -27 -181 -39 104 173 -154 -7 130 61 -223 -64 -60 -183 -89
5823 -89 114 46 366 16 -200 -190 11 -51 -87 162 -15 -256 237 -17 -71 1 93 140 -33 -12 -58 -226 223 66
5847F6M1l78J05O9P7j8n8K31p2m99M35m1J56J9j57J62l26J17K97k00p5J15r6p0
5871a00K06L03m06q5K52j56k89k0J44n3O32k78l28L68k03J49k07L01j59jJ25j49
5893D6P2n1j75J34K30l26K32m87K66K29l92M05p0j08j36R0l2P1j28L64j92j51
5915a09K19L4p1j35J40j29J14n26L26M36k00l7J22p4J30k73L6L8n8J36p3qoj55
5939a23K31nl87L35k07m9K25j32k2J35P7k33O8k0J48k49K50l8j20O6O1L8j80J03
5963b8n5R4k04J65M2J13l04K21K37j43j96rl4j37L41J98m94K55k10J47N0j34O4
5986b1M0q3N7J30j82l9J77k80K9K03k44R0mJ36J5j3O5J59m3l94K1K71Q3j47k2
6011Dk46L55k12JQ3j15J58M94m63j33J48K9l21K99n9j28J11l6K33j21j09J23m7
$$ plain form
5847 66 107 -271 -166 -97 -20 -38 -96 135 63 -436 -1 -42 114 133 -24 138 -188 -71 226 26 -49 66 -30 -100
5871 -100 106 409 3 -82 170 14 -275 -295 -151 -204 428 150 -178 190 -13 136 -71 230 71 70 195 46
5893 46 118 67 -108 26 256 -70 162 -325 -59 170 -222 183 113 5 -131 -41 -73 -2 -130 234 42 -109
5915 -109 110 144 73 -62 78 -51 63 -463 -137 299 99 62 184 110 240 -33 3 41 -17 119 46 38 32 -123
5939 -123 108 103 -284 51 -156 -205 20 -112 -134 1 78 -155 -87 -107 41 -208 42 4 -116 -50 11 49 -131 -28
5963 -28 -83 11 -193 -28 14 127 -177 44 281 138 -58 -67 -101 -238 103 301 -193 62 -148 -1 49 -85 -21
5986 -21 19 -64 -7 123 -59 -98 79 -201 -172 31 -213 -123 -127 9 24 11 76 235 192 -202 -181 90 173 26 4
6011 4 -242 113 -99 -98 -15 -130 28 522 59 -74 74 103 -218 81 22 -106 5 -31 202 81 -28 95 48
6034D8k04J68J26k29J63j13K6J30k4p1p8J14KP7j81O7J27j28Q6j83K44l9j39P8
$$ plain form
6034 48 -156 12 138 -91 72 -41 -15 115 91 20 -58 56 58 135 -46 21 148 20 106 -77 167 128 -11 67
$$ [...]
8191a1
##END NTUPLES=NMR FID
##END=
