##TITLE=1H_Pr AMBu
 CDCl3, 8 sc, 
 7.06.2021
##JCAMPDX= 6.0         $$ Bruker NMR JCAMP-DX V2.0
##DATA TYPE= NMR FID
##DATA CLASS= NTUPLES
##ORIGIN= UXNMR, Bruker Analytische Messtechnik GmbH
##OWNER= root
$$ XWIN-NMR		Version 3.5
$$ Mon Jun  7 12:29:53 2021 Russian Standard Time (UT+4h)  she@DPX200
##.OBSERVE FREQUENCY= 200.131506
##.OBSERVE NUCLEUS= ^1H
##.DELAY= (6, 6)
##.ACQUISITION MODE= SIMULTANEOUS
##.ACQUISITION SCHEME= undefined
##.AVERAGES= 8
##.DIGITISER RES= 18
##SPECTROMETER/DATA SYSTEM= spect
##.PULSE SEQUENCE= zg30
##.SOLVENT NAME= DMSO
##.SHIFT REFERENCE= (INTERNAL, DMSO, 0, 15.7039)
##AUDIT TRAIL= $$ (NUMBER, WHEN, WHO, WHERE, WHAT)
$$ ##TITLE= Audit trail, XWIN-NMR		Version 3.5
$$ ##JCAMPDX= 5.01
$$ ##ORIGIN= Bruker BioSpin GmbH
$$ ##OWNER= she
$$ F:/spectra/data/she/nmr/H-F/1/audita.txt
$$ ##AUDIT TRAIL=  $$ (NUMBER, WHEN, WHO, WHERE, WHAT)
(   1,<2021-06-07 12:28:00.26 +0400>,<she>,<DPX200>,
      <created by zg, POWCHK disabled, PULCHK disabled
       configuration hash MD5:
       00 E9 B6 7A A2 85 ED C7 34 08 36 98 17 FE 4E 26
       data hash MD5: 16K
       CB 07 41 FF C0 EE 38 77 BE 14 EC 53 2C BA 2A D0>)
$$ ##END=
$$ 
$$ hash MD5
$$ B1 BE AA 6A A6 4D 46 E3 A3 1B F7 4D 3F D1 BF 61
##$RELAX= 
##$RELAX= 
##$RELAX= 
##$RELAX= 
##$RELAX= 
##$RELAX= 
$$ Bruker specific parameters
$$ --------------------------
##$DU= <F:/spectra>
##$EXPNO= 1
##$NAME= <H-F>
##$PROCNO= 1
##$TYPE= <nmr>
##$USER= <she>
##$AMP= (0..31)
100 100 100 100 100 100 100 100 100 100 100 100 100 100 100 100 100 100 
100 100 100 100 100 100 100 100 100 100 100 100 100 100 
##$AQSEQ= 0
##$AQ_mod= 1
##$AUNM= <au_zg>
##$AUTOPOS= <>
##$BF1= 200.13
##$BF2= 200.13
##$BF3= 200.13
##$BF4= 200.13
##$BF5= 200.13
##$BF6= 200.13
##$BF7= 200.13
##$BF8= 200.13
##$BYTORDA= 1
##$CFDGTYP= 0
##$CFRGTYP= 5
##$CHEMSTR= <none>
##$CNST= (0..31)
1 1 145 1 1 1 1 1 1 1 1 1 1 1 1 1 1 1 1 1 1 1 1 1 1 1 1 1 1 1 1 1 
##$CPDPRG= <>
##$CPDPRG1= <>
##$CPDPRG2= <>
##$CPDPRG3= <>
##$CPDPRG4= <mlev>
##$CPDPRG5= <mlev>
##$CPDPRG6= <mlev>
##$CPDPRG7= <mlev>
##$CPDPRG8= <mlev>
##$CPDPRGB= <>
##$CPDPRGT= <>
##$D= (0..31)
0 1.2 0 0 0 0 0 0 0 0.06 0 0.03 0 0 0 0 0.0002 0 0 0 0 0 0 0 0 0 0 0 0 
0 0 0 
##$DATE= 1623054479
##$DBL= (0..7)
120 120 120 120 120 120 120 120 
##$DBP= (0..7)
150 150 150 150 150 150 150 150 
##$DBP07= 0
##$DBPNAM0= <>
##$DBPNAM1= <>
##$DBPNAM2= <>
##$DBPNAM3= <>
##$DBPNAM4= <>
##$DBPNAM5= <>
##$DBPNAM6= <>
##$DBPNAM7= <>
##$DBPOAL= (0..7)
0.5 0.5 0.5 0.5 0.5 0.5 0.5 0.5 
##$DBPOFFS= (0..7)
0 0 0 0 0 0 0 0 
##$DE= 6
##$DECBNUC= <off>
##$DECIM= 32
##$DECNUC= <off>
##$DECSTAT= 4
##$DIGMOD= 1
##$DIGTYP= 9
##$DL= (0..7)
0 120 120 120 120 120 120 120 
##$DP= (0..7)
150 150 150 150 150 150 150 150 
##$DP07= 0
##$DPNAME0= <>
##$DPNAME1= <>
##$DPNAME2= <>
##$DPNAME3= <>
##$DPNAME4= <>
##$DPNAME5= <>
##$DPNAME6= <>
##$DPNAME7= <>
##$DPOAL= (0..7)
0.5 0.5 0.5 0.5 0.5 0.5 0.5 0.5 
##$DPOFFS= (0..7)
0 0 0 0 0 0 0 0 
##$DQDMODE= 0
##$DR= 18
##$DS= 0
##$DSLIST= <SSSSSSSSSSSSSSS>
$$ [...]
##$SUBNAM2= <"">
##$SUBNAM3= <"">
##$SUBNAM4= <"">
##$SUBNAM5= <"">
##$SUBNAM6= <"">
##$SUBNAM7= <"">
##$SUBNAM8= <"">
##$SUBNAM9= <"">
##$SW= 20.0188882624521
##$SWIBOX= (0..15)
0 0 2 0 0 0 0 0 0 0 0 0 0 0 0 0 
##$SW_h= 4006.41025641026
##$TD= 16384
##$TD0= 1
##$TE= 0
##$TE2= 300
##$TE3= 300
##$TEG= 300
##$TL= (0..7)
0 120 120 120 120 120 120 120 
##$TP= (0..7)
150 150 150 150 150 150 150 150 
##$TP07= 0
##$TPNAME0= <>
##$TPNAME1= <>
##$TPNAME2= <>
##$TPNAME3= <>
##$TPNAME4= <>
##$TPNAME5= <>
##$TPNAME6= <>
##$TPNAME7= <>
##$TPOAL= (0..7)
0.5 0.5 0.5 0.5 0.5 0.5 0.5 0.5 
##$TPOFFS= (0..7)
0 0 0 0 0 0 0 0 
##$TUNHIN= 0
##$TUNHOUT= 0
##$TUNXOUT= 0
##$USERA1= <user>
##$USERA2= <user>
##$USERA3= <user>
##$USERA4= <user>
##$USERA5= <user>
##$V9= 5
##$VALIST= <valist>
##$VCLIST= <CCCCCCCCCCCCCCC>
##$VD= 0
##$VDLIST= <DDDDDDDDDDDDDDD>
##$VPLIST= <PPPPPPPPPPPPPPP>
##$VTLIST= <TTTTTTTTTTTTTTT>
##$WBST= 1024
##$WBSW= 4
##$XGAIN= (0..3)
0 0 0 0 
##$XL= 0
##$YL= 0
##$YMAX_a= 91407
##$YMIN_a= -83860
##$ZGOPTNS= <>
##$ZL1= 120
##$ZL2= 120
##$ZL3= 120
##$ZL4= 120
##$ABSF1= 10
##$ABSF2= 0
##$ABSG= 5
##$ABSL= 3
##$ALPHA= 0
##$AQORDER= 0
##$ASSFAC= 0
##$ASSFACI= 0
##$ASSFACX= 0
##$ASSWID= 0
##$AUNMP= <proc_1d>
##$AZFE= 0.1
##$AZFW= 0.1
##$BCFW= 1
##$BC_mod= 2
##$BYTORDP= 1
##$COROFFS= 0
##$CY= 11.3945322036743
##$DATMOD= 1
##$DC= 2
##$DFILT= <>
##$DTYPP= 0
##$F1P= 15.9154993809931
##$F2P= -4.1035820241983
##$FCOR= 0.5
##$FTSIZE= 0
##$FT_mod= 4
##$GAMMA= 1
##$GB= 0.15
##$INTBC= 1
##$INTSCL= 1
##$ISEN= 128
##$LB= 0.24
##$LEV0= 0
##$LPBIN= 0
##$MAXI= 10000
##$MC2= 0
##$MEAN= 0
##$ME_mod= 0
##$MI= 1.114404
##$NCOEF= 0
##$NC_proc= 0
##$NLEV= 6
##$NOISF1= 3.799351
##$NOISF2= 2.8
##$NSP= 1
##$NTH_PI= 0
##$NZP= 0
##$OFFSET= 15.70392
##$PC= 1
##$PHC0= -11404.07
##$PHC1= 24.60101
##$PH_mod= 1
##$PKNL= yes
##$PPARMOD= 0
##$PSCAL= 0
##$PSIGN= 0
##$REVERSE= no
##$SF= 200.130013532006
##$SI= 16384
##$SIGF1= 3
##$SIGF2= 2
##$SINO= 400
##$SIOLD= 16384
##$SREGLST= <1H.CDCl3>
##$SSB= 0
##$STSI= 0
##$STSR= 0
##$SW_p= 3612.71676300578
##$SYMM= 0
##$S_DEV= 0
##$TDeff= 0
##$TDoff= 0
##$TI= <>
##$TILT= no
##$TM1= 0
##$TM2= 0
##$TOPLEV= 0
##$USERP1= <user>
##$USERP2= <user>
##$USERP3= <user>
##$USERP4= <user>
##$USERP5= <user>
##$WDW= 1
##$XDIM= 8192
##$YMAX_p= 0
##$YMIN_p= 0
$$ End of Bruker specific parameters
$$ ---------------------------------
##NTUPLES= NMR FID
##VAR_NAME=  TIME,          FID/REAL,        FID/IMAG
##SYMBOL=    X,             R,               I
##VAR_TYPE=  INDEPENDENT,   DEPENDENT,       DEPENDENT
##VAR_FORM=  AFFN,          ASDF,            ASDF
##VAR_DIM=   8192,          8192,            8192
##UNITS=     SECONDS,       ARBITRARY UNITS, ARBITRARY UNITS
##FACTOR=    0.0002496,     1,               1
##FIRST=     0,             0,               0
##LAST=      2.0444736,     0,               0
##MIN=       0,             -83860,          0
##MAX=       2.0444736,     91407,           0
$$ Real data points
##PAGE= N=1
##DATA TABLE= (X++(R..R)), XYDATA
0 0 0 0 0 0 0 0 0 0 0 0 0 0 0 0 0 0 8 -8 8 -8 8 -11 16 -16 18 -24 24 -32 37 -40 48 -56 62 -70 80 -88 101 -112
38 -112 126 -141 157 -174 191 -214 237 -262 288 -319 351 -385 425 -468 517 -568 629 -696 772
57 772 -858 957 -1075 1214 -1381 1593 -1861 2222 -2727 3494 -4814 7671 -27183 57382 60857
72 60857 -83860 -35616 43207 6062 -34526 -7546 -5275 -947 4423 -15217 -23942 8784 13628
85 13628 -12506 -19522 5349 13008 -5962 -11509 8262 9185 -1455 -910 1481 4418 13638 4178
99 4178 -10314 2431 15200 1520 -1286 7098 -152 108 13352 6886 -5578 -34 11540 10914
113 10914 -6240 -13851 12470 24250 -14138 -25605 20084 22988 -21117 -12368 19410 2589 -12085
126 -12085 3963 2855 -4646 8443 3304 -17856 -395 22343 -4956 -24431 5470 16951 -10233
139 -10233 -12614 8250 3490 -6728 1497 -1246 -6924 6551 4904 -12990 -5377 8484 -1928
152 -1928 -7922 1411 -1123 -6990 892 2175 -6045 -3716 2963 1020 -5565 -5670 4824 6530 -8520
167 -8520 -10163 6797 7120 -8944 -6755 6543 2980 -4929 -1402 2202 2659 3270 -862 -4222 2468
182 2468 8912 1161 -6728 1842 8462 131 -2959 3790 3505 -281 3219 3165 -2300 3655 9668 -1265
198 -1265 -5424 6816 7733 -3000 -1771 4953 2039 -992 1533 768 1154 4013 -754 -3757 3566
213 3566 5728 -1756 -4183 1612 4296 -567 -4107 -711 3307 -306 -4978 -1167 1874 -1658 -1225
228 -1225 -151 -3697 -1148 2992 -2148 -4962 887 278 -5597 -1611 2128 -4226 -4652 1279 -945 -4587
244 -4587 -1339 788 -2148 -3532 -810 162 -1833 -2226 -991 -745 -1483 -1670 -1310 -1089 351 -491 -3572
261 -3572 -447 3625 -476 -3225 948 3051 25 -1586 823 2457 697 -1221 403 3033 1225
276 1225 -650 1821 2085 964 2426 1169 321 3865 2923 -1659 1377 5846 769 -2417 3656 4101
292 4101 -1427 442 3777 1281 24 1828 1740 860 1900 1302 -726 1356 2771 -1012 -1568 2179
308 2179 1555 -2322 -1113 2316 51 -2362 184 677 -1079 -688 -660 -1060 -314 -754 -2226 -1458 46
325 46 -1707 -2940 -900 -648 -2019 -1845 -1558 -939 -869 -2441 -1900 -116 -1192 -2989 -1380 163 -2083
342 -2083 -2514 -219 -992 -1967 -508 -656 -1444 -253 184 -1266 -993 1219 40 -1924 442 1567 -914
359 -914 -939 1419 1001 -776 523 1795 229 686 1818 501 890 2253 946 388 2093 1988 265
376 265 1001 2490 1187 576 1727 1675 1374 1202 1157 1862 1569 792 1145 1453 1158 790 744 761 798 825 82
397 82 145 1235 308 -497 555 549 -165 -229 -169 -109 -457 -733 -601 -597 -730 -1002 -922 -1055 -1331 -603 -899 -1882 -867
420 -867 -518 -1670 -1465 -764 -1054 -1672 -1580 -1146 -1236 -1291 -1394 -1326 -939 -1263 -1070 -505 -1130 -1044 -500 -904 -747 -358
442 -358 -650 -466 -186 -667 -576 597 344 -1089 -19 1256 0 -235 931 1064 507 233 830 1273 1009
461 1009 791 315 686 1724 1213 395 1160 1943 1123 443 1550 1691 908 1429 934 235 1936 2062 97
480 97 297 1672 1082 172 738 914 750 960 -320 -332 2073 1155 -1551 -397 1317 12 -1058 -137
498 -137 52 -653 -416 -668 -949 238 -9 -1675 -1479 -362 -317 -1047 -1250 -1123 -1209 -801 -774 -1563 -1050 -496
518 -496 -1530 -2108 -973 127 -892 -1923 -1100 -491 -634 -604 -1052 -1138 -309 -489 -1505 -726 1067 -131
536 -131 -1912 -93 874 -451 162 710 -714 -400 1268 678 -223 819 908 38 648 607 642 2000 596
555 596 -1108 1465 2793 417 95 1907 1211 54 1292 1533 700 1288 875 66 1119 1765 1197 515
573 515 47 547 1481 1120 -140 84 1358 553 -770 102 1234 904 -841 -1502 240 1315 58 -1185
591 -1185 -903 109 215 -799 -1204 -330 291 -1236 -2481 -356 934 -963 -2025 -1207 -593 -516 -728 -1379
609 -1379 -1390 -292 -674 -2096 -881 539 -500 -1625 -1999 -874 1126 -12 -2753 -1346 1563 -125
625 -125 -2291 156 1447 -698 -1305 -458 437 1271 -64 -1354 276 1364 120 -37 1016 466 68
642 68 830 196 358 2120 1209 -727 294 1812 1661 776 109 398 1243 1199 473 949 1491 512 329 1077
662 1077 889 1023 958 -66 154 978 762 418 618 407 20 278 111 19 987 180 -1526 -292 1010
681 1010 57 -381 -413 -1003 -533 409 -516 -1512 -345 -59 -1309 -973 -338 -392 -422 -1257 -1628 -427 -115 -1214
701 -1214 -1142 -343 -1050 -1545 -251 29 -961 -1101 -1042 -604 -221 -497 -479 -449 -941 -516 435 11 -935 -274 552
722 552 -473 -634 567 584 28 -105 -26 473 824 546 246 299 374 426 1066 1011 61 550 1192 297 408 1639
744 1639 1126 -206 359 1560 1031 391 777 727 801 792 129 609 1400 538 -241 376 1036 626 287 286 39
765 39 155 443 147 116 -5 -219 -104 -220 -31 151 -561 -693 -88 -254 -786 -392 -85 -830 -919 -315 -710
786 -710 -689 -219 -1058 -1239 -407 -631 -861 -487 -787 -1208 -492 -215 -1013 -814 -277 -822 -660 -240 -789 -427 90
807 90 -658 -928 27 152 -527 -174 186 -480 -129 650 71 -196 288 218 81 533 631 15 165 1024 537
828 537 32 804 953 436 521 743 590 632 1020 692 257 838 903 423 831 859 304 367 972 800 128 406
850 406 758 267 338 544 143 193 400 108 -48 139 128 -130 68 28 -545 -97 157 -535 -482 -55 -528 -613
872 -613 -102 -390 -977 -511 -165 -871 -727 -303 -868 -795 -308 -657 -844 -533 -551 -729 -594 -459 -822 -576 -251
893 -251 -722 -689 -240 -453 -531 -270 -215 -432 -349 114 -93 -403 -62 117 -12 51 139 132 147 285 312 181 441 371
917 371 273 677 452 229 679 687 312 539 798 488 434 819 577 347 826 631 347 771 638 206 623 784
939 784 331 240 617 485 125 405 374 68 243 267 3 67 187 24 -159 12 -20 -346 -9 -76 -670 -205
961 -205 111 -681 -680 30 -308 -978 -372 -136 -832 -572 -305 -809 -503 -276 -870 -629 -180 -676 -893 -307 -317
982 -317 -900 -463 -120 -698 -582 -101 -326 -563 -291 -43 -312 -424 45 -77 -266 99 -5 -159 285 341 -162
1003 -162 14 631 224 -197 648 698 -72 383 738 248 385 742 354 283 776 646 240 756 774 161 546
1024 546 794 279 427 778 375 91 665 693 89 366 626 3 90 531 175 68 239 62 -81 187 118
1045 118 -226 4 -33 -414 -119 10 -342 -239 -318 -441 -220 -374 -446 -267 -467 -671 -432 -317 -495 -448 -439 -790
1067 -790 -486 -175 -677 -618 -268 -661 -656 -278 -259 -377 -461 -391 -418 -270 -170 -329 -165 -262 -413 63 143 -211 -1
1090 -1 58 -47 -22 199 415 160 -101 165 537 466 163 318 636 255 187 591 706 496 222 390 654 485
1112 485 531 635 352 311 447 511 564 578 310 233 470 387 314 671 177 -270 460 461 -199 293 435 -263 -185 199
1136 199 -10 52 77 -554 -327 355 -417 -512 314 -347 -933 -120 -20 -502 -316 -377 -718 -414 -205 -455 -330
1157 -330 -411 -810 -377 -176 -731 -367 -90 -686 -742 -245 -23 -225 -597 -545 -157 -176 -421 -117 147 -432 -481 206
1179 206 63 -47 177 -195 -203 366 205 -5 299 353 -102 81 545 396 342 469 -34 156 816 604 144
1200 144 418 612 206 245 807 572 134 443 392 207 675 692 135 140 475 257 147 603 269 -136 260 138
1222 138 -92 473 315 -403 -219 240 23 -143 110 -185 -411 -124 -102 -150 -70 -432 -569 -261 -208 -276 -314 -356
1244 -356 -431 -524 -420 -262 -245 -432 -554 -483 -524 -265 49 -523 -791 -156 -249 -501 -75 -81 -536 -448 -53 -127 -129 -11
1268 -11 -333 -246 185 -120 -162 320 123 -294 38 352 216 182 330 15 -28 501 483 261 379 255 199 454
1290 454 560 371 317 478 243 215 707 534 136 426 438 165 304 576 386 145 209 206 241 415 254 8
1312 8 102 98 155 164 50 -13 -122 -121 -9 13 -54 -169 -264 -260 -192 -68 -242 -354 -234 -357 -458 -86 -178 -480 -392 -322 -421
1339 -421 -377 -191 -328 -539 -360 -329 -412 -174 -293 -471 -378 -286 -181 -169 -255 -302 -242 -106 -201 -156 73 -162 -172 11
1363 11 -25 23 174 49 4 84 164 211 232 254 106 187 334 250 341 390 150 271 430 332 328 323 348 302 323 376 363 407
1391 407 373 215 221 334 389 354 139 187 293 203 250 200 96 135 171 93 -19 49 47 -115 -23 -50 -173 -19 -42 -298
1417 -298 -116 -185 -289 -151 -185 -324 -345 -248 -241 -308 -302 -362 -304 -271 -364 -317 -327 -425 -236 -248 -455 -259 -185 -358 -290 -200 -304
1444 -304 -260 -63 -231 -268 -58 -150 -190 57 -57 -191 76 29 -56 86 54 19 145 217 82 102 218 162 216 270
1468 270 159 292 314 220 354 327 192 361 405 211 315 363 278 335 415 208 184 392 261 177 369 151 110 376
1492 376 216 12 183 204 79 59 158 3 -30 125 -29 -139 -53 -55 -75 -137 -160 -155 -241 -163 -204 -309 -238 -253 -282 -191
1518 -191 -323 -357 -240 -297 -262 -357 -294 -221 -347 -269 -310 -326 -272 -253 -196 -236 -351 -62 -193 -231 -100 -125 -216 -80 -11 -147
1544 -147 -119 77 -63 -92 231 15 -50 225 136 -12 262 176 34 228 269 126 230 384 193 185 403 282 221
1567 221 348 301 255 332 277 305 227 233 305 283 212 290 253 179 170 263 94 105 247 79 30 130 4 45 98 19 -61 -15
1595 -15 -45 -147 -74 -57 -147 -185 -232 -198 -142 -186 -241 -167 -267 -269 -195 -329 -260 -187 -420 -315 -142 -327 -350 -187 -265 -370
1621 -370 -143 -174 -328 -113 -206 -389 -85 -94 -232 -7 -57 -334 10 169 -151 -36 197 -119 -172 204 108 38 291
1644 291 -41 -9 304 179 66 232 253 80 184 333 182 280 245 89 294 344 218 301 326 106 255 345 197
1667 197 234 272 97 120 282 184 149 259 -38 -9 411 141 -101 224 115 -226 17 157 10 -104 -72 -93 -120
1690 -120 19 -178 -210 -39 -215 -316 -52 -20 -293 -257 -143 -250 -294 -106 -145 -377 -226 -222 -223 -160 -241 -254 -265 -245 -244
1715 -244 -109 -130 -309 -291 -15 -142 -71 -33 -82 -166 -206 -144 108 44 -29 -59 41 117 64 182 85 -8 57 174 46
1740 46 246 291 94 -18 249 306 201 207 198 121 166 236 301 450 130 77 240 290 146 265 418 35 74 239 264
1765 264 75 184 105 1 146 87 96 138 -90 -147 110 124 -124 -118 40 -167 -258 2 -54 -127 -177 -222 -107 -101 -227
1790 -227 -162 -168 -236 -329 -114 -68 -289 -167 -174 -239 -178 -64 -170 -234 -273 -265 -171 -46 -138 -229 -108 -157 -176 65 31 -208 -188
1817 -188 0 -56 15 30 90 49 -70 2 119 159 61 1 176 34 167 308 126 127 176 145 199 267 230 185 69 164
1843 164 157 290 228 33 225 245 91 182 311 197 24 174 184 117 151 154 45 113 151 -12 143 -9 -77 -12 -9
1868 -9 -44 29 32 -54 -177 -47 9 -147 -103 -19 -185 -213 -218 -132 -135 -254 -246 -224 -191 -143 -161 -234 -159 -215 -180 -138 -167 -157 -248 -132
1898 -132 -90 -140 -112 -117 -197 -118 -104 -125 5 -56 -30 -56 -102 39 -22 104 13 32 143 124 166 110 107 79 142 99 146 86 152
1927 152 215 155 110 152 219 139 129 194 131 170 214 151 103 152 166 175 235 106 23 111 190 72 118 167 0 8 94 17 139
1956 139 18 -51 -23 -50 -111 -31 -53 -109 -84 -112 -120 -154 -61 -138 -154 -138 -176 -100 -125 -170 -166 -150 -225 -144 -143 -202 -189 -167 -182 -139 -170
1987 -170 -135 -164 -97 -137 -132 -55 -52 -109 -75 -86 -38 -6 -55 -47 -31 35 15 7 74 86 13 61 95 75 69 110 123 87 111 203 130 153
2019 153 162 112 158 182 190 156 163 133 153 164 165 112 146 206 145 122 133 53 49 107 87 42 100 91 55 1 45 78 -3 27 28 -34 -94
2052 -94 -58 -48 -123 -73 -103 -100 -77 -164 -137 -114 -142 -130 -79 -125 -170 -179 -129 -141 -141 -127 -118 -126 -169 -140 -130 -131 -163 -119 -145 -100 -73 -106 -81
2085 -81 -76 -113 -57 -44 -38 0 8 -32 -59 13 49 -20 72 75 -13 89 55 99 98 104 154 72 124 134 94 147 203 102 134 109 133 120
2117 120 104 89 78 179 163 88 99 132 105 107 77 85 -1 88 87 92 107 91 -2 34 54 -14 28 -38 -28 -22 -115 -24 -49 -84 -36 -97
2149 -97 -66 -111 -30 -24 -243 -127 -29 -199 -125 -115 -192 -113 -112 -183 -135 -84 -187 -236 -75 -140 -178 -100 -29 -157 -74 -6 -147 -34
2177 -34 -3 -102 -87 65 4 -80 -12 21 -78 78 75 -62 47 84 -32 93 89 114 76 76 38 94 176 173 247 137 152 96 175
2206 175 71 129 156 121 89 107 63 131 127 89 2 54 85 34 44 211 45 108 120 59 56 94 -54 -55 2 -16 -136 -40 13
2235 13 -122 -8 -2 -39 -91 -25 -100 -129 -36 -120 -37 1 -131 -112 -51 3 -169 -137 -179 -156 -76 -130 -134 -32 -99 -229 -153 79
2263 79 -58 -77 -114 -78 -44 35 -82 -61 21 -99 -101 36 61 -20 -41 58 -21 55 81 118 52 90 43 113 54 116 70 42 -16
2292 -16 85 180 4 23 173 139 41 145 168 154 58 69 80 107 104 133 16 33 36 37 111 94 8 67 18 -22 50 80 6
2321 6 -26 23 35 -21 -11 -20 -128 -27 -13 -87 69 -155 -94 -94 -49 -128 -17 -29 -112 -74 -48 -76 -71 -6 -213 -144 -72 -68 -127 -79
2351 -79 -181 -42 -174 -57 -113 -84 -48 -184 -36 -20 0 17 -114 21 1 18 31 5 27 33 18 89 106 59 25 55 11
2378 11 88 103 134 127 43 55 103 96 127 165 115 49 27 184 193 78 80 79 72 41 154 75 57 39 18 42 106 51 13 45 8 16
2410 16 54 28 4 -53 -39 -33 -12 25 -58 -91 -66 -79 -57 -6 -113 -81 -67 -88 -115 -73 -51 -131 -111 -67 -104 -66 -64 -131 -108 -65 -107
2441 -107 -61 -35 -97 -113 -73 -59 -69 11 -95 -110 -15 -15 -75 1 -18 -84 4 10 -13 63 51 -4 -7 82 43 66 69 37 31 68 87 104
2473 104 132 50 73 106 108 107 138 77 50 118 96 45 157 108 65 110 62 58 105 83 -13 58 94 34 57 60 7 -19 19 15 8 11 -49
2506 -49 -22 -11 -43 -20 -41 -71 -49 -84 -65 -48 -57 -82 -99 -66 -90 -92 -16 -83 -110 -79 -102 -97 -38 -115 -110 -89 -71 -105 -35 -49 -82 -72
2538 -72 -48 -66 -23 -42 -72 -20 -44 -66 4 -20 -24 4 34 -24 1 48 22 27 82 48 55 91 53 30 86 34 66 88 63 67 95 77
2570 77 94 103 110 66 112 98 56 99 104 22 75 81 38 104 35 15 43 53 8 17 36 3 -5 27 -14 -33 7 -37 -33 -12 -18 9 -39 -74
2604 -74 -40 -57 -55 -53 -65 -41 -85 -67 -53 -87 -100 -93 -78 -43 -85 -76 -86 -63 -87 -78 -63 -66 -106 -33 -58 -76 -33 -32 -26 -48 -24 0 -58 -37
2638 -37 29 -53 -20 -22 11 34 23 2 5 49 52 35 51 67 36 86 89 65 42 68 109 92 47 100 81 39 93 89 40 77 93 84 36
2671 36 62 57 37 63 37 23 68 47 10 20 2 15 -22 17 6 11 -38 25 -1 -29 -43 -42 -49 -82 -40 -65 -73 -12 -68 -109 -56 -35 -93
2704 -93 -37 -36 -96 -81 -31 -79 -74 -49 -66 -94 -64 -78 -77 -51 -83 -59 -49 -79 -63 -8 -44 -37 -21 -10 -26 1 -27 -18 29 14 -10 21 16
2737 16 5 63 24 28 18 55 61 62 92 51 23 119 46 26 86 52 24 80 83 62 41 63 55 86 51 33 70 110 13 51 71 58 -3
2770 -3 44 3 11 19 20 11 -13 -2 -51 22 11 -58 -61 -6 -29 -59 -48 -27 -42 -68 -56 -46 -66 -69 -65 -61 -67 -46 -27 -77 -77 -69 -34 -34 -63 -66 -61 -60
2808 -60 -90 -61 -15 2 -68 -73 -4 -21 -42 -10 17 -12 -23 -19 31 16 24 30 3 8 32 2 45 14 15 32 81 35 5 54 27 54 68
2841 68 40 60 83 24 84 87 72 64 42 62 12 54 75 42 35 51 43 33 61 22 10 20 19 -5 3 51 1 -17 20 -48 44 28 -20
2874 -20 -26 -57 -66 -23 6 -39 -73 -51 -59 -64 -4 -36 -82 -93 -48 -34 -33 -69 -77 -60 -97 -28 -24 -41 -59 -43 -14 -18 -41 -1 -44 -28 -29 -25 18
2909 18 26 12 -22 16 2 -3 11 15 -11 -18 47 20 56 60 11 37 34 61 53 76 19 19 40 53 65 76 57 11 58 76 58 57 52 1 46
2944 46 65 67 40 69 22 22 18 22 47 26 12 46 -20 -17 47 52 8 -36 -9 17 19 -62 -28 -38 -50 -25 -13 -4 -4 -78 -51 -24 -14 -12 -54
2979 -54 -78 -60 -30 -6 -43 -32 -78 -54 -44 -53 -37 -32 -49 -43 -33 -4 11 -40 -44 -7 -36 -18 2 34 9 15 30 1 31 18 -4 49 35
3012 35 -23 74 49 21 44 43 80 38 94 42 17 82 40 57 67 101 44 26 49 -21 53 79 55 61 46 16 54 58 5 3 -15 -1
3044 -1 -14 11 39 -57 -3 -36 19 37 47 -55 -33 90 36 -57 15 -13 -57 -61 11 -26 -119 -80 -33 -35 -50 -68 -49 -8 -8 -53 -84
3075 -84 30 -75 -87 -103 -18 75 -28 -2 -105 -43 -14 48 25 40 -78 -5 42 -27 -37 -7 66 -94 -16 -21 -200 -35 -106
3102 -106 93 56 19 154 -55 -24 126 36 -28 138 56 132 70 -1 -27 15 236 95 -14 138 -119 118 22 46
3126 46 27 -17 -3 53 -15 76 80 63 -38 38 -23 97 -18 29 -22 20 -51 19 5 -19 -6 17 -41 37 -9 -3 -16 -51 -44 -67
3156 -67 50 -48 -32 -81 -9 -20 -9 -46 -56 -101 -25 7 -29 -72 -71 15 -46 -31 -33 22 -1 -49 -13 5 12 -70 -46 -48 4 19 80 -40
3188 -40 0 -36 -57 29 -29 -65 21 101 173 26 -49 84 92 74 50 140 -81 89 -18 92 58 -18 146 87 67 17 100
3215 100 -65 21 -14 74 -16 33 122 -91 53 -48 40 25 -112 -33 31 15 -7 56 26 10 -53 -43 42 11 52 -32 57
3242 57 -25 -1 34 -54 -81 52 -119 20 -93 47 -176 -98 -94 -26 -112 24 -56 -22 -65 -46 21 -81 27 -61 118 42
3268 42 13 -46 -48 -14 -132 -176 31 122 -100 14 69 52 -26 69 37 8 95 32 24 88 55 38 -1 2 44 115 86 54 91 47
3298 47 -2 108 84 63 60 50 2 111 146 -24 -6 -22 -55 1 -33 29 12 41 9 -64 -6 5 0 -84 30 71 4 60 18
3327 18 -26 12 30 4 -22 -68 -67 14 7 4 -130 -49 -5 20 58 -53 -41 -77 -95 -57 -59 -12 -99 8 30 -56 -15 -96 -74 -108 -13
3358 -13 -35 0 -50 -86 9 -24 -17 71 -47 19 0 18 -12 -24 11 46 54 18 71 -12 14 23 98 47 -33 56 13 -38 -17 -29 59
3389 59 57 50 0 50 65 54 50 57 23 4 48 8 7 58 -70 -27 19 16 68 -2 -8 0 12 17 34 9 15 -35 -21 15 -20 0 -14 18 -44
3424 -44 0 -10 -23 -7 -20 -5 -49 -20 -68 -8 -58 10 -54 -12 -21 -51 4 -27 -53 -36 -30 -24 22 -45 -13 19 -19 -16 -24 -7 -8 -6 -5 52
3458 52 19 0 6 8 23 0 22 14 6 -32 3 36 29 10 0 9 26 43 5 31 54 -13 34 49 24 55 31 -9 4 47 7 7 28 24
3492 24 -13 13 -24 10 4 7 -2 39 11 21 18 -19 -3 -26 -30 -4 -16 -25 6 27 -11 -22 -34 -57 -27 -3 -13 -37 -34 -45 -59 1 -12 -5
3526 -5 -10 -22 -46 -23 7 -1 -10 -44 -28 -35 -19 -20 14 -13 -30 -30 11 -34 -23 -19 -4 -12 5 -4 9 13 -21 11 38 23 -24 40 4 -2 43 25
3562 25 17 34 23 35 12 20 14 31 5 11 12 -11 43 11 7 2 0 33 19 22 -7 2 32 26 16 -35 7 -15 -13 1 -8 -9 0 -13 -20 -12 30 -25 -18
3601 -18 1 -58 -17 7 -41 -17 -20 -34 -30 -14 -13 -10 -60 -22 -7 -27 -37 -45 -12 -28 -18 -16 -36 -43 -18 -7 -8 -26 -27 15 -21 -38 -29 -24 37 -31
3637 -31 -12 -33 1 -49 6 -3 -7 -13 -1 10 -2 23 9 6 10 12 -5 49 -13 32 54 -32 -10 -11 42 -17 32 51 10 3 17 -16 17 1
3671 1 19 58 11 -13 4 42 -17 44 -42 23 7 23 -11 14 34 -1 -2 -26 -18 -7 8 -27 3 -37 -40 -28 -6 -15 -37 -26 -14 -6 -17
3704 -17 -56 -41 10 0 -34 -31 -26 -40 -15 17 -51 -41 1 -29 -2 -13 14 -28 5 -8 25 12 -9 3 23 -10 -14 -16 -7 3 28 13 29
3737 29 -13 -11 -15 21 -18 -16 11 -2 18 17 -3 11 20 21 43 22 16 23 4 24 37 22 50 8 27 24 20 -5 2 5 -3 -10 -23 6 9 -7 -14 21
3775 21 -17 -31 -7 -23 -2 13 -26 -3 14 -10 -30 -29 -24 -8 -14 -7 -30 -25 1 -6 -63 -31 -14 -19 -35 -59 -22 19 -2 -32 1 -4 -14 4
3809 4 -64 11 18 -18 29 12 12 -38 4 -20 7 26 1 7 36 -3 8 -1 -46 -19 3 -24 5 6 23 -8 22 28 24 52 -11 3 27 4
3843 4 31 15 30 26 9 18 -1 33 18 22 -3 49 19 -5 46 -27 3 25 -17 20 -10 -8 11 -5 14 2 15 -17 -5 -35 12 -5 -14
3876 -14 -17 -12 -28 -25 -2 -18 -5 -9 -20 -46 -14 -12 22 -4 -37 2 -18 -31 -24 1 3 -2 -35 -3 -11 -30 -31 -5 -17 29 -8 13 -31 -1 -10 -11
3912 -11 -8 -40 -1 -16 11 -8 -6 10 14 25 5 29 7 -11 10 1 17 24 20 16 14 -1 3 57 7 12 -2 0 26 25 3 14 10 -5 -1 17 33
3949 33 18 1 19 15 4 48 -11 6 16 3 8 -25 5 10 -14 -27 -32 -11 -5 -37 -3 -7 -6 24 -1 -21 -18 -14 -26 -20 8 -10 -10 -7 -29 0
3985 0 -3 0 -22 -18 -16 -2 8 1 -15 -17 15 -5 -1 -16 -10 8 -26 -21 32 -2 27 -24 -20 -6 -17 1 -18 13 14 18 14 38 1 14 40 -19 24
4022 24 8 3 41 -20 6 20 10 20 14 -28 5 17 28 16 34 14 -9 -33 11 29 18 -15 -1 16 15 19 12 16 -24 -4 10 -11 21
4055 21 -19 11 -33 2 -5 -8 -35 -33 -10 -46 12 4 -29 -14 -23 -20 4 -22 4 -37 -28 8 17 8 -7 -22 -12 -39 -4 24 -4 -10 -24 1 -6 24
4091 24 22 11 -11 31 8 8 35 2 3 14 10 -1 24 6 4 -7 15 16 4 -2 -20 4 2 21 7 10 13 1 30 3 12 -16 14 20 33 25 7
4128 7 -1 19 7 0 12 6 28 -19 4 -7 -9 -9 22 -21 -8 -2 8 15 3 5 3 -11 3 -18 -11 4 -2 13 -18 -43 -12 -21 -2 -26 -23 -17 -13 -36
4166 -36 -13 -13 -34 -6 8 0 -10 -20 -42 9 -1 -11 -14 4 -1 2 30 6 13 3 -2 7 -7 21 -3 -9 25 -13 2 12 17 6 7 4 4 -3 19
4203 19 17 39 11 -7 10 26 -11 -7 2 -24 26 27 -1 6 10 -11 33 5 5 9 -9 10 12 19 10 21 -13 -14 0 -31 -25 -8 -15 -1 2 -24 -23 0
4241 0 -11 -13 -20 -13 5 -12 -12 -27 -15 -26 6 -11 -24 -3 -40 -33 -2 -16 -28 4 27 -55 5 -6 -8 -5 -13 1 2 14 -15 1 -17 13 6 30
4277 30 -1 9 35 35 -14 2 -3 27 26 6 20 -22 4 9 17 5 -3 14 7 -15 -23 1 -3 6 12 17 -3 -28 20 -1 28 16 -21 12 3 23 5
4314 5 11 -12 -8 -16 14 12 6 18 8 1 10 -15 -2 6 -26 -6 -12 -30 3 -27 -16 -9 -7 -21 8 -26 -31 10 -6 -18 17 -6 -5 -5 7 -41 1 -27
4352 -27 -33 -7 -11 11 -26 -52 -15 -4 -43 17 -9 -31 -1 16 -20 35 -12 -12 19 26 14 15 2 -2 -4 21 17 -24 22 9 1 -10 8 30 18
4387 18 7 -15 -6 4 -8 22 4 -7 -20 22 -1 -10 -36 -7 8 -25 13 -16 -25 -10 5 -16 36 -21 9 -6 -42 7 -27 0 13 -1
4419 -1 -1 -12 3 -18 -21 -10 -33 -24 -32 -2 -5 -16 -10 5 -16 -10 -9 -8 -40 -7 -27 -20 -7 -18 -12 -13 -11 -22 -32 -15 -5 -25 -34 -20 12 2 23 -9
4457 -9 -11 -14 7 25 -21 -5 7 -1 7 10 -7 -2 -27 -16 36 26 2 -1 -5 6 13 -15 13 -2 22 -7 14 3 2 -8 -4 8 12 7 9 15 -16 -2
4495 -2 -4 11 -5 -19 -6 -28 0 0 10 14 -2 14 44 14 5 2 -2 -17 -20 -11 12 1 -4 15 -6 -5 10 -26 -31 -24 -20 -2 -3 -13 -7 3 -50 -22
4533 -22 -11 -1 -26 5 -19 -52 -6 -4 -21 4 -35 -17 24 -2 2 21 14 -5 2 -15 -15 -7 1 21 -14 30 17 -19 -27 -9 10 12 -27 -4 -3
4568 -3 4 6 2 -13 -21 -5 14 -19 -16 1 30 -23 12 34 10 -7 20 -5 2 -20 -37 -6 -16 4 -11 -38 2 9 0 -6 -21 6 -19 -21 -15 13
4604 13 -16 -38 -21 10 -12 -2 -26 -23 14 -15 -26 9 -13 -42 -20 -34 0 -2 8 -9 -28 -5 11 -9 11 -19 10 2 9 -16 -31 -4
4636 -4 -5 -17 27 13 10 -14 -7 -16 -30 8 16 10 3 -15 13 -4 -23 3 -6 -17 14 12 17 -20 -14 16 6 38 14 -19 32 26 -4 7 25 -13 -7
4673 -7 -5 -3 -5 -34 -1 -2 -22 19 -33 29 -11 9 9 28 7 -32 20 17 7 -10 27 12 22 -21 -18 -14 1 -7 10 -15 9 -17 -9 19 7 16
4709 16 -6 -7 -23 22 9 -27 1 13 -8 1 1 -31 5 10 -8 5 -17 40 -6 -11 -39 -2 1 -20 10 7 14 7 6 11 -1 -10 11 6 -29 2 29
4746 29 -28 -1 -3 48 8 31 7 -9 35 -6 -7 -41 -32 8 13 -17 6 -5 10 -15 -41 18 -13 -4 -29 -31 -38 14 -14 -20 -2 -13 -20 -7 -22
4781 -22 -14 15 -22 42 -5 -18 -2 1 6 32 -20 11 19 -8 -11 8 -10 -6 42 -26 15 0 31 -5 -44 -21 3 -21 -28 -9 26 3 -4 21
4815 21 -36 -5 24 51 24 -13 11 -4 15 -16 17 24 -21 -42 2 -6 10 -9 -10 -10 -15 -2 -14 -15 -33 15 2 -20 14 -8 -16 0 0 2 0
4850 0 -3 -31 13 8 -12 13 7 3 8 -32 -13 13 5 -1 43 36 17 5 1 -1 17 21 -26 18 -36 6 -8 -1 22 -6 17 5 -39 -21 -1 19 -11
4887 -11 -43 6 -22 -50 -10 35 9 -5 11 30 -1 14 17 4 24 -13 12 30 7 -12 7 35 3 -49 60 34 -16 21 47 9
4917 9 -3 25 -49 -21 32 -54 -26 -9 -7 -5 51 14 0 -10 -18 28 23 28 9 50 44 52 42 -7 -17 48 -1 14 -8 -18 21 4 -13 -2
4951 -2 -24 -40 3 -9 -30 54 8 -15 -3 -14 -19 5 1 14 9 -6 14 -30 0 -28 -36 8 -23 -64 -8 -34 41 -15 -35 10 19 18 8 27
4985 27 -1 -1 33 18 3 20 25 -12 3 19 8 6 20 8 -25 18 40 5 13 37 -32 -19 -23 6 -39 -44 -13 2 12 14 34 2 33 -27
5019 -27 -7 -15 8 -9 2 -27 43 14 -14 17 22 19 2 22 8 6 32 12 -24 21 16 1 -11 16 6 13 17 -57 -17 -26 12 -21 -12 -3 -4 14
5055 14 12 -3 -8 29 -16 -33 16 -33 20 24 2 15 -18 5 13 8 20 6 11 -8 -9 22 -31 -14 -24 17 -18 -5 5 -8 5 12 0 -32
5089 -32 -19 23 -18 -56 -5 -11 -9 -8 -19 -22 8 -43 -11 -24 -11 -22 23 -5 -8 -26 -26 15 -31 -3 -3 -25 -37 14 27 26 -13 -23 9 1 23
5124 23 18 -3 1 -2 -21 9 -8 6 -25 -6 0 32 -3 -5 -3 9 36 11 8 15 -7 -12 -30 14 4 -18 6 -20 -8 -14 -2 25 5 -22 11
5159 11 -13 -4 37 -32 2 2 -10 -11 18 13 1 19 -13 -27 -7 4 2 25 -6 1 17 -4 25 -43 4 -25 2 -13 -5 -5 -4 -18 0 -6 2 -20
5195 -20 -31 4 -16 -41 16 -16 -9 6 -24 -1 -1 -4 -15 17 16 -20 1 26 -2 -12 -16 0 21 -22 14 -1 15 5 1 -10 11 6 -17 2
5229 2 21 17 -2 -6 12 18 -5 13 -4 4 9 -16 -33 0 -29 5 -10 -5 -19 -10 -5 5 13 -12 34 -18 -6 9 -31 21 21 -1 12 31 -1 -4
5265 -4 -3 12 36 -16 -15 6 -6 -2 -22 22 -12 -19 -8 10 33 -3 -1 -10 -14 -14 -21 -27 6 -26 0 -11 -7 -36 -14 -7 3 -22 1 -12 21 15 -20
5302 -20 19 -15 -2 -12 -4 -25 -1 2 19 12 -3 29 14 4 -26 -1 3 7 11 2 -13 -13 2 5 -2 -3 -1 17 -7 -11 -21 -30 3 -3 2 -10 -28 -11
5340 -11 -27 -15 -20 -39 -3 17 18 8 -41 -15 -4 23 -2 -13 3 4 0 1 -19 0 -14 -21 8 -8 -19 -4 -9 -17 -25 7 3 36 4 -8 7
5375 7 17 -17 19 3 -21 -14 -18 -12 13 -26 19 -4 -28 -3 0 -23 -15 4 -23 5 -9 24 32 -14 1 14 -1 35 -2 -12 2 -22 49 -4
5409 -4 -17 -3 12 28 1 2 -14 7 18 8 26 14 20 30 9 -3 -3 -30 9 3 1 16 -25 -15 42 -15 0 -9 25 -3 -8 -11 18 -9 -8
5444 -8 -5 14 -9 0 -2 -43 0 -21 3 36 8 -29 11 13 -14 -9 -5 9 -19 11 8 8 -25 10 2 2 -18 19 -25 -31 14 -33 -18 -12 14 5 -2 -13
5482 -13 -11 0 2 -26 3 13 -10 -7 -16 12 5 -21 -6 -2 -21 -21 -4 -22 -17 -8 8 9 0 41 10 -10 -18 -4 34 11 -29 15 8 2 9 -24 21 -1
5520 -1 -12 12 4 -13 -13 46 2 24 2 -16 -22 13 -17 -8 11 -3 -21 -7 -14 -5 0 12 -2 5 16 -17 16 4 3 3 -14 14 20 -14 -5 -28 -24
5557 -24 -2 9 3 -3 3 7 8 -11 -12 -22 14 -15 -7 -17 6 -20 14 9 -25 -1 -9 22 -24 -15 -23 -16 -26 3 -7 -3 12 -4 -1 -28 -9 15 -10
5594 -10 -13 1 31 -11 4 -24 30 19 5 25 12 4 19 -1 7 2 -3 -17 -5 -18 22 14 45 51 25 15 24 9 31 9 9 53 -23 -5 4
5629 4 6 -2 -22 -15 64 -14 -13 4 23 15 25 -25 10 12 35 5 -18 -9 4 44 21 -22 0 -22 19 -4 -16 -21 13 -37 -19 3 -3 4 15 -29
5665 -29 3 -14 24 -1 35 13 -38 19 -14 -21 8 -19 -9 2 -16 -22 -5 18 3 7 -5 -24 59 16 -44 -10 -6 -4 -35 -34 4 4 24 -14
5699 -14 -2 -23 15 14 44 -38 9 -3 28 -6 -11 19 23 -11 15 -17 -38 8 -5 -3 -12 -15 -25 -3 -16 26 19 11 0 38 40 8 -11 21 8
5734 8 14 12 10 12 13 28 5 -39 15 11 -20 -9 22 33 2 36 -21 -16 10 15 -34 -18 -29 -22 -11 36 -23 20 -8 26 3 -27 -21 -51 -10 -10
5770 -10 10 8 -3 -33 -6 -26 13 -9 -4 10 7 19 -2 -32 14 49 -50 14 -7 34 14 19 -8 19 10 -22 -28 -13 21 -54 -39 -10 17
5803 17 5 -11 57 17 12 -69 -25 7 -46 -28 14 -6 -24 3 -49 -3 17 -30 15 -3 -19 -28 9 -10 30 -6 -39 11 11 27 31 20
5835 20 -35 -16 6 -23 8 -7 -16 -11 7 -6 -35 -27 -62 -47 -41 -8 34 -9 20 40 -39 32 -33 -18 -43 50 -22 2 5 -67 5 48 6
5868 6 0 59 37 -29 -3 25 16 -28 -17 -30 51 -43 7 2 10 -12 -6 15 36 33 -31 23 -5 20 -29 -7 -38 54 33 47 -39 76 -57
5901 -57 -14 -9 -41 -44 -25 -24 54 -23 9 9 -40 51 -13 2 -57 -2 -1 9 33 -3 -79 28 17 -26 24 22 15 -30 20 -14 -13 27 12 71
5935 71 -28 30 -33 -4 -34 2 13 76 40 18 29 -24 -12 -2 11 -17 6 -15 30 -66 -74 70 16 -33 -97 25 3 20 -8 35
5965 35 13 -56 28 -23 -9 -76 -9 22 -35 0 70 3 39 57 -5 66 32 -24 83 16 -84 -24 -22 -11 -10 -94 27 4 7 35
5995 35 7 -25 3 69 -74 -42 -58 -51 -3 10 -12 -53 -20 7 -13 5 -35 8 34 15 -19 65 0 24 1 -28 -9 39 1 3 -32
6026 -32 48 16 -8 20 -3 -10 -6 -28 -42 15 -37 -29 82 -22 -23 14 19 -6 14 -42 -66 -9 15 6 -10 -55 20 9 -13 -18 18 -3 25
6059 25 4 2 10 49 41 -9 -8 12 48 44 -22 30 -27 23 34 -56 7 -16 -45 -23 56 -74 10 48 -38 5 -5 17 -65 30 -6 1 -14
6092 -14 -43 5 26 23 -25 69 -58 -69 -32 -78 15 -82 -22 -26 -9 10 0 12 5 -4 -21 41 82 83 -21 -40 -19 27 -14 -9 -18 -17 -57
6125 -57 41 -7 -29 48 20 -19 -11 -39 -4 -15 37 45 41 16 -33 -99 -35 -26 -23 -1 -34 -31 20 -13 -25 -24 16 -64 0 35 39 -43 -53 80
6159 80 -87 7 -31 -13 28 78 -51 -74 19 9 23 -27 46 59 4 -2 19 15 -8 5 -105 -15 50 35 -97 68 -135 -163
6187 -163 -56 -46 -44 -8 94 3 -36 -5 57 15 8 -139 -49 -40 88 41 -80 50 -110 -57 -64 -14 97 -33 12 4 60 -2
6215 -2 -12 25 23 -3 8 13 -81 17 -41 -87 60 52 -24 -61 -16 -27 -31 48 -47 23 66 13 2 -25 18 -8 5 -9 56 84 -58 -42
6247 -42 -3 12 -38 9 4 67 35 -17 84 -18 40 -14 33 -21 3 -65 29 -35 92 24 -77 37 -67 -8 3 -16 7 -30
6275 -30 5 52 12 1 -107 -21 43 -15 25 -51 -73 -29 -4 86 -35 5 13 -18 9 17 43 -11 -49 -31 -57 -13 -9 -28 -88 4 -82
6306 -82 62 95 50 -40 46 14 -32 -4 10 -55 34 52 13 24 6 32 -26 14 3 -78 -26 69 -7 54 12 0 -123 99 69
6335 69 -88 44 43 -5 -42 29 -17 75 -4 -73 18 -30 124 93 -10 114 -51 -40 99 106 23 -22 -139 -65 37 20 -20
6362 -20 -34 -40 -72 -83 -35 -7 23 25 52 23 -12 -55 -113 -15 -16 25 8 -84 -45 -1 -44 -88 -9 24 -51 9 -35 -102 -27 19 25 49
6394 49 27 13 -123 -4 26 19 38 -45 69 -71 -48 48 36 35 -30 56 54 -83 -115 0 -57 -31 -39 -16 15 23 8 -52 25 -39
6424 -39 24 43 66 23 -52 62 110 -59 -34 10 -26 25 58 6 41 59 49 18 47 -47 21 6 89 -35 -23 17 20 60 -3
6453 -3 -23 41 -36 19 -36 -56 10 -50 -44 -30 48 -23 -24 0 -19 -32 -14 -46 7 -40 32 29 -72 0 -42 12 7 18 30 -6 -8 -5 -3 -5
6487 -5 -13 -28 6 -21 -3 -11 11 12 -23 19 -9 11 -2 -7 1 13 -12 2 -4 -4 17 6 21 28 -8 3 -62 29 7 8 52 -21 3 33 -11
6522 -11 -29 1 -18 21 -23 36 3 7 -15 11 12 -1 6 17 20 -34 11 -6 -39 -20 -10 -12 -10 14 4 -19 30 -26 18 22 33 -12 -17 8
6556 8 -13 5 -10 -5 -9 9 -12 0 14 -4 -2 -2 1 -22 -10 -10 9 -8 -31 -25 -12 0 -1 -20 -14 12 4 6 25 1 1 -7 -2 -8 -1 -11 -1 -16 10
6595 10 27 10 23 18 17 4 -1 -5 -6 -1 -1 -9 15 -10 23 4 9 -1 -7 -27 18 3 6 -4 -17 -11 -8 -7 -20 -4 -11 7 17 -19 -12 7 -5 -17
6633 -17 -4 6 12 -19 4 4 1 19 1 40 -6 10 -1 -32 5 3 7 -2 -11 -18 -1 -24 0 16 4 4 -9 -22 32 5 -29 -17 -14 -2 4 -25
6669 -25 11 -17 6 6 8 11 16 -1 -17 10 33 27 9 -4 15 18 6 8 -13 19 10 2 1 -27 -3 5 9 34 39 2 11 -3 -29 0 18 2 4 -22
6707 -22 -11 -4 -32 0 -22 -10 22 11 2 -4 8 12 13 11 12 -5 -1 10 7 1 -1 -5 0 -14 1 2 -7 23 -5 -10 -8 7 -6 -5 -7 -6 -3 10 1 22 35
6748 35 6 5 10 5 2 11 1 -9 5 28 -7 -8 -13 -13 1 -12 -9 14 -24 -10 2 5 17 0 -2 22 -26 6 5 22 -19 -5 -6 3 -1 7 -18 10
6786 10 -8 2 6 31 24 -12 25 5 9 -2 -4 10 -3 -2 -21 10 -10 -22 -22 -1 -9 -28 24 -13 -7 1 10 15 0 15 2 -11 -3 -5 -4 17 -29
6823 -29 -10 15 -23 7 -6 10 1 -13 19 31 -29 3 -12 -44 -6 -26 -6 -26 23 14 -16 26 -3 -20 10 -7 -2 -13 10 -16 9 -24
6855 -24 5 -4 7 21 -19 7 -13 16 -20 15 -18 -2 7 -27 -6 -28 4 8 17 24 -22 16 26 18 10 26 19 14 3 -15 18 29 -4 -6 1 -6
6891 -6 1 -7 -6 1 -4 8 -11 14 21 -27 4 5 1 -13 -34 14 1 -2 1 20 2 10 -13 -34 -8 5 -9 1 24 12 3 -1 -5 -24 27 14 -6 5
6929 5 -4 33 16 -9 7 -6 3 -24 4 25 -4 16 22 -7 5 1 10 1 3 -16 -28 -1 22 -24 -6 6 2 5 -23 34 4 13 -2 22 31 3
6965 3 -1 -14 5 4 -11 -22 36 -1 30 1 15 -13 27 27 8 12 32 4 -10 10 23 -13 36 -2 23 -16 5 -17 -16 -2 19 -5 7
6998 7 -9 -43 -17 5 -2 -3 28 -12 12 -11 -7 7 6 -1 -26 5 1 -16 30 31 26 -22 -8 -64 -6 -10 -3 18 40 18 -5 -18 -8 -14 7 -6
7034 -6 -1 -10 -28 -2 6 5 35 12 -34 -8 -17 16 1 -12 8 -2 -25 -1 11 9 -17 -30 -8 14 -17 20 -27 24 28 17 0 27 6 -2 19
7069 19 3 8 25 13 9 15 8 30 -10 14 25 16 17 -16 -11 28 -23 -5 -2 18 -11 8 -11 0 -23 -40 4 -28 -3 12 -17 -19 -21 -18 -5 -1
7105 -1 -20 -6 1 -19 2 12 -23 -15 11 26 9 0 31 16 2 31 21 3 20 3 -17 25 -19 8 -23 7 -8 -7 10 15 -17 -12 -10 19
7139 19 -28 14 44 5 -14 2 49 9 -8 19 7 -22 3 -11 9 8 -16 18 -2 -7 16 12 -19 -8 24 -13 11 -10 8 -7 18 17
7171 17 46 1 40 -9 -23 27 5 3 13 1 -31 15 39 21 30 -17 8 -4 10 1 13 -14 -12 -17 18 -4 1 -13 5 -6 0 35 26 -2
7205 -2 5 6 -11 -13 7 -31 -24 -24 21 -8 -15 -21 6 24 -11 -11 -3 1 2 -25 1 -26 -4 26 35 12 29 20 -2 -12 -13 -24 3 -14 -16 -24 -13 20 21
7244 21 -8 -3 -7 -12 30 -11 8 -4 -20 21 33 -25 -19 8 -4 -17 -14 -6 -18 -14 -7 -8 22 -28 -22 -1 18 9 9 -15 20 -1 35 22 5 -7
7280 -7 -13 1 -23 24 -5 34 -11 -15 1 13 2 5 -10 5 -4 -17 13 0 -19 33 -1 -12 -17 -45 -9 16 -18 -20 16 9 -13 38 22 -7
7314 -7 6 24 4 5 -3 -28 0 -12 -29 3 14 -5 4 -9 -17 15 1 9 26 -34 1 13 12 21 -21 -9 -28 -35 -35 3 29 -15 2 2 -50 15
7350 15 2 -17 27 27 -27 -24 -36 -13 -33 32 20 17 -10 30 5 19 2 -11 4 -20 -41 -18 -35 0 4 -11 -17 -1 34 -6 29 14 -14
7383 -14 -16 -11 21 9 -38 -9 -27 -26 -20 -22 6 -16 7 -11 -7 -2 -2 -22 10 -28 2 25 6 16 -33 28 -20 27 27 15 18 21 15 25 37 4
7419 4 -10 22 16 -26 -31 4 -28 -36 24 -9 -42 24 -19 -10 17 24 4 39 5 -1 -22 -8 -9 -10 -51 3 6 -10 -11 4 -1 -4 16 -35 48 -19 11
7456 11 20 41 -1 -9 4 5 14 -9 9 -32 35 -24 11 -29 16 24 22 6 22 -27 35 0 1 5 -23 32 -7 1 19 19 17 32 26 0 13 37
7492 37 10 57 18 -16 -27 -14 31 41 -50 16 29 -34 -15 13 54 6 17 1 24 17 -16 28 24 -9 -42 -43 -28 -44 -34 -20 -6 11
7524 11 -12 -12 11 -32 55 -18 13 -18 -10 -29 17 47 -23 21 -18 -47 1 0 -47 16 12 19 52 13 -21 -26 14 -19 -13 -8 -50 10 10 11 -29
7559 -29 -27 -47 -21 -1 11 5 -16 19 40 -19 24 -38 14 -11 -33 -29 -2 -5 -16 30 13 5 -22 4 42 18 58 8 -11 15 3 -49 14
7592 14 36 27 49 -4 -25 -1 54 75 -26 25 15 27 31 -59 3 -14 24 33 4 -13 -17 0 -41 0 -8 13 -18 -1 4 -22 -27 23 10
7625 10 5 12 38 -10 22 -15 21 19 39 30 -11 24 5 6 -25 43 -34 -2 -16 6 6 -11 56 -27 24 18 -10 -69 1 8 0 9 23 0 25
7660 25 10 7 -6 14 16 -24 -13 9 4 5 22 28 19 28 59 8 13 -5 -16 16 -9 25 5 -4 33 -5 7 7 -7 19 -9 -20 -6 -42 23
7695 23 13 22 3 7 -13 -1 2 20 -14 4 -43 36 50 -1 -18 15 32 19 -10 28 -18 22 -27 -61 10 34 -3 -5 -17 31 2 -16
7727 -16 -21 8 -19 6 9 -25 42 -12 34 -3 -25 114 -4 -3 -9 -10 -56 8 24 -38 -7 -13 3 -14 -47 -9 2 9 -15 11 7 1 -7 -11 24
7762 24 -25 -2 -15 -17 20 0 -13 33 -45 11 44 -7 20 15 1 -17 -23 27 9 -7 5 -32 5 -10 17 3 -9 -8 -4 4 4 27 -50 -1
7796 -1 -43 -14 -40 -48 4 34 -18 9 2 -15 8 0 11 3 -27 27 37 -1 0 -2 -35 16 -32 -11 49 -3 28 57 63 -39 -5 -13 0 -71
7830 -71 -42 -29 -73 -38 57 -26 30 6 -41 -101 -71 8 -2 -35 -12 -23 14 -60 -53 7 -42 -8 -34 -56 71 -4 -12 -33 -3 -18 -56
7861 -56 -7 0 56 9 -21 -3 20 13 0 -14 -19 30 14 6 -29 9 37 12 -5 11 -86 -53 -55 22 -30 47 17 27 -17 -42 47 -22 -19
7894 -19 -26 -24 -8 -55 -26 10 -88 -110 0 -30 48 -23 67 7 14 119 51 -18 -38 39 -78 74 -35 9 -67 77 -15 1 51
7923 51 -68 64 -5 -13 40 50 -28 -1 18 -19 44 -10 100 -11 -5 -8 -86 -8 50 12 -47 -6 108 -25 29 -57 -16 28 15
7952 15 -54 -78 -6 26 -18 7 30 -26 -14 54 55 -48 -36 31 44 -3 -17 60 -35 -6 -64 -27 -9 48 11 -39 23 -29 56 -35
7982 -35 3 -28 3 64 28 6 -9 -2 23 24 -35 -18 40 1 53 -41 -60 23 17 5 -37 -6 18 52 6 -54 -38 -8 3 -8 -13 17
8014 17 4 65 15 -63 -13 -34 -12 -46 -6 -3 -66 18 -47 -7 12 -22 -24 28 -37 2 -50 -18 89 -28 14 12 33 64 2 -42 -55
8045 -55 -27 14 -25 -13 35 -73 -3 27 26 -8 -15 4 49 -35 -8 -97 18 16 44 20 -49 75 6 -17 -54 40 -38 -22 -22 -9 49
8076 49 23 -22 -21 -13 31 -10 37 48 103 23 -4 12 13 -15 13 4 -7 -40 16 -32 -40 -36 9 25 -35 -2 21 -5 -31 -25 19 -39 0 41
8110 41 20 -6 -28 -38 -3 26 19 -17 -34 54 -26 -22 -4 41 -13 -12 -44 -20 -12 -26 -45 30 -21 24 -26 -28 50 15 9 -7 -34 3 36
8143 36 -6 12 62 -17 40 -2 3 -36 -22 -36 -9 21 65 54 43 1 0 -28 10 -58 -22 3 32 31 -34 -14 -26 56 58 -17 27 14
8175 14 12 25 -44 37 35 1 22 -21 0 -14 70 -5 -8 -31 49 5
8191E
$$ Imaginary data points
##PAGE= N=2
##DATA TABLE= (X++(I..I)), XYDATA
0 0 0 0 0 0 0 0 0 0 0 0 0 0 0 0 0 2 -8 8 -8 8 -8 16 -16 16 -24 24 -26 32 -40 40 -48 56 -64 72 -80 89 -101
37 -101 112 -125 140 -156 173 -191 212 -234 258 -286 313 -345 383 -421 463 -511 563 -624 691 -768
57 -768 857 -960 1083 -1233 1418 -1654 1965 -2402 3044 -4103 6130 -11383 52498 91407 -72461
72 -72461 -35963 68009 27154 -36631 113 15101 5739 6508 -5120 -15325 13716 18409 -10930
85 -10930 -17965 8286 14701 -6125 -14188 6195 8625 -6632 -6796 381 565 4562 -2055 -14373
99 -14373 -3053 12182 -1575 -9458 2287 127 -4104 7086 2775 -10701 -4150 7214 3379
112 3379 -10339 -14106 7112 17204 -15363 -28007 14788 22714 -23686 -20964 17987 4170 -19305
125 -19305 -1772 4450 -8249 -738 618 -17197 -5751 16997 -5913 -27488 2187 18308 -10410
138 -10410 -16976 7791 6545 -9244 -1915 2088 -5516 3351 5775 -10722 -5485 11504 2223 -7725
152 -7725 2772 4534 -3065 2894 6752 -1681 -732 6864 4349 -1861 -889 7305 8301 -4685 -6552
167 -6552 9862 11031 -5743 -4786 10232 7220 -3535 404 5988 4129 2679 111 -2034 3468
181 3468 8202 837 -6723 1387 8994 287 -4732 2951 4203 -1242 703 2662 -2104 632 6499
196 6499 -2437 -7943 3912 6233 -5702 -5536 3155 918 -4041 -1026 -42 -1581 463 -2225 -5467
211 -5467 757 3240 -4608 -6902 -241 2197 -3164 -6303 -2228 1557 -1774 -6144 -2430 1927 -1868
226 -1868 -3212 -634 -2778 -1966 2234 -1752 -5380 361 1650 -4267 -1770 3428 -1864 -3797 2824
241 2824 1913 -2846 296 3165 20 -1558 1386 2662 320 -227 1418 1713 845 690 1461 1735 2234
258 2234 1946 -309 1680 5469 1693 -1860 2409 4656 1066 -788 1879 3352 1267 -456 1119
273 1119 3434 1782 -709 1499 2634 473 1164 1123 -469 1947 1852 -2531 -604 3948 -266 -4381
289 -4381 1260 3110 -3041 -2235 2298 -242 -2530 -360 38 -1482 -1037 -920 -2685 -1417 401 -2655
305 -2655 -3717 112 64 -3737 -2817 897 -816 -3827 -1275 201 -2096 -1994 -1101 -1611 -1123 -1090 -2159
322 -2159 -1523 142 -1048 -2393 -247 613 -1107 -902 12 226 313 -768 -472 1344 543 -1210 239
339 239 2065 229 -748 1787 1705 36 1385 1777 641 1437 2069 804 682 2487 1868 -350 1429
356 1429 3050 588 49 2508 2265 184 1057 2609 1058 551 2009 945 449 1831 768 -287
372 -287 1206 1325 -486 -147 1476 326 -886 455 571 -286 -353 -407 0 -194 -1132 -820 -363 -825 -1189
391 -1189 -1165 -1029 -1046 -1034 -1398 -1479 -510 -1029 -2091 -1067 -690 -1629 -1622 -1300 -1256 -1379 -1601 -1261 -1100 -1200 -1296 -1126
413 -1126 -875 -1075 -557 -422 -1330 -567 241 -882 -879 165 -71 -622 -369 286 273 94 251 351 721 656 527
434 527 1108 704 428 1182 926 764 1336 1048 958 1315 1001 938 1761 1649 257 935 2406 1174 424 1657
454 1657 1723 828 578 1058 1415 901 461 334 583 1387 876 -172 432 1137 280 -590 336 728 -476 -333
474 -333 -163 -912 187 542 -1515 -1494 174 -305 -1501 -972 -436 -873 -885 -1441 -1637 223 -277 -3055 -1892
493 -1892 356 -913 -2302 -1162 -503 -1311 -1218 -895 -1241 -418 -372 -1907 -1562 -53 -75 -965 -1067 -552 -421
512 -421 -233 -30 -598 -305 421 -312 -691 507 1386 365 -692 327 1234 710 564 353 318 1079 1077 275
532 275 770 2233 1290 -612 953 2455 780 602 1579 425 399 2024 1542 162 921 1421 314 642
550 642 1137 668 1361 629 -1078 963 2504 -139 -1128 941 713 -909 135 783 -491 -279 -82 -924
568 -924 -113 620 -446 -1169 -1153 -599 112 -392 -1532 -1346 -105 -601 -1936 -1053 115 -584 -1991 -2169 -306
587 -306 647 -962 -2141 -1384 -242 -222 -1262 -1467 -544 -31 -1135 -2014 -60 1309 -782 -1952 -487
604 -487 421 160 -206 -548 -403 519 460 -769 134 1649 417 -808 -347 809 2134 1032 -1409 -58
622 -58 2892 1415 -1162 968 2727 239 -609 1011 1706 1759 634 -568 1006 2277 782 98 1217
639 1217 981 155 874 817 374 1608 952 -1037 -31 1668 980 -284 -621 -148 688 516 -336 -179 427
658 427 -441 -859 65 -41 -458 -395 -1121 -983 1 -270 -896 -750 -732 -1067 -820 -659 -897 -378 -741 -2145 -1033
679 -1033 572 -617 -1490 -1026 -1142 -857 86 -628 -1664 -547 209 -1027 -874 112 -121 -400 -772 -934
697 -934 234 666 -481 -564 449 126 -458 652 1071 -139 -256 312 667 989 632 385 592 380 648
716 648 1408 966 -15 544 1475 627 190 1331 1376 479 426 667 1000 1147 686 319 445 628 652 872 792
737 792 -86 99 924 159 -118 930 494 -863 -338 909 286 -728 -244 -80 -270 -212 -644 -476 230
756 230 -518 -1359 -593 163 -424 -965 -802 -800 -737 -434 -658 -887 -757 -925 -758 -661 -661 -456 -940 -1109 -391 -382 -897
779 -897 -549 -169 -733 -909 -133 -225 -539 12 -466 -766 195 215 -291 63 28 -319 285 698 -41 -81 675 286
801 286 185 789 361 362 1008 411 25 934 1154 401 435 1008 490 486 1269 775 217 767 830 498 780 871 298
824 298 262 1019 690 -89 562 804 111 75 397 264 95 321 109 -383 63 327 -350 -170 57 -495 -502 52
846 52 -134 -795 -605 -98 -517 -674 -343 -667 -744 -391 -618 -823 -583 -519 -763 -661 -497 -909 -702 -199 -799
867 -799 -901 -267 -551 -779 -229 -346 -860 -456 52 -493 -584 75 -308 -431 216 -27 -332 76 179 -21 77
888 77 333 65 175 591 237 127 639 524 276 585 635 432 476 816 720 332 604 896 584 542 651 601
910 601 568 618 657 484 559 603 359 599 541 100 467 555 74 191 438 132 -39 272 154 -258 138 70 -395
933 -395 -24 -35 -514 -215 0 -453 -616 -248 -271 -680 -547 -347 -669 -574 -406 -648 -604 -469 -513 -735 -557 -427
955 -427 -737 -558 -316 -830 -606 -44 -664 -820 -21 -164 -894 -379 182 -502 -459 109 -294 -228 227 -271 -211
976 -211 367 44 -265 318 464 -88 149 670 164 88 660 495 171 452 670 476 299 680 752 345 572
997 572 660 386 716 770 301 317 894 628 14 672 903 5 194 788 224 104 503 218 -30 366 333 -168
1019 -168 146 328 -341 -170 265 -219 -306 78 -257 -590 -110 47 -645 -520 -36 -616 -664 -133 -429 -702 -393
1040 -393 -477 -642 -379 -402 -694 -556 -366 -718 -514 -180 -531 -534 -429 -479 -239 -313 -485 -229 -302 -410 -206 25
1062 25 -166 -236 -69 -279 -76 354 -36 -191 343 94 -22 390 409 180 162 309 307 471 472 335 420 439 282
1085 282 654 790 303 366 564 398 398 573 712 444 170 434 704 571 183 230 534 221 49 445 481 155
1107 155 -118 84 351 122 -21 87 -100 -254 -17 -2 -61 -86 -316 -392 -199 -147 -380 -215 -385 -902 -252 38
1129 38 -738 -469 -60 -708 -805 -212 -303 -528 -385 -775 -694 57 -355 -799 36 -277 -1045 -179 195 -461 -381 -180
1151 -180 -399 -193 142 -142 -155 -33 -277 -5 398 -90 -33 442 -75 -202 522 598 227 -12 99 523 516 242
1173 242 385 655 184 53 793 668 252 491 321 157 720 692 213 457 569 167 193 695 506 162 324
1194 324 16 41 679 432 -175 21 311 -49 -141 305 137 -442 -138 19 -213 12 65 -467 -551 -57 -188
1215 -188 -485 -93 -259 -777 -339 -183 -533 -199 -163 -858 -659 -30 -264 -563 -334 -407 -673 -314 -180 -362 -283
1236 -283 -473 -575 -169 -81 -216 -239 -264 -201 -205 -78 72 29 -144 -188 -35 41 201 423 -38 -288 373 474 38
1259 38 332 437 25 40 524 510 303 387 183 206 669 441 183 611 506 44 332 694 467 284 398 246
1281 246 112 564 538 100 186 198 122 314 324 56 -42 141 16 -75 230 162 -369 -117 68 -246 -200 -3 -155
1304 -155 -415 -347 -188 -223 -214 -310 -537 -400 -289 -316 -283 -417 -492 -414 -420 -297 -252 -416 -430 -431 -382 -292 -235 -277 -411 -271
1330 -271 -233 -363 -51 -58 -363 -220 -40 -131 -46 93 13 -159 13 110 80 228 156 -30 92 258 269 311 171 156
1354 156 299 378 306 278 407 346 186 418 424 359 482 372 227 345 387 418 367 307 206 229 389 287 220 278 100
1379 100 112 282 189 64 104 39 47 -37 70 6 -25 -71 -231 -177 -61 -128 -192 -343 -283 -132 -251 -287 -257 -365 -377 -272
1405 -272 -357 -394 -340 -299 -419 -346 -252 -356 -266 -191 -478 -332 -184 -310 -230 -146 -299 -288 -111 -90 -190 -199 -93 -87 -17 -24
1431 -24 -20 52 -55 80 151 -45 121 293 66 84 262 169 207 348 229 124 355 350 157 361 314 131 393 407
1455 407 248 324 369 259 306 387 285 176 322 282 231 299 179 186 273 107 130 215 -13 109 161 -51 -24 58 -50
1480 -50 -85 -12 -124 -239 -22 -129 -297 -124 -177 -342 -130 -210 -431 -257 -181 -303 -346 -228 -324 -413 -196 -288 -454
1503 -454 -301 -275 -317 -320 -314 -274 -279 -222 -214 -254 -232 -151 -162 -82 -166 -177 -98 -66 -71 -69 -44 49 33 23 80 76 138 119 163 166 119 276 266
1536 266 43 185 292 179 281 327 195 193 382 312 204 392 298 106 359 309 114 351 339 138 224 312 105
1559 105 173 320 100 -1 190 128 12 131 67 1 64 -35 -14 -52 -118 -56 -123 -198 -132 -114 -208 -193 -153 -232 -274 -97
1585 -97 -238 -370 -205 -309 -326 -178 -314 -325 -260 -278 -316 -285 -203 -266 -326 -230 -250 -105 -200 -251 -135 -137 -187 -68 -117 -162
1611 -162 23 -155 -86 119 -17 -77 70 107 -42 139 215 -13 181 249 19 212 386 87 218 335 64 221
1633 221 438 139 109 404 257 60 422 328 22 341 202 22 461 294 -35 219 282 102 116 271 109
1654 109 85 97 -37 124 229 -25 -42 123 -67 -65 37 -134 -157 -95 -218 -243 27 -95 -228 -138 -266 -414 -20
1677 -20 -118 -470 -186 -76 -447 -304 -2 -263 -368 -285 -259 -272 -56 -175 -365 -78 -215 -331 -69 -65 -298 -273 16
1700 16 -40 -218 -40 23 -199 -125 46 86 64 61 -33 -24 73 159 184 136 71 123 365 258 152 221 207 138 186 279 315 218
1728 218 121 88 263 275 262 268 191 156 183 260 131 228 256 -16 15 171 207 10 19 147 -89 67 37 -40 57 -11 -151
1755 -151 -4 135 -43 -156 -76 -175 -175 18 10 -193 -107 -209 -289 -180 -141 -180 -291 -355 -357 -112 -140 -248 -307 -93 -293
1780 -293 -310 -132 -79 -292 -255 -301 -110 3 -109 -231 -75 -132 -188 12 106 -70 -100 14 -17 -12 134 94 -64 -2
1804 -2 79 185 232 160 -5 194 117 97 282 299 -18 94 262 253 276 261 291 136 145 157 254 259 147 62 122 109 149 244
1832 244 209 -28 57 149 47 118 -2 -34 -48 91 1 85 6 -134 -100 -23 -113 -62 -1 -110 -225 -163 -69 3 -77 -132
1858 -132 -269 -198 -122 -154 -86 -198 -291 -283 -142 -202 -196 -198 -257 -291 -173 -27 -186 -162 -156 -181 -225 -118 -4 -55 -136 -98 -10 -101
1886 -101 64 44 -66 -16 -34 53 140 135 -3 23 76 183 112 225 144 47 177 204 119 228 192 151 96 84 250 175
1912 175 179 162 134 200 162 137 179 124 76 125 137 216 100 2 90 105 49 82 69 9 -22 -24 -37 -40 41 -84 -115 -49 -90 -67
1942 -67 -60 -140 -228 -123 -52 -171 -132 -102 -225 -215 -112 -178 -160 -204 -219 -194 -182 -243 -158 -135 -195 -189 -163 -156 -130 -107 -126 -102 -84 -130
1972 -130 -54 -47 -173 -68 -14 6 4 12 -20 3 32 49 41 112 60 73 96 140 124 190 189 171 159 196 144 175 152 114 128 197 192 140
2004 140 175 168 111 145 173 154 133 133 130 134 60 105 79 85 101 11 47 58 -11 7 5 -1 -39 -24 -9 -105 -107 -16 -98 -85 -114 -149 -91 -67
2038 -67 -96 -157 -195 -79 -134 -116 -112 -165 -187 -158 -120 -150 -161 -133 -125 -129 -160 -178 -94 -112 -128 -148 -139 -119 -99 -14 -26 -84 -55 -8 -3 -43
2070 -43 -40 34 11 57 97 66 8 -13 100 43 96 98 116 108 155 48 129 149 122 84 190 182 74 199 221 118 154 174 163
2099 163 140 114 74 78 130 64 118 47 142 32 58 60 -22 16 73 38 -34 -35 -38 -42 -2 26 -74 -93 5 -54 -95 -74 -100 -161 -104
2130 -104 -66 -101 -103 -114 -171 -232 -94 -198 -123 -103 -155 -157 -164 -68 -138 -168 -84 -114 -140 -136 -79 -118 -48 -121 -54 -72 -69 -2 -94 -59 -43
2161 -43 -63 -56 60 -11 -6 12 64 -60 49 172 -39 45 196 29 96 128 127 112 146 73 128 114 161 47 171 217 67
2188 67 81 270 97 32 139 95 183 147 181 72 34 139 87 40 46 33 61 54 -50 -53 -60 -71 36 -102 -51 -60 25 -48 -81
2217 -81 -48 -10 -89 28 -21 -100 0 -34 -107 -160 -185 -183 -143 -66 -212 -226 -79 -208 -177 -22 -135 -166 -147 -180 -147 -57 -17
2244 -17 -18 -74 -194 -106 18 83 -44 -38 -84 -7 55 23 22 63 61 59 47 83 22 5 144 130 88 183 107 133 196 98 103 132 148
2275 148 125 77 142 34 50 243 27 65 140 66 123 84 57 47 139 78 92 92 13 -24 -56 48 -57 -93 139 31 -178
2302 -178 -83 -77 -44 -21 -51 -56 -84 -136 -65 29 -58 -141 -192 -71 -138 -76 -150 -217 -155 -134 -31 -17 -73 -84 -215 -117 -92 -94 48
2331 48 -47 -258 -79 -115 -43 -10 -83 -133 -72 0 -45 30 52 4 -159 77 119 46 70 26 -58 37 46 25 55 82 12 -23 121
2360 121 130 104 69 22 84 148 198 96 109 125 82 138 168 146 23 105 73 89 175 91 54 38 21 46 97 55 3 -13 -21 -62
2390 -62 41 37 -73 -72 -26 -45 -53 -29 -81 -110 -108 -77 -98 -56 -73 -151 -91 -85 -132 -55 -69 -120 -119 -94 -90 -84 -75 -109 -169 -75 -81 -79 -40 -100 -107
2425 -107 -70 -54 -85 -18 -42 -70 -101 -31 4 -15 62 -17 -29 33 10 47 69 -2 29 55 92 53 92 59 13 80 92 63 97 103
2455 103 25 96 122 76 112 73 70 65 111 136 111 105 65 33 87 81 64 103 37 41 41 17 37 21 -30 -66 11 7 -55 -20 -27 -63 -69 -14
2489 -14 -96 -24 -71 -142 -76 -48 -95 -91 -89 -99 -125 -71 -94 -94 -90 -124 -92 -61 -82 -74 -57 -103 -90 -45 -64 -55 -46 -59 -42 -37 -30 -16 22 -10 -60
2524 -60 35 29 -4 36 5 -14 43 6 15 48 85 24 41 103 56 32 111 52 83 81 43 103 96 25 78 123 78 100 101 50 64 99 98
2557 98 64 121 66 9 84 76 37 65 38 35 21 24 -3 32 36 -23 -4 13 -28 -2 -31 -66 -45 -31 -79 -22 -41 -119 -64 -74 -104 -106 -73
2590 -73 -113 -148 -49 -61 -82 -53 -58 -106 -72 -64 -69 -41 -78 -78 -43 -66 -23 -43 -31 -55 -27 -16 -10 -34 -23 9 12 -24 -4 60 14 -22 3
2623 3 45 13 30 74 84 1 31 47 39 45 55 70 74 75 115 74 68 89 66 77 58 36 65 88 72 76 65 64 52 43 56 10 18 37 32 32
2659 32 -13 20 9 -21 -4 -4 -26 -52 -11 1 -59 -35 -17 -33 -36 -45 -59 -43 -44 -100 -88 -58 -55 -107 -49 -55 -53 -75 -71 -74 -92 -81 -55 -58 -62 -42
2695 -42 -33 -37 -29 -46 -71 11 -31 -24 31 22 -37 -21 40 12 19 36 29 4 39 46 23 33 52 11 61 41 43 62 56 40 58 73 44 86 86 23
2731 23 61 88 29 65 66 24 62 55 38 24 83 36 28 72 19 2 40 21 -21 35 30 -49 12 0 -11 -17 0 -23 -31 -12 -53 -39 -8
2764 -8 -62 -74 -27 -49 -117 -90 -74 -65 -80 -57 -47 -69 -102 -78 -34 -45 -71 -102 -45 -80 -52 -68 -60 -62 -44 -38 -46 -24 -36 -48 8 -30 -40
2797 -40 2 -4 -35 -13 33 36 35 11 5 23 28 35 76 85 39 12 57 66 48 59 45 41 48 50 67 54 37 43 24 63 52 34 39 31 10 32 36 47
2835 47 26 22 25 4 62 56 5 -7 24 -4 10 14 10 -41 -18 -13 -37 28 -33 -57 -29 -35 -65 -27 -73 -47 -65 -41 -71 -58 16 -70 -86 -59
2869 -59 -66 -52 -11 -22 -77 -108 -102 -36 -14 -82 -60 -38 -50 -44 -16 2 -43 -37 19 13 21 33 6 34 20 7 71 62 36 -18 56 43 -12 71
2903 71 30 25 61 43 58 53 69 29 6 44 49 70 27 15 21 72 44 60 60 29 31 40 44 -8 42 2 -8 -16 9 15 -32 10 -25 -11 -2 23
2939 23 -29 -3 -89 -32 0 -54 -38 -19 -42 -29 -41 6 -43 -75 -52 -39 -30 -36 -16 -74 -84 -94 -58 -52 -65 -55 -73 -55 -25 -47 -38 -61
2971 -61 -30 -82 -49 12 -1 3 -60 -58 -3 -9 15 -5 13 -1 -13 21 35 42 23 56 24 46 45 69 45 42 60 55 45 91 49 -1 40 66
3005 66 36 55 32 68 30 32 14 33 44 56 -25 62 38 16 93 35 -10 -18 21 15 -14 14 -6 34 5 6 21 10 -67 -14 27 -36
3037 -36 -21 -23 -23 -38 -28 -42 -2 -51 -46 -26 45 -62 -103 -26 28 -93 -34 -42 -53 -98 -57 -66 -35 21 -26 -27 -25 -30 -18 -46 -16 51 2
3070 2 -43 10 -2 -63 3 12 68 58 12 66 -18 -6 33 36 74 -41 86 34 -107 75 56 21 38 119 72 -15 109 132 109
3099 109 -34 -69 73 -17 -25 92 158 -53 -67 -2 22 -200 104 57 1 41 -127 222 127 56 38 10 112 121 -102 -13
3125 -13 -73 -39 126 64 -124 56 12 22 -111 -38 -34 -92 -47 -43 -27 -9 -27 -44 -23 -55 -37 -10 -64 -34 -59 -72 -38 -38 -45 0
3155 0 -23 -19 -40 15 -34 2 -86 -19 11 5 31 -14 -23 14 35 22 -7 -17 35 64 48 73 36 90 56 61 55 95 59 53 70 109 -29
3188 -29 84 51 -65 21 183 75 77 -163 -92 -167 -59 8 37 -104 -22 82 -88 -22 -15 3 -8 106 -31 -69 -95 -54
3214 -54 -88 -35 81 20 28 -48 -150 -83 19 -108 -141 115 -29 -174 -14 -34 -157 -14 -103 -32 -5 -106 -62 58 -3
3239 -3 1 -55 -29 -63 -49 -45 -62 -102 2 -55 -35 -57 -92 29 9 -2 -56 2 -45 -13 -97 11 -29 -6 11 -45 55 -18 48 25
3269 25 -2 -7 127 21 -23 -4 -11 44 -1 96 43 49 17 -42 83 -66 77 30 -4 -36 52 53 24 14 50 7 95 -89 -141
3298 -141 37 63 15 -86 26 -31 -43 -62 66 49 -7 -44 -100 -11 -26 -86 -50 -1 -15 28 -38 15 -53 75 -3 -16 -20 -53
3326 -53 25 -158 5 62 19 13 64 -79 -8 -63 -100 26 95 -20 -64 -12 -106 12 36 -48 65 -26 -49 96 12 -26 -37
3353 -37 16 21 -70 9 45 13 58 -43 28 59 42 50 63 37 70 2 41 58 39 24 50 1 29 -11 57 -30 28 20 24 34 -25 46
3385 46 31 12 -23 24 -31 -35 -23 -15 -34 -25 -4 -27 -90 -22 -21 -44 7 -52 -17 44 -62 -11 -48 -47 -30 -37 -53 -28 -6 -20 -59 -29 -49
3418 -49 -33 -37 -18 -40 -45 -56 -58 51 -19 -38 -19 45 -26 -2 -30 13 -50 18 2 -17 6 3 8 -45 62 9 2 -40 14 57 42 41 11
3451 11 15 -16 40 -9 76 48 22 -7 40 3 56 26 32 12 61 18 38 52 1 -26 17 2 -5 28 5 -5 3 10 13 22 -58 -38 31 13
3485 13 -8 -22 -11 -34 -38 -13 -4 30 -38 -33 -35 -37 -48 25 -3 -66 -52 -12 -29 -12 11 -31 -70 -21 -18 -24 1 -12 -38 16 12 -8 39 33 -20
3520 -20 -10 -22 -7 23 7 0 14 5 -4 8 39 -10 -20 27 10 59 14 13 20 -3 11 0 31 2 18 51 24 2 19 -3 31 18 22
3553 22 11 17 -2 39 31 14 4 10 -2 -4 13 6 22 24 21 24 -30 -1 25 6 -30 -1 -10 -49 -35 -19 0 -5 -57 -56 -11 9 -42 -17 -1 -54
3589 -54 -54 -27 -30 -61 -27 -54 -29 -27 -10 -18 -14 -13 -4 -6 -20 -13 -20 -29 -31 12 26 -2 -11 -29 24 -5 9 5 -11 -4 -14 -25 54 7 13 -13 27 13
3627 13 -2 46 -5 4 19 39 -5 26 -18 -44 10 -13 -6 45 24 7 25 1 46 24 -15 -14 -11 23 6 10 25 35 1 10 11 -39 -41 5
3661 5 -7 -24 -25 34 -12 10 36 -7 -19 -33 -48 -29 -54 -28 -9 -30 -33 -47 -23 -12 -10 -3 -43 -30 3 -58 -4 -22 -38 -15 -7 -8 22 -21
3695 -21 19 16 -4 -20 28 -6 -25 21 -9 2 29 4 -46 -15 29 4 12 -18 -11 8 -25 30 -9 36 18 2 8 -1 9 28 11 6 20
3728 20 -16 19 10 0 6 23 -11 17 2 25 4 25 15 23 21 18 -3 23 3 -13 14 2 -32 -3 -12 -7 -16 10 -21 -21 -8 -14 9 -20 -22 5
3764 5 -18 -19 -11 -35 -50 -22 -48 -33 -15 -12 -25 -21 -28 -48 -40 -23 -36 -6 -23 -17 -16 -4 -32 -33 -21 -7 9 -7 -22 26 -23 -1 13 13 44 -16
3800 -16 25 34 -6 -12 14 52 2 -2 10 57 20 18 24 2 -15 3 28 30 46 2 40 18 45 -19 47 -1 3 19 -9 6 -6 -3 8 4 20
3835 20 3 16 26 3 0 10 3 16 11 -14 -1 27 3 -7 4 -10 -6 -26 -19 -9 -43 5 -23 -41 -32 -39 -29 -25 8 -23 -38 -12 -30 -12
3869 -12 -14 -47 -15 -13 -35 -18 -7 -18 2 -2 -9 -7 -8 6 -8 5 -23 15 25 -33 -21 29 -24 24 2 30 24 19 20 17 31 71 -4 14 16 -17
3905 -17 13 30 9 50 26 10 28 -7 14 -13 -17 4 -4 -12 -36 -33 32 19 22 -18 15 -2 1 -15 13 -1 15 21 -29 23 8 -6 30 11
3939 11 -1 -1 -7 -13 -22 -14 -4 -29 -9 -18 10 -30 -43 -24 -20 -21 -27 -22 -21 -1 -27 2 -39 -58 -29 -23 -30 10 -15 -19 -19 -26 -21 -2 -6 -27 -13 -20 -3 7
3979 7 16 -15 -22 13 3 29 15 23 -32 -9 9 -7 62 13 4 2 52 17 13 17 2 17 4 13 9 6 -7 -13 18 3 -3 5 -2 -5 -1 30 0 -26 -4
4018 -4 -19 3 34 4 -3 -24 -14 3 -21 -19 7 -9 -4 -2 6 -26 -23 -7 -4 -31 -14 0 -50 -24 -5 -21 8 -15 -29 -21 -46 -32 -21 -9 -4
4053 -4 -23 -34 -42 -13 -10 -30 -30 -22 -15 -25 -12 -23 24 0 0 5 27 7 30 0 33 -11 23 34 0 -1 16 -2 21 21 4 -5 -16 9 15 46
4089 46 14 23 13 8 4 8 28 -24 -18 12 -9 2 19 14 12 12 34 4 10 -12 2 -21 25 3 -7 -22 -19 -13 -4 33 -10 -8 -4 0 -1 -12 -9 -17 -3
4128 -3 -7 -7 -17 -22 -26 2 -9 -34 7 -14 6 -12 -20 -35 -44 -30 -16 -15 2 -25 -17 -21 6 -16 -11 -37 -10 17 -1 6 2 11 -22 -27 -16 11 -1 -21
4166 -21 -9 -5 -18 1 9 22 -20 14 32 39 7 -8 22 31 17 7 16 34 28 16 11 10 2 15 -3 15 1 14 1 -6 16 -11 3 12 22 17
4202 17 -17 -5 23 13 -5 -7 -2 -6 -14 -29 19 -11 -18 -1 -14 11 -12 -5 14 -24 12 16 -21 -21 -8 -11 -7 23 -7 10 -6 -11 -44 -26 -18 0
4238 0 -22 -10 -23 -42 15 -9 1 1 -20 -17 -14 -25 -35 -12 11 -13 9 -9 -4 -19 4 -5 1 6 5 3 8 5 23 30 -1 6 6 19 9 24 4 47
4276 47 -3 -5 14 39 9 22 5 20 7 20 30 -12 -18 -42 -4 13 -4 -8 0 0 -4 4 -20 -9 -22 -24 -18 -12 -25 -8 4 11 -8 -11 15 17 -10
4313 -10 -30 13 5 -2 15 -3 -4 3 -16 17 -14 -10 -8 -14 -14 -5 -2 -17 -14 -18 -13 -26 -6 15 -11 -12 -21 -17 15 -5 -30 -1 -13 7 -31 -2 -7 12 6
4352 6 18 11 20 9 15 15 40 -3 22 12 11 41 6 9 -3 22 11 20 14 14 21 16 -20 0 9 -10 26 6 19 24 -12 6 15 -34 -5 24 -24 8
4390 8 13 6 15 -13 11 -19 -7 0 -28 -21 -14 -15 -11 4 -26 -22 9 -24 -29 -19 -8 -3 -12 7 -12 6 10 1 -8 -13 38 -18 8 -10 -12 -28 -16 -17 -16 -24 7
4431 7 7 7 4 -40 -20 -22 -3 -32 -35 -15 -11 -1 27 4 -16 -10 16 14 8 11 12 14 -21 25 -2 5 0 -6 32 -26 -28 12 -2 0 25 -7 5 30 33 18
4471 18 5 -11 -6 13 1 -22 -11 24 11 -26 -10 -34 -15 -14 -50 -35 -23 7 -9 -20 2 -47 -4 25 4 2 -21 -1 17 -6 -15 0
4503 0 6 -3 -2 10 11 -6 -12 11 -17 -4 -23 2 -13 -3 -28 5 25 -14 13 10 25 4 21 -15 5 0 -9 -5 -19 6 -43 -18 -19 -3 9 0
4539 0 1 8 -16 -11 2 -3 15 -1 2 2 36 35 35 10 19 11 12 37 2 22 15 27 14 1 17 9 3 -3 -7 29 6 -13 -7 14 -9 -5 -8 -12 -15 -23 -14 -16 -29
4582 -29 20 9 3 9 -13 20 -6 -37 -11 17 -11 20 -33 11 -27 6 -27 2 11 5 7 0 15 -15 0 19 9 4 25 16 13 19 17 -12 -17 3
4618 3 5 -23 3 -21 -36 -14 -20 0 -10 0 6 33 5 8 -5 3 9 2 36 19 -11 13 -7 -9 12 -11 4 -21 28 24 45 -3 -6 -3 29 -5
4654 -5 22 13 -2 0 -9 -1 -7 -5 14 -6 -22 1 -38 -2 -12 -21 -32 13 14 -5 -29 -37 -23 -15 21 5 0 5 1 -17 -39 -41 1 35 -2 -12 19 -17
4692 -17 8 7 -19 1 16 8 18 9 34 -3 0 -18 -17 31 -4 -2 -21 -17 -14 -17 -11 5 25 11 6 -26 -29 0 1 45 25 -40 -19 0 -21 3 -13
4729 -13 -7 27 4 3 -5 -8 22 21 2 -16 12 13 13 40 48 -2 -43 31 11 38 0 10 -8 -5 17 -13 -9 1 22 -6 15 47 0 32 9
4764 9 -17 -13 -4 -4 -22 -28 -44 -20 -60 -37 11 23 -1 -8 7 -2 -1 -27 32 30 17 0 -27 -3 16 -28 26 -13 -16 41 13 12 -63 7 -2 19
4800 19 17 -14 -22 0 -50 -28 39 10 -22 -11 -29 -10 -11 -17 -1 -2 -6 -24 -15 23 26 -2 -51 -13 -17 -4 -9 -27 30 -24 25 27 -11 -22 6 27
4836 27 13 6 21 -36 -30 7 -1 1 3 22 -56 20 18 -3 12 11 7 17 -3 13 25 -21 26 7 -49 -26 16 -19 0 -46 51 -36 -19 14
4870 14 29 12 33 -3 36 -15 18 -27 2 -3 -46 29 1 38 -28 -7 -6 38 59 -11 61 24 22 8 46 32 30 -12 -9 -39 2 -14 -17
4903 -17 24 39 -49 -11 39 -22 21 -30 22 -14 -2 -6 -34 -22 9 -21 -25 15 -65 9 26 -6 33 6 -21 -16 12 37 -25 1 44 25
4935 25 21 5 4 12 19 -16 40 -23 -6 -3 13 23 -9 -12 29 -29 15 -26 -12 1 -17 -5 -13 12 -1 7 10 -7 -71 -35 -17 2 -4 -18 13
4970 13 19 23 14 -44 17 -46 0 21 -17 1 15 47 2 36 -11 -23 18 -7 13 18 -26 -19 -18 -34 -26 27 -4 -27 -21 13 -17 -11 1 -5 13
5005 13 7 2 -11 0 -5 -31 0 32 17 -27 4 -82 21 24 68 12 -7 6 12 12 -16 -19 38 -15 12 37 15 24 -19 0 -8 -19 -32 -10
5039 -10 6 8 6 -12 -36 1 28 7 -25 5 -6 -58 -22 16 -45 -10 -56 -47 26 -13 -36 -18 -23 7 12 3 -2 -20 -2 -6 2 -19 27 3 -2
5074 -2 8 -16 8 15 5 -13 0 12 15 -1 17 5 18 12 -13 2 -5 -7 -21 33 -28 -16 -6 -43 -45 -13 22 4 -2 -29 -9 -12 13 -18 -9
5109 -9 29 -2 10 2 18 32 -13 21 7 -7 -4 14 -10 -16 21 27 16 21 9 -10 -1 6 0 -37 10 -6 -14 -7 -1 -36 -26 33 -19 -10 8 6 9 5
5147 5 10 -7 -15 -16 -20 12 14 -6 -42 -2 11 -13 23 -7 30 -15 -24 -17 -29 10 42 -2 -15 -16 15 11 14 6 14 19 13 -15 -27 -5 14 17 -11 20
5185 20 -18 -23 -14 26 -10 -9 7 8 25 -21 17 8 4 2 6 -9 -19 1 -28 -17 -4 -29 -21 -24 -6 11 8 -10 22 10 -4 32 35 -4 24 9
5221 9 -4 -15 0 8 -3 6 18 11 -27 5 18 4 4 -2 -11 16 7 5 -10 4 7 27 -2 -16 -36 -10 -9 -5 -2 -22 -10 -11 3 -4 7 2 -13 19
5259 19 -11 -28 21 -3 -12 3 8 31 4 -2 -36 -15 -8 -14 4 -23 -4 -32 -4 -5 -15 9 1 -10 -15 -14 -10 3 -15 -16 -10 -28 -1 -12 40 -23
5295 -23 -8 8 -19 12 1 2 -17 3 21 0 -3 -8 -14 -16 11 13 8 0 3 15 7 3 -16 5 -3 8 3 30 -7 8 30 -7 -21 12 0 29 5
5332 5 -17 -12 17 -17 18 22 -32 -10 -8 -6 -24 12 -9 -13 -1 -36 -15 -11 -18 14 2 -22 0 15 0 -10 10 0 7 32 1 13 -10 0 2
5367 2 -1 9 -5 -41 14 4 -23 24 -24 3 -10 -50 9 7 -16 9 -8 14 14 -18 -18 -6 -42 -19 2 -4 -16 -21 -5 5 -5 1 -1 21 27
5402 27 21 -32 2 3 7 -18 19 -36 1 30 7 -6 22 9 29 -13 20 19 9 0 12 -6 29 13 1 -1 -7 -7 -10 -5 -1 -11 14 12 -29 24
5438 24 -22 0 -48 -16 -33 -48 12 -27 22 -25 -26 19 2 -7 25 -11 4 -19 13 20 -10 -10 -1 21 -6 -13 5 7 -17 -35 -1 -8 -11 -32 -26
5473 -26 -3 4 10 -14 -10 -11 5 -22 3 6 -5 40 32 -2 -11 8 -12 5 -1 8 2 -11 -8 22 14 12 3 19 1 -26 2 10 22 11 2 27 -4 6
5511 6 -15 40 17 11 14 -3 22 4 0 5 -10 -8 -16 -14 -22 -14 12 -42 14 -35 -21 -14 -31 -2 -11 -18 -39 1 -2 -21 33 13 -5 20 25 8 6 18
5549 18 -38 -4 -39 -5 29 12 17 -11 -7 21 1 1 -4 -4 -16 18 -20 -21 15 15 -6 31 -1 11 -12 -21 -10 -9 -9 17 -7 -26 18 -21 3
5584 3 -8 -37 -9 8 -17 4 18 -5 -6 30 24 28 13 20 -5 7 -11 -7 -15 9 14 14 35 0 -6 -24 -18 -7 -9 -30 -22 27 -35 -4 4 -20 -7
5621 -7 8 -30 -51 -5 26 41 23 3 -19 -20 -1 -4 -26 -10 -20 -20 25 -22 2 -8 -13 -27 36 10 2 8 21 -1 -3 -41 -7 29 -16 -6
5655 -6 -6 -13 23 -18 -29 -24 30 14 -16 -9 -46 -25 -9 -31 -22 36 -10 -6 1 -10 38 0 11 -8 0 -14 16 -3 -15 -52 46 5 0 21 -28
5690 -28 -15 24 36 20 -17 24 31 7 22 0 26 8 6 43 20 26 -1 10 30 18 19 52 28 -21 10 -10 13 8 32 -6 -11 -15 -43 0
5724 0 -35 5 -17 -56 28 24 3 6 -14 -21 -5 -25 14 -28 -1 21 -21 -31 10 27 20 40 -32 -38 -15 3 -9 -3 -4 16 -9 -20 4 41
5758 41 -2 -25 39 -2 4 -59 -37 8 -34 13 3 -6 -4 -31 -30 -43 3 -50 -12 27 21 16 -12 -8 7 -10 61 31 19 15 -4 -25 37 -49
5792 -49 1 33 38 28 -19 -51 26 -26 -38 -2 -19 19 -23 -62 20 9 -22 -21 3 27 22 -5 10 -33 -10 -30 -2 -27 -37 22 33 4
5824 4 24 15 -15 25 13 -31 -28 18 32 37 13 -26 2 31 20 27 28 -25 -5 -52 -29 -12 -19 -10 39 15 50 -12 58 -37 10 4 11 30 29 -35
5860 -35 -65 -15 -32 12 5 17 37 30 5 -8 -30 6 -53 -9 13 12 6 21 5 36 -5 2 40 23 57 2 2 -11 -21 13 -1 -2 -62 35
5894 35 8 30 -5 -69 -4 12 -40 72 -35 -30 -8 -13 29 -6 -17 3 -15 -68 0 32 -9 -39 7 -5 -47 11 38 -11 -1 -48
5924 -48 -23 -34 15 -32 -21 2 -33 39 -11 89 17 9 -5 -11 34 -10 9 103 -83 32 -26 5 16 29 5 -11 -28 -28 -31 -24 -62
5955 -62 -20 54 63 -5 35 9 -4 25 15 19 -44 60 -88 8 -1 -3 58 52 -33 37 -36 -30 60 87 73 -14 2 -31 42 19 16 -9 -80
5988 -80 32 -2 9 -4 -70 -7 -27 -33 -57 -18 -4 -20 28 -42 30 -26 -7 14 14 16 -25 17 -11 -35 3 -33 -72 -13 -24 -49 11
6019 11 40 39 -4 -30 -12 31 -45 19 -33 -31 -42 -33 89 21 -19 -40 33 -24 42 14 -23 41 36 36 -9 10 -24 -17 -25 1 -3 -24 -7 5
6053 5 -46 -19 29 -15 13 -18 50 -119 -11 37 -25 -41 -19 50 7 14 -59 -58 -34 -13 40 27 56 7 30 28 19 14 -29 -9 -7 -13 0
6086 0 20 -43 -34 -59 -41 -19 -1 3 33 21 -74 31 -63 41 -18 -35 13 -28 15 -8 -80 -43 -31 3 82 77 -41 0 -34 -35 100
6117 100 -12 -10 3 -47 44 61 31 34 -39 -50 23 45 23 -45 49 -12 7 8 -48 -26 2 -42 -49 -50 -103 15 -47 141 1 -21
6147 -21 -98 -76 64 -3 -47 22 -62 17 35 -20 72 0 30 17 -20 -1 61 16 -48 75 26 -36 14 -11 -119 68 45 7
6175 7 -48 32 -48 17 92 -26 -115 22 -36 -3 22 45 -34 -19 112 -20 17 16 -76 -61 -51 -66 -49 94 -31 -30 -30 47 -73
6204 -73 -48 -23 -5 13 -24 -18 -28 87 39 5 21 -21 62 29 -23 20 -19 -44 34 -110 -17 21 -51 -29 -19 -110 5 -113 24
6233 24 -21 66 74 29 -43 -47 17 -66 -62 -63 -77 37 -19 9 -4 18 -67 -26 1 -72 -50 62 -28 -22 -84 7 -10 74 0 -27 -29 -31 19
6266 19 -10 -92 -51 29 -46 -35 -58 34 -39 -42 40 34 -98 43 -12 -26 25 -110 117 8 4 51 40 39 -22 48 -56 75 -17
6295 -17 -12 -160 30 -59 -31 -41 59 -68 40 57 -32 58 71 -7 -31 90 -14 -14 27 60 -76 -20 64 72 -63 45 79
6322 79 52 -27 21 62 -75 -118 -111 -40 7 -45 6 81 -68 -7 -57 6 20 -36 47 31 13 57 -61 -81 24 -12 -27 -50 -54
6351 -54 -50 -78 19 -1 102 -12 -33 90 -48 -21 19 -47 -67 106 81 -133 -22 -79 -30 60 47 28 35 -113 -35 7 52
6378 52 42 -16 26 12 64 -28 -88 -198 19 45 -51 -8 56 -24 -49 41 -14 -65 -8 -52 -95 -96 10 67 43 27 -5 25 118
6407 118 75 96 -27 -98 16 18 -69 70 14 -28 -16 -47 104 53 -33 -10 -20 -49 -39 3 -66 78 56 -15 -5 25 12 12
6435 12 12 -84 43 -51 11 -21 -14 3 -69 3 -38 -24 -17 52 79 2 -27 31 25 -36 -16 -44 -8 -17 -55 19 -20 3 -17 58 3 -12
6467 -12 -24 17 -82 11 33 -15 -8 8 34 24 -23 36 5 -52 -20 26 -22 8 -15 -47 -37 -42 -40 15 -10 -14 -30 11 -18 -15 -33 39 5
6500 5 -16 -6 0 1 -16 19 1 15 -12 10 56 40 -4 -35 -3 -33 -22 -5 -33 -11 6 -24 5 -20 -6 2 -9 8 8 -13 16 -3 -26
6533 -26 -21 -1 -32 26 -25 -11 -42 1 -15 48 38 -48 -14 -25 -11 -18 17 -14 5 -28 -13 10 -11 4 19 -17 -2 9 -3 -15 -12 -11
6565 -11 -49 -8 -10 -18 -25 -26 12 -5 -27 -23 -14 -39 -16 -24 0 -23 -7 0 7 -7 8 -6 11 11 5 8 6 11 -7 7 5 -10 -5 5 6 -1 14 -8 6
6604 6 20 -26 -17 24 -11 -20 -4 -12 -4 -4 6 -19 -16 -11 -17 -3 -19 -21 15 16 -13 -19 -21 3 -24 6 16 -10 8 -2 -6 -3 -27 1 7 -10 -22 -3
6642 -3 13 19 2 -7 2 -23 12 1 -8 -5 -9 -10 4 11 -17 -25 -7 -12 -4 -14 -20 -25 -6 -15 -1 16 -11 0 9 -15 -24 -17 -12 7 24 -4 13 -8 15 7
6682 7 15 24 6 -26 -6 3 5 5 -19 7 5 -17 2 -7 -21 0 -4 12 -39 11 -32 -6 -25 -5 -24 -4 7 0 -15 -20 -13 -9 -30 -10 -24 -9 1
6719 1 12 -15 9 7 -15 -7 -12 15 -28 1 14 -13 -13 -17 -4 -15 0 -23 5 1 31 0 6 11 -20 -5 17 24 -8 15 18 -33 -23 -18 -7 -18
6755 -18 -13 -3 -12 -43 -9 -14 -30 -1 10 -12 4 2 -7 15 -3 -14 -33 5 -10 -22 2 8 -8 -16 -5 -40 -6 -14 20 -4 -28 3 -13 -11 -14
6790 -14 -6 31 -15 -6 -7 -10 -7 -1 -11 -27 12 12 -8 -7 -18 6 -13 -23 -17 -18 -8 -7 8 -4 6 12 25 -29 -16 -9 2 1 2 3 4 -1 3 -7 8 15
6830 15 -19 3 -12 -18 -5 18 -1 0 1 18 -8 3 7 10 8 17 23 -23 3 4 -10 -3 -3 -14 11 2 8 2 8 -17 -4 -15 21 -7 3 6 -16 -2
6868 -2 25 -27 -33 -8 9 -6 -6 7 4 -10 20 21 17 0 23 9 16 13 7 22 -10 -3 -5 -3 -18 -13 24 15 40 -4 2 -21 -11 -12 12 10 -29 -2 -7
6907 -7 -10 0 -9 -18 0 -17 -26 -11 24 16 6 -17 -8 0 -18 -10 -10 -15 -15 0 -5 13 -6 13 23 -29 20 17 -8 7 9 -9 -7 11 5 -4 -12 -10 -12 -4 8
6948 8 -16 -24 24 29 -12 -5 -14 8 16 -3 -2 18 -16 -13 20 2 -1 17 6 -3 5 2 8 40 24 15 10 -22 12 -2 6 31 -14 9 8 5 18 -1 22
6987 22 -38 16 -14 -22 -13 -50 -13 17 17 -5 -16 -9 26 -1 -4 14 -27 12 -24 -20 -18 21 5 -20 -2 -9 -19 12 -1 7 20 -33 -10 -13 12
7022 12 21 -8 10 17 13 -11 -22 -4 -3 -3 -40 20 -13 5 -5 -10 -30 34 -28 -27 0 -3 -10 -7 6 0 -37 -24 -30 2 -8 -27 9 -8 11 30
7058 30 -35 -13 3 -1 32 -13 -26 -57 -16 13 -2 23 -4 -3 -32 -2 -11 -8 -5 -1 18 1 -11 -4 -9 -24 38 7 -9 -16 -4 -3 -12 -7 -23 24
7094 24 4 -4 28 -10 -33 -6 -8 0 -12 -14 22 -5 -7 -1 13 4 27 25 7 -8 1 -22 4 -14 -1 8 -20 -35 -14 -5 46 3 -3 7 -10 15
7130 15 -6 -30 12 -6 -6 28 -18 11 -22 -6 -15 4 5 18 -10 19 -5 -9 4 12 -5 -12 -12 11 -16 12 -8 -17 3 -15 -1 -8 -11 -1 -7 2
7166 2 -1 -11 4 -5 -12 -27 -3 16 28 3 -22 -31 9 -2 2 -8 20 -11 3 -7 -31 7 -5 -17 -2 -40 -16 -2 -25 -13 -9 12 25 -1
7200 -1 16 1 -2 -4 -7 4 -11 26 -1 4 -6 -11 3 16 14 -49 -14 -25 11 28 -35 -12 20 8 12 -22 4 -19 -20 -11 19 -38 -18 -11 -12 18
7236 18 15 -22 29 8 -23 -7 -13 -22 -6 -16 14 28 -27 32 6 6 4 -6 44 -1 0 7 -12 -11 20 -13 -52 7 -21 -25 -37 -20 1 22 -15
7271 -15 21 16 -1 8 47 -45 -33 0 8 -1 1 18 1 -24 -2 13 -38 39 -12 -16 23 0 -21 2 -7 16 6 2 -29 27 6 -5 17 -26
7305 -26 -7 9 -28 48 23 27 20 17 -18 -24 -22 -9 10 11 14 -13 -40 2 5 -29 -24 8 5 -5 -29 -9 13 -9 -46 -11 12 -33 72 -37
7339 -37 -33 -41 -17 21 -29 -1 2 7 -17 -11 -29 14 9 16 9 -27 19 2 -20 14 29 12 -10 -8 -32 -3 22 -1 -22 -10 -4 8 -25 -7 -10 -12
7375 -12 -24 11 -10 4 -36 -22 -5 -29 -14 -32 -4 -2 -8 17 2 -4 -18 4 -16 2 -9 42 16 6 -25 -12 12 7 -31 8 -9 -16 2
7408 2 -28 -2 -20 12 -31 -16 1 38 -4 27 27 13 14 -40 -16 -5 0 -29 0 -25 8 29 6 -12 78 37 8 8 -2 35 -4 6 21
7441 21 -26 -10 28 -4 17 1 -37 -50 -1 -32 -47 -7 -1 14 -5 1 9 -5 -17 -9 18 -24 -15 -27 -43 -28 -18 -31 6 0 11 -36 11
7474 11 9 19 8 -11 3 15 9 -17 3 -9 -28 39 -10 32 10 -13 -4 -56 53 -4 9 -23 -30 53 -15 27 14 -1 19 -3 32 7
7506 7 4 6 -1 -2 -13 1 -17 -16 1 18 -3 26 -30 21 12 -11 10 59 15 -37 -18 -22 -26 27 -38 1 -51 31 -58 2 21 45 34 -4 -7
7541 -7 -9 6 26 -42 -36 17 -31 3 20 30 16 -27 4 -2 -64 -15 -23 -2 -5 -47 -10 -5 -10 -38 -1 18 0 0 31 -39 -41 12 16 -22 3 -59
7577 -59 11 5 -10 18 1 16 -3 52 -20 38 -7 13 -34 15 10 27 -19 65 0 19 3 4 5 -2 -27 -26 -9 23 -82 -20 11 -39 -23
7610 -23 -14 15 -28 -13 -8 18 -4 -11 -32 -6 -2 -18 31 -47 0 -34 8 -15 20 0 31 60 19 -5 -17 21 -64 18 2 -12 -18 -13 -7 -3
7644 -3 -7 -6 28 9 0 15 11 3 -11 8 2 -44 -9 -19 -4 -11 28 7 9 -32 35 24 -38 20 -46 8 21 -22 2 11 15 -14 8 12 12 -29 12
7681 12 0 37 -21 -5 5 -26 31 27 11 8 -4 -14 17 4 -32 6 16 -14 -21 -4 -6 -15 -4 -52 35 34 -11 2 -10 7 -19 -33 22
7714 22 -24 19 -27 6 -21 -39 -24 -42 -48 -44 27 25 35 -49 20 -20 30 -9 5 -27 4 27 -9 22 -19 -7 -29 19 18 -45 -11 2
7746 2 8 32 -41 66 11 4 12 -2 -18 -16 -15 -21 -37 4 -15 10 13 4 54 2 -5 -41 32 -56 -49 16 3 -26 41 41 -5 20 -7 22 11 -6
7782 -6 -25 24 26 1 7 26 -14 32 -18 -4 -30 -55 -23 -36 8 5 16 -37 -19 -42 15 -32 3 -23 -23 -34 -25 27 48 41 17 15 32 35 -5
7817 -5 -20 -34 6 45 51 -17 -1 2 -37 33 -25 -17 -10 -22 6 -82 16 -49 6 2 2 9 58 -20 5 -8 -6 -27 -39 -39 -55 -58 36 -8 -4 17
7853 17 14 -20 22 -32 -4 0 4 -41 -30 -5 1 -36 20 22 27 69 -27 5 15 -17 -45 -19 93 0 14 -33 5 -3 -20 70 -17 -33 -1
7886 -1 49 7 -10 -18 1 -23 5 -27 -28 -65 -24 3 51 -38 67 57 -59 -44 -26 -63 -38 9 22 36 -59 24 36 23 -11 53 49
7917 49 -1 -32 -45 19 56 36 -61 -79 33 25 -38 27 26 14 47 -43 -15 -14 -14 -13 14 15 34 35 -61 39 -14 3 78 -20 -6 -23 -26
7950 -26 11 -123 -66 6 2 13 53 -33 -47 -85 2 -74 -49 131 -30 -22 20 140 37 -20 -48 4 -9 -12 4 -4 -24 23 61 33
7980 33 -2 19 -6 -1 -39 -14 47 -11 -45 -18 -32 -18 -14 -38 13 5 33 14 16 -12 22 -12 -61 90 -29 12 -22 -77 -37 -33 18 -26
8012 -26 -40 -5 4 39 -29 -51 35 26 -22 2 2 -19 -39 -10 -15 -38 -79 -45 48 27 -22 -75 -33 -9 37 58 -7 7 65 10 3 -22 -43
8045 -43 -54 -12 -69 76 -51 -58 26 29 -75 19 -53 -63 21 38 -6 -13 -36 -8 37 -45 61 45 54 9 -32 -34 34 -56 -40 37 39
8076 39 -8 54 -45 9 -11 -25 -77 -32 -52 18 -46 -22 -33 -34 -24 -20 -33 -37 11 8 9 -41 -4 38 14 -64 -3 18 -14 -5 -29 32 57
8109 57 15 -18 -43 -3 -20 -19 49 -9 -4 41 76 23 12 0 -34 -48 17 31 -42 0 -9 -33 -16 7 -77 -17 -22 12 3 -23 27 18 -21
8142 -21 -12 -12 -28 -11 24 -2 19 67 -9 -12 -52 -38 72 -43 -42 23 -59 30 -6 43 -69 4 43 -2 -11 -11 -3 6 37 -30 -7 -21 -64
8175 -64 22 -39 -31 -29 48 26 2 -31 -36 -11 -38 92 -7 14 -19 -1
8191a
##END NTUPLES=NMR FID
##END=
