##TITLE=1H_Pr AmBnM
 CDCl3, 8 sc, 
 26.11.2020
##JCAMPDX= 6.0         $$ Bruker NMR JCAMP-DX V2.0
##DATA TYPE= NMR FID
##DATA CLASS= NTUPLES
##ORIGIN= UXNMR, Bruker Analytische Messtechnik GmbH
##OWNER= root
$$ XWIN-NMR		Version 3.5
$$ Thu Nov 26 13:42:21 2020 Russian Standard Time (UT+4h)  she@DPX200
##.OBSERVE FREQUENCY= 200.1315066352
##.OBSERVE NUCLEUS= ^1H
##.DELAY= (6, 6)
##.ACQUISITION MODE= SIMULTANEOUS
##.ACQUISITION SCHEME= undefined
##.AVERAGES= 8
##.DIGITISER RES= 18
##SPECTROMETER/DATA SYSTEM= spect
##.PULSE SEQUENCE= zg30
##.SOLVENT NAME= CDCl3
##.SHIFT REFERENCE= (INTERNAL, CDCl3, 0, 15.7039)
##AUDIT TRAIL= $$ (NUMBER, WHEN, WHO, WHERE, WHAT)
$$ ##TITLE= Audit trail, XWIN-NMR		Version 3.5
$$ ##JCAMPDX= 5.01
$$ ##ORIGIN= Bruker BioSpin GmbH
$$ ##OWNER= she
$$ F:/spectra/data/she/nmr/H-F/1/audita.txt
$$ ##AUDIT TRAIL=  $$ (NUMBER, WHEN, WHO, WHERE, WHAT)
(   1,<2020-11-26 13:40:58.50 +0400>,<she>,<DPX200>,
      <created by zg, POWCHK disabled, PULCHK disabled
       configuration hash MD5:
       00 E9 B6 7A A2 85 ED C7 34 08 36 98 17 FE 4E 26
       data hash MD5: 16K
       31 0C E3 43 F5 02 E7 CF EC FD B6 CD 7E 8B DC E3>)
$$ ##END=
$$ 
$$ hash MD5
$$ 12 96 AC F1 D9 E6 C5 F0 A8 EE C4 DC 69 C8 C5 6B
##$RELAX= 
##$RELAX= 
##$RELAX= 
##$RELAX= 
##$RELAX= 
##$RELAX= 
$$ Bruker specific parameters
$$ --------------------------
##$DU= <F:/spectra>
##$EXPNO= 1
##$NAME= <H-F>
##$PROCNO= 1
##$TYPE= <nmr>
##$USER= <she>
##$AMP= (0..31)
100 100 100 100 100 100 100 100 100 100 100 100 100 100 100 100 100 100 
100 100 100 100 100 100 100 100 100 100 100 100 100 100 
##$AQSEQ= 0
##$AQ_mod= 1
##$AUNM= <au_zg>
##$AUTOPOS= <>
##$BF1= 200.13
##$BF2= 200.13
##$BF3= 200.13
##$BF4= 200.13
##$BF5= 200.13
##$BF6= 200.13
##$BF7= 200.13
##$BF8= 200.13
##$BYTORDA= 1
##$CFDGTYP= 0
##$CFRGTYP= 5
##$CHEMSTR= <none>
##$CNST= (0..31)
1 1 145 1 1 1 1 1 1 1 1 1 1 1 1 1 1 1 1 1 1 1 1 1 1 1 1 1 1 1 1 1 
##$CPDPRG= <>
##$CPDPRG1= <>
##$CPDPRG2= <>
##$CPDPRG3= <>
##$CPDPRG4= <mlev>
##$CPDPRG5= <mlev>
##$CPDPRG6= <mlev>
##$CPDPRG7= <mlev>
##$CPDPRG8= <mlev>
##$CPDPRGB= <>
##$CPDPRGT= <>
##$D= (0..31)
0 1.2 0 0 0 0 0 0 0 0.06 0 0.03 0 0 0 0 0.0002 0 0 0 0 0 0 0 0 0 0 0 0 
0 0 0 
##$DATE= 1606383657
##$DBL= (0..7)
120 120 120 120 120 120 120 120 
##$DBP= (0..7)
150 150 150 150 150 150 150 150 
##$DBP07= 0
##$DBPNAM0= <>
##$DBPNAM1= <>
##$DBPNAM2= <>
##$DBPNAM3= <>
##$DBPNAM4= <>
##$DBPNAM5= <>
##$DBPNAM6= <>
##$DBPNAM7= <>
##$DBPOAL= (0..7)
0.5 0.5 0.5 0.5 0.5 0.5 0.5 0.5 
##$DBPOFFS= (0..7)
0 0 0 0 0 0 0 0 
##$DE= 6
##$DECBNUC= <off>
##$DECIM= 32
##$DECNUC= <off>
##$DECSTAT= 4
##$DIGMOD= 1
##$DIGTYP= 9
##$DL= (0..7)
0 120 120 120 120 120 120 120 
##$DP= (0..7)
150 150 150 150 150 150 150 150 
##$DP07= 0
##$DPNAME0= <>
##$DPNAME1= <>
##$DPNAME2= <>
##$DPNAME3= <>
##$DPNAME4= <>
##$DPNAME5= <>
##$DPNAME6= <>
##$DPNAME7= <>
##$DPOAL= (0..7)
0.5 0.5 0.5 0.5 0.5 0.5 0.5 0.5 
##$DPOFFS= (0..7)
0 0 0 0 0 0 0 0 
##$DQDMODE= 0
##$DR= 18
##$DS= 0
##$DSLIST= <SSSSSSSSSSSSSSS>
$$ [...]
##$SUBNAM2= <"">
##$SUBNAM3= <"">
##$SUBNAM4= <"">
##$SUBNAM5= <"">
##$SUBNAM6= <"">
##$SUBNAM7= <"">
##$SUBNAM8= <"">
##$SUBNAM9= <"">
##$SW= 16.9725356469052
##$SWIBOX= (0..15)
0 0 2 0 0 0 0 0 0 0 0 0 0 0 0 0 
##$SW_h= 3396.73913043478
##$TD= 16384
##$TD0= 1
##$TE= 0
##$TE2= 300
##$TE3= 300
##$TEG= 300
##$TL= (0..7)
0 120 120 120 120 120 120 120 
##$TP= (0..7)
150 150 150 150 150 150 150 150 
##$TP07= 0
##$TPNAME0= <>
##$TPNAME1= <>
##$TPNAME2= <>
##$TPNAME3= <>
##$TPNAME4= <>
##$TPNAME5= <>
##$TPNAME6= <>
##$TPNAME7= <>
##$TPOAL= (0..7)
0.5 0.5 0.5 0.5 0.5 0.5 0.5 0.5 
##$TPOFFS= (0..7)
0 0 0 0 0 0 0 0 
##$TUNHIN= 0
##$TUNHOUT= 0
##$TUNXOUT= 0
##$USERA1= <user>
##$USERA2= <user>
##$USERA3= <user>
##$USERA4= <user>
##$USERA5= <user>
##$V9= 5
##$VALIST= <valist>
##$VCLIST= <CCCCCCCCCCCCCCC>
##$VD= 0
##$VDLIST= <DDDDDDDDDDDDDDD>
##$VPLIST= <PPPPPPPPPPPPPPP>
##$VTLIST= <TTTTTTTTTTTTTTT>
##$WBST= 1024
##$WBSW= 4
##$XGAIN= (0..3)
0 0 0 0 
##$XL= 0
##$YL= 0
##$YMAX_a= 320176
##$YMIN_a= -257147
##$ZGOPTNS= <>
##$ZL1= 120
##$ZL2= 120
##$ZL3= 120
##$ZL4= 120
##$ABSF1= 10
##$ABSF2= 0
##$ABSG= 5
##$ABSL= 3
##$ALPHA= 0
##$AQORDER= 0
##$ASSFAC= 0
##$ASSFACI= 0
##$ASSFACX= 0
##$ASSWID= 0
##$AUNMP= <proc_1d>
##$AZFE= 0.1
##$AZFW= 0.1
##$BCFW= 1
##$BC_mod= 2
##$BYTORDP= 1
##$COROFFS= 0
##$CY= 11.3945322036743
##$DATMOD= 1
##$DC= 2
##$DFILT= <>
##$DTYPP= 0
##$F1P= 15.9154993809931
##$F2P= -4.1035820241983
##$FCOR= 0.5
##$FTSIZE= 0
##$FT_mod= 4
##$GAMMA= 1
##$GB= 0.15
##$INTBC= 1
##$INTSCL= 1
##$ISEN= 128
##$LB= 0.24
##$LEV0= 0
##$LPBIN= 0
##$MAXI= 10000
##$MC2= 0
##$MEAN= 0
##$ME_mod= 0
##$MI= 1.114404
##$NCOEF= 0
##$NC_proc= 0
##$NLEV= 6
##$NOISF1= 3.799351
##$NOISF2= 2.8
##$NSP= 1
##$NTH_PI= 0
##$NZP= 0
##$OFFSET= 15.70392
##$PC= 1
##$PHC0= -10847.16
##$PHC1= 12.20088
##$PH_mod= 1
##$PKNL= yes
##$PPARMOD= 0
##$PSCAL= 0
##$PSIGN= 0
##$REVERSE= no
##$SF= 200.130013532006
##$SI= 16384
##$SIGF1= 3
##$SIGF2= 2
##$SINO= 400
##$SIOLD= 16384
##$SREGLST= <1H.CDCl3>
##$SSB= 0
##$STSI= 0
##$STSR= 0
##$SW_p= 3612.71676300578
##$SYMM= 0
##$S_DEV= 0
##$TDeff= 0
##$TDoff= 0
##$TI= <>
##$TILT= no
##$TM1= 0
##$TM2= 0
##$TOPLEV= 0
##$USERP1= <user>
##$USERP2= <user>
##$USERP3= <user>
##$USERP4= <user>
##$USERP5= <user>
##$WDW= 1
##$XDIM= 8192
##$YMAX_p= 0
##$YMIN_p= 0
$$ End of Bruker specific parameters
$$ ---------------------------------
##NTUPLES= NMR FID
##VAR_NAME=  TIME,          FID/REAL,        FID/IMAG
##SYMBOL=    X,             R,               I
##VAR_TYPE=  INDEPENDENT,   DEPENDENT,       DEPENDENT
##VAR_FORM=  AFFN,          ASDF,            ASDF
##VAR_DIM=   8192,          8192,            8192
##UNITS=     SECONDS,       ARBITRARY UNITS, ARBITRARY UNITS
##FACTOR=    0.0002944,     1,               1
##FIRST=     0,             0,               0
##LAST=      2.4114304,     0,               0
##MIN=       0,             -257147,         0
##MAX=       2.4114304,     320176,          0
$$ Real data points
##PAGE= N=1
##DATA TABLE= (X++(R..R)), XYDATA
$$ [...]
$$ plain form
665 677 -5378 -1276 3772 -2465 -5208 2135 2371 -4409 -2645 2804 -892 -4050 -268 873 -665 -1529
681 -1529 -421 1305 304 -1530 -131 837 -100 -611 -1424 1228 2069 -2019 -1029 3673 795 -3807 867
698 867 3725 -2058 -3395 2659 2635 -2891 -1730 3437 1453 -4079 -494 3651 -1429 -3179 1329 1423
714 1423 -1254 -736 417 1117 324 -1684 -489 2102 -152 -2843 949 2916 -1138 -1985 2284 2411
730 2411 -1963 -1735 2621 1675 -3115 -491 3951 -171 -2453 1755 2322 -875 -1147 616 1410 -432
746 -432 -1421 983 1544 -496 -941 784 1324 -509 -1896 455 1684 -1456 -2116 1573 1764 -2367 -1339
763 -1339 2382 298 -3022 -486 1782 -938 -2392 94 1710 -660 -1996 502 1295 -1070 -1681 410
779 410 984 -770 -1472 889 1767 -754 -1348 1397 1786 -1390 -1385 2334 1264 -1911 27 2810 689
$$ packed form
665F77o055M102N048o237k743P343K36o780J764N449l696l158L782J141j538q64
681a529J108J726j001j834J399R68r37n11q13K652Q41m088R90M702k878m602M674
698H67K858n783j337O054k4n526J161N167j984n532L585M145n080j750M508R4
714A423k677N18J153P00p93k008J195K591k254k691L792J967m054q47M269J27
730B411m374K28M356r46m790K624M442m122k282M208N67l197k72J763P94j842
746d32r89K404N61k040m45J725N40j833j387K351J229l140o60L689J91m131J028
763a339L721k084l320K536K268k720j454K486J616k370j336K498P93k365o11K091
779D10N74j754p02K361Q78k521n94K745L89l176NL719j070l175J938K783k121
$$ plain form
796 689 -1326 374 2438 257 -2179 773 2317 -603 -1519 1045 1604 -869 -1508 804 1222 -1660
812 -1660 -1838 861 921 -2080 -1721 1627 497 -2527 -907 1617 -495 -2391 -597 1631 -174 -2559
828 -2559 726 2258 -859 -1675 1523 1871 -999 -1108 1878 1971 -1207 3 2616 1286 -774 165 2285
845 2285 1046 -1321 180 2551 9 -1340 1037 1447 -452 -1122 491 710 -866 -1492 3 460
861 460 -1155 -1767 -102 741 -1922 -2149 541 -153 -2370 -1395 575 -258 -1966 -1119 1215 -159 -2197
878 -2197 -74 1150 -526 -1425 349 1593 -105 -1019 1418 1756 -421 44 1085 1413 485 -668 1474
895 1474 2452 -527 -343 2595 1131 -880 624 1792 353 -710 615 1189 272 -547 95 1174 17
912 17 -1438 378 860 -1286 -650 311 -174 -60 -997 -892 978 -331 -2688 159 1644 -2201 -2321 1863
$$ packed form
796F89k015J700K064k181k436K952J544k920r16K564N59k473o39K312M18k882
812a660j78K699O0l001L59L348j130l024J620K524k112j896J794K228j805k385
828b559L285J532l117q16L198L48k870j09K986R3l178J210K613j330k060R39K120
845B285j239k367J501K371k542j349K377M10j899o70J613K19j576o26J495M57
861D60j615o12J665Q43k663k27K690o94k217R75J970q33j708Q47K334j374k038
878b197K123J224j676q99J774J244j698r14K437L38k177M65J041L28r28j153K142
895A474R78k979J84K938j464k011J504J168j439j063J325N74r17q19O42J079j157
912A7j455J816M82k146O36R61m85J14r37J05J870j309k357K847J485l845j20M184
$$ plain form
930 1863 631 -2982 -502 1795 -697 -2215 -128 1054 -546 -1973 17 1683 -715 -1920 888
945 888 1616 -1536 -1390 1658 701 -1444 -181 1366 614 -670 -313 1455 1058 -1350 -328 2429 546
962 546 -2268 1317 3043 -1557 -1200 2892 834 -1507 511 1318 513 -374 -217 1315 822 -719 -241
979 -241 1211 700 -1163 -387 1233 -100 -1023 -92 353 632 -1156 -1267 1849 -161 -2895 834 1398
996 1398 -2259 -906 1181 -383 -1279 -310 472 -435 -917 -414 241 -202 -953 -127 605 -301 -748 17 174
1015 174 126 -696 -524 1219 33 -1267 425 1187 -291 -1148 531 1615 -876 -1255 1750 586 -1138
1032 -1138 383 811 286 57 -125 487 901 -169 -455 794 1329 -530 -619 1761 655 -1046 434
1049 434 1433 127 -893 366 1692 -254 -1420 1507 1351 -1603 -536 1819 98 -1863 303 1216
$$ packed form
930A863j232l613K480K297k492j518K087J182j600j427J990J666k398j205K808
945H88P28l152J46L048r57k145J263J547p52j284L57J768l97k408J022K757j883
962E46k814L585J726m600L57M092k058k341K018Q07q05q87J57J532m93j541M78
979b41J452n11j863P76J620j333r23R31M45K79j788j11L116k010k734L729N64
996A398l657J353K087j564q96R69P82r07m82N03O55m43p51Q26P32r06m47P65J57
1015A74m8q22J72J743j186j300J692P62j478q57J679J084k491l79L005j164j724
1032a138J521M28n25k29j82O12M14j070k86J249N35j859q9K380j106j701J480
1049D34R99j306j020J259J326j946j166K927j56k954J067K355j721j961K166R13
$$ plain form
1065 1216 -913 -1073 204 158 -365 -1199 -729 740 -768 -1670 -191 252 -654 -1433 -436 818 -919 -1918
1083 -1918 629 696 -1569 -897 966 391 -1447 -231 1366 117 -891 477 1052 -79 -182 617 1039
1100 1039 126 131 744 950 639 -153 417 1469 235 -621 1037 1387 -605 -612 1423 1037 -1238 -326 1502
1119 1502 62 -1313 105 1204 -399 -1321 357 734 -1075 -799 252 -144 -427 -771 -365 405 -431
1136 -431 -1029 79 449 -788 -933 411 544 -1026 -561 975 297 -1001 -141 1108 -17 -1052 503
1153 503 1165 -580 -486 879 530 -246 -219 493 522 -268 -349 529 395 -307 -229 345 538 -428 -624 535 581
1174 581 -910 -638 1099 82 -1339 76 978 -541 -955 447 497 -598 -655 508 387 -505 -333 437
1192 437 380 -393 -286 477 567 -358 -366 704 622 -709 -152 1236 246 -801 286 1000 -19 -681 369
$$ packed form
1065A216k129j60J277m6n23q34M70J469j508r02J479M43r06p79R97J254j737r99
1083a918K547O7k265O72J863n75j838J216J597j249j008J368N75j131j03P99M22
1100A039r13NO13K06l11p92N70J052j234q56J658L50j992pK035l86k275R12J828
1119A502j440j375J418J099j603r22J678L77j809K76J051l96k83l44M06P70q36
1136d31n98J108L70j237j45J344J33j570M65J536o78j298Q60J249j125j035J555
1153E03O62j745R4J365l49p76K7P12K9p90q1Q78j34p02P8N74J93r66j96J159M6
1174E81j491K72J737j017j421J415R02j519m14J402N0j095n7J163j21q92J72P70
1192D37n7p73J07P63R0r25qJ070q2j331N57J388r90j047J087P14j019o62J050
$$ plain form
1211 369 1082 -230 -745 665 859 -694 -516 1038 406 -785 48 349 -65 -812 -216 309 184 -432
1229 -432 -828 328 48 -986 -248 677 -241 -979 62 650 -390 -951 402 484 -805 -484 476 206
1247 206 -696 -285 417 96 -500 -330 405 106 -606 -238 654 18 -645 77 472 -39 -497 24 578 -20
1267 -20 -724 256 811 -310 -472 593 691 -400 -216 740 482 -333 -52 760 375 -290 67 792 298 -327
1287 -327 233 620 286 -342 79 823 63 -682 402 875 -420 -491 549 431 -485 -408 411 254 -635 -502
1307 -502 488 37 -839 -381 426 -188 -881 -249 346 -313 -823 -203 323 -453 -912 12 347 -623 -643 183
1327 183 270 -494 -526 395 301 -570 -340 570 235 -548 0 719 174 -423 205 704 126 -381 221 793 152
1348 152 -422 457 904 -251 -295 679 591 -322 -136 631 325 -319 -63 545 279 -307 -74 608 166 -537
$$ packed form
1211C69P13j312n15J410J94j553J78J554o32j191Q33L01m14p47N96N25j25o16
1229d32l96J156k80j034P38R25r18p38J041N88j040n61J353Q2j289L21R60k70
1247B06r02M11P02l21n96J70P35k99p12L68Q92o36o63P22L95n11m58N21N54n98
1267b0p04R80N55j121j62J065R8j091J84R56k58q15K81Q12l85o65L57P25m94o25
1287c27N60L87l34o28M21P44p60p45J084M73j295p1J040j18r16P7Q19j57q89J33
1307e02R90m51q76M58Q07o14o93O32N95o59n10O20N26p76m59R24L35r70k0Q26
1327A83Q7p64l2R21r4q71K30R10l35p83N48P19n45n97O28M99n78n07O02N72o41
1348A52n74Q79M47j155m4R74q8r13J86P67l06o44K56O08k66n86K33O82m42p03
$$ plain form
1368 -537 137 575 -136 -371 145 426 -160 -439 99 369 -254 -505 177 399 -494 -557 409 78 -716 -141
1388 -141 238 -190 -509 -326 97 -79 -582 -292 98 -136 -718 -308 310 -302 -640 -90 275 -367 -507 58
1408 58 319 -311 -479 356 366 -357 -250 568 403 -356 165 802 205 -172 505 610 254 95 284 796 353
1429 353 -120 390 866 101 -297 531 796 -276 -218 576 336 -266 -273 236 366 -592 -552 385 -116 -932 -262
1450 -262 125 -518 -756 -240 -115 -643 -581 -365 -250 -389 -739 -264 230 -598 -737 290 50 -605 -209 413
1470 413 256 -503 69 777 122 -321 401 671 184 -75 436 842 114 -9 607 639 233 44 515 639
1490 639 49 -26 442 431 74 -180 195 492 -387 -344 461 -14 -518 -87 193 -189 -591 -156 163 -439 -503
1511 -503 -31 -44 -408 -480 90 53 -510 -131 137 -62 -172 -318 130 449 -466 -349 651 149 -474 58 624
$$ packed form
1368e37O74M38p11k35N16K81n86k79N38K70o23k51O82K22q93o3R66l31p94N75
1388a41L79m28l19J83M23j76n03K90L90k34n82M10O18o12l38N50L65o42j40N65
1408E8K61o30j68Q35J0p23J07Q18j65p59N21O37n97l77O77J05l56j59J89N12m43
1429C53m73N10M76p65l98Q28K65j072N8P94k40o02pN09J30r58M0R37n01q16O70
1450b62L87o43k38N16J25n28O2K16J15j39l50M75M94q28j39J027k40o55L96O22
1470D13j57p59N72P08o55m43P22K70m87k59N11M06p28j23O16L2m06j89M71J24
1490F39n90p5M68j1l57k54L75K97q79M3Q05m75n04M31K80l82m02M35L19o02o4
1511e03M72j3l64p2N70l7n63L79K68j99j10j46M48L19r15J17J000n02o23N32N66
$$ plain form
1532 624 117 -422 174 599 -62 -255 160 398 -2 -453 269 380 -339 -138 201 -14 -127 -248 63 163
1552 163 -398 -139 166 -39 -252 -214 198 28 -482 -37 481 -179 -453 272 449 -220 -264 507 370 -271 116
1573 116 474 299 93 52 495 494 -71 187 619 299 49 101 488 337 -238 52 511 42 -299 43 317
1594 317 -142 -539 77 152 -483 -341 -32 -118 -535 -446 -88 -139 -707 -302 -44 -430 -467 -361 -86 -229 -520 -259
1616 -259 111 -187 -467 -86 264 -110 -408 230 378 -134 -172 376 563 -75 28 627 159 -11 170 797
1636 797 314 -30 237 469 293 -44 268 378 148 -100 193 311 49 -234 162 314 -174 -210 243 176 -313
1657 -313 -287 305 35 -449 -72 238 -131 -259 -76 218 -20 -341 40 217 -65 -189 99 245 -18 -162
1677 -162 176 263 -117 -128 163 339 -220 -279 266 144 -351 -131 265 -60 -353 -81 161 -147 -462 -92 31
$$ packed form
1532F24n07n39N96M25o61j93M15K38m00m51P22J11p19K01L39k15j13j21L11J00
1552A63n61K59L05k05k13L8M12j70n10M45N18o60k74P25J77o69m4P71j37o41L87
1573A16L58j75k06m1M43jn65K58M32l20k50N2L87j51n75K90M59m69l41L42K74
1594C17m59l97O16P5o35J42L09q6m17Q9L58n1n68M05K58l86l7J06K75j43k91K61
1616b59L70k98k80L81L50l74k98O38J48n12l8N48J87o38J03N99m68j70J81O27
1636G97m83l44K67K32j76l37L12J10k30k48K93J18k62k83L96J52m88l6M53o7m89
1657c13K6N92k70m84L77L10l69j28J83K94k38l21L81J77k82j24K88J46k63j44
1677a62L38Q7l80j1K91J76n59n9N45j22m95K20L96l25k93K72K42l08l15L70J23
$$ plain form
1698 31 -239 -434 -141 -2 -238 -416 -93 21 -344 -300 -18 57 -244 -210 189 132 -221 -83 353 152 -106 176
1720 176 440 246 -79 329 449 131 18 325 435 138 74 327 378 62 34 315 271 37 -35 242 180 -231
1742 -231 -101 209 9 -326 -157 133 -40 -343 -166 72 -141 -446 -79 32 -232 -293 -12 43 -226 -216 61
1763 61 97 -222 -215 161 70 -162 -146 203 80 -228 -59 179 8 -232 13 204 -95 -233 69 99 -157 -211 76
1786 76 83 -197 -225 53 84 -243 -217 131 88 -210 -132 174 91 -196 28 333 122 -125 129 378 124 -27 249
1809 249 391 112 107 251 441 100 20 257 301 231 -2 367 313 63 -2 316 321 -257 -89 42 32 -37 310 9
1833 9 -127 -448 -194 6 -331 -440 -117 -100 -384 -391 -146 -80 -353 -303 -67 -106 -246 -269 49 40 -308 -109 178 50
1857 50 -123 49 199 73 -10 155 264 99 4 317 241 133 -150 179 290 48 148 411 152 -151 12
$$ packed form
1698C1k70j95K93J39k36j78L23J14l65M4K82P5l01L4L99n7l53J38M36k01k58K82
1720A76K64j94l25M08J20l18j13L07J10k97o4K53N1l16k8K81m4k34p2K77o2m11
1742b31J30L10k00l35J69K90j73l03J77K38k13l05L67J11k64o1K81N5k69J0K77
1763F1L6l19PL76r1k32J6L49j23l08J69K38j71k40K45J91k99j38L02L0k56n4K87
1786G6Pk80k8K78L1l27K6L48m3k98P8L06q3k87K24L05k11k47K54K49k54j51K76
1809B49J42k79nJ44J90l41q0K37M4p0k33L69n4k50o5L18Nn78J68J31j0o9L47l01
1833Ij36l21K54K00l37j09L23J7k84pK45O6k73N0K36l9j40k3L18rl48J99K87j28
1857E0j73J72J50j26q3J65J09j65r5L13p6j08k83L29J11k42J00K63k59l03J63
$$ plain form
1878 12 219 108 -108 -267 381 45 -57 149 383 55 -222 125 25 39 98 -11 -184 4 -331 -155 346
1899 346 -258 -469 167 -11 -165 -366 -55 -1 -227 -216 87 -55 -176 -149 21 -45 -292 -98 168 -161 -184 90
1921 90 95 -82 -134 101 155 -115 -31 150 140 -53 -62 218 228 -146 72 295 121 38 102 269 202 -85 67 356
1945 356 68 1 193 279 117 -126 208 254 -45 -28 92 9 -72 -36 59 45 -137 -101 36 -110 -189 -124 21 -117
1969 -117 -306 -79 55 -257 -227 -62 -25 -132 -359 3 76 -266 -211 56 54 -209 -203 67 100 -210 -8 109 48
1992 48 -29 -69 153 96 -73 16 195 24 -27 72 227 99 -111 144 177 -3 -53 126 190 2 -44 270 150 -120
2016 -120 136 178 16 -41 48 202 -48 -105 109 131 -11 -113 72 153 -24 -206 96 124 -98 -115 13 92 -67
2039 -67 -163 120 70 -237 -67 12 -50 -123 -154 61 -45 -188 31 34 -59 -49 -28 46 -31 -154 62 79 -117 -32 66 110
$$ packed form
1878A2K07j11k16j59O48l36j02K06K34l28k77L47j00J4N9j09j73J88l35J76N01
1899C46o04k11O36j78j54k01L11N4k26J1L03j42j21K7J70o6k47J94K66l29k3K74
1921I0Nj77n2K35N4k70Q4J81j0j93rK80J0l74K18K23j74q3O4J67o7k87J52K89
1945C56k88o7J92Q6j62k43L34M6k99J7J20q3q1L6R5j4j82L6J37j46p9O5J45j38
1969a17j89K27J34l12L0J65L7j07k27L62P3l42N5K67kk63OK70L3l10K02J17o1
1992D8p7m0K22n7j69Q9J79j71n1R9J55j28k10K55L3j80n0J79O4j88m6L14j20k70
2016a20K56M2j62n7Q9J54k50n7K14K2j42j02J85Q1j77j82L02K8k22j7J28P9j59
2039f7r6K83n0l07J70P9o2p3l1K15j06j43K19Lr3J0K1P4p7j23K16J7j96Q5R8M4
$$ plain form
2065 110 -106 -70 137 47 -137 33 59 83 -142 -45 129 -27 -202 77 105 -20 -131 -7 125 -56 -124 81
2087 81 82 -72 -83 -4 117 -91 -15 168 101 -56 9 112 132 31 -5 205 152 22 192 211 97 21 101 235 3
2112 3 -63 179 190 -52 15 114 167 -101 -34 115 -14 -68 -106 14 22 -157 -153 40 -116 -269 -151 13 -158 -240 -154
2137 -154 -19 -173 -250 -74 -57 -193 -173 -45 21 -123 -58 28 25 -37 -6 81 53 -5 24 182 32 -28 142 202 152 31
2163 31 121 230 114 69 181 204 22 26 122 175 -18 -11 136 97 -26 -67 76 -16 -99 -25 38 11 -111 -57 -17 -36 -138
2190 -138 -79 47 -138 -130 -5 29 -133 -93 -12 24 -91 -46 94 15 -34 -28 108 33 -84 29 116 0 -32 90 84 7
2216 7 -24 9 99 -53 -71 12 63 -144 -91 33 44 -95 -100 40 62 -144 -124 12 26 -105 -14 34 -27 -68 -61 81 18
2243 18 -107 29 101 -50 -79 39 92 77 -51 79 122 -26 6 166 116 4 16 97 74 -63 54 139 44 -69
$$ packed form
2065A10k16L6K07r0j84J70K6K4k25R7J74j56j75K79K8j25j11J24J32j81o8K05
2087H1Jj54j1P9J21k08P6J83o7j57O5J03K0j01l6K10n3j30J70J9j14p6Q0J34k32
2112Co6K42J1k42O7R9N3k68O7J49j29n4l8J20Qj79MJ93j56j53J18J64j71q2Q6
2137a54J35j54p7J76J7j36K0J28O6j44O5Q6lo2L1Q7k8n8K9J58j50o0J70O0n0j21
2163C1R0J09j16m5J12K3j82MR6N3j93PJ47l9j23m1J43r2q3P4O3k7j22N4M0j9j02
2190a38N9J26j85QJ25L4j62M0Q1L6j15M5J40p9m9OJ36p5j17J13Q7j16l2J22op7
2216Gl1L3R0j52j8Q3N1k07N3J24J1j39nJ40K2k06K0J36J4j31R1M8o1m1PJ42o3
2243A8j25J36P2j51k9J18N3j5j28J30M3j48L2J60n0j12J2Q1k3j37J17Q5r5j13
$$ plain form
2267 -69 24 88 -22 -139 19 91 -34 -129 33 65 -22 -80 11 47 -50 -115 33 42 -48 -82 56 53 -66 -39 101 60 -41
2294 -41 -6 84 -5 -76 14 26 -15 -81 21 60 -23 -82 43 120 -68 -32 -2 -20 -78 -82 38 7 -55 -12 22 -27 -108 -64 44
2323 44 -39 -99 1 20 -32 -40 44 137 -13 -27 99 151 -1 30 107 70 -20 -30 123 116 -69 9 123 7 -58 54 95
2350 95 -12 -82 18 87 -44 -51 -43 18 -64 -98 25 40 -85 -94 60 -22 -39 -94 -23 9 -162 -72 20 -75 -82 -18 4 -36 -67
2379 -67 31 75 -22 -66 -11 80 -11 -47 94 93 -34 26 65 89 15 -23 141 100 -60 3 119 59 1 16 128 103 -50
2406 -50 84 63 -41 -16 7 25 19 -54 54 25 -30 -30 14 38 -17 -46 45 36 -115 6 24 -52 -97 -104 56 -67 -131 -41 -23
2435 -23 -71 -119 -50 37 -74 -157 21 4 -78 -53 -45 55 -19 -34 24 110 -66 33 119 33 69 -1 117 42 30 111 85 69
2463 69 72 69 108 1 -33 126 77 21 27 30 59 -22 -11 143 -70 -86 20 11 -5 -48 -88 66 -23 -135 -23 21 -20 -129
$$ packed form
2267f9R3O4j10j17J58P2j25r5J62L2q7n8R1L6r7o5J48Rr0l4J38lj19K7J40m1j01
2294d1L5R0q9p1R0J2m1o6J02L9q3n9J25P7j88L6L0j8n8mJ20l1o2M3L4m9q1M4J08
2323D4q3o0J00J9n2qQ4R3j50j4J26N2j52L1P7l7r0j0J53pj85P8J14j16o5J12M1
2350I5j07p0J00O9j31pQO1q2l4J23J5j25rJ54q2j7n5P1L2j71R0R2r5pO4K2m0l1
2379f7R8M4r7m4N5R1r1l6J41jj27O0L9K4p4l8J64m1j60O3J16o0n8J5J12k5j53
2406e0J34k1j04K5K3J8op3J08k9n5%M4K4n5k9R1rj51J21J8p6m5pJ60j23o4R0J8
2435b3m8m8O9Q7j11q3J78j7q2K5QJ00p4j5N8Q6j76R9Q6q6L6p0J18p5j2Q1k6j6
2463F9LlL9j07l4J59m9n6OLK9q1J1J54k13j6J06rj6m3m0J54q9j12J12M4m1j09
$$ plain form
2491 -129 -73 62 -18 -95 25 28 -73 -47 -44 24 -30 -77 44 -21 -69 -29 8 15 -38 -45 74 15 -82 26 11 -38 -47 -22 69
2520 69 -95 -64 63 39 -46 8 4 122 -48 -19 115 81 -26 34 60 128 -47 -78 127 -1 -79 15 114 41 -31 3
2546 3 97 50 -24 77 -6 -29 -27 36 84 -88 7 78 -32 0 -11 -38 -36 -68 -40 35 -65 -97 -14 -24 -14 -142 27 29 -95
2575 -95 -53 -1 1 -62 -88 2 31 -74 -27 56 -4 -48 -13 21 52 -13 -5 51 -5 3 8 33 13 -50 11 111 3 -57 17 52 51
2606 51 -47 30 48 -52 -35 60 4 -68 9 7 31 -32 29 64 41 4 8 18 43 -43 30 78 -49 -20 12 14 -4 -66 60 46
2636 46 -80 -45 13 16 -33 -41 6 31 -58 -14 60 -7 -69 9 28 -22 -35 7 -8 -37 -83 -11 -2 -63 -29 10 -4 -45 44 88 -27
2667 -27 -26 -95 6 26 -42 24 110 26 -28 89 38 8 -16 55 102 -24 -21 33 36 -35 -30 52 19 -18 -4 24 31 5 -5 8 65
2698 65 -77 -65 27 7 -59 -17 -24 -16 -83 32 6 9 -92 -7 15 -65 -87 26 53 -22 16 -10 26 -22 -1 29 -5 -44 29 2
$$ packed form
2491a29N6J35q0p7J20Lj01K6LO8n4m7J21o5m8M0L7Pn3pJ19n9r7J08j5m9rK5R1
2520F9j64L1J27k4q5N4mJ18j70K9J34l4j07O0K6O8j75l1K05j28p8R4R9p3p2L4
2546CR4m7p4J01q3k3KO3M8j72R5P1j10L2j1k7Kl2K8P5j00l2Q3j0J0j28J69Kj24
2575i5M2N2Ko3k6R0K9j05M7Q3o0m4L5L4L1o5QN6n6QNK5k0o3O1J00j08o0P4L5j
2606E1r8P7J8j00J7R5n6p2P7kK4o3O1L5k3l7MJ0K5q6P3M8j27K9L2Kj8o2J26j4
2636D6j26L5N8Lm9qM7K5q9M4P4o7o2P8J9n0j3M2j5k9m6P2Ro1L4L9j4m1Q9M4j15
2667b7Jo9J01K0o8O6Q6q4n4J17n1l0k4P1M7j26LN4Lp1NQ2l3l7J4K8Pk6j0J3N7
2698F5j42J2R2k0o6M2pQo7J15k6Lj01Q5K2q0k2J13K7p5L8k6L6m8K1L0l4l9P3k7
$$ plain form
2728 2 -25 -16 23 63 36 4 41 72 16 7 68 75 -34 -42 32 59 -31 -5 46 -38 -7 -10 -10 33 -29 24 -4 -20 -83 -43 3 -53 -60 -28
2762 -28 7 -88 -61 -9 3 -62 -26 -1 -44 -15 -65 29 -18 -16 14 63 14 12 34 57 46 -56 0 17 28 -13 -7 76 -2 20 58
2793 58 47 -30 -17 56 -4 15 -19 -14 104 13 24 38 10 -39 50 25 -18 -36 3 33 21 -10 -47 16 21 -14 -26 -8 -16 -45 -7
2824 -7 20 -22 -48 22 2 -21 -42 51 14 -59 -45 11 -19 -29 -10 -17 14 -13 37 48 17 -17 -13 43 23 -14 55 43 16 -4 -5 6
2856 6 -14 -74 48 -3 -59 3 45 32 -27 4 15 20 -11 38 -10 13 -30 -4 34 -29 -66 24 -53 -10 -25 -53 -2 -58 -37 20 -20
2887 -20 -72 44 14 -39 -58 -19 -4 -26 -85 8 18 9 -6 10 48 5 -48 2 -14 20 49 -5 51 3 -13 8 66 -14 -20 12 42
2918 42 -37 -42 31 -5 -45 62 -87 50 48 19 41 -50 -46 64 6 -4 -34 -2 58 -12 -4 3 15 -20 4 -13 -1 -32 15 -33 -20
2949 -20 -75 -4 39 2 -64 -18 47 -20 8 -18 18 -34 22 -49 -22 -30 -60 -4 -31 -16 -20 -24 -8 -39 -39 21 4 -12 48 -18 -6 -30
$$ packed form
2728Bk7RL9M0k7l2L7L1n6rO1Pj09qP4K7r0K6N1q4L1l%M3o2N3k8j6o3M0M6n6pL2
2762b8L5r5K7N2J2o5L6K5m3K9n0R4m7KL0M9m9kK2K3j1j02N6J7J1m1OQ3p8K2L8
2793E8j1p7J3P3o0J9l4NJ18r1J1J4k8m9Q9k5m3j8L9L0j2l1l7O3Nl5j2J8qk9L8
2824gK7m2k6P0k0k3k1R3l7p3J4N6l0j0J9pL1k7N0J1l1l4MN6k0l7O9j2k7k0jJ1
2856Fk0o0J22n1n6O2M2j3n9L1J1Nl1M9m8K3m3K6L8o3l7R0p7M3j5k8N1n6K1N7m0
2887b0n2J16l0n3j9L9J5k2n9R3J0rj5J6L8m3n3N0j6L4K9n4N6m8j6K1N8q0oL2L0
2918D2p9nP3l6m0J07j49J37kk9K2r1MJ10n8j0l0L2O0p0QPJ2l5K4j7J2l1M7m8J3
2949b0n5P1M3l7o6M6O5o7K8k6L6n2N6p1K7ql0N6k7J5mmJ6l1%O0j7j6O0o6J2k4
$$ plain form
2981 -30 20 70 -24 -9 23 5 21 -3 28 103 -22 -57 66 31 33 3 1 24 -55 7 -5 30 28 -2 7 45 -56 -1 46 -37 2
3012 2 35 -17 -23 -38 28 12 -39 -1 -17 10 -4 -22 9 41 -60 -24 -11 -4 -23 -14 -49 54 -48 10 33 -61 -52 -49 -48 3 -18 -1
3044 -1 0 -31 2 17 -6 24 -29 20 15 -33 53 19 -44 -17 24 -33 44 -23 35 24 27 -19 -11 25 22 5 56 -5 9 28 49 -20 -1
3077 -1 -16 -6 23 -58 21 15 12 36 10 23 15 -28 -34 30 -34 0 1 35 -14 -50 -32 -19 5 -93 -14 49 -21 -33 15 2 -6 57 17 37
3111 37 42 10 -10 45 -11 3 18 10 25 -30 -17 -36 4 15 54 15 -16 23 -14 -5 34 4 88 11 -19 27 -60 -64 -55 -5 0 33 -40
3144 -40 25 15 14 7 -26 55 -27 -5 -62 28 20 -23 7 10 -11 -19 19 30 -24 -19 -12 24 -80 -7 -15 0 -34 1 -49 -36 -33 6 52 -32
3178 -32 -7 -17 38 7 19 -6 13 7 44 24 24 -34 35 51 17 14 7 -11 -18 38 55 31 -15 -9 31 -44 -28 30 -29 -16 -45 0 -6 -21
3212 -21 -63 33 28 -21 -11 3 -22 -47 28 11 46 13 -17 -18 -33 6 12 4 -20 44 12 11 -11 -17 -1 25 -42 -29 -25 79 39 -41 39
$$ packed form
2981c0N0N0r4J5L2j8J6k4L1P5j25l5J23l5Kl0kK3p9O2j2L5kl0RL8j01N5M7q3L9
3012BL3n2oj5O6j6n1L8j6K7j4j8L1L2j01L6J3Pj9Rl5J03j02N8K3r4RLJN1k1J7
3044aJl1L3J5k3L0n3M9nm8Q6l4o3K7M1n7P7o7N8j1Lm6QL6lj7N1o1J4J9K1o9J9
3077aj5J0K9q1P9olK4k6J3qm3oO4o4L4JL4m9l6J8J3K4r8P9O3p0j2M8j3qO3m0K0
3111C7Nl2k0N5n6J4J5qJ5n5J3j9M0J1L9l9l1L9l7RL9l0Q4p7l0M6q7mRN0NL3p3
3144d0O5j0jpl3Q1q2K2n7R0qm3L0Lk1qL8J1n4NPL6j04P3qJ5l4L5n0J3LL9M6q4
3178c2K5j0N5l1J2k5J9oL7k0%n8O9J6l4lpj8pN6J7k4m6OM0p5J6N8n9J3k9M5oj5
3212b1m2R6nm9J0J4k5k5P5j7L5l3l0jj5L9Oqk4O4l2jk2oJ6K6o7J3MJ04m0q0Q0
$$ plain form
3245 39 20 47 -75 -12 24 -21 -10 3 4 4 -44 -7 12 -42 38 -12 -8 -29 2 16 -77 -20 46 -47 -28 -42 -56 -16 -24 8 68 -2
3277 -2 -4 -42 -18 -31 32 -4 -25 -2 -23 -29 -15 -29 -23 -21 -20 -2 -24 -8 19 -37 -9 39 -20 -3 9 38 0 20 14 9 43 16 -24 56
3311 56 -26 -10 -8 -13 9 -46 17 -23 41 13 34 35 -11 -19 -18 -6 -83 -33 -38 -14 -18 -17 -27 48 -30 -47 -4 -29 -21 18 9 -32 26 -3 -38
3346 -38 -9 54 0 6 17 -21 -43 -14 -66 9 -51 5 -15 -44 -18 -21 30 -66 -6 -16 40 34 -8 -42 -8 1 3 7 11 -17 41 4 -10 12
3380 12 48 24 16 73 35 15 -49 -9 -30 22 55 48 -4 -45 9 22 -10 11 -13 -23 12 -6 -2 -49 -2 -5 37 -9 22 -23 31 12
3412 12 -14 -40 -19 -29 -44 -50 -7 31 -20 -1 -37 -73 -13 -3 16 -6 42 35 53 9 44 6 2 -20 -24 20 24 15 1 -34 -16 -11 -30 63
3446 63 22 -16 -10 -7 4 -16 -41 14 -15 2 -5 15 8 -11 -7 39 -3 -24 35 39 34 37 -65 -24 -130 40 66 32 -6 65 -43 -4
3478 -4 36 15 74 5 29 -49 -105 26 9 -104 31 -54 53 -76 -66 -69 -76 11 -2 43 102 -79 -74 -106 299 241 23 -198
$$ packed form
3245C9j9K7j22O3L6m5J1J3J%m8L7J9n4Q0n0Mk1L1J4r3N7O6r3J9j4j4M0qL2O0p0
3277bkl8K4j3O3l6k1K3k1oJ4j4OKJJ8k2J6K7n6K8M8n9J7J2K9l8K0onL4k7m0Q0
3311E6q2J6KnK2n5O3m0O4k8K1Jm6qJJ2p7N0nK4mJj0P5p8j7M3k5QL9rm1N8k9l5
3346c8K9O3n4OJ1l8k2K9n2P5o0N6k0k9K6lN1r6O0j0N6om2l4L4RKMMk8N8l7j4K2
3380A2L6k4qN7l8k0o4M0k1N2L3pn2m1N4J3l2K1k4j0L5j8Mm7M7lM2m6L1m5N4j9
3412A2k6k6K1j0j5oM3L8n1J9l6l6O0J0J9k2M8pJ8m4L5l8mk2mM4Mrj4l5J8Nj9R3
3446F3m1l8OLJ1k0k5N5k9J7pK0pj9MM6m2k1N9MnLj02M1j06J70K6l4l8P1j08L9
3478dM0k1N9o9K4p8n6J31j7j13J35q5J07j29J0lpQ7j3M5N9j81Nl2M05n8k18k21
$$ plain form
3506 -198 240 -44 -44 -4 -18 20 2 67 16 6 11 22 10 45 -9 -34 -10 -21 -8 -13 -5 -17 4 -29 14 -41 -17 -19 18 -49 -30
3537 -30 15 16 -12 -40 2 4 -2 -13 -23 -1 8 8 3 1 -28 -10 17 -45 33 -17 -2 -13 -22 -75 15 -30 -26 -12 -33 -5 18 -26 -38 -87 140
3572 140 -74 -319 -7 -4 -20 68 61 -26 91 -65 8 -20 38 -33 70 17 -14 -18 30 -17 41 26 10 44 51 -19 18 32 -23
3601 -23 -4 -40 11 -10 38 27 -37 -9 -7 9 57 -25 -16 14 19 -6 -23 -15 -36 11 34 51 11 -43 -66 -19 2 18 -3 -31 -10 4
3633 4 5 -53 26 -33 30 2 -16 57 -29 6 -38 -38 -40 53 -116 -77 43 45 -46 122 -69 0 -86 290 -43 -288 37 9 45
3662 45 58 -52 3 -16 25 -53 157 11 -8 12 7 74 -30 -4 -9 11 27 38 1 38 -45 -28 40 4 15 7 37 -8 40 2
3692 2 25 -19 -27 3 -23 -33 36 23 -13 -1 5 -30 -5 61 -1 -5 16 -70 -200 -231 -2 -55 50 128 172 -56 -1 93 22 84
3722 84 -82 -106 -146 -183 256 271 31 -133 -121 149 -51 -254 143 33 -90 -59 2 16 -21 -30 -24 -40 -37 11 -39 20 1
$$ packed form
3506a98M38k84%M0j4L8j8O5n1j0NJ1j2L5n4k5K4j1J3nQj2K1l3M3n5K4kL7o7J9
3537c0M5Jk8k8M2Koj1j0K2R%nkk9J8K7o2P8n0J5j1rn3R0m5MJ4k1K8K3m4j2m9K27
3572A40k14k45L12Lj6Q8pq7J17j56P3k8N8p1J03n3l1mM8m7N8j5j6L4Pp0L7J4n5
3601b3J9l6N1k1M8j1o4K8KJ6M8q2RL0Nk5j7Qk1M7K3J7m0n4k3M7K1J6k1k8K1J4
3633DJn8P9n9O3k8j8P3q6L5m4%kR3j69L9J20Kr1J68j91O9q6L76l33k45L25k8L6
3662D5J3j10N5j9M1p8K10j46j9K0nO7j04K6nK0J6J1l7L7q3J7O8l6J1qL0m5M8l8
3692BK3m4qL0k6j0O9j3l6J2Ol5K5O6o2mK1q6j30l1K29n3J05P8M4k28N5R4p1O2
3722H4j66k4m0l7M39J5k40j64J2K70k00k03L97j10j23L1O1J4l7rOj6LM8n0N9j9
$$ plain form
3749 1 14 31 28 -14 -35 -20 15 -24 -20 33 0 23 20 26 11 31 3 36 24 -41 32 6 54 -10 27 -9 13 23 -11 -17 25 20 30 -11
3783 -11 -49 -9 59 -18 17 18 10 -11 -12 20 20 -21 -18 -30 7 35 23 16 61 -102 45 369 -160 -397 -16 0 85 -77 -108 111
3813 111 1 13 0 -44 -94 -11 30 44 -20 4 5 -35 -21 34 -2 54 3 42 0 35 -32 0 7 -6 24 56 12 13 42 23 -12
3844 -12 -10 -53 -30 10 -11 49 -59 8 13 22 -15 10 68 10 -50 -35 44 -15 23 -11 7 -1 14 -10 32 56 14 1 4 22 -75 -25
3876 -25 -13 144 -47 105 -74 -108 -26 -100 70 -20 -72 22 3 1 -9 -14 -8 53 23 19 14 -7 -35 -63 -54 -1 14 7 -17 -84 -16
3907 -16 25 13 27 23 21 27 32 -24 -1 8 50 36 3 -18 38 50 6 -25 1 -15 -6 35 27 48 39 38 -44 26 28 -28 9 -34 -39 6 -28 -74
3943 -74 -66 28 13 8 -70 9 -55 -14 2 -8 11 1 30 30 -13 48 -1 -29 -6 -21 -47 34 58 -49 23 -39 -6 17 -58 -53 19 13
3975 13 -23 24 -29 -13 13 -18 53 -18 -15 65 -15 17 41 13 21 -8 6 32 30 49 16 30 -19 -40 -31 63 -36 4 17 10 -41 35 4
$$ packed form
3749AJ3J7lm2k1J5L5l9MN3l3K3lOj5K0k8L3j2o5P3k6M8o4L7l6K2J0l4oM2nJ0m1
3783a1l8M0O8p7L5Jqk1jL2%m1Lj2L7K8j2pM5j63J47L24n29k37L81J6Q5j62l1K19
3813A11j10J2j3m4n0Q3M1J4o4K4Jm0J4N5l6N6n1L9m2L5o7L2Pj3L0L2m4JK9j9l5
3844a2Km3K3M0k1O0j08O7NRl7K5N8n8o0J5P9n9L8l4J8qJ5k4M2K4m2j3LJ8r7N0
3876b5J2J57j91J52j79l4Q2p4J70r0n2R4j9kj0nOO1l0mnk1k8k8RN3J5pk4o7O8
3907a6M1j2J4mkONn6K3RM2j4l3k1N6J2m4l1K6j6RM1qK1rjq2P0Kn6L7m3nM5l4m6
3943g4QR4j5np8P9o4M1J6j0J9j0K9%m3O1m9k8K3j5k6Q1K4j07P2o2L3K3p5NP2o
3975A3l6M7n3J6K6l1P1p1LQ0q0L2K4k8Qk9J4K6kJ9l3J4m9k1RR4r9M0J3pn1P6l1
$$ plain form
4008 4 -14 -57 -49 -10 23 -27 -1 -44 -24 -11 -35 -1 12 5 21 -26 -29 -33 21 34 -4 -24 43 38 -21 -18 7 88 23 -1 33 24 8 43
4042 43 13 3 22 -21 47 -15 -17 -30 62 41 34 -18 -16 4 -6 1 -70 -6 31 4 -31 47 -20 0 -76 -24 -18 -56 -24 -31 32 15 -14
4075 -14 1 1 1 -6 7 -31 -42 41 -17 -43 44 31 -49 16 7 20 -35 -17 16 42 -3 18 -37 -14 25 15 20 32 -41 -17 57 -47
4107 -47 -17 -33 -39 40 21 -5 7 69 25 -5 13 21 -43 34 -37 2 -39 -1 -20 -5 -17 -18 -35 -60 25 14 21 -9 -51 -39 21 -17
4139 -17 74 -23 -12 35 30 45 31 4 -9 -62 15 -31 -13 7 -14 9 -37 -2 23 4 -44 -7 -16 -1 28 -21 -7 31 22 -26 -24 10
4171 10 -42 -43 -8 -4 -20 -26 20 -29 20 -2 -12 16 -13 -27 -13 -63 8 -34 29 -37 -50 28 40 -22 11 28 -24 -12 -32 20 -15 33
4203 33 50 -34 -65 22 -10 33 73 -48 -23 -33 19 -17 19 3 17 -3 -25 -42 -27 -14 -33 26 -13 23 11 47 31 38 29 39 4
4234 4 -11 14 13 -34 19 19 -7 -8 -1 25 3 -8 21 6 9 -18 -28 18 0 9 29 -35 15 -16 -21 -14 1 -38 14 -31 -13 18 15 -16 24
$$ packed form
4008Dj8m3QL9L3n0K6m3K0J3k4L4J3pJ6m7lmN4J3l8k0O7nn9LK5Q1o5k4L4rj6L5
4042D3l0j0J9m3O8o2kj3R2k1pn2KK0j0Pp1O4L7k7l5P8o7K0p6N2Ol8L2pO3j7k9
4075a4J5%%pJ3l8j1Q3n8k6Q7j3q0O5rJ3n5J8L3K6m5K1n5K3L9j0NJ2p3K4P4j04
4107d7L0j6oP9j9k6J2O2m4l0J8Qo4P7p1L9m1L8j9J5j2jj7k5Q5j1Pl0m2J2O0l8
4139a7R1r7J1M7nJ5j4k7j3n3P7m6J8K0k1K3m6L5K5j9m8L7rJ5K9m9J4L8rm8KL4
4171A0n2jL5Mj6oM6m9M9k2j0K8k9j4J4n0P1m2O3o6j3P8J2o2L3J7n2J2k0N2l5M8
4203C3J7q4l1Q7l2M3M0j21K5j0N2l6L6j6J4k0k2j7J5J3j9N9l9L6j2L6j6PrJ0l5
4234Dj5K5jm7N3%k6jPK6k2j1K9j5Lk7j0M6j8RK0o4N0l1nPJ5l9N2m5J8L1ll1M0
$$ plain form
4269 24 -57 1 -10 -16 -18 45 21 36 -27 -16 22 -4 -41 10 -21 57 -32 6 53 -36 6 16 22 -28 -2 -3 14 -37 -44 -10 61 -6 -2
4302 -2 50 -11 -12 56 11 -10 -4 8 -43 2 12 -5 0 -43 -20 -34 -44 -41 -17 34 -16 5 -36 -54 -32 -16 15 9 25 43 -12 40 -52
4335 -52 67 -52 -5 26 -57 -12 -21 36 -7 -8 -8 -37 -11 32 -7 -46 30 -61 19 -2 65 90 18 -21 41 26 3 11 -1 -5 0 11
4367 11 -31 54 13 79 21 11 -47 -36 -3 -40 -2 3 36 28 -39 21 5 41 -30 23 -78 16 -133 -88 -65 145 -24 23 -14
4396 -14 -184 169 -218 47 87 -110 -163 44 -130 107 8 -7 -24 19 -44 -52 -37 75 44 7 32 -17 -10 -15 -51 27 -39
4423 -39 21 4 -33 0 8 -20 46 -14 -46 30 -15 27 41 -2 -23 6 -22 13 -22 41 10 -20 -3 20 -2 -14 -62 5 42 -14 23
4454 23 -13 11 40 4 -80 -12 15 -29 -22 31 -25 -7 -9 5 -23 -21 -8 5 -14 -6 -1 -18 1 7 8 14 48 -40 19 -3 45 -37 1 -14
4488 -14 -5 16 60 -29 -37 28 -15 -13 15 -51 -61 10 -15 25 -19 11 1 19 11 -29 38 23 -1 55 42 -10 -11 21 34 48 33 0 13
$$ packed form
4269B4q1N8j1okO3k4J5o3J1L8k6l7N1l1P8q9L8M7q9M2J0On0K6jJ7n1pL4P1o7M
4302bN2o1jO8m5k1OJ2n1M5J0j7Nm3K3j4j0LK4N1n0K1m1j8K2J6L1oJ6J8n5N2r2
4335e2J19j19M7L1q3M5rN7m3j%k9K6M3l9l9P6r1Q0k1O7K5p2l9O2j5k3Qj2mNJ1
4367A1m2Q5m1O6n8j0n8J1L3l7L8NL3qo7O0j6L6p1N3j01R4j49M5K3K10j69M7l7
4396a4j70L53l87K65M0j97n3K07j74K37r9j5j7M3o3qJ5J12l1l7K5m9Pnl6P8o6
4423c9O0j7l7L3Qk8O6o0l2P6m5M2J4m3k1K9k8L5l5O3l1l0J7K3k2j2m8O7L7n6L7
4454B3l6K4K9l6q4O8K7m4PN3n6J8kJ4k8KJ3J3j9QNj7J9OJOL4q8N9k2M8q2L8j5
4488a4RK1M4q9qO5m3KK8o6j0P1k5M0m4L0j0J8qm0O7j5k4N6j3n2jL2J3J4j5l3J3
$$ plain form
4521 13 2 -51 -19 -40 -22 -12 -27 26 -17 18 28 11 51 11 -6 -30 17 -56 0 32 15 -28 -39 29 53 11 -11 -15 -27 -55 -31
4552 -31 -5 19 37 24 -15 -43 -21 33 15 19 -1 18 0 30 -26 30 -40 5 -38 -13 6 -53 2 -31 -53 -4 27 30 26 2 -1 15
4584 15 5 35 1 75 -23 -1 -18 1 -19 -24 6 19 -17 6 -26 5 -28 -8 34 -24 3 -7 4 41 12 -13 31 24 -16 27 -32
4615 -32 -8 -21 55 -15 12 60 4 -49 -13 38 -19 24 10 -3 -15 11 24 12 18 -38 -10 27 -41 3 -16 22 10 2 -13 23 14 51
4647 51 -4 5 -32 -15 5 -6 9 42 -51 -15 -40 6 -41 -44 -35 -13 -16 -3 8 -11 2 -5 46 -40 -2 -44 -9 -1 2 -44 -5 -19 -60 35
4681 35 52 14 5 24 -22 3 14 -27 -18 -11 22 -34 20 37 3 2 -27 -47 1 12 5 -4 12 -25 -15 -60 -39 -38 -10 -7 -22 -15 -9 -5 59 0
4717 0 22 49 -16 -30 1 53 13 -12 29 7 -9 -11 14 32 -37 -10 -20 32 24 18 6 22 -8 11 1 12 -37 26 -6 -27 -7 0 50
4750 50 13 1 -9 -8 10 -56 21 28 29 22 -14 14 4 -35 -10 -48 -42 31 44 -5 -19 -11 37 -22 -9 -20 -22 5 6 -28 4 41 -58 -66 7
$$ packed form
4521A3j1n3L2k1J8J0j5N3m3L5J0j7M0m0j7k4M7p3N6L2j7m3j1O8K4m2k2mj2k8K4
4552c1K6K4J8j3l9k8K2N4j8Mk0J9j8L0n6N6p0M5m3K5J9n9N5l3k2M9L1Lmk4lJ6
4584A5j0L0l4P4r8K2j7J9k0nL0J3l6K3l2L1l3K0M2n8K7j0J1L7k9k5M4pm0M3n9
4615c2K4j3P6p0K7M8n6n3L6N1n7M3j4j3j2K6J3j2On6K8L7o8M4j9L8j2qj5L6rL7
4647E1n5Rl7J7K0j1J5L3r3L6k5M6m7lRK2lJ3J1j9J3pN1q6L8m2L5QLm6L9j4m1R5
4681C5J7l8rJ9m6K5J1m1RPL3n6N4J7l4jk9k0M8J1prJ6l7J0m5K1JK8Lj5POMO4n9
4717@K2K7o5j4L1N2m0k5M1k2j6kK5J8o9K7j0N2qoj2J6l0J9j0J1m9O3l2k1K0PN0
4750E0l7j2j0JJ8o6P7PJpl6K8j0l9K5l8OP3J3m9j4QM8n9J3j1kK7Jl4L2L7r9qP3
$$ plain form
4785 7 -25 -26 -47 -12 -20 67 12 39 3 -9 12 -42 28 17 -30 6 -48 0 29 -23 -23 55 -4 12 18 -61 -33 1 -19 -28 29 51 13
4818 13 -23 -55 -23 -9 29 -14 -24 23 -9 20 20 35 -21 21 -41 -14 -17 -25 -6 18 -14 -22 2 36 51 -5 34 10 5 6 25 -8 6
4851 6 -21 -19 -15 11 -7 -8 -24 21 -6 -10 1 38 -32 -45 -25 24 17 -29 24 2 -34 18 -10 -29 -29 -41 25 35 39 17 -11 39 32 23 26 84
4887 84 21 2 47 -25 -11 -21 3 -22 21 -2 26 -42 -46 11 3 -21 0 16 -52 -13 -37 -31 16 -47 -7 30 -25 -8 18 -27 22 13
4919 13 -14 26 22 -11 -41 13 -25 -19 10 -24 5 39 17 -15 9 54 37 43 -37 -56 33 3 2 -31 -46 -3 -38 -12 -43 -28 -20 53 -36
4952 -36 15 -31 28 22 -14 -26 51 37 -5 47 -17 36 9 15 -16 -3 2 7 22 12 -48 35 -41 37 -23 -39 -10 -18 -25 -31 23 36 -25 -10
4986 -10 2 15 3 -16 -43 -44 -33 7 10 -20 35 -2 17 -6 17 -18 -16 -43 -66 -12 -30 -19 -43 -15 -23 6 -7 63 50 38 29 45 -4
5019 -4 16 27 20 -20 -13 14 -19 1 6 -17 27 -29 -58 11 -29 18 23 -2 22 28 14 6 34 33 -12 10 36 3 -15 32 30 56 -30 -16 19
$$ packed form
4785Gl2jk1L5qQ7n5K7l6j2K1n4P0j1m7L6n4M8K9n2%P8n9J6Op9K8L4k0rN7K2l8
4818A3l6l2L2J4L8m3j0M7l2K9%J5n6M2o2K7lqJ9K4l2qK4L4J5n6L9k4nJJ9l3J4
4851Fk7KMK6j8jj6M5k7mJ1L7p0j3K0M9pm6N3k2l6N2k8j9%j2O6J0Mk2k8N0prLN8
4887H4o3j9M5p2J4j0K4k5M3k3K8o8mN7qk4K1J6o8L9k4OM7o3M0L7n5J7K6m5M9r
4919A3k7M0ml3l0N4l8OK9l4K9L4k2l2K4M5j7Oq0j9Q9l0jl3j5M3l5K6l1J5QP3q9
4952c6N1m6N9ol6j2P7j4m2N2o4N3k7Ol1J3NNJ5j0o0Q3p6P8o0j6K9qpoN4J3o1J5
4986a0J2J3j2j9k7jJ1M0Ll0N5l7J9k3K3l5Kk7k3N4j8J1k4K8qK9j3P0j3j2rJ6m9
5019dK0J1pm0PK7l3K0Nk3M4n6k9O9m0M7Nk5K4Oj4qK8jm5K2K6l3j8M7kK6q6J4L5
$$ plain form
5054 19 17 32 -52 -12 2 7 13 -12 -16 -45 -17 -14 -31 5 -17 -46 26 37 -30 -10 -17 32 -29 -3 34 -8 19 47 24 -53 14 63 -5
5087 -5 4 38 39 29 18 -31 37 -13 -30 -10 36 -18 5 49 20 -22 -11 -4 -46 22 74 38 25 23 -8 -22 52 18 21 37 -15 -4 21
5120 21 7 37 11 3 15 50 24 -30 51 -3 -18 48 -34 28 -19 -18 -25 -29 -19 53 6 33 4 -40 28 -6 -4 56 -24 -19 12 -5 -18
5153 -18 -2 -15 -8 -19 9 17 31 -24 -26 77 20 -29 -15 4 48 -36 24 -12 20 35 -9 0 -50 -31 8 23 7 -45 17 37 27 -23
5185 -23 -25 52 -12 -5 -9 26 -1 -17 -16 -18 53 33 -3 -23 -29 7 24 43 -6 8 -47 30 20 44 -9 -34 -13 5 -12 4 37 33 26 -17
5219 -17 60 30 45 2 -41 14 -17 -8 45 -7 31 15 8 13 -2 -25 -50 -6 43 0 7 19 28 -8 6 54 -12 -33 3 60 22 69 -40
5252 -40 -27 -4 14 -8 -4 0 34 1 11 1 6 56 32 -12 13 -45 -6 -18 -7 -4 1 7 57 -21 -11 23 -39 18 16 5 5 10 9 -31 29
5287 29 9 9 -1 -4 41 51 -18 46 3 -13 -22 21 -1 14 10 -59 0 -10 -55 -11 36 -34 18 -106 46 9 5 -34 -89 -1 60 -6
$$ packed form
5054A9kJ5q4M0J4NOk5mk9K8Lj7L6k2k9P2J1o7K0pM9o1K6L7m2K7K8k3p7O7M9o8
5087eRL4Jj0j1m9O8n0j7K0M6n4K3M4k9m2J1Pm2O8N2l6j3kl1j4P4l4LJ6n2J1K5
5120B1j4L0k6qJ2L5k6n4Q1n4j5O6q2O2m7JpmJ0P2m7K7k9m4O8l4KO0q0NL1j7j3
5153a8J6j3Pj1K8QJ4n5kJ03n7m9J4J9M4q4O0l6L2J5m4Rn0J9L9J5j6n2O2K0j0n0
5185b3kP7o4PmL5k7j6JkP1k0l6k0oL6J7J9m9J4n5P7j0K4n3k5K1J8j7J6L3mpm3
5219a7P7l0J5m3m3N5l1RN3n2L8j6pNj5k3k5M4M9m3PJ2Rl6J4M8o6k1L6N7l8M7j09
5252d0J3K3J8k2MML4l3J0j0NN0k4m4K5n8L9j2J1LNON0p8J0L4o2N7kj1%Njm0O0
5287B9k0%j0lM5J0o9O4m3j6rM3k2J5mo9N9j0m5M4M7p0N2j24J52l7ml9n5Q8O1o6
$$ plain form
5319 -6 54 61 -11 32 8 1 1 25 0 -18 3 -16 39 37 -20 15 -17 -4 -15 10 79 -41 18 -18 -10 -4 9 -38 -16 28 -10 -12 -6 28
5353 28 -25 16 14 -33 18 -27 -12 56 10 -48 22 27 18 7 3 41 -12 48 -43 29 -33 34 8 59 7 14 45 45 23 4 27 -13 38
5386 38 9 37 -19 29 -8 31 0 -14 -20 -7 20 27 -7 -12 50 51 26 20 30 18 -39 -17 -2 32 36 41 -20 10 -5 70 6 -30 -32 -26 26
5421 26 15 -47 7 26 0 2 -13 1 -9 -4 19 19 12 -2 -13 46 -9 -50 -44 2 12 14 -24 -13 -41 -26 -7 18 32 0 -10 -19 -5 4
5455 4 8 15 -16 2 24 23 20 16 9 19 28 -17 17 34 -39 -29 4 -48 19 25 -31 12 22 21 21 -54 -7 55 19 0 -16 -31 -21 27 -36 2
5491 2 1 25 20 7 -27 -31 51 -9 -33 -1 54 -11 -40 -30 -45 8 -38 -9 13 -4 -41 -22 36 11 -18 6 -37 -34 22 22 56 5 0 31
5525 31 60 8 -14 4 -21 7 19 -4 -11 62 7 37 20 -8 6 -3 -22 -3 24 -11 38 -66 16 26 4 -6 -59 -55 3 43 21
5556 21 -30 -1 32 -2 -2 9 -67 -12 -3 -17 -1 -11 7 27 27 -11 -27 -1 -3 43 -11 7 -5 42 -43 26 -35 10 -9 10 13 17 37
$$ packed form
5319fO0Pp2M3k4p%K4k5j8K1j9N5kn7L5l2J3j1K5O9j20N9l6QOJ3m7K2M4l8kOL4
5353B8n3M1km7N1m5J5O8m6n8P0Nrj1mL8n3O0r1P2o2O7k6N1n2PL1%k2j9K3m0N1
5386C8k9K8n6M8l7L9l1j4oJ3K7Pl4nO2Jk5oJ0j2n7K2J5L4MNo1L0j5P5o4l6kON2
5421B6j1o2N4J9k6Kj5J4j0NK3%pj4j1N9n5m1OM6J0Kl8J1k8J5J9K5J4l2j0rJ4R
5455DMPl1J8K2jlmpJ0Rm5L4J7p3J0L3n2O7On6M3J0j%p5M7O2l6j9j6j5J0M8o3L8
5491BjK4nj3l4mQ2o0k4L2N5o5k9J0j5N3m6K9K2j7l7J9N8k5k9K4m3LN6%L4n1nL1
5525C1K9n2k2J8k5K8J2k3pP3n5L0j7k8J4rj9J9K7l5M9j04Q2J0k2j0n3MN8M0k2
5556B1n1K9L3l4%J1p6N5Rj4J6j0J8K0%l8j6K6kM6n4J8j2M7q5O9o1M5j9J9LMK0
$$ plain form
5589 37 6 -58 -52 12 28 10 -34 -33 -22 47 -12 -24 -10 -39 -2 23 1 -7 14 -17 53 -35 29 7 20 -23 20 18 16 -12 -12 15 -10
5622 -10 -22 11 22 -12 -7 -31 18 -19 25 13 35 9 13 -36 3 16 27 -57 -61 -51 -24 -44 10 0 -22 27 18 -11 -24 15 60 -21
5654 -21 23 -45 9 8 -4 -20 2 8 -15 18 24 55 29 17 -3 -41 12 42 21 -37 4 25 -19 -19 -15 15 -17 21 -12 -33 0 22 -2
5687 -2 46 -11 28 -65 -29 13 10 6 69 -8 -55 -8 23 -8 -5 27 11 -18 -4 -8 17 -63 -12 -51 31 -40 -22 23 5 -18 -16 87 4
5720 4 6 -23 -17 20 7 59 17 -17 -19 -6 9 -11 47 3 34 47 26 -18 -10 62 -10 -14 39 -3 35 -20 -23 -48 -30 -10 17 -11 31 30
5754 30 -5 -32 -12 -15 12 33 -30 17 40 -8 -24 -34 35 -6 -21 -9 10 33 -24 4 21 28 2 20 -45 68 -19 -40 9 9 -6
5785 -6 68 32 47 92 -11 50 -68 30 18 -5 -33 -22 -2 41 14 -1 22 -6 -27 -4 29 5 -9 18 20 11 36 2 35 20 0
5816 0 44 -25 21 -19 52 21 -2 -14 22 14 -44 3 33 22 -50 -19 -10 25 2 -8 22 50 22 -24 22 1 12 -32 -30 -12 3 21
$$ packed form
5589C7l1o4OO4J6j8m4JJ1O9n9j2J4k9L7K5k2qK1l1P0q8O4k2J3m3M3kkk8%K7k5
5622a0j2L3J1l4Nk4M9l7M4j2K2k6Mm9L9J3J1q4mJ0K7k0N4j0k2M9rk9j3L9M5q1
5654b1M4o8N4jj2j6K2Ok3L3OL1k6j2k0l8N3L0k1n8M1K1m4%ML0l2L8l3k1L3K2k4
5687bM8n7L9r3L6M2lmO3p7m7M7L1l1LL2j6k9J4mK5q0N1l9Q2p1J8M5j8k3KJ03q3
5720DKk9OL7j3N2m2l4kJ3J5k0N8m4L1J3k1m4QP2p2mN3m2L8n5lk5J8K0K7k8M2j
5754C0l5k7K0lK7K1o3M7K3m8j6j0O9m1j5J2J9K3n7K8J7Pk6J8o5J13q7k1M9%j5
5785fP4l6J5M5j03O1j18R8j2k3k8J1K0M3k7j5K3k8k1K3L3k4j4K7KrK5l4L3j5k0
5816@M4o9M6m0P1l1k3j2L6qn8M7L0j1p2L1RL5k3j0L0K8k8m6M6k1J1m4KJ8J5J8
$$ plain form
5848 21 22 -39 44 -19 22 10 -37 30 -30 27 14 -6 -57 24 -7 -11 0 7 9 32 -45 1 -20 -4 -69 -18 10 -15 48 -8 -7 46 -79
5881 -79 -18 22 -14 -42 27 -5 20 -19 -52 2 7 -18 6 14 -4 14 -6 14 11 2 20 21 -37 8 2 1 1 3 -16 -55 -20 2 -46 -13 -20
5916 -20 33 -42 -34 -12 -22 60 9 6 14 -24 10 5 9 -3 10 32 58 24 11 -11 -10 42 -21 37 17 -16 -11 45 -7 37 24 4 -12 -5
5950 -5 21 -15 21 41 -11 -30 3 -12 -12 56 -8 27 -24 -44 -37 18 -7 11 9 46 -36 9 26 7 0 -26 -2 19 -16 -6 -3 -43 3
5983 3 7 -21 -58 6 34 27 -11 0 -2 -2 6 7 -25 8 -25 1 8 -26 -10 -22 -2 20 22 -25 -6 3 -1 3 12 12 11 27 -46 -2 -8 -43 6 -36
6021 -36 10 23 42 -42 -13 -42 0 -19 -46 9 -29 7 -22 -5 17 -17 -21 -15 41 -13 23 39 -14 -3 10 -46 -2 -44 15 -48 29
6052 29 43 19 -34 22 16 -2 0 -23 -22 0 -82 2 48 -40 1 5 -87 -25 -7 12 -1 -21 -53 -7 -12 77 -16 -28 -5 -63 2 41 24
6085 24 -38 -24 -43 -8 35 7 -11 -22 -19 33 51 26 26 -14 15 -36 -1 6 10 16 13 19 9 -9 -25 36 57 -3 -48 21 12 13 13 1 -11
$$ packed form
5848B1Jo1Q3o3M1j2m7O7o0N7j3k0n1Q1l1mJ1PKK3p7M6k1J6o5N1K8k5O3n6JN3j25
5881g9O1M0l6k8O9l2K5l9l3N4Nk5K4Qj8J8k0K0lrJ8Jn8M5oj%Kj9l9L5K2m8L3p
5916b0N3p5QK2j0Q2n1lQl8L4nMj2J3K2K6l4j3k2JN2o3N8k0l3NN6n2M4j3k0j6P
5950eK6l6L6K0n2j9L3j5%O8o4L5n1k0PN5k5J8kL7q2M5J7j9pk6K4K1l5J0Lm0M6
5983CMk8l7O4K8pl8J1k%QJl2L3l3K6Pl4J6j2K0K2Km7J9RmMR%jJ6p3M4ol5M9m2
6021c6M6J3J9q4K9k9M2j9k7N5l8L6k9J7K2l4mON6n4L6J6n3J1J3n6M4m2N9o3P7
6052B9J4k4n3N6oj8Kk3JK2q2Q4M6q8M1Mr2O2J8J9j3k0l2M6nQ9r3j2K3n8O5L9j7
6085B4o2J4j9L5M3k8j8j1LN2J8k5%m0K9n1L5PMOlOj0j8j6O1K1o0m5O9rJ%j2j2
$$ plain form
6120 -11 10 -33 -66 -13 33 -3 -36 -1 13 28 10 -5 10 4 37 -7 44 47 -3 28 8 -13 -27 1 -1 8 45 -11 16 -16 -5 4 23
6153 23 -41 9 7 -28 24 -10 -38 -27 27 12 5 -6 4 4 -26 -5 -23 -39 11 -12 27 33 -38 -49 42 -21 6 21 58 -4 32 4
6185 4 2 52 -20 14 -52 -15 14 41 -27 -31 4 -54 1 6 -15 13 5 -13 19 16 34 -15 12 9 -21 23 -3 29 -12 42 21 -6 -37 -10
6219 -10 -41 -31 -11 13 -10 -25 -2 31 -44 5 19 3 -44 -23 33 -10 18 -24 -68 6 20 35 -32 30 21 13 11 -32 -25 -19 92 28
6251 28 21 25 16 -4 -55 -44 25 14 -3 -19 11 7 30 9 6 14 15 11 -9 -9 -10 16 -33 34 34 30 8 -65 27 -7 -15 -32 -20 15 -19 -42 -10
6288 -10 36 -35 -13 62 -11 10 22 -2 -7 2 21 46 -6 50 3 -45 -4 -1 2 6 -56 30 77 -16 -2 -7 9 31 9 9 30 -11 5 37
6322 37 4 -15 2 27 -13 16 41 -13 -25 26 -1 -14 13 -35 14 -13 20 41 0 -46 -2 -38 -6 11 -4 13 -3 -41 2 -38
6352 -38 28 -9 -25 -3 28 37 -44 -26 -33 -14 -35 -13 -3 6 -12 5 15 16 23 17 -5 14 7 -9 64 -13 -3 13 9 -24 59 -20 0 -26
$$ packed form
6120a1K1m3l3N3M6l6l3L5J4J5j8j5J5oL3m4N1Ln0L1k0k1j4K8kRL7n6K7l2J1RJ9
6153B3o4N0kl5N2l4k8J1N4j5pj1J0%l0K1j8j6N0k3L9Op1j1R1o3K7J5L7o2L6k8
6185DkN0p2L4o6L7K9K7o8mL5n8N5Nk1K8qj8L2lJ8m9K7ll0M4k6L2m1N4k1k7l1K7
6219a0l1J0K0K4k3j5K3L3p5M9J4j6m7K1N6m3K8m2m4P4J4J5o7O2rqkm3POJ11o4
6251B8pMrk0n1J1O9j1j7j6L0mK3k1lQJmk0%jK6m9O7%mk2p3R2l4qj7J2L5l4k3L2
6288a0M6p1K2P5p3K1J2k4nRJ9K5n2N6m7m8M1LLMo2Q6M7r3J4nJ6K2k2%K1m1J6L2
6322C7l3j9J7K5m0K9K5n4j2N1k7j3K7m8M9k7L3K1m1m6M4l6L2J7j5J7j6l8M3m0
6352c8O6l7j6K2L1Rq1J8pJ9k1K2J0Rj8J7J0JPok2J9pj6P3p7J0J6ml3Q3p9K0k6
$$ plain form
6386 -26 17 -32 8 54 -1 41 6 22 10 24 -44 -55 -49 -30 31 4 -20 11 -11 19 -10 15 -40 -7 53 -31 15 31 -26 -27 9
6417 9 -17 -30 37 8 28 -17 -14 -5 14 69 -47 30 44 46 -20 -5 -4 46 -20 -46 -30 23 -5 18 17 -33 -18 15 -14 -21 -15 11 6 50
6451 50 -10 10 -25 11 -1 7 15 -17 39 9 -21 0 -14 -26 -26 -68 -10 -5 8 64 26 18 -2 14 56 6 1 4 12 -42 -27 49 11 -20
6485 -20 3 -5 -6 5 32 11 -12 32 34 -55 -6 -13 -31 22 8 15 4 -10 -7 -19 -32 0 -8 29 31 -48 -16 1 22 -29 -5 -3 17 40 -12
6520 -12 12 -31 -21 11 -7 -14 -32 10 32 -7 -7 11 44 -13 31 8 25 9 -27 -3 19 -25 9 85 23 15 -19 15 -27 36 -5 0
6552 0 11 24 -36 13 -61 6 -34 12 -30 4 -2 -13 55 4 66 41 -14 -37 -35 45 -22 -21 43 26 63 18 -21 34 48 17 5 22
6584 22 -4 -23 -4 69 26 4 62 53 42 -7 25 -13 36 2 -7 11 -25 5 -32 26 44 25 14 -43 -32 13 3 0 6 -12 15 -54
6616 -54 -4 -23 32 -51 -16 -28 7 9 27 -38 -55 5 1 -7 40 -22 -1 30 13 15 17 2 28 29 -22 38 32 -8 -17 -17 -3 4 -12 -9 -2 -19
$$ packed form
6386b6M3m9M0M6n5M2l5J6j2J4o8j1OJ9O1k7k4L1k2L0k9K5n5L3O0q4M6J6n7jL6
6417Ik6j3O7k9K0m5LRJ9N5j16P7J4Ko6J5JN0o6k6J6N3k8K3jn0J5L3k9pOK6nM4
6451E0o0K0l5L6j2QQl2N6l0l0K1j4j2%m2N8NJ3N6l8qk0J6M2n0nLQn4J5P6l8l1
6485b0K3qjJ1K7k1k3M4Kq9M9pj8N3j4Pj1j4Lj2j3L2qL7Kp9L2J7K1n1K4KK0K3n2
6520a2K4m3J0L2j8pj8M2K2l9%J8L3n7M4k3J7j6l6K4K2m4L4P6o2ql4L4m2O3m1N
6552@J1J3o0M9p4O7m0M6m2L4oj1O8n1O2k5n5k3KQ0o7JO4j7L7m5l9N5J4l1j2J7
6584B2k6j9J9P3m3k2N8rj1m9L2l8M9l4rJ8l6L0l7N8J8j9j1n7J1M5j0lOj8K7o9
6616e4N0j9N5q3L5j2L5KJ8o5j7O0mqM7o2K1L1j7KKj5K6Jn1O0om0r%J4Pj6LPj7
$$ plain form
6652 -19 8 -4 49 6 -25 5 -30 14 0 88 -3 34 -24 17 32 18 -13 -13 -54 -13 24 -16 3 25 -10 -44 -23 10 53 7 19
6683 19 46 -34 14 -6 42 0 13 42 9 -13 2 -5 81 22 30 11 8 14 12 6 -17 -12 5 3 -2 -16 4 17 19 -12 -27 -8 9 55 -6
6718 -6 -6 -53 43 -40 47 72 -37 48 -3 -18 30 21 12 3 -27 7 9 -21 40 18 11 -27 16 45 38 -31 -37 74 -1 34 25 -28 -41 2
6752 2 -23 23 29 -17 8 -30 -22 -19 -17 42 1 -15 -1 -9 -57 61 76 17 10 2 -5 0 -26 15 1 -25 8 95 18 53 -12 -1 -1 9 -20
6787 -20 24 48 19 24 6 -24 10 -11 8 13 -15 7 10 7 -7 8 -5 -45 -32 -4 22 45 -23 3 -13 24 -38 57 -4 50 -2 43
6819 43 38 10 -4 45 7 4 33 50 -14 -36 -8 41 -25 -1 -13 -27 2 8 -6 36 -27 32 -23 13 39 -9 60 -31 5 -5 -8 27
6851 27 -4 17 -11 -17 7 26 35 2 4 34 38 62 -19 9 -34 44 50 -9 -7 16 21 26 -34 -33 0 -12 -9 49 5 -16 50 -2 17 -12 -4 51
6887 51 -25 25 -4 46 39 18 26 -40 27 -9 -5 36 54 80 -18 3 -6 8 19 1 -16 4 -23 -10 51 -36 8 -81 2 -52 22 -11
$$ packed form
6652a9K7j2N3m3l1L0l5M4j4Q8r1L7n8M1J5j4l1%m1M1L7m0J9K2l5l4K1L3M3m6J2
6683A9K7q0M8k0M8m2J3K9l3k2J5pQ6n9Qj9lOkok3NJ7knj4K0J3Kl1j5J9J7M6o1
6718f%m7R6q3Q7K5j09Q5n1j5M8rrrl0L4Kl0O1k2pl8M3K9po9oJ11p5L5rn3j3M3
6752Bk5M6Om6K5l8QLKN9m1j6J4qm8J18J5n9pqpNk6M1j4k6L3Q7p7L5o5J1%J0k9
6787b0M4K4k9Nj8l0L4k1J9Nk8K2Llj4J5j3m0J3K8K6K3o8K6j6L7o2R5o1N4n2M5
6819D3nk8j4M9l8lK9J7o4k2K8M9o6K4j2j4K9Oj4M2o3N9n5L6K6m8O9r1L6j0lL5
6851B7l1K1k8oK4J9Rl3KL0MK4q1K8m3P8On9KK3NNo0JL3j2LN8m4k1O6n2J9k9QN5
6887E1p6N0k9N0pk1Qo6O7l6MM1J8K6r8K1rJ4J1j8j7K0k7J3O1q7M4q9Q3n4P4l3
$$ plain form
6919 -11 -21 -18 -17 -38 -20 -14 -8 -39 13 8 -39 22 3 -1 35 -13 6 42 -2 -16 -15 14 -20 -8 -46 -26 6 15 -27 3 63 -30 34 21
6953 21 6 -1 29 -81 -39 -9 -28 -1 -11 7 7 -28 -43 7 29 -20 -17 -17 -16 -22 -3 56 -30 -25 2 20 -2 -27 -34 42 -9 -30 -2 30
6987 30 -11 4 9 9 -36 5 17 12 -5 12 5 -23 -16 -18 -44 -44 17 5 15 -34 -64 9 22 35 -12 17 45 -31 -13 -21 13 -2 17 -12
7021 -12 6 40 -15 14 -43 4 -34 22 59 -1 29 -45 -43 -6 24 -53 8 -1 4 -78 53 17 -10 -34 16 -22 17 24 77 15 23 -15
7053 -15 -21 13 17 8 -14 -67 -4 26 -48 12 6 16 20 1 9 -13 -4 -17 -12 29 34 27 -21 -5 35 -38 25 -4 16 17 0 51 -3 7 7 15 2
7090 2 68 -41 -20 -13 -25 8 -25 3 33 6 -3 11 17 -35 31 -36 -32 32 -3 21 30 11 12 43 -33 29 -72 30 -42 66 -6 45
7122 45 -7 30 11 -12 5 -2 -16 -26 -27 26 -34 -15 -4 18 -19 8 83 3 7 -41 -33 -43 -39 8 -4 -7 61 31 39 12 35 61 45 30
7156 30 43 -59 38 22 61 -2 -10 73 23 -7 15 28 45 17 -56 29 16 -13 21 -49 4 33 -18 -13 11 24 -4 5 8 6 35 -36
$$ packed form
6919a1j0LJk1J8OOl1N2nm7O1j9mL6m8J9L6m4j4JK9l4J2l8K0L2Rm2L0O0r3O4j3
6953B1j5pL0j10M2L0j9K7j0J8%l5j5N0K2m9L%JoJ9N9q6NK7J8k2k5pP6n1k1K8L2
6987C0m1J5N%m5M1J2nj7J7pk8Pkk6%O1j2J0m9l0P3J3J3m7K9K8p6J8qL4j5J9k9
7021a2J8L4n5K9n7M7l8N6L7o0L0p4KL7L0p7O1rNq2J31l6k7k4N0l8L9PN3o2Ql8
7053a5oL4Mrk2n3O3L0p4O0oJ0Mj9Qk2Rj3NM1Npm8J6M0p3O3k9K0Jj7N1n4J0%Qj3
7090BO6j09K1Pj2L3l3K8L0k7rJ4On2O6o7MO4l5K4Rj9JL1p6O2j01J02p2J08p2N1
7122D5n2L7j9k3J7pj4j0jN3o0J9J1K2l7K7P5q0Mm8Qj0MM7j2lO8l0Qk7K3K6j6j5
7156C0J3j02R7j6L9o3qQ3n0l0K2J3J7k8p3Q5j3k9L4p0N3K9n1NK4J3k8RLkK9p1
$$ plain form
7188 -36 -47 10 24 8 7 -7 -10 19 16 -13 70 -44 46 24 -31 2 -17 52 2 -63 -8 -22 -13 -3 17 -54 -21 53 2 39 -34 19
7220 19 11 -6 -30 18 -26 18 -40 -35 16 27 34 22 -63 41 62 75 18 20 28 65 14 12 -25 -52 36 52 -12 0 6 -4 -20 29 5
7253 5 -22 -21 18 -17 22 16 20 31 -27 -14 35 40 -21 -12 -21 39 53 19 4 -65 -13 14 7 11 -60 -27 35 9 40 -30 -42 -23 -63 -5 -33
7288 -33 -20 -9 -2 10 8 9 -13 -5 4 1 4 -12 7 47 3 10 7 -1 38 9 36 28 -12 30 2 28 1 -21 23 25 -17 -11 -40 49 -28 -23 31
7325 31 26 1 0 -2 -12 -2 76 24 -75 -32 8 -11 3 -28 -15 64 2 -11 3 -3 -27 60 -7 24 -12 22 -11 -17 32 24 16 -12 -39 21
7359 21 32 22 6 -73 16 -10 -53 -19 -38 -3 -26 -38 -88 5 30 38 22 18 20 38 -36 8 -6 -4 6 17 14 -29 22 26 3 -12 -40
7392 -40 9 -2 8 -26 3 27 -28 -8 -58 24 -5 -26 40 1 -30 27 10 18 4 34 48 -28 0 -38 -2 -37 -12 2 47 -8 -14
7423 -14 27 15 -3 39 78 -2 15 23 19 -26 -56 -11 58 20 -26 -15 10 -27 -21 25 -21 -12 11 -18 -13 -3 13 -22 -5 17 15 14 45 -48
$$ packed form
7188c6j1N7J4j6jj4lK9lk9Q3j14R0k2n5L3j9O9n0o5N5j4RJ0K0p1L3P4n1L7p3N3
7220A9qj7k4M8m4M4n8NN1J1Pj2q5J04K1J3n7KQL7n1kl7k7Q8J6o4J2Oj0j6M9k4
7253Ek7JL9l5L9oMJ1n8J3M9No1RrO0J4l4j5o9N2K7pMp1L3O2k6L1p0j2J9m0N8k8
7288c3J3J1PJ2kJk2QRlLj6J9M0m4PlqL9k9K7qm0M2k8K6k7k2M4Km2Ok9Q9p7NN4
7325C1nk5jkj0J0P8n2r9M3M0j9J4l1J3P9o2j3J4ok4Q7o7L1l6L4l3oM9qqk8k7O0
7359B1J1j0j6p9Q9k6m3L4j9L5k3j2n0R3K5Qj6mKJ8p4M4j4KJ0J1lm3N1Mk3j5k8
7392d0M9j1J0l4K9K4n5K0n0Q2k9k1O6l9l1N7j7Qj4L0J4p6K8l8L6l5K5J4M5n5o
7423a4M1j2j8M2L9q0J7Qmm5l0M5O9l8m6J1K5l7OM6m6RK3k9NJ0J6l5J7K2kjL1r3
$$ plain form
7457 -48 15 -16 -14 22 -8 7 17 -79 26 -9 24 22 19 0 0 27 -6 46 6 -5 -52 -29 5 1 -6 -37 -32 8 -8 -34 6 16 -40
7490 -40 -38 -24 -78 -10 -38 -57 -38 6 -4 -30 1 53 17 -55 11 -4 17 2 -36 -53 2 1 29 -2 -42 37 26 29 21 15 26 -23 19
7523 19 3 1 -27 -32 -11 -35 11 16 24 21 -49 -9 27 -2 43 -10 -57 -33 -9 10 10 -14 -2 -3 37 6 7 44 23 -3 -5 -12 -25 47 53 -1
7559 -1 19 -28 -16 31 -21 -20 -13 1 -19 -47 -17 -72 -34 -68 -61 -1 11 -8 -26 17 15 -34 10 24 33 -15 -48 -37 -21 -31 -33 15 -27 10
7593 10 -18 7 33 -7 9 90 -11 -44 67 22 -34 23 -21 44 30 -4 30 -6 33 40 -65 31 -23 5 -55 3 23 30 13 -23
7623 -23 13 6 -55 25 -36 4 -74 55 3 43 -7 -26 72 -25 -8 20 25 -5 0 -19 67 34 -14 -17 -24 -48 21 -19 -33 -19 -47 55
7655 55 -27 -20 -9 5 4 -13 -2 47 48 8 39 -2 -68 39 -2 -2 15 6 19 25 -54 15 -27 2 -3 -20 -38 21 5 -13 -21 -21 -17 23 38
7690 38 14 8 5 -1 -3 46 -39 -37 -12 -47 -39 7 -8 -5 -12 14 38 -21 46 31 31 8 -6 26 22 -42 -9 -21 -25 19 4 -3 -18 32 -11 -46
$$ packed form
7457d8O3l1KL6l0J5J0r6J05l5L3klj9%K7l3N2m0j1m7K3L4mpl1NM0j6k6M0J0n6
7490d0KJ4n4O8k8j9J9M4j0k6L1N2l6p2O6j5K1j5l8j7N5jK8l1m0P9j1LqoJ1m9M2
7523A9j6kk8nK1k4M6NQlp0M0L6k9M5n3m7K4K4J9%k4J2jM0l1JL7k1k6kpj3P2On4
7559aK0m7J2M7n2JPJ4k0k8L0n5L8l4PO0J2j9j8M3km9M4J4Rm8l3J1J6j0kM8m2L7
7593A0k8K5K6m0J6Q1j01l3J11m5n6N7m4O5j4l4L4l6L9Pj05R6n4K8o0N8K0Pj7l6
7623b3L6po1Q0o1M0p8J29n2M0n0j9R8r7J7K8Nl0Nj9Q6l3m8lpk4O9m0j4J4k8J02
7655E5q2PJ1J4jj7J1M9Jm0L1m1o6J07m1%J7rJ3Op9O9m2K9nj7j8N9j6j8q%MM0J5
7690C8k4olokM9q5KK5l5QM6j5LpK6K4n9O7j5%k3j4L2mo4L3j2mM4j5pj5N0m3l5
$$ plain form
7726 -46 2 30 -18 16 15 -26 4 -39 22 -2 -51 3 -21 39 -11 16 -50 3 -20 59 25 18 10 18 7 -40 4 -20 11 -21 18 -18
7758 -18 1 11 28 -5 -49 36 -9 -10 21 25 12 37 5 -6 20 -17 -23 -39 38 -48 1 -22 -1 4 22 0 13 22 40 -29 -12 -15 10
7791 10 42 5 -23 12 -43 -44 23 35 22 -25 42 33 -29 -44 -9 -2 31 7 20 5 -14 -11 16 25 -7 -8 -51 7 -13 3 -3 -45 -22 4
7825 4 16 14 -41 -5 37 -35 -12 9 4 4 -3 -29 5 2 28 24 -18 60 -2 14 12 -39 -48 -18 -3 -6 20 20 33 -11 -17 15 -17 8 3 -31 -34
7862 -34 74 -41 -7 -33 60 -11 -53 0 -45 47 41 8 31 32 24 1 13 -18 27 -40 -32 -11 -17 -20 -29 11 -32 60 -17 27 -20 -5 -7
7895 -7 -7 15 -13 -25 9 -13 -26 22 -12 -22 37 39 -23 -44 27 -21 -1 -9 59 11 1 9 -45 -32 -37 -49 -2 44 62 -32 -41 -50 -1 -19
7929 -19 12 1 -19 37 12 2 -2 -15 25 -31 13 24 -6 -14 -17 33 15 1 -1 -22 -33 21 7 -2 59 53 -4 -29 32 -18 11 29 -8
7962 -8 -9 -8 -21 25 24 27 -11 -38 -28 -14 -29 -41 7 -14 13 11 -27 -4 36 -27 51 -10 -43 25 30 22 33 -19 20 -6 38 44 36 12 25
$$ packed form
7726d6M8K8m8L4jm1L0m3O1k4m9N4k4O0n0K7o6N3k3P9l4pqQj1m7M4k4L1l2L9l6
7758a8J9J0J7l3m4Q5m5jL1Mj3K5l2j1K6l7oj6P7q6M9k3K1NJ8k2J3RJ8o9J7lK5
7791A0L2l7k8L5n5jO7J2j3m7O7ro2j5L5PL3k4J3j5j9LK7Rl2jm3N8k0J6om2K3K6
7825DJ2kn5L6M2p2K3K1n%pk6L4lK6mm2P8o2J6kn1rL0J5lK6%J3m4oL2l2K5nl4l
7862c4J08j15L4k6R3p1m2N3m5R2ol3K3Jqk3J2l1M5o7QK1olrM0m3R2p7M4m7J5k
7895g%K2k8j2L4k2j3M8l4j0N9Ko2k1P1m8K0qO8m8j0Qn4J3nj2M7M6J8r4rrM9j8
7929a9L1j1k0N6k5j0mj3M0n6M4J1l0qlN0j8j4kk1j1N4j4rO1on7k5O1n0K9J8l7
7962hjJj3M6jLl8k7J0J4j5j2M8k1K7kl8K3M0o3P8o1l3O8NqJ1n2L9k6M4Oqk4J3
$$ plain form
7997 25 -21 15 -3 -17 8 21 2 14 1 -3 -2 28 -24 -3 6 -26 9 5 -42 -22 -21 -12 0 -32 52 -8 -12 0 14 -5 10 -5 59 25
8031 25 7 27 14 25 16 13 1 -20 3 -27 56 -15 28 3 22 -25 1 48 -5 -5 -26 -21 -6 37 14 78 -9 -39 64 39 -6 6
8063 6 -38 3 30 -35 -55 9 72 11 39 -17 -22 14 -18 -31 35 44 -13 23 9 -6 37 13 -1 3 -79 -39 47 5 -15 13 -15 20
8095 20 -18 -37 18 -35 3 -8 -2 -15 -48 8 -20 -3 3 -26 27 23 6 6 -15 18 -11 26 -48 -15 24 21 -32 -33 13 29 -1 6 27 36
8129 36 -45 -22 -16 -11 32 3 -20 -17 14 18 -26 -6 -11 50 26 -11 22 25 7 -36 10 -20 10 9 41 -29 -15 23 -33 -38 25 -15 -10 44 -41
8164 -41 -8 2 6 -24 65 -2 -9 -26 4 17 30 13 -26 5 -6 7 -32 21 -43 0 -24 7 21 13 6 23 -29
$$ packed form
7997B5m6L6j8j4K5J3j9J2j3mJL0n2K1Rl2L5mm7K0JRJ2l2Q4o0mJ2J4j9J5j5O4l4
8031B5j8K0j3J1rlj2k1K3l0Q3p1M3k5J9m7K6M7n3%k1NJ5M3k3O4q7l0J03k5m5J2
8063Fm4M1K7o5k0O4O3o1K8n6nL6l2j3O6Rn7L6j4j5M3k4j4Mq2M0Q6m2k0K8k8L5
8095B0l8j9N5n3L8j1Oj3l3N6k8J7Ok9N3mj7%k1L3k9L7p4L3L9ln3jM6J6l0PK1R
8129C6q1K3ONM3k9k3LL1Mm4K0nO1k4l7L3Lj8m3M6l0L0jL2p0J4L8n6nO3m0NN4q5
8164d1L3J0Ml0Q9o7pj7L0J3J3j7l9L1j1J3l9N3o4M3k4L1J4qpJ7n2
8191b9
$$ Imaginary data points
##PAGE= N=2
##DATA TABLE= (X++(I..I)), XYDATA
$$ plain form
0 0 0 0 0 0 0 0 0 0 0 0 0 -8 8 -8 8 -16 16 -16 24 -32 32 -40 48 -56 64 -78 88 -104 120 -136 153 -176 198
33 198 -224 252 -284 317 -356 396 -442 490 -546 603 -667 738 -813 897 -989 1088 -1200 1320
51 1320 -1454 1605 -1771 1961 -2173 2417 -2701 3031 -3424 3902 -4497 5259 -6271 7681 -9788
66 -9788 13251 -19882 36906 -165365 -257147 256388 -58295 -236284 49747 18443 -113888
77 -113888 -91276 -78228 14122 -73004 -153500 15926 38194 -118907 -50444 61068 -26916
88 -26916 -86136 6371 17008 -27628 -13560 5673 42510 44659 -25896 43949 93243 -20922
100 -20922 4016 73591 17574 21620 26814 38933 85891 -2403 2464 118679 -1185 -53992
112 -53992 87927 26617 -70026 35899 61619 -37452 -15713 58870 1638 -53813 11612 20314
$$ packed form
0@%%%%%%%%%%%qJ6j6J6k4L2l2M0n6O4p2Q8j04J20j42J66j92K24k56K89l29L74
33A98m22M76n36O01o73P52q38R32j036J149j270J405j551J710j886K077k288K520
51A320k774L059l376L732m134M590n118N732o455P326q399R756j1530J3952j7469
66i788K3039l3133N6788k02271r1782N13535l14683j77989K86031l1304j32331
77a13888K2612J3048R2350q7126q0496J69426K2268j57101O8463J11512q7984
88b6916n9220R2507J0637m4636J4068J9233L6837K149p0555O9845M9294j14165
100b0922K4938O9575n6017M046N194J2119M6958q8294M867J16215j19864n2807
112e3992J41919o1310r6643J05925K5720r9071K1739P4583n7232n5451O5425Q702
$$ plain form
124 20314 -47154 -36809 12815 6981 -40637 -21228 45408 -11359 -64187 29777 18315 -70993
136 -70993 575 29434 -38907 112 26090 -14564 11368 16568 -22150 4357 16651 -22020
148 -22020 -10977 20338 2896 -9757 6726 14237 8444 -17256 -19091 21938 -5970 -55773 9942
161 9942 36768 -47738 -26725 48235 -7387 -50943 8429 13654 -33496 -24136 5161 4552 -12270
174 -12270 -9771 15320 9368 -10815 3371 4969 -4754 8810 -2794 -3861 33157 12178 -14779
187 -14779 34359 33730 -18984 6148 33344 583 -8472 12687 23081 11196 -6486 14949 29843
200 29843 -11816 -13407 22417 -3682 -24164 7528 2756 -14431 6693 -276 -15589 4846 -3176
213 -3176 -27388 -8293 3334 -19832 -20037 3067 7067 -14008 -15600 13831 5636 -30003 -8777
$$ packed form
124B0314o7468J0345M9624n834m7618J9409O6636n6767n2828R3964j1462q9308
136g0993P1568K8859o8341L9019K5978m0654K5932N200l8718K6507J2294l8671
148b2020J1043L1315j7442j2653J6483P511n793k5700j835M1029k7908m9803O5715
161I942K6826q4506K1013P4960n5622m3556N9372N225m7150R360K9297o09j6822
174a2270K499K5091n952k0183J4186J598r723J3564j1604j067L7018k0979k6957
187a4779M9138o29n2714K5132K7196l2761r055K1159J0394j1885j7682K1435J4894
200B9843m1659j591L5824k6099k0482L1692m772j7187K1124o969j5313K0435q022
213c176k4212J9095J1627k3166k05K3104M000k1075j592K9431q195l5639K1226
$$ plain form
226 -8777 20983 -13207 -23999 16833 16548 -12448 -964 20481 5712 -9281 866 9219 2214
239 2214 -4161 2642 13401 9199 -2050 6492 12757 777 -5479 -1201 4905 1103 -8909 241
253 241 15006 -850 -11022 9012 7557 -14671 -9018 6290 -5504 -11633 635 3014 3
266 3 -1976 -2271 2624 -1852 -8987 -857 -3285 -5496 5427 -5364 -1991 17870 -4457 -12446 17880
281 17880 2646 -18695 5395 9045 -4765 -1692 4968 10344 4372 -6599 4218 11731 -6771
294 -6771 -10078 8263 7753 -7712 -1742 11947 5602 -4559 -3454 7640 3657 -15445 -3775 13470
308 13470 -6529 -9839 8564 2902 -797 -4476 -7015 10267 -4480 -23091 9312 10652 -20757
321 -20757 -2091 15084 -4042 -9371 446 4478 -3889 -10098 -273 4784 -2265 -3381 2489 7893
$$ packed form
226h777K9760l4190j0792M0832k85k8996J1484K1445j4769j4993J0147Q353p005
239B214o375O803J0759m202j1249Q542O265j1980o256M278O106l802j0012R150
253B41J4765j5856j0172K0034j455k2228N653J5308j1794o129J2268K379l011
266Cj979k95M895m476p135Q130k428k211J0923j0791L373J9861k2327p989L0326
281A7880j5234k1341K4090L650j3810L073O660N376n972j0971J0817P513j8502
294f771l307J8341n10j5465N970J3689o345j0161J105J1094l983j9102J1670J7245
308A3470j9999l310J8403n662l699l679k539J7282j4747j8611L2403J340l1409
321b0757J8666J7175j9126n329R817M032q367o209R825N057p049j116N870N404
$$ plain form
335 7893 1491 -7295 3940 8064 -6025 -5329 7885 6306 -4348 1830 12601 2062 -3209 6839
349 6839 1347 -1110 4134 -4511 2037 10626 -5157 -1947 12904 -171 -8031 2575 3156 -5125
363 -5125 -6740 1999 2649 -5505 -1365 2635 -1844 -1670 -4368 -5614 1751 -4297 -9444 2743 3474 -6541
379 -6541 -1967 5456 -619 -5175 -1137 572 -1203 -1681 -2121 2544 6596 -2181 -2666 9305 3275 -8687
395 -8687 1422 8019 -3881 -4987 5696 5861 -2098 -1184 4274 2315 -2422 -3785 -806 2727 -2650
410 -2650 -8180 4284 7986 -8931 -5385 10038 -252 -12300 -878 6950 -3063 -9782 2974
423 2974 11058 -4495 -6707 10229 6290 -8032 -1134 8727 2328 -3662 2676 9081 4050 28
437 28 3995 7250 3293 -2513 1680 6316 1091 -1875 2722 4885 2372 -2710 -1566 5124 -2060 -10161
$$ packed form
335G893o402q786J1235M124j4089O96J3214j579j0654O178J0771j0539n271J0048
349F839n492k457N244q645O548Q589j5783L210J4851j3075p860J0606N81q281
363e125j615Q739O50q154M140M000m479J74k698j246P365o048n147J2187P31j0015
379f541M574P423o075m556M038J709j775m78m40M665M052q777m85J1971o030j1962
395h687J0109O597j1900j106J0683J65p959R14N458j959m737j363K979L533n377
410b650n530J2464L702j6917L546J5423j0290j2048J1422P828j0013o719J2756
423B974Q084j5553k212J6936l939j4322O898R861o399n990O338O405n031m022
437B8L967L255l957n806M193M636n225k966M597K163k513n082J144O690p184q101
$$ plain form
453 -10161 -1002 4030 -7722 -10159 3652 1680 -12650 -6257 4541 -7290 -12414 -2511 -2508 -6220
467 -6220 -6317 -4708 1013 -201 -9129 -3314 6917 -3567 -11035 3672 8460 -6677 -3714 11154
481 11154 5973 -4041 1504 10499 5075 -4709 3156 13261 1438 -4381 11531 11499 -4439 1405
495 1405 13913 535 -6462 8865 5614 -6351 3080 7027 -3120 183 4602 -2009 -2670 1184
509 1184 -1269 -3659 -1039 -120 -1034 -2313 -1678 2134 -894 -6327 6 3369 -6535 -4323 4868 -716
525 -716 -4471 1088 1601 -586 -991 -3202 -276 3160 -4699 -6363 6319 3315 -11160 -457 9712
540 9712 -6676 -10193 5041 2035 -10204 -4989 4548 -640 -8643 -1886 4657 -3364 -8135 394
554 394 3567 -6030 -5359 4966 1406 -4421 2272 3798 285 2381 1056 809 6239 3774 -2025 5689
$$ packed form
453a0161R159N032j1752k437J3811j972j4330O393J0798j1831n124R903Ll712
467f220r7J609N721j214q928N815J0231j0484p468J4707M788j5137K963J4868
481A1154n181j0014N545Q995n424r784P865J0105j1823n819J5912l2j5938N844
495A405J2508j3378o997J5327l251j1965R431L947j0147L303M419o611o61L854
509A184k453k390K620R19r14j279O35L812l028n433O333L363r904K212R191n584
525g16l755N559N13k187m05k211K926L436p859j664J2682l004j4475J0703J0169
540I712j6388l517J5234l006j2239N215R537n188q003O757O543q021m771Q529
554C94L173r597O71J0325l560n827O693J526l513K096j325k47N430k465n799P714
$$ plain form
570 5689 11551 569 -1142 12635 8659 -4509 3941 12349 1965 -2230 6344 8597 855 -1286
584 -1286 5365 5421 -2640 -3284 3591 1070 -6504 -2582 2863 -4293 -5804 -870 -4099 -4685 -4228 -8101
600 -8101 -3939 -1863 -9839 -6614 1322 -4952 -9793 -1802 1566 -7672 -7374 2264 -844 -6626 -1062
615 -1062 3396 -80 -2209 1674 4302 -68 612 4203 1347 3009 4968 1125 3875 7362 2363
630 2363 1243 5638 5593 797 -313 6715 4857 -3375 2458 7626 -394 -3063 3747 3517 -3608 -3040
646 -3040 3812 93 -5357 223 1628 -2404 -2721 -1319 -466 -2004 -3763 -1761 -798 -1773 -2017 -2695 483
663 483 1140 -4550 -2023 3598 -1629 -5571 1704 3455 -3469 -2347 4095 1372 -3226 727 2416 -403
679 -403 -1111 99 1559 846 -806 559 1928 537 -196 -583 606 1770 -1757 -1658 2992 1216 -3516
$$ packed form
570E689N862j0982j711J3777l976j3168Q450Q408j0384m195Q574K253p742k141
584a286O651N6q061o44O875k521p574L922N445p156j511M934l229n86M57l873
600h101M162K076p976L225P936o274m841P991L368r238K98R638l108n782N564
615a062M458l476k129L883K628m370O80L591k856J662J959l843K750L487m999
630B363j120M395m5m796j110P028j858q232N833N168q020k669O810k30p125N68
646c040O852l719n450N580J405m032l17J402Q53j538j759K002R63r75k44o78L178
663D83O57n690K527N621n227l942P275J751o924J122O442k723m598L953J689k819
679d03p08J210J460p13j652J365J369j391p33l87J189J164l527R9M650j776m732
$$ plain form
696 -3516 549 4220 -1383 -3572 2163 2655 -3063 -2336 3060 1848 -3432 -620 4332 -376 -3263 1450
712 1450 2123 -1543 -1124 892 1001 446 -961 77 2255 417 -2407 418 2823 -1178 -2498 1859
728 1859 2519 -1744 -1699 2632 1934 -2889 -1362 3417 -163 -3450 956 2444 -1192 -1399 873 1219 -588
745 -588 -1823 278 997 -1238 -1582 392 1052 -610 -1594 288 1546 -1363 -2429 920 1354 -2356 -1894
762 -1894 2455 968 -2581 -233 2520 -389 -2283 282 1795 -384 -1771 903 2147 -273 -977
777 -977 1221 1676 -366 -1046 889 1881 -476 -1115 1585 2139 -873 -1172 2190 1484 -2126 -1150 2107
794 2107 229 -2308 -108 1873 8 -2118 -36 1405 -1087 -2253 411 966 -1433 -1832 526 1302
810 1302 -1373 -1678 1051 1072 -1792 -1637 1634 1054 -2011 -431 2565 654 -1635 377 2282 554
$$ packed form
696c516M065L671n603k189N735M92n718P27N396j212n280K812M952m708k887M713
712A450O73l666M19K016J09n55j407J038K178j838k824K825K405m001j320M357
728A859O60m263M5M331o98m823J527M779l580l287M406J488l636k07K272L46j807
745e88j235K101P19k235l44J974O60j662r84J882J258k909j066L349M34l710M62
762a894M349j487l549K348K753k909j894K565J513k179j387K674J244k420p04
777i77K198M55k042o80J935R92k357o39K700N54l012k99L362p06l610R76L257
794B107j878k537K200J981j865k126K082J441k492j166K664N55k399l99K358P76
810A302k675l05K729K1k864J55L271n80l065J580K996j911k289K012J905j728
$$ plain form
826 554 -1812 768 2868 -312 -1362 1848 2425 -672 -969 1764 1802 -1430 -963 2025 607 -1604 -492
843 -492 1509 378 -1997 -851 1450 -664 -2794 -87 713 -1444 -1865 -99 411 -1287 -1703 -253
859 -253 280 -1342 -1694 -4 953 -1080 -1593 1335 1012 -1365 -484 1576 701 -907 -113 2094 1240 -1020
877 -1020 912 2552 553 -476 1093 2190 419 -675 1382 2143 -232 -136 1437 1120 163 -819 508
894 508 1629 -1020 -1523 1612 626 -1905 -340 1031 -464 -1781 -457 300 -889 -1474 -764 309 -522
911 -522 -1815 -294 734 -1454 -1378 300 -413 -612 -727 -766 737 196 -1966 88 2171 -1362 -2167 1947
929 1947 1500 -2522 -434 2649 52 -1657 642 1951 32 -1265 451 2077 -42 -1487 1155
944 1155 2184 -688 -1146 2060 1434 -1230 -106 1636 696 -710 -77 1376 1101 -1045 -385 2169 636
$$ packed form
826E54k366K580K100l180j050L210N77l097k97K733L8l232M67K988j418k211J112
843d92K001j131k375J146K301k114k130K707Q00k157m21J766N10j698m16J450
859b53N33j622l52J690R57k033n13K928l23k377Q81K060q75j608P94K207q54k260
877a020J932J640j999j029J569J097j771j094K057P61k375R6J573l17r57r82J327
894E08J121k649n03L135r86k531J565J371j495j317J324P57j189n85P10J073q31
911e22j293J521J028k188P6J678p13j99j15l9J503n41k162K054K083l533q05M114
929A947m47m022K088L083k597j709K299J309j919j297J716J626k119j445K642
944A155J029k872m58L206o26k664J124J742r40j406O33J453k75k146O60K554j533
$$ plain form
961 636 -2282 361 2794 -1465 -2194 2401 1093 -2283 -75 1283 -299 -988 -763 535 208 -1452
977 -1452 -791 654 231 -1488 -910 885 -292 -1641 -317 168 -16 -948 -1333 1325 525 -2706 314
994 314 2077 -1903 -1349 1708 109 -1213 26 932 90 -610 165 673 179 -590 119 955 138 -485
1012 -485 499 692 293 -54 -242 1197 521 -1075 493 1416 -26 -857 653 1704 -354 -1326 1667
1029 1667 1173 -1487 177 1124 66 -136 9 323 685 -206 -626 454 825 -589 -1124 1173 593 -1576
1047 -1576 -187 1122 -353 -1330 -179 957 -586 -1981 540 1095 -2003 -1225 1356 -59 -2218 -348
1063 -348 1138 -1087 -1493 194 226 -598 -883 -500 756 -139 -1450 255 837 -289 -766 176 1314 39
1081 39 -1227 1094 1745 -789 -443 1705 1117 -765 138 1881 537 -591 786 963 270 -195 683
$$ packed form
961F36k918K643K433m259p29M595j308l376K208J358j582o89K25J298l27j660
977a452O61J445m23j719N78J795j177j349J324M85j84r32l85K658q00l231L020
994C14J763l980N54L057j599j322J239R06q42p00P75N08m94p69P09Q36q17o23
1012d85R84J93l99l47j88J439o76j596J568R23j442q31J510J051k058r72K993
1029A667m94k660J664R47j058k02J45L14L62q91m20J080L71j414n35K297n80k169
1047a576J389J309j475r77J151J136j543j395K521N55l098P78K581j415k159J870
1063c48J486k225m06J687L2q24k85L83J256q95j311J705N82j126m77R42J138j275
1081C9j266K321O51k534L46K148n88j882R03J743j344j128J377J77o93m65Q78
$$ plain form
1098 683 959 71 -177 607 495 112 -339 -66 801 -145 -1140 197 923 -957 -1174 648 391 -1566 -1086
1117 -1086 1046 -264 -1872 -498 830 -631 -1619 55 811 -1037 -1016 454 26 -508 -411 -151 561
1134 561 -72 -752 341 878 -305 -530 706 887 -536 -359 1172 623 -702 6 1295 316 -861
1151 -861 472 1255 -470 -711 872 480 -495 -297 388 393 -417 -469 365 287 -529 -399 246 266 -483 -638 403
1172 403 554 -777 -690 992 326 -1290 -75 1179 -282 -950 649 760 -399 -491 628 629 -435 -284
1190 -284 519 518 -240 -186 512 508 -205 -414 658 551 -687 -407 950 217 -985 93 879 -151 -886 77
1210 77 759 -284 -1116 272 888 -944 -833 687 282 -991 -388 475 -170 -732 -260 183 62 -495 -1000
1229 -1000 109 45 -1119 -391 784 -200 -897 123 766 -249 -779 432 771 -644 -487 665 377
$$ packed form
1098F83K76q88k48P84j12l83m51K73Q67r46r95J337P26j880k17J822k57j957M80
1117a086K132j310j608J374J328j461r88J674P56j848K1J470m28n34R7K60P12
1134E61o33o80J093N37j183k25J236J81j423J77J531n49j325P08J289r79j177
1151h61J333P83j725k41J583l92r75J98O85Nq10n2Q34p8q16J30O45K0p49j55J041
1172D03J51j331Q7J682o66j616J215J254j461o68J599J11j159r2J119Jj064J51
1190b84Q03jp58N4O98mp13k09J072j07j238K80J357p33j202J078P86j030p35R63
1210G7O82j043q32J388O16j832J11J520m05j273O03Q63o45n62M72M43j21n57n05
1229a000J109o4j164P28J175r84o97J020O43j015n30J211L39j415J57J152k88
$$ plain form
1246 377 -498 -224 643 212 -280 -117 590 426 -431 -108 803 228 -594 189 674 94 -300 178 671 152
1266 152 -508 187 882 -151 -490 639 681 -398 -321 742 428 -455 -213 688 282 -529 -62 504 164
1285 164 -588 0 423 -33 -588 -260 391 -147 -915 -54 570 -661 -864 250 186 -747 -713 252 35 -790
1305 -790 -585 339 108 -834 -417 426 -56 -809 -104 537 -147 -592 60 637 -80 -532 311 815 -156 -348
1325 -348 628 599 -116 -221 705 737 -254 -73 859 519 -378 103 849 322 -393 171 703 158 -332 163 608
1346 608 35 -584 168 676 -324 -584 406 438 -558 -399 470 166 -624 -292 318 99 -562 -325 260 39
1366 39 -726 -149 400 -268 -578 -6 292 -268 -539 13 277 -321 -570 96 332 -467 -665 369 205 -719
1386 -719 -240 370 -109 -465 -152 269 142 -404 -165 425 165 -347 -42 660 146 -387 229 637 23 -153
$$ packed form
1246C77q75K74Q67m31m92J63P07j64q57L23R11n75q22P83M85n80l94M78M93n19
1266A52o60O95O95j033l39J129M2j079P7J063l14q83K42R01m06q11M67N66l40
1285A64p52N88M23m56n55L28O51n38p68Q61O24j231k03J114o4r33L4R65k17q25
1305g90K05R24k31r42M17Q43m82p53P05O41o84m45O52N77p17m52Q43N04r71j92
1325c48R76k9p15j05R26L2r91J81R32l40q97M81P46n27p15N64N32n45m90M95M45
1346F08n73o19P52N08j000k60R90L2r96J59Q69l04p90L32O10k19o61K37N85k21
1366C9p65N77N49o68l10N72K98n60k71N52K64n98k49O66K36p99j98J034j64r24
1386g19M79O10m79l56L13M21j27n46K39N90k60n12L05P02n14n33O16M08o14j76
$$ plain form
1406 -153 408 570 108 -211 627 695 -114 57 733 627 -256 110 869 232 -295 315 551 -23 -138 10
1426 10 375 31 -580 -78 373 -288 -845 -5 291 -665 -839 113 -95 -761 -588 -127 3 -739 -761 160 -163
1447 -163 -992 -331 237 -419 -614 -27 250 -270 -255 173 209 177 -117 241 704 91 -157 813 766 -119 201
1468 201 881 633 -130 227 991 340 -194 454 772 176 -172 288 627 -79 -379 312 291 -241 -354 45
1488 45 216 -448 -560 -1 -71 -403 -537 -183 133 -575 -687 176 -210 -713 -275 164 -229 -579 -165 341 -273
1509 -273 -422 229 163 -227 -237 282 288 -275 -57 429 165 -34 -31 240 517 -201 -231 706 350 -483 44 557
1531 557 96 -479 72 569 -138 -409 68 275 -143 -506 40 344 -389 -300 249 63 -219 -119 42 191
1551 191 -253 -170 372 82 -182 15 317 225 -162 -2 667 58 -304 439 607 -73 -216 540 477 -287 53
$$ packed form
1406a53N61J62m62l19Q38O8q09J71O76j06q83L66P59o37n27O10K36n74j15J48
1426A0L65l44o11N02M51o61n57Q40K96r56j74R52k08o66J73M61J30p42k2R21l23
1447a63q29O61N68o56j95N87K77n20J5M28L6l2k94L58M63o13k48R70m7q85L20
1468B01O80k48p63L57P64o51n34O48L18n96l48M60L39p06l00O91k1n32j13L99
1488D5J71o64j12N59p0l32j34L54L16p08j12Q63l86n03M38M39l93l50M14N06o14
1509b73j49O51o6l90j0N19On63K18M86k64j99LK71K77p18l0R37l56q33N27N13
1531E57m61n75N51M97p07k71M77K07m18l63N46L04p33Q9N49j86k82J00J61J49
1551A91m44Q3N42k90k64J97L02r2l87J60O69o09l62P43J68o80j43P56o3p64L40
$$ plain form
1572 53 512 171 -153 -60 237 287 -349 -207 313 -27 -407 -182 36 -39 -550 -339 130 -250 -678 -218 -11
1593 -11 -365 -746 -157 87 -636 -436 21 -194 -152 -225 11 108 -462 -119 293 -101 -142 141 306 184 -82 172
1615 172 502 252 -43 296 682 227 -66 433 769 40 126 533 371 -46 -138 382 245 -224 295 503 186
1636 186 -58 27 228 -38 -281 -99 113 -129 -338 -117 75 -190 -410 -84 165 -347 -421 18 115 -335 -324
1657 -324 208 44 -461 -115 312 -33 -245 -17 202 96 -214 76 274 -3 -221 111 269 -88 -269 99
1677 99 202 -176 -211 23 152 -226 -336 156 113 -371 -299 187 -51 -376 -167 136 -101 -351 -35 167 -112
1698 -112 -212 90 224 -38 -140 188 338 60 -4 320 346 90 9 429 426 20 88 568 327 -82 163 501
1720 501 167 -151 184 354 20 -128 161 177 -145 -189 16 130 -259 -308 14 -33 -337 -337 -71 -74 -427 -343 -46
$$ packed form
1572E3M59l41l24R3K97N0o36J42N20l40l80K25K18p5n11K11M69l80m28M60K07
1593a1l54l81N89K44p23K00M57k15M2p3K36R7n70L43M12l94m1K83J65j22k66K54
1615A72L30k50k95L39L86m55k93M99L36p29Q6M07j62m17r2N20j37m69N19K08l17
1636A86k44Q5K01k66k43J82K12k42k09K21J92k65k20L26K49n12p4M39R7m50J1
1657c24N32j64n05L46M27l45k12K28K19j06l10K90J98k77k18L32J58l57j81L68
1677I9J03l78l5K34J29l78j10M92m3m84P2M86k38l25K09L03k37k50L16K02k79
1698a12j00L02J34k62j02L28J50k78o4L24K6k56q1M20lm06O8M80k41m09K45L38
1720E01l34l18L35J70l34j48K89J6l22m4K05J14l89m9L22m7l04%K66ll53Q4K97
$$ plain form
1743 -46 -112 -416 -285 57 -70 -388 -186 167 -122 -291 16 187 -121 -157 60 174 -43 -134 229 165 -84 -101
1765 -101 207 176 -39 -103 221 133 -222 -45 238 113 -197 -16 213 -37 -251 79 272 -126 -157 110 181 -55
1787 -55 -139 230 235 -48 -63 319 180 -14 13 298 304 -49 57 372 205 -107 141 385 132 -93 176 330 27
1810 27 -136 71 147 -109 -243 25 106 -194 -342 61 -4 -545 -296 -229 -316 -257 -408 -113 -257 -485 -49 -100 -172
1833 -172 -360 -161 59 -183 -306 68 21 -119 -205 156 167 -51 -32 213 231 62 89 322 373 32 136 446
1855 446 233 -14 208 370 222 8 204 283 76 -59 269 203 58 -188 183 361 -60 -105 113 61 -211
1876 -211 -56 134 35 -287 -180 -30 54 -418 -138 27 12 -374 -39 10 -93 -210 -47 -67 -235 -220 -23 362
1898 362 -9 -496 73 106 -196 -245 172 78 -199 -84 211 70 -114 -22 145 149 -46 1 301 81 -145 220
$$ packed form
1743d6o6l04J31L42j27l18K02L53k89j69L07J71l08l6K17J14k17r1L63o4k49j7
1765a01L08l1k15o4L24q8l55J77K83j25l10J81K29k50k14L30J93l98l1K67P1k36
1787e5q4L69Nk83j5L82j39j94K7K85Ol53J06L15j67l12K48K44k53k25K69J54l03
1810B7j63K07P6k56j34K68Q1l00j48M03o5n41K49O7q7N9j51K95j44k28M36n1p2
1833a72j88J99K20k42j23L74m7j40q6L61J1k18J9K45J8j69K7K33N1l41J04L10
1855D46k13k47K22J62j48k14J96P9k07j35L28o6j45k46L71J78m21m5K18n2k72
1876b11J55J90r9l22J07J50Q4m72K80J65j5l86L35M9j03j17J63k0j68J5J97L85
1898C62l71m87N69L3l02m9M17r4k77J15K95j41j84R2J67Mj95M7L00k20k26L65
$$ plain form
1920 220 233 28 0 218 291 -39 82 310 218 2 50 206 244 -109 14 271 44 -84 33 94 64 -188 -130
1943 -130 143 -78 -245 -28 12 -99 -279 -106 62 -194 -256 16 -99 -220 -189 -92 -31 -264 -163 29 -125 -190
1965 -190 -65 -11 -79 -284 22 123 -123 -94 102 86 39 -125 75 277 -62 -115 224 208 -48 -20 259 229 -42
1988 -42 35 309 122 45 56 175 173 -76 67 251 100 -97 112 127 53 -45 86 177 -50 -68 103 106 -117 -80 57
2013 57 68 -205 -42 129 -116 -213 6 96 -66 -226 -16 51 -149 -195 -55 17 -113 -271 -28 137 -201 -175 26
2036 26 59 -42 -141 114 139 -192 -111 133 -4 -65 -74 105 101 -156 32 121 -39 40 58 60 0 -47 68 130 -89 8
2062 8 111 87 -82 -83 155 92 -145 -45 75 33 -114 -101 136 86 -156 73 173 -28 -103 57 157 -8 -134
2085 -134 91 186 -40 -54 142 110 56 -67 219 184 -61 6 135 146 -27 -18 50 43 -107 107 95 -66 -126 -83 30
$$ packed form
1920B20J3k05k8K18P3l30J21K28r2k16M8J56L8l53J23K57k27j28J17O1l0k52N8
1943a30K73k21j67K17M0j11j80J73J68k56o2K72j15j21L1R7O1k33J01J92j54o5
1965a90J25N4o8k05L06J01k46K9J96j6m7j64K00K02l39n3L39j6k56K8K79l0k71
1988d2P7K74j87p7J1J19kk49J43J84j51j97K09J5p4r8J31R1k27j8J71Lk23L7J37
2013E7J1k73J63J71k45r7K19R0j62j60K10O7k00m6J40P2j30j58K43J65l38K6K01
2036B6L3j01r9K55K5l31Q1K44j37o1rJ79mk57J88Q9j60P9J8Ko0m7J15O2k19R7
2062HJ03k4j69jK38o3k37J00J20m2j47J3K37n0k42K29J00k01p5J60J00j65j26
2085a34K25R5k26j4J96l2n4j23K86l5k45O7J29J1j73RO8pj50K14j2j61o0M3J13
$$ plain form
2110 30 -51 -154 -18 63 -258 -165 -43 -52 -209 -243 -83 -109 -270 -171 -41 -64 -243 -198 3 -3 -196 -60 48 -65
2134 -65 -114 -11 171 -4 -83 105 179 -10 17 191 203 61 70 235 174 57 50 205 190 81 59 223 148 -9 101
2159 101 135 27 -41 59 133 -48 -88 -14 69 -62 -167 -36 -29 -131 -180 -39 -68 -155 -104 -18 -72 -170 -114 -7 -14 -175
2185 -175 -103 -1 -39 -138 -87 108 -43 -99 33 131 14 -62 68 127 -35 -63 93 110 -46 -1 85 64 -72 -33 130
2210 130 20 -99 -32 64 13 -108 23 83 -90 -136 -32 4 -122 -96 72 30 -57 -122 73 38 -80 -67 66 110
2234 110 -33 57 121 89 -50 58 166 23 -34 77 179 16 -25 47 104 1 -36 82 76 -38 -56 65 69 -113
2258 -113 -50 87 -13 -109 -73 16 -47 -138 -98 76 -40 -124 -63 33 -80 -179 6 72 -39 -78 37 75 -88 -23 119
2283 119 55 -79 -54 93 68 -62 -34 128 23 -126 1 59 28 -27 0 55 -38 -122 -7 68 40 -63 69 76 -47
$$ packed form
2110C0q1j03J36Q1l21R3J22rj57l4J60k6j61R9J30k3j79M5K01oj93J36J08j13
2134f5m9J03J82j75p9J88P4j89K7J74J2j42RJ65o1j17pJ55j5j09k2J64p5j57J10
2159A01L4j08o8J00P4j81m0P4Q3j31j05J31Pj02m9J41k9q7N1Q6n4r8N6J07pj61
2185a75P2J02l8r9N1J95j51n6J32R8j17p6J30N9j62k8J56J7j56M5Q6k1j36L9J63
2210A30j10j19O7R6n1j21J31O0j73m6J04L6j26K6J68m2q7o5J95l5j18J3J33M4
2234A10j43R0O4l2j39J08J08j43n7J11J02j63m1P2N7j03l7J18oj14j8J21Mj82
2258a13O3J37j00r6L6Q9o3r1M0J74j16q4O1R6j13r9J85O6j11l9J15L8j63O5J42
2283A19o4j34K5J47k5j30K8J62j05j49J27N8l1n5K7N5r3q4J15P5k8j03J32Pj23
$$ plain form
2308 -47 -89 44 28 -36 -49 83 90 -59 25 58 50 -11 32 64 60 -53 30 114 17 -57 48 90 0 -31 55 96 -81 -71 74
2337 74 49 -99 -26 80 102 -116 -52 77 -68 -112 -101 62 -30 -124 -116 12 -47 -131 -34 32 -69 -126 -50 12 -68 -66 84
2364 84 -17 -20 -52 20 34 -96 8 108 22 -48 52 144 70 -6 74 88 3 -50 53 111 63 -28 51 102 -18 24 69
2391 69 67 -64 43 70 123 -42 28 84 65 5 -56 57 -56 -71 -14 30 -16 -67 -33 -34 -22 -89 -56 34 -64 -7 -6 -4 -40 -174
2421 -174 4 8 -148 -12 59 -74 -61 -55 62 8 -95 31 80 -68 -77 57 85 -10 -57 121 122 -24 6 56 113 85
2447 85 -23 133 90 -58 67 112 43 -13 29 82 62 -44 26 52 -22 -18 17 96 -51 -98 14 -35 -133 -30 21 8 -63
2474 -63 -38 24 -39 -125 -28 -12 -49 -129 -72 78 -6 -103 -33 37 -6 -42 -42 59 -16 -113 67 40 -31 -57 -16 34 7 -84 36
2503 36 70 -89 35 26 -12 21 -39 34 9 -22 48 56 16 -45 27 61 24 -63 67 29 -25 16 66 42 -48 -36 112 37 -67
$$ packed form
2308d7m2J33j6o4j3J32Pj49Q4L3qo1M3L2mj13Q3Q4r7p4J05M2r0l1Q6M1j77J0J45
2337G4k5j48P3J06K2k18O4J29j45m4J1J63r2r4QJ28n9q4R7O6j01n7P6O2q0KJ50
2364H4j01ll2P2J4j30J04J00q6p0J00R2p4p6Q0J4q5n3J03N8m8r1P9N1j20M2M5
2391F9kj31J07K7N3j65P0N6j9o0o1J13j13j5N7M4m6n1L4jJ2o7L3R0r8N7JKl6j34
2421a74J78Mj56J36P1j33J3OJ17n4j03J26M9j48rJ34K8r5m7J78Jj46L0N0N7k8
2447H5j08J56m3j48J25M5o9n6M2N3k0j06P0K6p4ML5P9j47m7J12m9r8J03N1j3p1
2474f3K5O2o3q6R7J6l7q0N7J50q4r7P0P0m3l6%J01p5r7J80k7p1k6M1N0k7r1J20
2503C6L4j59J24rl8L3o0P3k5l1P0Qm0o1P2L4l7q7J30l8n4M1N0k4r0J2J48p5j04
$$ plain form
2532 -67 55 41 50 -69 -101 88 45 -59 -16 55 -48 -38 -4 22 7 -50 -11 1 -31 -88 -27 29 -38 -94 57 -24 -116 0
2560 0 -59 -51 -62 -44 59 -1 -93 -9 21 -12 -69 -61 58 4 -30 85 36 -33 -5 35 44 -45 -34 65 63 -24 21 66 61 -11 24 87
2592 87 58 -28 46 91 42 -16 -15 117 18 2 18 39 33 -43 -31 46 -9 -47 6 -4 -55 -5 -1 -47 -56 54 12 -50 -92 -35 23
2623 23 4 -61 -46 45 -63 -71 -4 53 -74 -55 -14 30 -66 -93 16 2 -78 -46 37 -45 -55 -21 12 -62 -38 -35 38 -16 -38 20
2653 20 39 8 -65 15 72 -12 -87 63 38 -6 74 92 31 -16 -31 33 29 -89 15 85 37 -58 14 47 -2 -61 33 46 -3
2682 -3 -43 18 -2 -69 -25 20 0 -62 -48 52 -14 -99 -69 18 -50 -89 -14 16 -6 -90 -102 1 -52 -59 -42 38 -81 22 31 25
2712 25 26 -24 41 0 -28 26 24 122 -1 22 91 58 -11 2 69 46 3 34 33 16 15 12 45 -16 -50 -7 28 -38 -22 3 -1 -52 -25
2745 -25 -71 -18 -121 -61 -5 -18 -72 -35 2 35 -35 -37 32 18 -21 -39 58 25 -45 -44 71 -9 -40 73 76 31 0 2 34 -24 8
$$ packed form
2532f7J22j4Rj19l2J89m3j04M3P1j03J0L4K6j5n7L9J2l2n7O1N6o7n6J51q1r2J16
2560@n9Qj1J8J03o0r2Q4L0l3n7QJ19n4l4J15m9o9K8M0Rq9J1R9kq7M5M5np2L5O3
2592H7k9q6P4M5m9n8JJ32r9j6J6K1op6J2P7n5l8N3j0n1N0Mm6rJ10m2o2m2N7N8
2623B3j9o5J5R1j08qO7N7j27J9M1M4r6k7J09j4q0L2Q3q2j0L4L3p4K4LP3n4k2N8
2653B0J9l1p3Q0N7q4p5J50k5m4Q0J8o1m7j5O4mj18J04P0m8r5P2L3m9n9R4J3m9
2682cm0O1k0o7M4M5k0o2J4J00o6q5L0Q7o8l9P5L0k2q4j2J03n3pJ7Q0j19J03Ro
2712B5Jn0O5m1k8N4kR8j23K3O9l3o9J3O7k3m3L1jj7jlL3o1l4M3L5o6J6K5mn1K7
2745b5m6N3j03O0N6j3n4L7L7L3p0kO9j4l9j8R7l3p0JJ15q0l1J13Lm5l1KL2n8L2
$$ plain form
2776 8 64 71 -56 31 62 -35 35 44 18 36 -35 7 29 -23 -56 -45 -12 -23 -21 -4 -6 -38 -17 17 12 -26 -67 1 -2 -20 -63 39 -53
2809 -53 -100 -15 32 -1 -57 -8 24 29 -87 33 18 -33 -44 43 -28 -32 -80 -12 0 -11 -18 29 35 16 13 -42 -8 12 -37 -12 -24 -9
2841 -9 2 29 63 2 35 -6 32 41 58 54 27 6 55 14 -7 -43 -18 44 20 7 50 15 -96 -48 -21 -3 -50 -35 -41 -4 -5 -59
2873 -59 12 -20 -14 -19 -1 -70 -43 1 8 -21 -41 -26 -25 -19 -18 -29 -22 -13 -23 29 0 -67 10 -38 -15 -61 -20 45 25 -39 57 14 10 -18 -18
2908 -18 44 12 -15 38 18 -21 -14 48 -6 -1 0 24 0 -16 48 41 13 -69 5 41 12 -15 85 24 -41 -19 47 8 -28 -4 36 60
2940 60 1 -21 -19 -32 -46 -81 -11 23 -57 49 -35 -20 -13 -64 -8 0 -35 -5 -55 -11 -25 -12 41 -3 13 63 43 46 -1 -11 -70 -4
2972 -4 -25 17 7 -24 40 25 16 9 -11 64 -19 43 24 21 -12 -21 6 57 -33 -66 69 -17 -6 -45 25 27 -60 -24 0 -11 -26 38 -44
3005 -44 20 -2 -10 56 30 20 -6 -36 24 -27 -9 52 -52 -37 81 -35 10 -46 -17 -50 -24 32 7 -18 -17 -23 10 17 -38 -34 26
$$ packed form
2776HN6Pj27Q7L1r7P0Rk6J8p1M2K2n2l3J1L3j1KJ7kl2K1L4nl8m1O8lj8m3J02r2
2809e3m7Q5M7l3n6M9L2Nj16J20j5n1j1Q7p1mm8O8J2j1pM7Oj9ln5L4K0m9K5j2J5
2841iJ1K7L4o1L3m1L8RJ7mk7k1M9m1k1l6K5O2k4j3M3l5j11M8K7J8m7J5oL7jn4
2873e9P1l2OnJ8o9K7M4Pk9k0J5JOJj1PRj0N2k9o7P7m8K3m6M1O5k0o4R6m3mk8%
2908a8O2l2k7N3k0l9PO2n4NJK4k4j6O4pk8q2P4L6k9k7J00o1o5K2O6l9l6K4M0K4
2940F0n9k2Kj3j4l5P0L4q0J06q4J5Pn1N6Ql5L0n0M4j4J3N3m4J6N0k0Lm7j0n9O6
2972dk1M2j0l1O4j5rpk0P5q3O2j9ll3rK7N1r0l3J35q6J1l9P0Kq7L6K4j1j5O4q2
3005d4O4k2qO6k6j0k6l0O0n1J8O1j04J5J18j16M5n6K9l3K6N6k5k5JoL3Pn5MO0
$$ plain form
3036 26 -8 -12 14 46 -24 -25 41 71 2 8 49 11 39 5 16 46 10 -25 65 28 -2 41 90 27 -19 -6 38 -41 -26 -5 43 -15
3068 -15 -18 25 12 14 17 -19 -35 -29 30 0 0 -25 16 18 -59 -23 8 -63 8 -43 -7 25 -47 -2 -37 48 0 -42 10 41 2 -28 -42
3101 -42 -6 20 61 9 19 -35 -56 3 56 -23 10 58 20 19 -11 15 9 -32 -10 13 11 -21 22 41 30 -8 57 27 19 -32 8 -6
3133 -6 -13 43 37 25 29 -37 -9 -34 31 -37 37 -38 19 -29 -3 -46 -26 -40 11 14 -52 -29 27 -65 -13 -38 -16 -31 -2 3 28 36 -29 -7
3167 -7 -53 12 25 -62 -30 -24 8 13 15 -8 46 16 29 55 63 -47 24 -38 8 41 -63 30 37 -13 9 -13 13 -24 -62 7 -18 -13 -37
3200 -37 27 -20 -10 -43 20 38 -23 -12 1 52 -4 9 26 56 -53 -4 6 13 -31 -20 70 -4 -27 34 37 -1 -9 5 77 19 11 31
3232 31 105 34 21 -6 -1 -29 19 65 3 33 -13 9 -31 -7 4 4 2 -16 -15 56 -8 -49 7 -37 2 -15 -28 -15 15 -26 1 -5 -18
3265 -18 -13 -3 19 14 -42 -20 47 -33 -8 -7 41 -51 25 7 -13 2 -10 14 -9 -30 -13 12 8 30 22 14 39 7 9 -2 -1 0 62 22 33
$$ packed form
3036B6l4mK6L2p0jO6L0o9OM1l8K8l4J1L0l6l5R0l7l0M3M9o3m6J3M4p9J5K1M8n8
3068a5lM3j3KLl6j6ON9l0%k5M1Kp7L6L1p1P1n1L6L2p2M5l5Q5m8m2N2L1l9l0j4
3101d2L6K6M1n2J0n4k1N9N3p9L3M8l8jl0K6om1K2K3kl2M3J9j1l8O5l0qn1M0j4
3133fpN6oj2Mo6K8k5O5o8P4p5N7m8K6m3K0j4N1Lo6K3N6r2N2k5K2j5K9NK5Qo5K2
3167gm6O5J3q7L2OL2NKk3N4l0J3K6Qj10P1o2M6L3j04R3Pn0K2k2K6l7l8O9k5Nk4
3200c7O4m7J0l3O3J8o1J1J3N1n6J3J7L0j09M9J0Pm4J1R0p4k3O1Ll8qJ4P2n8qK0
3232C1P4p1j3k7Nk8M8M6o2L0m6K2m0K4J1%kj8JP1o4m1N6m4L9j7j3J3L0m1K7oj3
3265a8NJ0K2nn6K2O7q0K5JM8r2P6j8k0J5j2K4k3k1J7K5mK2qqK5l2Kj1JJO2m0J1
$$ plain form
3300 33 32 10 -18 -35 53 10 -9 53 15 -7 -22 -6 -27 -15 -41 23 -27 -53 -19 -30 -12 31 9 -8 -9 1 3 29 21 -17 -39 28
3332 28 50 -1 -29 11 -18 44 -61 20 2 1 -34 -24 48 -6 8 32 6 9 24 36 26 -68 63 13 -21 -1 -26 -23 -10 -19 14
3363 14 31 8 -21 -4 -10 -21 44 -24 -12 2 54 15 28 26 0 -3 41 -13 54 23 17 -26 -6 -45 -19 18 5 -35 -6 -25 -6 2 20
3396 20 16 -47 -9 -53 -59 -31 10 1 -42 -31 46 -34 4 11 15 -44 22 11 59 13 -37 14 -91 19 -21 19 21 -11 11 -54 -33 -8
3428 -8 -39 11 -1 10 -44 5 32 -28 38 -35 -10 8 7 -3 3 36 16 24 -22 -18 13 5 23 10 11 -21 -28 2 -6 44 -3 -17 -33 -23 -21
3463 -21 34 6 9 2 -45 36 -62 22 29 40 -72 25 -51 54 -36 -37 -70 -46 20 -7 -20 -4 165 -125 28 40 75 6 -101
3492 -101 37 112 -146 159 -59 -40 21 25 -39 117 22 258 -54 116 -69 203 45 -4 49 -21 43 -37 3 34 15
3517 15 -9 -3 -54 -27 9 4 -59 6 -31 -4 -58 -2 -10 0 -31 71 25 34 8 -25 -40 -26 4 15 47 10 -56 24 24 25 8 -17 15
$$ packed form
3300C3jk2k8j7Q8m3j9O2l8k2j5J6k1J2k6O4n0k6L4j1J8M3k2j7jJ0KK6ql8k2O7
3332B8K2n1k8M0k9O2j05Q1j8jl5J0P2n4J4K4k6LJ5J2j0r4J31n0l4K0k5LJ3rL3
3363A4J7k3k9J7oj1O5o8J2J4N2l9J3kk6lM4n4O7l1om3K0l9K6L7j3m0K9j9J9QJ8
3396B0mo3L8m4oK8M1rm3J1P7q0L8PMn9O6j1M8m6n0N1j05J10m0M0Kl2K2o5K1K5
3428hl1N0j2J1n4M9K7o0O6p3K5J8jj0OL3k0Qm6ML1qJ8j3Jl2pL0qN0m7j4j6J0K
3463b1N5k8Lpm7Q1r8Q4PJ1j12R7p6J05r0jl3K4O6k7j3J6J69k90J53J2L5o9j07
3492a01J38P5k58L05k18J9O1Mo4J56r5K36l12J70j85K72j58m9N3p0O4q0M0L1j9
3517A5k4On1K7L6no3O5l7K7n4N6qJ0l1J02m6Rk6l3j5J4L0J1L2l7o6Q0%Jj7k5L2
$$ plain form
3550 15 -12 53 -5 -47 21 18 -8 -49 32 -10 29 10 12 -22 -40 -45 40 17 4 4 32 -183 46 146 40 229 -38 8 -45
3579 -45 -149 -24 9 -55 0 -22 -26 -20 54 -21 3 -34 -51 29 -34 -1 3 -24 -59 -23 -15 0 14 -26 24 -4 1 3 -29 18 11 -29 13
3612 13 -51 20 40 -21 -66 20 11 -1 -4 -36 34 -13 -9 -6 7 6 -30 3 6 22 -16 52 54 34 -69 -16 52 31 -59 -3 -59 50 -25
3645 -25 16 -39 94 196 -75 -164 60 -227 -44 15 -5 -115 12 -106 18 -29 -47 67 -8 90 -8 35 27 19 4 3
3671 3 9 -11 -70 -10 -19 19 -22 -19 -26 -10 -59 -8 3 -11 -55 21 5 5 10 -16 30 -37 10 0 -3 -16 -1 4 5 38 -18 -28 49 84 -26
3706 -26 163 -34 -126 -90 -54 148 -115 -92 54 -58 -82 144 -111 212 -28 -45 198 -5 146 -24 360 -45
3728 -45 -233 -100 65 79 -64 202 13 181 56 -62 -25 85 4 51 -27 65 -33 -9 -10 9 -19 86 9 -28 30
3753 30 -37 20 31 7 52 5 -8 21 24 37 18 -30 -26 -34 -9 20 22 38 -38 37 12 41 -14 34 25 -12 27 17 -20 -58 -31 -21 36
$$ packed form
3550A5k7O5n8m2O8lk6m1Q1m2L9j9Kl4j8nQ5k3j3%K8k15K29J00j06J89k67M6n3
3579d5j04J25L3o4N5k2mOP4p5K4l7j7Q0o3L3Mk7l5L6QJ5J4m0N0k8NKl2M7pm0M2
3612A3o4P1K0o1m5Q6rj2ll2P0m7MLJ3jl6L3LJ6l8O8Kk0j03N3O8k1r0N6n6J09p5
3645b5M1n5J33J02k71q9K24k87J83N9k0j10J27j18J24m7j8J14p5R8r8M3qqj5j
3671COk0n9O0rL8m1LpJ6m9N1J1j4m4P6j6%Nk6M6o7M7j0lj3J5NJL3n6j0P7L5j10
3706b6J89j97r2L6L6K02k63K3J46j12k4K26k55L23k40j7K43k03J51j70L84m05
3728d5j88J33J65J4j43K66j89J68j25j18L7J10q1M7p8R2r8K4jJ9k8J05p7l7N8
3753C0o7N7J1k4M5m7j3K9LJ3j9m8MqK5K9KJ6p6P5k5K9n5M8rl7L9j0l7l8K7J0N7
$$ plain form
3786 36 -7 -6 -20 -19 -14 -25 -3 -32 -74 20 -5 130 43 -9 23 -5 13 104 42 22 21 -203 -112 -229 124 381 -82 -4 -2 51
3816 51 -92 19 -30 81 -55 -76 61 -14 -18 -17 -3 -41 -37 -33 -12 21 -39 -31 -24 36 20 7 32 -71 32 -15 15 -7 8 3
3846 3 -28 12 41 -3 17 -3 0 4 4 16 16 9 -41 -32 -25 14 -36 8 14 -17 44 14 37 -6 -31 -6 11 -62 -21 -9 13 6 40 -10 -24
3881 -24 -52 53 200 194 83 -126 30 -9 34 10 -16 3 34 -21 69 5 -21 8 -9 9 -1 -20 22 -16 -19 -6 12 -6 38
3910 38 -20 -5 1 -12 -11 -33 -17 -58 -19 16 26 -53 -33 -28 -36 -33 12 3 -38 39 38 -32 13 8 -20 69 -23 12 10 22 -1 37 62 51 44
3945 44 -3 27 26 1 16 -50 -9 -31 -4 28 -23 24 -29 23 -12 -27 -25 2 -19 -10 46 34 -18 12 6 -5 10 0 -11 -23 -46 -36
3977 -36 -34 -41 0 26 49 -72 -24 -28 7 48 37 2 -5 -28 23 -37 -6 -29 -30 -3 -29 26 6 -33 -12 -17 -12 40 -12 4 0 -21 -26 -25 17
4012 17 21 24 -14 21 -26 16 21 15 -5 4 26 16 -57 -50 5 -59 8 36 -6 11 49 -15 15 -46 -62 -7 -19 4 18 -16 -30 -23 -27 -9
$$ packed form
3786C6m3Jj4JNj1K2k9m2R4k5J35q7n2L2k8J8R1o2k0jk24R1j17L53K57m63P8KN3
3816E1j43J11m9J11j36k1J37p5mJJ4l8MMK1L3o0QPO0j6j3K5j03J03m7L0k2J5n
3846Cl1M0K9m4K0k0LM%J2%pn0RPL9n0M4Ol1O1l0K3m3k5K5J7p3M1J2K2pL4n0j4
3881b4k8J05J47oj11k09J56l9M3k4k6J9L1n5R0o4k6K9j7J8j0j9M2l8lJ3J8j8M4
3910C8n8J5Oj3Jk2J6m1L9L5J0p9K0NqLM5rm1P7jp0M5nk8Q9r2L5kJ2k3L8K5j1p
3945D4m7L0jk5J5o6M1k2K7L2n1M7n3N2l5j5KK7k1RN6j2n2L0oj1J5j0j1j2k3J0
3977c6KpM1K6K3j21M8mL5M1j1l5pk3N1o0L1k3jK7k6N5k0l9K1nNN2n2J6mk1nJM2
4012A7MLl8L5m7M2Nok0RK2j0p3PN5o4O7K8m2J7L8o4L0o1j6N5j2K3J4l4j4PmJ8
$$ plain form
4046 -9 -16 -5 -33 40 -19 5 6 -17 28 44 32 -13 -55 25 -32 -22 1 -5 22 -28 30 30 -47 -56 -21 14 58 12 -78 -8 -9 -63 48
4079 48 -4 -30 -3 11 -7 -1 -38 79 35 8 -12 -69 -57 -9 19 6 -19 -15 -21 13 -19 -7 -15 6 31 18 -14 28 24 14 13 -45 10
4112 10 -3 0 9 14 -3 -25 -20 1 -7 -40 -29 0 8 -40 29 -32 25 -31 -40 2 18 4 -6 -40 -4 -8 -27 4 1 7 -66 48 17 -31 11
4147 11 19 19 -14 0 -37 -31 19 -35 11 -2 14 6 4 -16 -54 13 3 -42 -1 -16 -3 7 21 -6 5 -25 7 6 27 -11 -5 38 21 -7
4181 -7 50 4 -34 -4 -46 -31 43 -12 53 27 -18 33 1 -39 12 19 -25 22 -12 -14 -22 16 3 38 -18 62 -14 -29 -34 7 30 17 -15
4214 -15 37 9 -21 35 -32 -12 -17 -18 8 21 -54 21 -37 0 -39 -15 1 3 -6 -31 2 13 5 -9 -13 11 1 15 -23 -58 -9 -24 20
4247 20 7 6 -34 -29 14 1 6 15 4 4 -2 10 40 11 18 38 -39 -15 49 -20 23 66 68 3 -8 -15 7 21 -9 25 30 16 -23 2 13
4282 13 -2 38 -1 14 -46 -21 -24 -27 -16 -46 4 -39 13 11 -8 -12 -6 8 26 14 30 -42 18 31 18 47 -38 8 -8 15 -25 20 40
$$ packed form
4046ipJ1k8P3n9K4Jk3M5J6j2m5m2Q0n7J0K3oK7n0N8%p7rL5L5M4m6r0P0jn4J11
4079D8n2k6K7J4j8Ol7J17m4k7k0n7J2M8K8j3k5MoL4l2J2qK1K5j3l2M2mj0jn8N5
4112A0j3LRNj7k2NK1ql3J1K9Qm8O9o1N7n6rM2J6j4j0l4L6mj9L1lOp3J14l1m8M2
4147A1Q%l3J4l7ON0n4M6j3J6qkk0l8O7j0m5M1j5J3J0J4k7J1l0L2jK1l8OM3j7k8
4181gN7m6l8L0m2J5P4n5O5k6m5N1l2m0N1Pm4M7l4kqL8j3L5n6Q0p6j5nM1K3j3l2
4214a5N2k8l0N6o7K0njK6J3p5P5n8L7l9K4J6Krk5L3J1qj4mK4j0J4l8l5M9j5M4
4247B0j3jm0NM3j3NRj1%oJ2L0k9PK0p7K4O4o9M3M3Ko5j1pK2J4l0L4Nj4l9K5J1
4282A3j5M0l9J5o0K5llJ1l0N0m3N2kj9mOJ4J8j2J6p2O0J3j3K9q5M6j6K3m0M5K0
$$ plain form
4315 40 -24 -6 5 -51 -26 -49 -20 18 -10 13 -50 16 -1 -32 -9 -8 -29 -40 -74 7 21 -2 -19 34 26 -15 29 55 1 -33 44
4346 44 -17 13 -18 -2 -17 49 -17 -35 20 -56 -39 64 16 -7 18 26 -4 -30 26 2 0 36 -8 0 28 26 0 24 -15 14 48 17
4378 17 -15 43 2 57 -33 3 -24 23 -51 37 -112 67 -55 -287 31 -59 -2 23 187 -60 30 -39 -40 15 48 153 78
4405 78 -153 75 -38 57 -18 40 -60 15 7 89 24 -38 16 51 -56 -28 11 30 -28 22 1 12 34 -33 -10 20 8 25
4433 25 -14 32 34 -16 -12 -32 33 19 27 -10 -19 -32 7 1 5 -13 -24 -47 -17 18 7 10 -22 -7 -16 -14 58 25 -2 -80 -35 35 44 -4 12
4468 12 -2 36 32 8 52 -26 -42 -62 -3 -29 -13 -25 9 -10 6 32 -27 -3 -11 -26 -69 20 13 -48 2 -46 -9 -28 -44 35 -72
4499 -72 -14 29 36 44 34 4 -8 3 9 3 -24 -19 94 6 18 -7 7 4 26 43 13 -37 16 -10 -30 -20 -53 -48 3 1 -35 27 16 7
4533 7 -29 -16 -12 39 -4 9 -21 26 19 16 -8 11 -62 -11 10 -22 7 12 34 -12 18 12 -23 18 -3 -19 -37 1 -18 -35 30 -14 34
$$ packed form
4315D0o4J8J1n6K5k3K9L8k8K3o3O6j7l1K3Jk1j1l4Q1J4k3j7N3qm1M4K6n4l4P7
4346D4o1L0l1J6j5O6o6j8N5p6J7J03m8k3K5Ql0k6N6k4kL6m4QK8kk6K4l9K9L4l1
4378A7l2N8m1N5r0L6k7M7p4Q8j49J79j22k32L18r0N7K5J64k47R0o9jN5L3J05p5
4405G8k31K28j13R5p5N8j00P5qQ2o5o2N4L5j07K8L9J9n8N0k1J1K2o7K3L0j2J7
4433B5l9M6Kn0Mk0O5j4Ql7rj3L9oMj8j1k3L0L5j1Ll2J5rKP2l3k7p8M5P0Rm8J6
4468A2j4L8mk4M4p8j6k0N9k6J6j2L4j9J6K6n9K4qj5m3Q9po1N0m8L7j9j6P9j07
4499g2N8M3PQj0l0j2J1Ook7NJ13q8J2k5J4lK2J7l0n0N3k6k0J0l3NN1kl6O2j1r
4533Gl6J3MN1m3J3l0M7plk4J9p3N1K1l2K9NK2m6L0ol5M1k1j6j8L8j9j7O5m4M8
$$ plain form
4566 34 2 14 -7 23 21 8 -51 18 -8 22 -9 -49 6 -19 47 -25 -50 14 6 3 -56 9 -19 41 27 5 -36 -16 56 -10 -29 -11
4598 -11 20 -3 25 14 -64 39 2 -19 6 -51 -4 -12 -11 28 16 18 -3 4 -26 -23 -22 15 -70 -62 -93 -1 -15 -30 23 -12 0 -15 5
4631 5 -14 -10 0 11 -35 1 -13 2 -21 23 -9 10 13 7 12 4 -4 -1 -38 -45 -13 6 -17 19 -51 34 39 26 -36 14 41 -26 -31 6 13 -16
4667 -16 69 -43 -6 31 -11 4 -11 19 -18 21 13 -14 28 11 32 -60 -23 34 3 12 23 21 29 -16 -5 11 -10 -32 13 23 -14 14
4699 14 -1 19 -2 -19 1 36 -37 -20 -44 -13 43 -50 -12 59 26 -39 -25 -41 -22 -40 -25 -15 25 29 5 29 -69 -7 -33 -1 4
4730 4 11 -41 19 -41 13 -33 -9 0 8 2 -9 -13 -15 49 18 -17 -3 41 18 -40 -33 32 33 18 -23 6 -3 10 22 -3 8 0 -56 30 29 -1
4766 -1 6 -12 11 -18 -16 39 -41 6 4 18 -48 -31 5 30 7 -38 9 64 14 -24 8 19 62 31 -12 -35 -15 30 79 17 47 6
4798 6 -37 -33 6 43 -55 -40 -30 24 14 10 1 35 28 1 10 -22 -39 -14 36 -22 23 -6 -1 -7 -19 -16 45 1 -27 -32 -16 10 -14 7 34
$$ packed form
4566C4l2J2k1L0kj3n9O9k6L0l1m0N5k5O6p2k5O4qln9O5k8O0j4k2m1K0P2o6j9J8
4598a1L1k3K8j1p8J03l7k1K5n7M7qJL9j2Kk1Pl0LJL7q5Ql1R2j4j5N3l5J2j5K0
4631Ej9MJ0J1m6L6j4J5k3M4l2J9LoNqqLl7pL2J9k3L6p0Q5Nj3o2N0K7o7nL7Pk9
4667a6Q5j12L7L7m2J5j5L0l7L9qk7M2j7K1r2L7N7l1RJ1kQm5J1J6k1k2M5J0l7K8
4699A4j5K0k1j7K0L5p3J7k4L1N6r3L8P1l3o5J4j6J9j8J5J0M0Mk4K4r8O2k6L2N
4730DPn2O0o0N4m6K4RQoj1mkO4l1l5J4M4k3n8PO5Jj5m1K9rJ3J2k5J1qn6Q6jl0
4766aPj8K3k9KN5q0M7kJ4o6J7L6K5k3m5M7N5n0l8L2J1M3l1m3k3K0M5M9o2L0m1
4798Fm3ML9L7r8J5J0N4j0mrL4pk7Rl2j7K5N0n8M5k9Noj2LO1m4k8nJ6K6k4K1K7
$$ plain form
4833 34 25 4 -8 7 -11 -6 -35 14 25 -8 -26 -23 -27 -28 -5 21 -10 -66 4 8 39 18 -18 -33 -9 40 1 20 -51 -19 58 65 64 27
4867 27 2 4 40 -7 -19 25 14 -2 -13 -18 -59 16 -11 -22 -23 -5 -43 7 -7 -40 32 -76 -30 10 -4 29 8 23 -59 -24 -52
4898 -52 -3 21 -28 -15 46 12 -28 -7 1 -10 57 12 -23 11 -22 37 2 -26 -15 29 -36 5 39 -31 33 17 -59 -36 3 -26 20
4929 20 -5 -25 -2 -34 -16 -12 19 21 22 -15 -5 -39 3 30 -2 -51 -22 38 -9 43 42 9 12 37 64 21 -31 67 16 47 10 0 -3
4962 -3 -11 -65 -30 4 37 -43 -15 -15 -22 12 -51 -2 15 -13 -15 -15 -39 3 13 5 -10 -61 -23 -11 -6 25 24 -12 26 -46 50 -39 -27 32 15
4997 15 50 -3 22 20 49 5 2 39 4 -6 31 5 -52 -37 34 24 44 -13 14 3 -23 -73 -1 79 18 29 0 -24 17 -6 -10 64
5029 64 -40 -22 0 35 32 -22 -28 -23 15 9 31 -27 -4 -10 -15 -29 -39 -38 21 25 10 -40 -40 38 -38 -12 -48 41 -38 4 6 -4 -19 16 -11
5064 -11 -44 -17 6 15 -46 -15 -5 48 1 12 -63 3 32 -24 15 -27 36 0 53 2 42 -45 31 24 46 27 -19 18 -8 -8 -16 32
$$ packed form
4833C4rk1j2J5j8Nk9M9J1l3j8LmjK3K6l1n6P0ML1k1l6j5K4M9l9J9p1L2P7Pjl7
4867B7k5KL6m7j2M4j1j6j1nm1P5k7j1jJ8l8N0j4l3P2j08M6M0j4L3k1J5q2L5k8
4898e2M9K4m9J3O1l4m0K1Qj1O7m5l5L4l3N9l5k8J1M4o5M1L4p0O4j6p6K3L9k9M6
4929B0k5k0K3l2J8ML1KJl7J0l4M2K7l2m9K9O0m7N2jl3LK5K7m3n2R8n1L1l7j0l
4962cqn4L5L4L3q0K8%pL4o3M9J7k8k%k4M2J0qj5n1L8J2NL1jl6L8p2R6q9J2N9j7
4997A5L5n3K5kK9m4lL7l5j0L7k6n7J5P1j0K0n7K7j1k6n0P2Q0o1J1k9k4M1k3mP4
5029F4j04J8K2L5ln4oNL8oK2n8K3onj4j0JN9Mj5n0%P8p6K6l6Q9p9M2Kj0j5L5k7
5064a1l3K7K3Ro1L1J0N3m7J1p5O6K9n6L9m2O3l6N3n1M0q7P6pK2j9m6L7k6%qM8
$$ plain form
5096 32 -30 18 -18 -56 -22 -1 28 -3 35 4 24 -9 -5 14 23 -34 -29 23 2 -25 -1 21 8 0 -26 7 -1 36 24 -1 8 -31 29
5129 29 28 -15 9 -47 -8 -42 45 49 13 11 -18 65 -4 -3 -1 -54 4 13 -4 -1 10 -59 -28 17 -28 15 28 -4 12 1 -4 15 -3 42
5163 42 29 54 -17 -34 15 5 8 14 -25 -12 33 -8 -34 34 36 9 34 8 -13 -14 -14 -4 14 -45 15 -30 2 47 6 -26 25 -10 4
5196 4 -30 -3 3 15 38 -1 8 -4 28 13 -13 -5 58 31 -27 27 11 -4 -15 20 -27 11 -28 25 -10 -21 -3 -14 27 -20 34 -23
5228 -23 10 11 7 -33 2 7 -44 -3 5 -2 28 24 -6 -13 -62 27 23 19 3 -35 -14 10 -9 4 48 -16 -38 8 53 7 -21 -12 24 5 17
5263 17 -31 -10 -13 8 -18 -4 64 -11 -26 20 62 6 -16 -54 13 11 20 -22 -28 -32 -27 -20 -15 39 -39 36 19 25 2 7 -25 -2 7 -2 -75 -26
5299 -26 -17 1 -11 35 7 -7 10 -13 -27 -9 -11 34 34 -19 28 -1 -13 7 9 -46 50 8 20 -32 -28 -22 -19 -2 -47 20 -46 8 3 -5 55
5334 55 -27 -42 -19 -26 -6 -19 37 25 -13 1 13 -60 8 -5 8 5 -23 8 34 34 15 -3 -42 -54 45 -18 10 -27 6 11 12 -14 -46
$$ packed form
5096C2o2M8l6l8L4K1K9l1L8l1K0l3MJ9Rn7NN2k1k7K4K2j3qk6L3qL7j2k5Rl9O0
5129B9jm3K4n6L9l4Q7Ml6kk9Q3o9JKn3N8Rj7LJ1o9L1M5m5M3J3l2J6j1nJ9j8M5
5163D2j3K5p1j7M9j0LOl9J3M5m1k6O8Kk7K5k6k1j%J0J8n9O0m5L2M5m1l2N1l5J4
5196Dl4K7OJ2K3l9Rj2L2j5k6QO3k7n8N4j6j5j1L5m7L8l9N3l5j1J8j1M1m7N4n7
5228b3L3Jmm0L5Nn1M1QpL0ml0pm9Q9mmj6l8K1K4j9J3M4o4k2M6M5m6k8RL6j9J2
5263A7m8K1lK1k6J4O8p5j5M6M2n6k2l8O7kRm2omNPNN4p8P5j7Ok3Nl2K3Rrp3M9
5299b6RJ8j2M6k8j4J7k3j4J8kM5%n3M7k9j2K0Kn5R6m2J2n2MOLJ7m5O7o6N4nqO0
5334E5q2j5K3pK0j3N6j2l8J4J2p3O8j3J3lk8L1K6%j9j8l9j2R9o3K8l7L3NJk6l2
$$ plain form
5367 -46 36 -8 -4 -45 -25 17 -22 -3 11 41 -39 -5 -3 -78 -37 -43 4 26 19 -45 -38 -37 18 -9 -35 -22 40 -23 10 19 32 -70 10
5400 10 33 0 10 -2 21 16 3 -21 -9 18 31 13 15 -8 -34 16 13 -38 -25 -64 -34 26 -1 5 7 -79 -12 48 45 38 7 15 -13 1
5434 1 -21 5 -30 -19 0 -10 13 9 -15 15 -10 -4 35 -14 -47 -5 5 -10 -28 19 -13 -29 -38 -51 24 -14 -33 -23 -6 -11 11 -6 3
5467 3 81 13 -3 22 37 -14 -23 101 -11 -5 -25 -17 0 1 1 -7 -30 39 7 12 -16 -8 -12 -25 29 -31 26 -23 30 -1 -28 -15 36 -43
5501 -43 29 -8 -27 33 -16 12 2 18 26 30 25 38 7 13 21 -62 17 -7 -22 6 22 -1 7 -40 -35 12 -3 -18 -26 25 -33 35 34 -45 14
5536 14 -21 -19 -15 -45 2 5 -21 -8 -32 -25 -46 3 -15 -9 59 -35 -3 40 -33 23 7 -3 11 11 -30 -54 30 -4 -1 -84 -10 -40 20 29
5570 29 1 14 9 10 -12 -22 -35 7 -11 35 5 4 3 -37 -53 -27 -71 58 47 26 2 -25 -33 9 34 -27 -8 -56 -9 45 55 7
5602 7 17 -42 17 26 -13 20 52 -61 4 -17 25 -33 8 -4 -16 17 -40 -1 -11 19 11 14 -19 -3 31 -63 7 48 -55 -6 -4 -45
$$ packed form
5367d6Q2m4Mm1K0M2l9J9J4L0q0L4Kp5M1oM7K2po4PJN5k7k6J3O2o3L3RJ3j02Q0
5400A0K3l3J0j2K3nj3k4J2K7J3j8Kk3k6N0ln1J3l9L0O0k7OKq6O7O0lpl1Qk8J4
5434Ak2K6l5J1J9j0K3mk4L0k5OL9m9l3M2J0j5j8M7l2j6rj3P5l8j9J0J7nK2j7R
5467CP8o8j6K5J5n1rJ24j12Ok0QJ7J%qk3O9l2Nk8Qmj3N4o0N7m9N3l1k7J3N1p9
5501d3P2l7j9O0m9K8j0J6QMnJ3l1OQq3P9k4j5K8J6k3Qm7NM7j5j5qN1n8O8jp9N9
5536A4l5KMl0M7Lk6J3k4Pk1M9j8OO8r4L2M3p3N6j6j0J4%m1k4Q4l4Lq3P4l0O0R
5570B9k8J3nJk2j0j3M2j8M6l0jjm0j6K6m4J29j1k1k4k7qM2K5o1J9m8M7N4J0m8
5602GJ0n9N9Rl9L3L2j13O5k1M2n8M1j2j2L3n7L9j0L0qLl3J6L4r4P0M1j03M9Km1
$$ plain form
5634 -45 21 -26 -33 -5 -35 -63 -15 -60 39 4 29 -9 14 13 51 7 23 1 -18 72 24 36 -2 40 6 36 -6 -13 -26 17 6 12
5666 12 27 46 51 42 -3 0 -12 8 -12 10 -68 -2 26 26 17 20 62 24 -54 40 23 24 8 -17 10 -15 50 -14 -45 -30 -48 -9 26 20
5700 20 -18 -1 13 11 -16 -43 -41 -3 -32 -21 -14 10 -51 -4 19 5 14 -24 55 24 27 14 -33 -47 -23 -3 17 -11 -23 5 17 20 -22
5733 -22 37 -24 -31 2 -10 -11 -51 -53 9 -54 -29 18 -8 -34 33 -31 2 27 -11 -6 -10 30 71 8 33 -23 29 4 47 5 32 23 20 -22
5767 -22 12 22 -18 -21 25 -38 -34 27 13 15 -20 41 -37 25 -37 -15 10 21 29 5 -27 -15 28 9 -3 9 -36 -1 -25 32 -20 -7
5799 -7 61 -35 38 -11 11 2 24 13 -16 -41 -2 31 40 16 -10 -24 -35 -32 13 -23 -37 64 -30 -40 -39 -51 9 -12 8 -21 -16 9 -38
5832 -38 19 5 3 34 -19 31 -29 -13 25 16 -8 -8 -19 -31 24 -23 71 -34 4 -42 -39 -38 -14 -11 15 17 -14 13 7 11 49 -21 12 -3
5866 -3 -53 59 50 -7 -7 -7 20 -31 -8 -31 68 -10 -1 -21 16 -9 -51 -13 40 38 23 46 0 1 -44 4 -47 23 -4 -23 -2 71 24
$$ packed form
5634d5O6m7pK8l0k8M8m5R9l5K5l8K3jL8m4J6k2j9R0m8J2l8M2l4L0m2pj3M3j1O
5666A2J5J9Nrm5Lj2K0k0K2p8O6K8%rLM2l8p8R4j7Jj6k5K7k5O5o4l1J5j8L9L5o
5700B0l8J7J4kk7k7KL8k9J1PK4o1M7K3j4Rl8P9l1Lj3m7j4K4K0K0k8j2K8J2Lm2
5733b2N9o1pL3j2jm0kO2o3K5M7k6k6O7o4L3K5l8NmM0M1o3K5n6N2k5M3m2K7rlm2
5767b2L4J0m0lM6o3MO1j4Kl5O1p8O2o2K2K5J1Qk4l2J2M3j9j2J2m5L5k4N7n2J3
5799gO8r6P3m9K2rK2j1k9k5L9L3Rk4k6j4j1LM5l6j4J01r4j0Jj2O0k1K0k9NK5m7
5832c8N7j4kL1n3N0o0J6L8rk4%j1j2N5m7R4j05L8m6LJK4LK6Kl1K7oML8p0L3j5
5866cn0J12rn7%%K7n1K3k3R9p8Rk0L7k5m2L8N3kj5K3m6Jm5M8n1P0k7j9K1P3m7
$$ plain form
5899 24 -8 37 6 12 19 -42 -33 20 16 -37 -10 7 53 -26 -55 -21 37 -22 17 34 68 -38 -13 5 31 0 40 -18 27 49 -8 -21
5931 -21 11 -17 -2 -44 -11 -40 -52 -36 6 9 -29 -19 -28 41 -3 -47 -8 -4 -16 25 11 -6 -62 15 -26 91 40 -24 -15 50 -31 -12
5963 -12 23 -30 40 56 32 41 -8 -27 18 13 -46 40 52 -35 -39 -6 7 -20 26 -21 -2 -36 23 14 9 -3 11 -18 25 -12 -25 -33 39
5996 39 -5 41 1 -19 19 5 49 6 -11 -32 26 22 59 8 2 -33 27 17 -28 4 -7 -42 -6 45 -2 -15 -2 41 -34 46 25
6027 25 -46 -21 20 46 -11 -5 -47 19 14 -53 55 50 3 29 -23 35 38 10 17 21 -31 -26 49 26 -63 10 14 27 -43 -49 52 -2 5 -18
6061 -18 22 21 0 9 27 -27 -4 14 -3 2 -25 40 -42 -16 42 -6 49 -17 48 30 -27 -1 -14 34 40 -38 -26 32 -6 8 -2 -9 -27
6094 -27 -49 -13 54 16 -20 23 21 -47 -19 44 -34 -32 -22 -26 1 36 -41 33 -14 -11 -17 37 27 3 30 -23 45 26 4 -9 12 50 40
6127 40 7 14 -23 20 -5 27 -22 -28 33 -3 -4 -4 -19 12 1 11 -11 -24 -43 51 -19 7 -36 -42 19 -24 42 -32 1 -6 42 -32 38
$$ packed form
5899B4l2M5l1OPo1RN3mn3K7J7M6p9k9L4N8n9L9J7L4j06K5J8K6l1M0n8M5K2n7j3
5931b1L2k8J5m2L3k9j2J6M2Ll8J0rO9m4m4L9Mj2M1j4j7n6P7m1J17n1o4RO5q1J9
5963a2L5n3P0J6k4Rm9j9M5nn9Q6J2q7mL3J3k7M6m7J9l4N9rnj2J4k9M3l7j3qP2
5996C9m4M6m0k0L8j4M4m3j7k1N8mL7n1ol5O0j0m5L2j1l5L6N1m7j3J3M3p5Q0k1
6027B5p1K5M1K6n7Om2O6no7J08nm7K6n2N8Lk8PMn2NP5k3q9P3MJ3p0oJ01n4Pk3
6061a8M0jk1RJ8n4K3J8j7Nk7O5q2K6N8m8N5o6O5j8n7K6j3M8Op8J2N8l8J4j0pj8
6094b7k2L6O7l8l6M3ko8K8O3p8KJ0mK7L5p7P4m7LoN4j0k4K7n3O8j9k2j3K1L8j0
6127D0l3Pl7M3k5L2m9oO1l6j%j5L1j1J0k2j3j9R4p0K6m3oO1m3O6p4L3pM8p4P0
$$ plain form
6160 38 -21 -7 10 -21 28 32 -19 -9 -24 2 18 -12 -50 36 -31 10 -21 -23 -21 -15 -25 -30 -32 53 13 36 34 18 13 -6 -11 1 -20 12 66
6195 66 -17 -4 -34 1 -5 7 25 46 -5 46 5 -6 -17 57 -50 15 -31 14 9 -58 -24 -2 -33 -58 -8 -24 45 -7 12 -27 20
6226 20 -14 -22 4 -18 12 0 17 -38 6 16 40 12 19 18 13 -16 9 -2 26 1 19 -32 0 31 7 -11 6 23 34 -7 58 22
6258 22 -5 -12 4 39 -21 -28 -56 52 38 4 -5 41 -34 -69 -14 -29 -25 -26 -42 -13 13 15 8 53 9 7 -2 10 -6 15 34 -18 -60 -26
6292 -26 6 -5 5 33 1 -35 5 16 24 15 -6 -17 -33 -31 -47 -22 44 13 -25 20 34 -2 -32 22 -6 15 -34 57 -8 -6 31 -19
6324 -19 -16 -12 77 28 22 23 2 9 -4 4 -26 15 -13 -77 26 21 -29 -13 -14 -25 7 34 6 -2 0 42 6 20 19 -14 -4 29 -36 -3 3 3
6360 3 -48 -22 3 -5 -38 19 8 3 47 8 -6 19 -61 -32 -3 23 53 23 -30 24 -20 7 19 27 -26 14 45 20 -28 -67 -29 -21 -41
6393 -41 49 -39 -41 -14 13 -3 5 -37 7 23 -3 34 -4 23 13 57 -10 11 20 3 10 -26 -23 58 -12 63 32 -41 42 0 -33 -39 0
$$ packed form
6160C8n9J4J7l1M9Mn1J0j5K6J6l0l8Q6o7M1l1kKOj0nkQ5m0K3kj6nj9nJ2k1L2N4
6195F6q3J3l0L5oJ2J8K1n1N1m1j1j1P4j07O5m6M5no7L4K2l1k5N0j6O9n2J9l9M7
6226B0l4qK6k2L0j2J7n5M4J0K4k8Pjnk9K5j1K8k5J8n1L2L1k4j8J7J7J1m1O5l6
6258B2k7pJ6L5o0pk8J08j4l4rM6p5l5N5j5Mjj6K9K6KpM5m4krJ2j6K1J9n2m2L4
6292b6L2j1J0K8l2l6M0J1Qrk1j1j6Kj6K5O6l1l8M5J4l6l0N4k8K1m9R1o5KL7n0
6324a9LMQ9m9oJk1Pj3Ql0M1k8o4J03nn0J6jj1L2K7k8qKM2l6J4jl3J0L3o5L3O%
6360Cn1K6K5ql3N7j1nM4l9j4K5q0K9K9K6L0l0n3N4m4K7J2Qn3M0L1k5m8l9L8Qk0
6393d1R0q8kK7K7j6Qm2M4J6k6L7l8K7j0M4o7K1Rj7Pl6LQ1p0P5l1p3Q3m2l3oL9
$$ plain form
6426 0 -17 -18 -10 -17 49 13 -5 58 -42 -18 -25 50 -17 -30 30 -10 2 38 7 10 37 -1 3 29 23 12 -44 2 -50 -46 -43 -1 6 18 -21
6461 -21 -17 62 -30 -51 35 19 -23 29 65 50 -21 -23 -12 -24 9 32 -7 -50 -38 -62 -70 -20 -11 12 28 21 -35 12 -55 45 -48 -42 -2
6494 -2 -35 -5 4 24 -11 -4 21 -27 -27 -7 4 3 35 -38 -19 11 -26 -34 -23 43 0 16 33 36 6 -16 20 -29 25 54 33 46 -7 -1
6528 -1 3 11 34 -37 3 47 26 -30 -2 -6 -18 -39 -24 -37 34 -15 20 65 5 -24 6 -38 -37 -23 -18 40 -5 -21 62 46 -15 -1 14
6561 14 -16 26 29 -18 -10 28 52 31 3 16 11 -4 7 -26 7 -11 28 6 -6 9 -47 -27 -10 19 10 -35 -46 5 -34 12 -57 -4
6593 -4 -13 14 -5 -21 -36 -2 -16 15 -12 -33 -4 -16 26 7 -53 30 9 -55 -25 -2 -65 -34 -18 6 1 -10 24 20 -4 15 -22 -12
6625 -12 -3 -19 -13 0 -19 33 -40 38 -28 -16 42 -30 12 17 14 32 -13 -19 -15 2 -11 -17 37 -17 28 2 20 -52 27 25 43 28 8 14 48
6660 48 34 24 1 -21 9 -17 -10 -81 7 -24 -26 1 11 -53 -3 16 36 -14 14 -51 27 19 64 1 2 15 -3 4 49 13 13 4 -32 17
$$ packed form
6426@j7jQpO6l6j8O3j00K4pP5o7j3O0m0J2L6l1LK7l8MK6oj1n6M6n2MLM2PJ2l9
6461b1MP9r2k1Q6j6m2N2L6j5p1kJ1j2L3K3l9m3J2k4qN0RK3J6pn6M7o7J00r3OM0
6494bl3L0RK0l5PK5m8%K0J1jL2p3J9L0l7qJ1O6m3J6J7Ll0k2L6m9N4K9k1J3n3O
6528aMQK3p1M0M4k1n6K8mj2k1J5j3P1m9L5M5o0k9L0m4JJ4NN8m5j6Q3j6o1J4J5
6561A4l0M2Lm7QL8K4k1k8J3nj5J1l3L3j8L9k2j2J5n6K0J7K9rm5j1N1l9M6o9N3
6593drK7j9j6j5L4j4L1k7k1K9j2M2j9o0Q3k1o4L0K3o3L1J6K4nj1L4mk4J9l7J0
6625a2Rj6OJ3j9N2p3P8o6J2N8p2M2NlJ8m5oMJ7j3oN4n4M5k6J8p2P9kJ8j5k0OL4
6660D8j4j0k3k2L0k6Pp1Q8l1kK7J0o4N0J9K0n0K8o5P8qM5o3JJ3j8PM5l6%rl6M9
$$ plain form
6694 17 -5 13 5 2 -31 -45 -14 4 -1 -13 -46 -19 -15 -47 -33 2 -3 68 -12 13 -66 -17 -26 -42 13 -3 48 16 -11 87 23 6 38
6727 38 4 -47 48 22 5 -7 33 38 -7 -21 -30 -28 6 4 -38 13 6 13 -11 -20 31 -4 16 19 21 -39 8 33 -13 45 40 -43 10 27 10
6762 10 92 15 42 51 36 43 -21 -21 -23 -58 13 -45 38 -29 -29 49 -21 4 -7 15 67 24 25 -19 53 -27 15 -16 7 -29 -24 32 9 26
6796 26 -11 31 -26 -79 -8 6 -27 32 13 17 0 27 24 -5 5 39 2 -26 -15 -12 -7 -33 -5 -6 -14 -50 24 -32 29 10 -19 -11 -12 17
6830 17 39 29 22 -33 -26 -25 -35 51 -36 -56 -29 10 -22 -18 -33 28 7 20 -25 -3 -19 14 -15 -27 22 16 5 15 -3 -25 28 4 -7
6863 -7 -38 -68 13 33 22 1 7 20 -18 -33 -2 -11 -10 25 23 20 -6 -10 -60 -22 18 -12 26 -2 -27 11 19 7 28 -16 -42 -25 -13 -69
6897 -69 -32 18 -4 -8 58 21 7 -10 24 -4 -7 -17 16 14 -17 -7 -17 -53 12 -20 -20 10 46 3 -11 -30 22 -27 19 9 28 47
6929 47 11 19 0 6 -2 -31 9 -1 -7 41 9 -3 37 11 16 -10 53 -11 -7 -29 18 -15 49 45 -43 17 19 -12 10 28 -1 47 -45 14
$$ packed form
6694A7k2J8qll3j4L1J8nj2l3K7Ml2J4L5nP1q0K5p9M9rj6N5j6N1l2k7R8o4j7L2
6727C8l4n1R5k6j7j2M0Nm5j4rKL4km2N1pPk4rN1l5K0LKo0M7K5m6N8nq3N3J7j7
6762A0Q2p7K7Rj5Po4%kl5P1n8Q3o7%P8p0K5j1K2N2m3Jm4P2q0M2l1K3l6NN6k3J7
6796B6l7M2n7n3P1J4l3N9j9Mj7K7lk9J0L4l7k8J1LNk6K8jql6P4n6O1j9k9QjK9
6830A7K2j0pn5PJj0Q6q7k0K7L9l2Mj5O1k1J3m5K2j6L3k9j2M9oj1J0j8k2N3k4j1
6863gl1l0Q1K0j1k1OJ3l8j5L1rJL5klk6mn0L8M0l0L8k8k5L8Qj2K1m4k6J7J2n6
6897f9L7N0k2mO6l7j4j7L4k8lj0L3kl1J0j0l6O5l2%L0L6m3j4j9N2m9M6j0J9J9
6929D7l6Qj9Oqk9M0j0oM8l2j2M0k6Nk6O3o4Mk2M7l3O4mq8O0Kl1K2J8k9M8r2N9
$$ plain form
6963 14 -21 -11 38 -39 41 -7 -4 -31 -35 34 11 24 -34 16 -21 -6 -23 48 -34 0 15 35 -22 82 -57 31 -39 13 28 -29
6993 -29 -47 10 -10 -19 -21 -16 -29 1 37 30 53 -24 47 -26 3 -17 20 7 18 -4 13 25 -29 27 -27 -16 -9 17 -15 -12 -24 26 39
7026 39 21 43 -47 32 -29 -51 12 3 30 -41 0 18 1 -14 54 5 23 -3 29 -24 18 47 3 2 6 -15 15 11 -20 37 7 36
7058 36 -19 7 -4 29 55 -54 -22 15 43 -34 17 -24 -9 -6 19 -10 -17 9 21 1 7 -63 -40 6 -49 -13 -17 -8 1 7 3 38 17 23
$$ packed form
6963A4l5J0M9p7Q0m8Lk7mO9k3J3n8N0l7J5j7P1q2L4J5K0n7J04j39Q8p0N2J5n7
6993b9j8N7k0rkNj3L0L6pK3p7P1p3K9k0L7j3J1k2J7J2n4N6n4J1PK6l2Lj2N0J3
7026C9j8K2r0P9o1k2O3rK7p1M1J8j7j5O8m9J8k6L2n3M2K9m4jMk1L0ml1N7l0K9
7058C6n5K6j1L3K6j09L2L7K8p7N1m1J5LK5k9pK6J2k0Op0K3M6n5L6mRROmL5k1O
$$ [...]
8191D2
##END NTUPLES=NMR FID
##END=
