##TITLE=1H_Pr AmBnD
 CDCl3, 8 sc, 
 26.11.2020
##JCAMPDX= 6.0         $$ Bruker NMR JCAMP-DX V2.0
##DATA TYPE= NMR FID
##DATA CLASS= NTUPLES
##ORIGIN= UXNMR, Bruker Analytische Messtechnik GmbH
##OWNER= root
$$ XWIN-NMR		Version 3.5
$$ Thu Nov 26 13:35:21 2020 Russian Standard Time (UT+4h)  she@DPX200
##.OBSERVE FREQUENCY= 200.1315066352
##.OBSERVE NUCLEUS= ^1H
##.DELAY= (6, 6)
##.ACQUISITION MODE= SIMULTANEOUS
##.ACQUISITION SCHEME= undefined
##.AVERAGES= 8
##.DIGITISER RES= 18
##SPECTROMETER/DATA SYSTEM= spect
##.PULSE SEQUENCE= zg30
##.SOLVENT NAME= CDCl3
##.SHIFT REFERENCE= (INTERNAL, CDCl3, 0, 15.7039)
##AUDIT TRAIL= $$ (NUMBER, WHEN, WHO, WHERE, WHAT)
$$ ##TITLE= Audit trail, XWIN-NMR		Version 3.5
$$ ##JCAMPDX= 5.01
$$ ##ORIGIN= Bruker BioSpin GmbH
$$ ##OWNER= she
$$ F:/spectra/data/she/nmr/H-F/1/audita.txt
$$ ##AUDIT TRAIL=  $$ (NUMBER, WHEN, WHO, WHERE, WHAT)
(   1,<2020-11-26 13:34:17.35 +0400>,<she>,<DPX200>,
      <created by zg, POWCHK disabled, PULCHK disabled
       configuration hash MD5:
       00 E9 B6 7A A2 85 ED C7 34 08 36 98 17 FE 4E 26
       data hash MD5: 16K
       9F 33 13 CA 0B A1 30 B6 6C 91 A8 A0 3C DB A4 F3>)
$$ ##END=
$$ 
$$ hash MD5
$$ 51 47 32 DF 11 03 AD 97 EB 50 22 54 E8 FA 97 23
##$RELAX= 
##$RELAX= 
##$RELAX= 
##$RELAX= 
##$RELAX= 
##$RELAX= 
$$ Bruker specific parameters
$$ --------------------------
##$DU= <F:/spectra>
##$EXPNO= 1
##$NAME= <H-F>
##$PROCNO= 1
##$TYPE= <nmr>
##$USER= <she>
##$AMP= (0..31)
100 100 100 100 100 100 100 100 100 100 100 100 100 100 100 100 100 100 
100 100 100 100 100 100 100 100 100 100 100 100 100 100 
##$AQSEQ= 0
##$AQ_mod= 1
##$AUNM= <au_zg>
##$AUTOPOS= <>
##$BF1= 200.13
##$BF2= 200.13
##$BF3= 200.13
##$BF4= 200.13
##$BF5= 200.13
##$BF6= 200.13
##$BF7= 200.13
##$BF8= 200.13
##$BYTORDA= 1
##$CFDGTYP= 0
##$CFRGTYP= 5
##$CHEMSTR= <none>
##$CNST= (0..31)
1 1 145 1 1 1 1 1 1 1 1 1 1 1 1 1 1 1 1 1 1 1 1 1 1 1 1 1 1 1 1 1 
##$CPDPRG= <>
##$CPDPRG1= <>
##$CPDPRG2= <>
##$CPDPRG3= <>
##$CPDPRG4= <mlev>
##$CPDPRG5= <mlev>
##$CPDPRG6= <mlev>
##$CPDPRG7= <mlev>
##$CPDPRG8= <mlev>
##$CPDPRGB= <>
##$CPDPRGT= <>
##$D= (0..31)
0 1.2 0 0 0 0 0 0 0 0.06 0 0.03 0 0 0 0 0.0002 0 0 0 0 0 0 0 0 0 0 0 0 
0 0 0 
##$DATE= 1606383256
##$DBL= (0..7)
120 120 120 120 120 120 120 120 
##$DBP= (0..7)
150 150 150 150 150 150 150 150 
##$DBP07= 0
##$DBPNAM0= <>
##$DBPNAM1= <>
##$DBPNAM2= <>
##$DBPNAM3= <>
##$DBPNAM4= <>
##$DBPNAM5= <>
##$DBPNAM6= <>
##$DBPNAM7= <>
##$DBPOAL= (0..7)
0.5 0.5 0.5 0.5 0.5 0.5 0.5 0.5 
##$DBPOFFS= (0..7)
0 0 0 0 0 0 0 0 
##$DE= 6
##$DECBNUC= <off>
##$DECIM= 32
##$DECNUC= <off>
##$DECSTAT= 4
##$DIGMOD= 1
##$DIGTYP= 9
##$DL= (0..7)
0 120 120 120 120 120 120 120 
##$DP= (0..7)
150 150 150 150 150 150 150 150 
##$DP07= 0
##$DPNAME0= <>
##$DPNAME1= <>
##$DPNAME2= <>
##$DPNAME3= <>
##$DPNAME4= <>
##$DPNAME5= <>
##$DPNAME6= <>
##$DPNAME7= <>
##$DPOAL= (0..7)
0.5 0.5 0.5 0.5 0.5 0.5 0.5 0.5 
##$DPOFFS= (0..7)
0 0 0 0 0 0 0 0 
##$DQDMODE= 0
##$DR= 18
##$DS= 0
##$DSLIST= <SSSSSSSSSSSSSSS>
$$ [...]
##$SUBNAM2= <"">
##$SUBNAM3= <"">
##$SUBNAM4= <"">
##$SUBNAM5= <"">
##$SUBNAM6= <"">
##$SUBNAM7= <"">
##$SUBNAM8= <"">
##$SUBNAM9= <"">
##$SW= 16.9725356469052
##$SWIBOX= (0..15)
0 0 2 0 0 0 0 0 0 0 0 0 0 0 0 0 
##$SW_h= 3396.73913043478
##$TD= 16384
##$TD0= 1
##$TE= 0
##$TE2= 300
##$TE3= 300
##$TEG= 300
##$TL= (0..7)
0 120 120 120 120 120 120 120 
##$TP= (0..7)
150 150 150 150 150 150 150 150 
##$TP07= 0
##$TPNAME0= <>
##$TPNAME1= <>
##$TPNAME2= <>
##$TPNAME3= <>
##$TPNAME4= <>
##$TPNAME5= <>
##$TPNAME6= <>
##$TPNAME7= <>
##$TPOAL= (0..7)
0.5 0.5 0.5 0.5 0.5 0.5 0.5 0.5 
##$TPOFFS= (0..7)
0 0 0 0 0 0 0 0 
##$TUNHIN= 0
##$TUNHOUT= 0
##$TUNXOUT= 0
##$USERA1= <user>
##$USERA2= <user>
##$USERA3= <user>
##$USERA4= <user>
##$USERA5= <user>
##$V9= 5
##$VALIST= <valist>
##$VCLIST= <CCCCCCCCCCCCCCC>
##$VD= 0
##$VDLIST= <DDDDDDDDDDDDDDD>
##$VPLIST= <PPPPPPPPPPPPPPP>
##$VTLIST= <TTTTTTTTTTTTTTT>
##$WBST= 1024
##$WBSW= 4
##$XGAIN= (0..3)
0 0 0 0 
##$XL= 0
##$YL= 0
##$YMAX_a= 42761
##$YMIN_a= -41691
##$ZGOPTNS= <>
##$ZL1= 120
##$ZL2= 120
##$ZL3= 120
##$ZL4= 120
##$ABSF1= 10
##$ABSF2= 0
##$ABSG= 5
##$ABSL= 3
##$ALPHA= 0
##$AQORDER= 0
##$ASSFAC= 0
##$ASSFACI= 0
##$ASSFACX= 0
##$ASSWID= 0
##$AUNMP= <proc_1d>
##$AZFE= 0.1
##$AZFW= 0.1
##$BCFW= 1
##$BC_mod= 2
##$BYTORDP= 1
##$COROFFS= 0
##$CY= 11.3945322036743
##$DATMOD= 1
##$DC= 2
##$DFILT= <>
##$DTYPP= 0
##$F1P= 15.9154993809931
##$F2P= -4.1035820241983
##$FCOR= 0.5
##$FTSIZE= 0
##$FT_mod= 4
##$GAMMA= 1
##$GB= 0.15
##$INTBC= 1
##$INTSCL= 1
##$ISEN= 128
##$LB= 0.24
##$LEV0= 0
##$LPBIN= 0
##$MAXI= 10000
##$MC2= 0
##$MEAN= 0
##$ME_mod= 0
##$MI= 1.114404
##$NCOEF= 0
##$NC_proc= 0
##$NLEV= 6
##$NOISF1= 3.799351
##$NOISF2= 2.8
##$NSP= 1
##$NTH_PI= 0
##$NZP= 0
##$OFFSET= 15.70392
##$PC= 1
##$PHC0= -11049.31
##$PHC1= 11.60088
##$PH_mod= 1
##$PKNL= yes
##$PPARMOD= 0
##$PSCAL= 0
##$PSIGN= 0
##$REVERSE= no
##$SF= 200.130013532006
##$SI= 16384
##$SIGF1= 3
##$SIGF2= 2
##$SINO= 400
##$SIOLD= 16384
##$SREGLST= <1H.CDCl3>
##$SSB= 0
##$STSI= 0
##$STSR= 0
##$SW_p= 3612.71676300578
##$SYMM= 0
##$S_DEV= 0
##$TDeff= 0
##$TDoff= 0
##$TI= <>
##$TILT= no
##$TM1= 0
##$TM2= 0
##$TOPLEV= 0
##$USERP1= <user>
##$USERP2= <user>
##$USERP3= <user>
##$USERP4= <user>
##$USERP5= <user>
##$WDW= 1
##$XDIM= 8192
##$YMAX_p= 0
##$YMIN_p= 0
$$ End of Bruker specific parameters
$$ ---------------------------------
##NTUPLES= NMR FID
##VAR_NAME=  TIME,          FID/REAL,        FID/IMAG
##SYMBOL=    X,             R,               I
##VAR_TYPE=  INDEPENDENT,   DEPENDENT,       DEPENDENT
##VAR_FORM=  AFFN,          ASDF,            ASDF
##VAR_DIM=   8192,          8192,            8192
##UNITS=     SECONDS,       ARBITRARY UNITS, ARBITRARY UNITS
##FACTOR=    0.0002944,     1,               1
##FIRST=     0,             0,               0
##LAST=      2.4114304,     0,               0
##MIN=       0,             -41691,          0
##MAX=       2.4114304,     42761,           0
$$ Real data points
##PAGE= N=1
##DATA TABLE= (X++(R..R)), XYDATA
0 0 0 0 0 0 0 0 0 0 0 0 0 0 0 0 0 0 0 0 0 -8 8 -8 8 -8 8 -16 16 -16 19 -24 24 -32 32 -40 45 -48 56 -64 72 -80
40 -80 88 -98 109 -122 134 -149 165 -182 200 -221 245 -270 294 -326 359 -396 440 -488 541 -605
60 -605 680 -769 878 -1013 1188 -1426 1763 -2298 3328 -14324 41231 -8879 -40698 23583
74 23583 4130 -11559 5750 2106 8944 10037 -13779 17051 14859 -7304 5656 22029 5378
87 5378 1376 18454 11274 8547 7933 8709 11754 9736 1102 7722 19238 -1374 5877 12412 2833
102 2833 5208 2776 -351 7024 -181 -8733 13018 -1654 -10533 10301 -595 -9686 -2343 2451
116 2451 -7654 -7842 -2024 295 -8089 -7522 5096 -7724 -7595 -1989 -1762 -8328 -8025 947 -3633 -8479
132 -8479 -3653 5349 -8278 -5861 3283 -5048 -5172 -2016 -710 -5432 1498 -1648 -4205 2772 83
147 83 -4535 -1952 4114 -5556 -955 1965 -1107 1288 -2549 1822 4427 -1684 -5183 9054 495
162 495 -6452 6284 5990 -1104 -1089 8452 3407 -521 2512 4115 3909 -332 3591 3637 3910 1893 4848
179 4848 3864 1500 5494 -758 2852 4552 373 -640 6126 2221 -2872 5126 871 25 -2190 -197
195 -197 1585 -2816 -3059 352 1191 -5932 -1051 -762 -3076 -3645 -3344 -2776 -5743 -652 -4511 -3666 -989
212 -989 -2259 -5477 -2009 171 -5722 -2669 -2039 247 -3783 -2547 3074 -1125 -2821 -762 3637 -2986
228 -2986 -2439 2481 2469 -737 -1216 5991 1082 1456 2247 3219 2540 1793 2142 1850 4737 777 3811 3040
246 3040 2961 3149 1165 3771 1659 1461 845 3422 1457 11 2488 2084 1261 -1989 2812 44 -1103
263 -1103 -322 -690 571 -929 -759 -1569 1013 -2594 -1251 -1612 -3078 402 -4295 -2650 -382 -801 -4554
280 -4554 -875 18 -4211 -2133 -2146 -725 -4080 -1562 -244 -1377 -1591 -2239 1010 -1871 -1818 -1907 1119
297 1119 -1200 -1963 799 26 2305 -1980 765 2748 394 -1459 2019 2681 -1457 2627 1215 2825
313 2825 1837 559 2653 2629 972 -560 4353 1273 492 2093 3498 1771 -625 3551 1560 1398
329 1398 -173 1447 1350 481 759 -93 2040 -566 -279 -796 628 -48 -2600 888 -430 -1068 -1462 875
347 875 -1779 -1621 -135 -2186 -611 -2251 -1049 -2023 -27 -2538 -2078 176 -1996 -1361 -2398 275
363 275 -2451 -2137 -1101 -613 -920 -2086 425 -1652 75 -908 -958 114 -38 -553 -882 2108 -335 378
381 378 670 1197 856 -563 1734 788 1471 47 1821 2199 1252 660 2014 3821 -593 1354 2662
398 2662 2307 340 1047 3911 1087 805 1229 3068 51 826 1465 712 1760 -841 1360 953 471
415 471 -961 680 575 -1526 -782 -854 916 -2993 -1397 122 -1415 -2635 -2066 -183 -2641 -2218 -2956
432 -2956 -1125 -2249 -2562 -1634 -2412 -463 -3232 -1920 -1272 -1940 -2137 -1157 -635 -1586 -611 -1376 1250 -476
450 -476 -1495 940 831 99 -1130 2534 1820 37 252 3681 2227 -948 3428 2671 1481 717 2741
467 2741 2787 1624 1839 2030 3085 758 1880 1384 2147 761 454 2741 135 999 938 1547 -99 617
485 617 154 -216 1131 -1681 316 -558 -242 -979 -783 -428 -1695 -551 -1280 -1375 -1649 -83 -2335 -2157
503 -2157 776 -1780 -2182 -1147 -76 -2604 -1784 -363 -1335 -1572 -2008 265 -1802 -1069 -1270 -52 -843
520 -843 -2521 419 115 -1213 -1580 1410 -721 -693 304 -590 644 -530 185 -263 1237 302 -588 1435
538 1435 1249 537 -529 2536 476 584 1155 1123 2082 296 1880 2118 1573 356 2145 2541 306 963
556 963 1929 2972 -58 1277 2133 1133 747 365 1256 690 1020 -1015 1527 744 -1112 219 362 455
574 455 -2523 182 154 -1740 -1965 -447 -864 -2580 -966 -1590 -930 -2291 -2111 -833 -1855 -1885 -2371 -459
592 -459 -2008 -1387 -1479 -1611 -1356 -1266 -1005 -2120 191 -927 -1207 -67 401 -280 -538 1394 -340 628 248
611 248 1059 935 152 1668 1269 1526 444 2087 1594 1363 1349 1372 2550 822 1318 1259 2219 1291 704 1246
631 1246 1164 1376 -23 1549 698 380 178 928 430 -938 479 -370 -46 -1011 105 -389 -1107 -654 -1317
650 -1317 -97 -1455 -1092 -1204 -657 -1255 -1915 -781 -1448 -954 -2043 -1130 -701 -805 -1824 -1464 257 -1774
668 -1774 -1219 -602 -105 -1247 -1083 443 -616 -518 -745 769 -538 -226 63 579 644 -592 1263 388
686 388 853 210 1071 1311 586 907 312 2255 771 504 1455 1491 700 752 1929 702 1260 234 1521
705 1521 823 11 811 614 902 -360 642 517 381 -172 81 536 -524 143 -812 350 -679 -916
723 -916 -294 -565 -477 -1839 -234 -720 -269 -1725 -844 -397 -1541 -973 -940 -377 -1558 -784 -622 -834 -875 -1162
743 -1162 -98 -1133 -327 -1051 138 -89 -1295 83 -242 506 -754 453 623 609 -292 108 1685 -284
761 -284 453 597 1452 511 413 1140 643 1019 338 1710 834 995 684 913 1380 251 1236 743 1287 179
781 179 830 764 690 383 -109 1565 46 148 -262 424 88 -793 72 -229 115 -1073 189 -395 -796 -664
801 -664 -847 -128 -1332 -752 -1026 -472 -1281 -1032 -672 -1004 -783 -1664 -129 -979 -1216 -968 -703 -190 -1264
820 -1264 -401 -546 66 -991 -241 132 -425 -35 -311 546 -7 314 129 642 301 -19 1108 323 857
839 857 48 1275 799 482 960 895 1586 216 1176 1033 1053 493 841 1376 355 785 287 1136 326 127
859 127 528 308 596 -127 579 -201 335 -425 183 242 -517 -114 -634 230 -912 -601 -631 -140 -835 -1036 -90
880 -90 -955 -523 -1349 -386 -424 -1198 -511 -858 -124 -1220 -775 -769 -222 -775 -994 215 -724 -555 -766 291 -476
901 -476 -450 318 70 127 -518 905 148 335 -187 717 864 -445 683 913 874 125 926 867 762 821 382
922 382 1507 522 998 313 1157 1268 31 966 634 740 -69 865 669 312 166 84 830 -468 332 -123
942 -123 390 -593 -331 350 -255 -353 -930 109 -689 -564 -876 -801 -51 -1062 -1097 -1107 -281 -1535 -1046 -294 -863
963 -863 -836 -1092 -138 -1380 -590 -369 -635 -814 -827 -77 -519 -157 -532 249 -116 -445 265 -143 255 -17 516
984 516 36 612 541 197 516 799 1213 -208 1613 801 391 722 702 980 322 1136 318 958 326 793
1004 793 900 362 727 329 911 -20 596 333 400 176 -359 465 -46 36 -691 68 61 -343 -513 -275 325
1025 325 -781 -623 -478 -313 -752 -786 -76 -1196 -440 -893 -165 -902 -731 -421 -640 -553 -1122 -251 -748 -396
1045 -396 -662 -445 -132 -499 -58 -667 465 -455 -235 -38 329 33 -463 708 29 62 83 750 164 -6
1065 -6 672 422 598 38 762 655 403 326 301 974 205 700 268 857 382 158 413 654 388 -532 744
1086 744 362 -2 251 259 685 -467 61 -98 307 -524 173 -160 -257 -168 -748 249 -711 -498 -448 -344 -1100
1107 -1100 -1088 248 -610 -717 -1358 -573 -514 -753 -284 -125 549 -235 170 -629 183 -107 -1230 -783 -317 -586
1127 -586 -134 76 -374 -305 -475 146 2043 570 504 165 1079 -106 -736 1082 436 805 772 1460 -1
1146 -1 1018 654 756 783 105 789 569 467 81 516 854 -42 296 448 611 -264 269 -71 370 59 -146
1167 -146 246 -13 128 -650 70 -179 -381 -296 -115 -119 -818 -260 -714 -295 -796 -404 -92 -741 -561 -655 -15
1188 -15 -1034 -528 -325 -428 -268 -641 -81 -695 -197 -371 -234 -273 -598 -74 -63 384 -618 240 52 352
1208 352 -49 129 696 87 310 37 952 227 -5 395 332 628 251 951 294 802 510 570 732 -4 325
1229 325 -194 1021 75 641 157 804 237 -72 677 207 28 -170 2 -81 -714 247 -642 -271 -626 204
1249 204 -78 -531 -360 -777 214 -482 -736 -419 343 -172 -678 -201 -1338 -120 -769 -83 674 -464 -553
1268 -553 127 -151 -474 -40 -48 -501 -409 413 105 383 484 139 563 502 544 365 668 705 29 770 116 416
1290 416 366 721 525 567 643 1043 1138 467 1006 344 1088 118 806 1042 603 581 -246 697 -157 145 333 590
1312 590 322 -306 156 -140 381 -533 -129 101 -286 -117 -667 295 -490 -71 -385 -176 -379 -840 -16 -457
1332 -457 -462 -688 -120 -201 -549 -188 -246 -222 -622 -342 -298 -105 -331 -512 -14 -259 -294 -353 219 -433 -206 35 100
1355 100 204 -51 532 129 211 141 101 296 -28 117 -11 634 -182 47 487 432 216 144 1102 504 464 51
1377 51 320 945 224 462 344 729 174 291 284 -9 151 -136 79 301 -92 148 -70 37 96 159 423 -38
1399 -38 -667 -96 -326 -299 -90 -56 -85 -1247 -552 -520 -262 -909 -664 -265 -210 -44 -408 -330 -150 -450 -480 -1020
1421 -1020 -312 -582 -60 -467 -115 -164 320 642 -19 338 -188 192 -944 606 539 195 860 -612 357
1440 357 189 135 179 706 737 -300 352 159 858 480 351 648 514 -71 584 558 599 174 -48 596 -199
1461 -199 606 -404 383 -273 365 174 -401 366 -792 -795 9 -41 -516 -534 62 -294 -969 -177 -743 -77 -756
1482 -756 -74 -900 -613 -671 -220 -1256 -572 183 64 -195 -482 -35 -64 310 -1186 -570 337 -689 -160 241
1502 241 -69 -343 84 311 91 409 -363 -107 -192 210 -155 793 106 -319 567 865 592 13 -76 439 332
1523 332 729 576 1549 154 419 545 483 208 970 169 265 -13 99 287 263 510 -145 531 631 -838
1543 -838 -4 -698 -560 585 64 329 -264 -30 -606 249 -280 -205 -777 -263 -48 -538 -302 -369 -47 -557
1563 -557 -196 -300 -197 -362 -336 -22 -343 -60 -291 -6 -250 -419 39 -124 122 -139 180 12 -65 -66 168
1584 168 539 -82 388 104 394 -27 228 517 371 394 220 577 20 202 70 666 409 154 666 181
1604 181 297 -59 481 101 206 288 -81 236 -183 136 -192 357 -423 -149 99 -370 81 -336 -48 -396
1624 -396 -317 -504 -461 -96 -628 -34 -237 -443 -407 -176 11 -553 -501 -591 -255 -529 -311 -450 -291 -105 -764 -231
1646 -231 -243 -45 -339 55 -86 -26 24 -169 473 -192 230 397 497 -21 273 549 313 234 213 547 275 213
1668 213 325 300 443 375 406 279 251 367 579 326 74 267 -189 481 138 81 349 365 128 -216 175 -167
1690 -167 -106 -179 17 -107 -539 -22 -125 -124 -594 -113 -317 -312 -521 -96 -244 -438 -123 -663 -109 -323 -239 -309 -213
1713 -213 -41 -676 -278 -238 -208 -347 -157 34 -91 -130 0 116 -266 -196 138 -160 69 89 288 81 48 118
1735 118 166 -11 59 356 126 489 296 206 -7 346 173 230 476 -72 384 377 359 139 259 580 66 242
1757 242 150 423 198 -41 103 38 117 23 -13 -58 346 -156 -80 250 -192 -107 -200 -67 -277 -31 -319 -272 -223 -374
1781 -374 -47 -379 -218 -659 -220 -522 -312 -179 -180 -283 -342 -443 -656 -328 -490 -495 284 225 -112 -435 113 -50
1803 -50 -119 -18 58 307 -102 256 165 193 10 358 409 499 456 283 691 300 334 276 365 382 9 660 235 375
1827 375 272 406 217 159 297 56 465 -188 195 123 332 -272 -253 -130 -369 184 -316 -463 -523 -189 112
1848 112 -209 -128 -460 -153 -413 -266 -256 -196 -275 -152 -211 -276 -170 -303 -323 -187 60 -197 -189 -41 -200 -355 -363 -327
1872 -327 212 -332 -17 -76 229 -28 176 207 -94 -27 -88 261 -123 193 44 426 -22 243 74 138 242 -99
1894 -99 521 257 356 -69 239 492 125 277 302 492 30 225 135 134 49 21 294 -290 -126 58 445 71 -24
1917 -24 31 14 -38 -215 173 -24 -139 9 -264 200 -223 -64 -388 -267 -368 -288 -372 -341 -249 -430 -149 -433 -247
1940 -247 -306 -286 -87 -413 -23 -134 -128 -373 -316 -172 -397 -160 -198 -32 -233 -224 -18 134 195 140 -41 42 137 -19
1964 -19 195 248 172 -18 108 386 340 447 12 633 58 216 556 256 299 97 473 253 180 177 472 295 -71
1987 -71 295 14 146 99 17 341 -116 162 -296 196 -163 -34 -54 -105 -19 -136 -172 -277 39 -428 -162 -131 -382
2010 -382 172 -378 -259 -347 -3 -484 -376 -300 -74 -85 -533 67 3 -64 -359 -120 111 -16 202 -398 153 165
2032 165 -31 -64 -33 35 269 66 289 179 100 44 -14 49 195 -104 441 -132 443 249 123 91 -277 630 444
2055 444 1745 317 -112 92 -182 295 68 486 -46 60 -155 -77 -71 -74 191 175 67 -410 -50 -326 -214
2076 -214 -110 -362 39 -265 -186 33 -175 -413 -242 26 -31 198 -297 69 -161 -109 -200 -109 -108 -157 135 12 116
2099 116 1 -28 77 -44 -14 -116 312 9 140 -128 280 -101 183 346 83 342 149 247 -107 196 155
2120 155 205 235 177 197 18 269 240 237 425 151 239 164 113 -235 346 186 170 202 35 380 -14 189 93 314
2144 314 18 -221 148 -93 41 -377 27 -312 -46 -248 -498 42 -251 -223 -391 47 -170 -200 -284 -258 -116
2165 -116 -441 60 -613 -368 -311 -170 -80 -328 24 -393 -62 -270 32 148 -114 226 -157 271 13 115 4
2186 4 350 -137 375 343 300 645 61 207 277 381 329 423 213 220 190 240 268 209 254 302 133 188 79 430 121
2211 121 149 -38 136 9 44 197 -111 247 -67 -155 -187 -280 -53 -148 92 -113 -89 -385 -243 -229 -461 -106 -261
2234 -261 19 -476 -24 -400 -299 -292 -508 -155 -151 -154 -346 -187 -441 -272 -68 -294 200 -83 43 82 10 240 64
2257 64 194 31 0 44 178 15 -57 -88 164 154 179 625 26 327 -38 218 395 -42 217 166 59 9 280
2280 280 37 200 107 -151 353 -92 402 353 264 -158 -91 47 54 -77 -211 84 186 144 -39 -87 -67 -71 -212 -71
2304 -71 -206 -120 -69 1 -389 -165 -17 -43 -289 40 -173 -119 -141 -452 -188 -468 -329 -58 -194 -61 -99 -49 -132
2327 -132 292 -215 88 -136 27 -74 124 111 120 392 43 87 75 58 254 62 361 28 470 425 252 -94
2349 -94 198 284 10 251 279 409 -22 55 335 252 68 9 92 172 146 -121 407 271 -75 22 -192 134 -165
2372 -165 -97 -205 129 31 72 -15 -330 -150 -253 -11 -270 -267 -16 -157 -95 -480 -126 -344 -105 -124 -50 -266 -374
2395 -374 -336 -261 -127 -159 158 142 35 250 -139 75 -63 -39 -76 -113 186 -121 155 118 468 -38 245 30 25
2418 25 117 -48 156 -5 187 211 296 161 -92 364 61 142 78 199 342 144 300 -18 -26 191 172 -88 88
2441 88 -324 13 199 -187 84 -57 -15 -87 -10 -182 -306 -208 -196 -51 -83 40 -202 -53 -234 -338 -156 -423
2463 -423 -12 -389 -275 -203 -131 -134 -334 -42 -239 -36 -251 -17 -159 -239 152 238 126 -241 136 34 1 -58 -142
2486 -142 180 136 -75 -140 446 5 167 -23 121 204 -162 289 216 -42 204 282 232 187 71 33 340 195 19
2509 19 263 160 9 123 188 -62 166 -239 26 -146 -61 -12 -96 142 -248 81 -136 48 -56 90 38 -86
2531 -86 -164 -357 -89 -193 -1 -139 -167 10 -383 76 -28 -107 -192 -196 5 -261 -93 -19 80 -37 167 151 -195
2554 -195 -78 -212 249 141 7 2 -108 11 -6 92 118 80 29 162 198 53 158 44 347 160 -137 98 466
2577 466 -211 177 131 -117 158 266 107 -170 428 29 390 264 48 -170 40 -5 -6 145 -109 -165 -242 -106
2599 -106 90 45 -4 -326 -154 -161 -132 -103 -82 -315 -296 -124 -247 -28 23 38 -86 -115 -91 -239 35 -215 1 -234
2623 -234 165 -87 -2 107 -184 11 -23 114 368 38 281 159 -7 49 154 186 163 443 6 309 -149 47
2645 47 -14 459 35 -22 147 -294 252 -103 90 -8 71 -96 -45 112 -142 52 297 220 -89 -20 30 -118 -227
2668 -227 -26 147 0 -267 -7 -27 -173 -47 193 -63 73 -135 -224 -343 -175 -25 -211 -192 -144 -356 -16
2689 -16 -64 -293 -289 74 -298 -201 82 19 152 -489 160 92 144 -24 144 -71 -165 75 45 190 -38 174 128 339
2713 339 -20 -48 139 -60 219 -34 477 -174 22 324 314 363 215 210 16 262 -103 280 188 -50 -34 -92 197
2736 197 -7 297 254 216 -175 27 113 -266 207 53 184 -165 -131 53 -71 72 -251 -281 -212 -31 -44 -125 -51
2759 -51 -555 25 -327 45 -311 -32 49 -254 32 -388 44 -73 -8 62 -187 -151 -118 -99 -50 -136 -76 -7 -129 162
2783 162 101 116 210 -29 16 -15 388 2 72 172 -77 2 173 245 -6 313 60 126 20 81 99 177 304 263
2807 263 172 138 -79 50 83 338 27 -172 -20 -121 -106 94 173 -75 -11 -289 120 -145 -27 -159 90 -129
2829 -129 -112 -76 -95 -287 -182 -100 -24 -349 -115 -289 -284 -107 -269 -269 -176 37 -205 -24 -31 74 21 -28 -100 -55 18 -238
2855 -238 -27 -135 67 -138 -193 124 79 -31 141 295 -124 218 52 146 105 67 300 297 247 -56 218 121 85
2878 85 108 -18 266 -55 -18 99 50 137 -181 307 -27 53 46 -20 -137 140 74 -129 58 36 161 -140 11 2
2902 2 -146 -6 146 -13 -258 40 -256 -244 -199 152 -60 -173 -86 -337 -67 -443 2 -87 -335 -112 -12 -77
2924 -77 60 -100 38 -96 108 6 -23 -180 136 -72 22 -18 176 169 249 42 -29 120 54 146 14 122 -4
2947 -4 -10 183 3 397 -264 216 247 334 600 22 222 127 64 -83 353 -108 -65 -76 79 28 -359 -106 221 -97
2971 -97 -98 20 88 -352 -12 -148 -141 -259 -187 50 35 -228 -41 87 -236 -165 -360 -145 -63 -137 -71 140 -7 -175
2995 -175 34 -11 -278 -212 -87 -233 67 21 -86 -103 44 29 -18 -54 -14 6 165 -77 359 270 -11 39 -11 197
3019 197 78 231 152 351 252 -56 101 69 24 -12 -153 -151 187 -75 -2 487 -77 17 -48 -218 -52 -254 167
3042 167 -39 -303 59 43 -31 51 81 82 -131 -134 -77 -302 -103 -41 -21 82 -136 7 -337 -465 -232 -58 -294 -11
3066 -11 57 -267 110 -247 83 -26 204 25 -78 209 -214 -41 275 -40 -78 26 69 145 -59 -71 -252 -173
3088 -173 -34 215 42 276 194 302 -266 243 30 269 -11 -50 348 69 99 241 214 83 289 -158 125
3109 125 -108 -96 112 176 -43 -8 52 -241 -262 -16 76 198 -95 212 -45 100 -130 -277 26 -183 -233 41
3131 41 -167 -110 -44 258 -172 38 -257 -39 78 26 -439 -324 -123 -215 89 -193 -21 0 24 -95 -99 27 -69
3154 -69 -115 34 -54 40 3 -74 -28 7 358 36 -152 238 107 121 -16 58 -135 185 -51 -102 56 98 -54 97
3178 97 7 127 30 298 160 -15 -43 -35 33 -268 193 12 -79 78 27 69 155 -143 -197 -219 -557 -81 -13 -70 48
3203 48 43 60 -177 -126 -124 51 -41 -191 -68 -181 -6 -148 24 -253 135 214 44 -122 -39 33 -278 68 110 97
3227 97 -299 -24 271 -102 80 -66 42 54 20 261 43 160 -40 34 40 96 109 51 309 245 185 -2 143 -127
3251 -127 -186 -148 -59 84 -11 147 -152 129 -179 195 -158 -299 426 -200 467 204 -213 131 -80 -400 -599
3272 -599 -748 -80 -51 205 -381 -485 43 -190 -46 111 -451 -141 289 -73 -438 -304 -478 -27 -245 -206 -161
3293 -161 -93 1 -111 -167 -175 -304 -89 -96 -202 1 -82 -160 69 355 -41 361 87 -10 -241 -42 184 99 175 -155
3317 -155 -18 24 390 -38 92 100 26 299 164 95 132 85 413 299 -162 222 -871 -344 478 -330 591 -237
3339 -237 -715 5 46 -44 50 102 364 -108 645 -195 505 98 -342 -46 -359 101 -58 76 -183 76 -280
3360 -280 33 -16 -186 -143 -397 67 -112 -141 -29 -73 79 67 -128 -154 220 -109 -33 -310 134 -7 -52 44 -255
3383 -255 164 95 68 -12 20 34 -244 240 -14 24 57 2 256 281 354 51 453 161 -33 91 246 383 104
3406 104 68 -77 83 215 35 -139 105 243 -21 125 -112 185 -68 73 -21 52 7 -247 -138 -277 -48
3427 -48 -117 -95 176 88 129 -146 121 -347 66 -186 -70 -387 -122 -286 -46 -129 -593 71 5 -184 -215 104 -54
3450 -54 63 -90 -171 86 -216 -230 61 -187 262 186 118 96 -12 32 57 -142 -20 149 -106 34 69 252 76
3473 76 -142 66 14 -44 -133 -171 37 -283 -36 299 157 187 -272 -19 -110 2 111 37 -95 9 -58 -9 -165
3496 -165 -41 -23 7 83 -88 -17 -137 169 -85 144 64 -86 -190 -138 -249 -191 247 -29 -367 -153 -127 -49 -157
3519 -157 5 -235 -97 -41 138 -27 45 85 -230 45 -80 -44 17 -139 80 179 -75 116 -63 -65 511 225 -116
3542 -116 224 -53 215 196 46 -63 -54 260 367 213 -227 62 -85 -184 67 255 55 -43 -45 167 -5 -318
3564 -318 90 69 88 231 -62 -105 12 138 -10 63 -172 -181 17 30 106 9 90 -82 -137 -12 -245 -233 85 -95
3588 -95 -228 -74 109 -262 -240 -80 150 -40 -102 -225 123 -80 -307 41 -18 -71 41 -137 -79 152 -115 -43
3610 -43 -26 184 154 146 68 138 -112 122 96 5 -181 -110 134 101 212 209 108 126 141 113 -30 -59 153 30 -17 -103
3636 -103 -40 -73 143 231 169 254 19 158 112 -377 272 -89 38 24 -110 9 -105 -71 53 112 72 39 -47 103
3660 103 -131 -59 -99 -88 109 -178 -265 -188 91 -210 -145 -42 -109 112 -157 113 -109 -155 258 -30 -163 -126 223
3683 223 122 98 14 22 73 150 217 61 303 -109 138 -26 -78 -122 297 78 48 117 6 17 54 197 237 122 376
3708 376 23 153 49 -99 -34 -179 74 -258 91 34 -41 147 7 231 -21 -86 -100 -10 127 -197 -138 82
3730 82 126 58 -93 -168 -170 -173 115 -117 -205 -179 200 -3 -27 47 42 83 251 141 -173 -216 -38 168 -181 -83 -175 64
3756 64 -112 -79 63 29 106 -61 -23 236 -62 -113 194 22 95 129 -99 67 -100 61 -66 233 155 414 110
3779 110 18 82 175 199 10 12 -160 31 116 -83 221 -66 22 -221 44 -35 103 -22 -122 -95 -126 -112 92 118
3803 118 73 -102 -124 241 -126 -125 -174 -75 104 -63 -3 -3 -202 -22 -218 -85 -210 102 3 46 -171 -44 25 -167
3827 -167 34 -152 -96 310 -69 180 108 223 144 -56 -141 70 15 82 267 -165 35 6 -6 61 279 94 -8
3850 -8 117 137 302 100 203 -87 -129 186 -370 149 3 -72 -16 29 167 -223 -155 -20 203 -75 -137 -26 -267
3873 -267 -139 -151 51 177 82 -126 -99 -125 -72 48 -89 92 -82 -17 -355 111 -68 -161 -52 -69 -9 -272 241
3896 241 -160 8 42 90 48 126 -140 -24 152 -6 -55 2 4 -111 95 -28 137 -115 91 169 130 102 133 71
3920 71 100 205 64 174 58 63 -40 200 185 106 121 184 155 180 207 26 205 -256 192 293 196 -152 104 -164
3944 -164 -116 246 141 150 -229 197 -166 100 -79 -218 -65 -124 -35 218 69 -82 -29 366 -338 126 45 -2 -211
3967 -211 25 -160 -247 99 -143 150 99 -151 -71 1 135 198 -16 59 23 138 -26 200 238 157 124 216 -6 -168
3991 -168 238 60 108 11 120 98 64 176 213 -98 24 397 213 159 -25 -122 246 115 -134 61 115 117 53 83
4015 83 -129 148 303 -1 136 104 131 226 -113 69 75 -71 -215 -331 1 19 -38 370 -144 -107 -75 32 17 -131
4039 -131 -275 -143 -100 140 -94 7 29 -5 41 -52 -226 -134 292 40 89 115 -150 306 175 64 41 -139 58
4062 58 207 109 70 274 -297 -222 -383 427 -41 -333 -404 11 81 -453 366 159 -49 73 -6 -168 -445 -214
4084 -214 -53 56 191 104 342 -108 47 79 -10 -81 68 -4 -78 111 18 53 -177 186 -104 -97 105 -206 102
4107 102 -62 159 -24 195 47 7 10 -246 -143 74 58 32 33 -138 -104 -112 20 59 -45 -97 144 -106 194 -207
4131 -207 220 138 149 -260 -43 172 24 104 -168 -114 -72 -62 238 25 36 156 110 72 -62 31 188 109 166 218
4155 218 18 213 -26 90 -56 65 -14 -11 68 20 -176 -35 -52 -132 -53 -44 84 53 -350 -61 -36 194 -33 67
4179 67 -48 -53 -190 99 -146 124 213 97 -161 -7 120 77 -73 -128 -156 170 -63 -75 164 -64 -70 -35 101 -79
4203 -79 -178 68 173 -14 -27 46 265 273 100 63 72 -221 -39 -52 112 120 -41 -374 -9 -48 -193 -146 52 117 -204
4228 -204 73 -80 -39 -49 46 -205 -100 89 154 63 -35 89 -73 -146 110 -103 125 -210 78 19 -80 226 -97
4251 -97 43 137 286 66 16 -18 -58 37 -67 -18 -34 9 -10 -181 15 177 118 20 57 179 -77 -64 -66 276 73
4276 73 94 7 -79 -32 70 -146 156 30 68 -74 50 68 213 98 -33 133 32 -235 -142 -43 225 291 236 188
4300 188 -186 260 -10 107 -140 108 12 221 71 -127 180 -139 24 -115 -48 429 115 -115 111 -203 -291
4321 -291 67 127 -124 -97 -98 -191 84 172 67 -173 256 254 123 -143 10 101 55 148 -29 -67 21 140 -278 53
4345 53 -62 -98 111 269 -94 -163 -66 -44 -228 -243 22 -63 -70 166 165 0 16 -198 -57 124 -54 107 -20 0
4369 0 135 -56 -124 -72 166 -49 6 -10 -215 -103 53 73 33 11 39 -1 -45 -220 278 102 187 -99 15 22 -39
4394 -39 336 126 116 235 60 -131 -5 -226 -16 -116 -168 -104 -1 -169 49 198 -44 87 58 104 65 113 258
4417 258 49 -238 161 19 10 -3 12 143 61 -135 72 -60 100 -100 68 222 140 -14 172 -45 125 77
4439 77 87 -215 -150 -22 174 7 137 122 -261 125 -183 -184 165 151 36 65 52 27 -125 -215 246 -18 57 25
4463 25 4 86 -198 49 89 256 -48 179 -61 -39 120 -101 97 -184 79 238 23 316 -226 99 167 20
4485 20 127 -4 -247 -12 37 52 114 31 46 -159 -36 -20 131 -56 133 -65 50 -3 183 -172 77 85 -169
4508 -169 -95 129 -308 128 10 -66 139 -16 217 -85 12 -8 41 -15 71 -37 -179 -58 -111 72 293 122 64
4531 64 202 206 -233 206 -37 175 39 18 138 50 228 129 -190 121 243 240 -9 219 -207 -87 -66 80 -103
4554 -103 -62 -22 -69 291 20 208 -4 142 -120 -228 194 15 -83 -137 -191 8 -43 172 -184 -235 21 297 -214
4577 -214 117 111 7 -289 45 5 113 247 -92 132 9 77 296 191 29 -111 -22 185 43 -11 111 215
4599 215 -219 26 32 108 -73 109 -46 -192 70 -77 -34 -52 -28 -99 -130 78 -175 -20 116 -10 -192 116 -28
4622 -28 13 -120 -231 261 -167 95 -34 -63 124 -19 94 161 106 -171 2 -51 180 -203 28 27 110 -88 104
4645 104 72 8 -5 39 -104 -58 -51 -352 244 -12 58 73 196 128 118 224 113 205 -90 -54 49 34 141 192 -107
4670 -107 -133 266 -245 -200 133 142 80 88 36 -102 30 224 68 117 192 22 142 107 377 -46 50 66 -197 -10
4694 -10 10 -100 -65 -109 83 179 44 17 228 -151 52 71 -58 242 -64 -172 -233 -109 -11 -105 -401 122 20
4717 20 139 -98 -1 -29 111 192 -51 -90 -116 103 -82 180 250 136 28 49 95 -45 -335 -60 177 99 100 -68
4741 -68 -95 -140 99 38 163 61 148 -154 116 143 68 188 -327 88 2 143 66 -70 -124 150 89 -178 132 -32
4765 -32 152 114 -48 148 172 29 -274 -160 348 145 108 -179 101 -46 -262 -59 39 -79 -123 14 -55 -147 -65
4788 -65 -113 -78 102 -139 -80 -9 63 -106 -121 -114 106 61 -91 78 -89 -64 -14 -297 86 -150 158 112 -259 -27
4812 -27 -87 108 208 -630 166 20 296 -74 -559 -167 195 286 -459 -306 790 371 2 -632 469 870
4832 870 512 385 -289 -192 964 615 -232 145 -280 -89 72 -216 236 -475 134 -534 -420 144 96 200
4852 200 -271 -18 -630 377 164 -40 -124 -33 -268 314 -245 -360 -231 170 -400 187 78 178 217 -29 536
4873 536 -228 75 -45 -600 355 424 -361 -213 -692 108 -67 79 476 -47 -311 -35 -1078 -724 -685 -10
4893 -10 729 -710 -500 -9 756 -408 285 -111 371 -594 248 360 48 -718 -171 98 -97 534 267 -337
4913 -337 -200 83 -19 373 87 -5 -302 -136 -25 268 -3 7 112 215 -225 163 -133 -223 -193 -104 174 -359
4935 -359 75 95 -177 -152 -179 -333 -174 550 267 11 -29 753 -88 -161 -253 97 -165 -307 -20 -417 97 61
4957 61 9 -357 296 226 117 -389 -305 356 73 92 98 185 65 -182 58 249 59 182 198 171 389 86 -158
4980 -158 465 289 114 -132 -285 166 -167 55 128 -132 126 -214 79 -50 468 278 -204 -138 -23 63 -38
5001 -38 -32 -60 34 201 192 100 -187 -32 -241 -39 18 -150 -89 -144 264 -200 79 -229 130 -8 -87 165 -225 -114
5025 -114 -42 -76 113 -165 -10 -288 -154 -14 -166 29 169 -11 -229 239 264 100 278 -66 -104 -52 -14 -103
5047 -103 18 11 -185 -16 -4 5 116 -26 145 276 -140 30 -38 124 14 76 99 61 22 158 -8 -37 0 218
5071 218 -30 -78 -14 -60 84 129 115 -98 -112 -169 109 -97 -289 -63 52 -184 297 177 18 75 -42 -62 -181
5094 -181 -51 -69 -46 -34 -11 -35 -90 91 67 94 -214 45 20 18 -14 82 97 20 87 -76 236 37 -124 74 78 43
5120 43 107 70 5 163 119 303 234 104 88 40 145 -15 86 -168 81 40 240 225 24 122 -26 -74 -52 -42 92
5145 92 -80 -119 -81 -29 -218 48 -191 -165 213 79 111 147 19 -92 -75 208 83 -28 -229 32 -145 195 -220
5168 -220 49 -17 -205 -18 29 65 -10 -130 32 -73 64 23 234 -8 -2 65 32 31 34 182 58 -32 -84 174 138
5193 138 316 74 -146 -21 159 102 75 -85 -41 -114 -91 -34 -9 174 20 -42 80 -115 -213 28 147 188 -89
5216 -89 266 75 143 114 -62 -61 -71 247 -31 92 -112 56 99 13 -34 -82 23 -59 90 120 -19 -21 -32 -155 -46
5241 -46 240 144 151 -170 33 35 22 5 78 -71 -88 79 203 -40 -76 -36 -11 -22 -35 -131 113 86 221 -63 -253 126
5267 126 53 5 102 -162 -93 -148 -29 219 -47 -101 -40 -108 12 -130 -110 -185 -1 172 87 56 -159 -15 -33 229
5291 229 102 -80 59 175 223 92 60 77 213 -64 80 81 -72 -7 -62 -20 141 -89 -21 -9 -105 -180 -2 44
5315 44 66 -96 374 50 -229 -6 -97 50 81 -54 -163 -129 -200 -162 -70 70 -357 263 -97 -278 -95 -18 -58
5338 -58 -182 201 63 101 -249 75 54 204 136 108 93 3 5 1 145 -65 43 -22 115 -108 -54 72 -216 -34
5362 -34 20 -135 1 -285 -53 -155 73 -122 -93 -64 -99 5 -120 -4 -99 -168 -43 -101 -184 -116 -2 35 61 -17
5386 -17 -206 -70 43 -264 -16 -187 19 -35 201 -178 22 75 73 -62 16 -155 -257 62 -277 -152 146 23
5408 23 51 84 50 -128 -20 -10 145 -45 180 -3 165 92 61 138 -77 -88 82 104 -99 44 -63 228 -170
5431 -170 -135 165 -106 190 18 -3 157 212 -70 -53 -44 -211 -162 -39 -188 11 19 -88 -70 -42 121 58 76 8 -156
5456 -156 220 -137 -42 2 -71 6 -108 76 21 -96 9 77 -58 168 -18 191 97 -57 -187 -270 -39 -36 56 -262
5480 -262 60 -28 -81 -247 7 114 -262 79 194 232 271 -70 -122 -13 -355 -123 -112 -148 65 -103 112 -51
5502 -51 75 -160 126 -115 174 -95 37 143 -91 103 165 -64 136 14 69 41 42 193 168 -61 112 -19
5524 -19 -231 -129 -142 151 60 144 -19 -8 230 -214 -345 167 96 -63 143 -66 115 102 -171 -51 101 100 -14
5547 -14 -217 -178 74 -132 242 115 -89 -50 158 -56 43 114 -37 -86 41 41 -95 -60 -54 -91 -76 -107 9 -150 204
5572 204 271 -109 154 133 -73 -14 -131 -75 80 -231 -89 76 -57 -226 -35 67 101 -43 147 -117 -268 259
5594 259 261 -8 90 6 -29 155 -157 50 -256 -188 125 8 -87 -85 -385 -130 -197 -7 -300 -111 93 26 -159 21
5618 21 -15 91 -13 -135 -134 -89 24 19 71 -16 -5 156 -170 58 32 -134 -219 55 69 122 -83 118 159 82 3 -14
5644 -14 236 74 53 -278 170 129 43 -85 27 -12 49 -55 109 63 -69 13 192 19 120 91 -61 57 -76
5667 -76 -88 -48 -39 48 0 -69 -244 103 -22 -37 63 -86 176 -82 -39 -72 68 -3 -15 88 -52 140 34 174
5691 174 -295 -68 -107 246 -177 122 100 -5 -236 209 -120 -182 -80 153 -109 32 -130 -5 -35 0 -229 -2
5713 -2 -93 139 -97 156 59 -99 103 229 -194 -211 -22 -143 35 -249 -118 -103 -167 14 -11 53 144 96 207 -201
5737 -201 84 68 -62 -47 103 111 100 -147 -75 61 -21 -95 -126 -51 26 -35 -169 74 -114 -38 -18 158 187 194 -34 -8
5763 -8 -159 -58 -84 23 81 -36 -64 89 30 89 -147 -232 78 93 36 -336 -63 -147 -17 -95 168 -21 107 40
5787 40 29 166 293 51 -37 161 218 -170 112 16 416 -31 371 274 -6 -373 178 -95 -202 -225 -606 -367
5809 -367 108 -185 144 16 -360 425 8 -80 -471 -357 -189 -226 375 -326 -552 185 -76 382 223 24 208
5830 208 259 -84 -58 -169 23 -133 31 141 -129 -41 -83 71 300 15 -59 -12 -73 -146 72 -46 -153 11 183
5853 183 70 121 -25 -204 -86 155 116 101 11 48 250 -111 285 -78 -170 -251 -63 -131 104 -293 186 -33 -83
5876 -83 189 2 -104 -82 54 -149 67 27 71 -82 -58 -33 -26 98 77 -49 160 -98 -23 261 130 -4 -19 165
5900 165 66 21 -65 3 -163 -21 -97 245 -249 -53 -192 106 -142 -403 -135 90 602 -430 -713 -703 149 -134
5922 -134 -362 -237 -652 306 198 98 -146 46 243 255 63 28 -7 -76 231 69 -1 117 -139 -146 -48 -179 -38
5945 -38 30 -40 -34 87 -2 357 67 36 -17 166 -151 47 199 -21 -79 -288 -35 239 234 56 -41 131 -118 227
5969 227 -268 -115 109 -85 -76 -44 223 -247 11 -214 -148 -51 105 70 -106 -34 -220 -426 178 -30 -296 -193
5991 -193 54 69 -1 -166 2 224 -49 -137 -84 2 103 241 89 52 -87 -27 125 23 71 -24 -41 -175 128
6014 128 27 -11 10 -298 -16 135 -39 253 98 270 -165 -118 211 422 110 -94 362 54 -148 11 182
6035 182 210 25 129 250 170 -44 44 -59 -158 44 28 -80 38 -168 -158 -198 53 342 -61 -91 -65 -144 84
6058 84 61 296 4 -43 42 -44 176 253 -190 -314 153 178 -6 158 -320 238 -31 78 218 -23 14 15 -74 86
6082 86 66 -304 -20 134 -222 -29 147 194 11 -340 -158 -82 -32 -160 64 -41 -148 -90 136 41 61 -48 -149
6105 -149 -115 -100 175 -65 4 -173 -56 33 -83 104 129 -31 -172 -80 72 -28 0 210 -33 6 -236 -114 135
6128 135 -48 -61 -1 73 -52 -186 -90 -83 -208 38 -281 -81 -53 -158 139 -77 -55 67 77 85 30 54 -111 63
6152 63 19 -52 -104 -32 188 -29 -191 5 -17 152 -136 23 212 25 -175 119 124 138 143 36 0 91 24 102 -150
6177 -150 176 10 -266 -292 -37 55 -267 84 134 -28 -39 43 22 43 -73 32 -61 60 169 -58 189 -67 192
6200 192 320 -161 45 8 -69 9 -5 50 -65 63 -117 170 -48 152 -62 108 154 88 462 -192 -37 -177
6222 -177 -218 -207 -283 105 -44 44 -107 -223 118 74 92 -12 -64 125 126 -40 174 198 97 -20 309 192 189 220
6246 220 -127 -65 167 -106 214 -77 37 183 159 169 -36 154 138 -153 -195 4 162 118 44 -127 80 21 -145
6269 -145 98 145 -110 -266 329 -201 69 157 30 -219 231 -91 -154 34 -375 -68 171 149 377 115 -344
6290 -344 -140 -2 21 325 -183 309 -165 -126 408 279 35 425 -74 -37 185 130 -42 227 -71 605 -62
6311 -62 -77 369 668 -42 -554 -7 50 284 -97 469 -183 633 -104 645 166 -173 148 216 -36 23 -79 423
6333 423 361 259 -139 43 682 90 341 -186 722 294 -155 196 102 45 201 333 160 289 307 -192 -141 352
6355 352 100 -12 23 77 -436 -328 110 162 125 28 320 -251 -12 264 235 397 114 -76 -236 -63 372 -418
6377 -418 -202 248 312 172 -312 -292 -82 -283 -179 155 -178 367 165 -13 321 -148 236 -274 74 -400 293
6398 293 581 616 116 534 509 130 -101 -440 -93 511 -464 -340 24 195 206 -217 262 575 -761 -1104 95
6419 95 -105 40 79 -118 -192 -998 347 388 386 343 -156 181 -457 -13 -93 -56 93 22 -111 -9 70 -71 68
6442 68 -74 -39 -40 -18 -8 43 -42 -137 185 -449 73 350 297 -218 -603 56 237 162 386 -120 549 142 -135 -1021
6466 -1021 110 280 48 189 9 173 302 -198 312 393 68 -188 -207 20 351 57 99 277 330 -10 -151
6487 -151 300 147 -311 -322 129 312 -516 316 -583 -354 -294 -792 -428 -223 -587 49 336 308 119 -187 539
6508 539 592 -144 166 770 59 208 -263 -549 -437 -892 323 -177 768 441 112 321 597 -134 -217 202
6528 202 -25 -401 -52 -59 179 -260 13 142 12 -2 -30 -166 225 190 -71 148 175 132 -40 -35 -130 38 289
6551 289 72 -257 116 -37 -3 110 78 67 -16 22 74 35 71 33 137 -171 41 -202 21 210 -204 -80 -132
6574 -132 -47 75 -157 33 -79 184 -167 -22 58 25 40 -29 40 58 48 -36 153 -1 -145 128 61 -102 -4 259
6598 259 -72 0 -367 -30 -228 -15 -435 270 681 479 332 -145 88 48 321 160 -105 -154 111 46 175
6619 175 25 75 -138 -171 90 -141 -114 437 -587 118 172 181 37 -45 1055 402 482 209 -832 243 -290
6640 -290 -162 -73 -112 -125 75 130 -116 108 250 201 94 108 6 67 -175 84 -98 61 -70 6 -17 -189 -64
6663 -64 -49 -68 191 27 5 8 60 80 -87 -43 -255 -196 -35 -119 21 -218 -151 179 7 196 159 -12 18 -320 113
6688 113 -39 456 -426 2 -306 -206 -259 -201 449 -621 453 -76 218 -217 110 -127 477 106 19 -10 -110
6709 -110 174 -196 790 -297 -94 -278 283 77 -8 461 186 323 561 529 211 -44 -159 -124 -394 213 -9
6730 -9 138 48 213 -135 -64 422 725 262 -178 455 -489 105 185 460 148 192 -316 24 -190 302 270 -452
6752 -452 245 228 -427 -705 355 28 -270 -780 748 -64 -783 -394 -654 72 -723 241 -409 -92 -305 -262
6772 -262 -258 -336 203 -181 -70 196 -157 -125 -104 -541 52 335 151 -186 86 104 -214 -14 -10 1 -40 151 -87
6795 -87 -7 155 117 162 143 -45 213 162 123 107 190 -176 202 72 22 -134 -32 303 -197 -99 -187 44 -27 -20 -114
6820 -114 191 -13 -79 290 297 48 153 75 -245 -107 55 121 106 -53 1 -14 -11 149 -29 154 -68 -81 -22 71
6844 71 -48 205 6 30 8 55 -64 -184 -122 60 -46 16 88 256 -54 89 -136 -83 168 176 -13 -129 -199 -126
6868 -126 183 158 -16 127 73 184 -13 83 -113 -77 -41 67 121 2 -56 -157 -128 -263 -819 -443 78 507 -311
6891 -311 80 -656 -583 967 324 -1014 345 -745 -792 268 -186 -68 -1116 434 -951 266 791 664
6909 664 -255 -9 69 95 506 -221 182 392 -380 -113 -835 150 359 206 45 -624 144 -97 -419 102 -14
6930 -14 -557 -429 194 270 -391 -583 528 -131 341 -164 27 665 228 120 96 -148 210 -183 -75 -155 -109
6951 -109 -125 14 -141 267 20 89 41 67 -175 255 77 21 -4 -61 4 5 -72 -83 -44 -56 -287 34 -4 47 127 164
6977 164 86 -12 30 85 78 -32 92 45 78 -204 -138 139 -190 319 103 8 204 8 -100 64 -304 111 225
7000 225 89 -118 -87 133 8 305 9 -195 -80 -123 19 -5 111 -88 -155 373 6 -122 -116 -14 82 -62
7022 -62 -217 144 -13 -67 116 58 -101 115 32 65 53 36 139 -195 -94 -18 6 96 -152 35 -31 169 -231 21
7046 21 -484 205 18 -260 -37 -187 -134 -48 -622 -9 260 -196 149 -56 -365 27 -687 725 -68 -223 130
7067 130 476 377 369 -558 -258 -381 -412 41 -501 337 -351 200 33 -426 -14 85 16 -140 257 60 42 26 -122
7090 -122 304 40 -17 82 152 -164 203 -24 -133 101 443 79 194 -69 -33 -37 -205 -19 -235 -160 -252 -112 30
7113 30 -77 85 22 66 0 -161 -132 180 73 42 212 22 -99 128 45 66 -68 -38 -105 0 -18 -206 237 -34
7137 -34 193 -4 -327 153 171 17 98 -55 105 -295 162 -70 -105 189 -89 67 -258 45 173 65 53 98
7159 98 43 131 -220 204 86 111 -89 -30 -138 -200 150 115 27 77 -159 118 21 -181 -28 252 19 126 -84
7182 -84 -37 228 35 15 14 35 1 113 -53 -98 -42 -69 118 54 -242 -58 -350 61 63 93 -129 87 4 -143 -172
7207 -172 -45 70 65 202 -90 27 37 -91 2 236 -71 30 39 91 -50 81 125 236 192 226 153 26 98 -124
7231 -124 -31 -97 136 -53 30 45 -63 -198 68 42 -8 176 178 -83 -304 106 -126 -222 -66 -148 -87 -12 -13 79 177
7256 177 120 157 251 -76 -37 7 88 57 -362 156 -5 133 -29 43 -185 393 -101 -134 126 -177 -115 139 -46
7279 -46 193 240 -256 104 115 150 -133 -79 -30 139 114 -216 -46 333 -30 -88 -48 -31 298 -3 249 560 -434
7302 -434 -134 913 317 -572 -430 637 293 -95 -677 -202 79 518 -54 -103 176 -21 -14 342 262 -82 635
7323 635 -169 56 251 338 -246 -110 210 -159 -19 -341 461 43 302 367 -52 -44 -170 -68 123 -611 -300
7344 -300 77 -353 -606 -150 473 681 -305 -388 -268 -697 -46 -263 389 35 -197 -29 -674 40 79 56 143
7365 143 46 320 48 -340 75 -36 -56 -304 -461 103 543 -239 -313 43 159 -136 100 170 334 -242 206
7386 206 306 63 -623 -465 220 80 -43 -874 28 -36 -327 -207 368 -175 195 178 -463 64 -118 -364 -161
7407 -161 -406 -128 113 286 421 335 -294 20 -287 503 279 -152 534 83 10 -169 -694 127 -189 -481 -388
7428 -388 -200 104 -199 -216 -161 144 27 87 -188 242 -924 149 190 161 -369 -1310 -168 -699 106 607 297
7449 297 46 -633 -373 -137 -439 -493 29 1080 66 -708 -1147 504 149 0 -598 -412 -51 345 -24
7468 -24 625 233 36 -37 -318 -245 152 404 1245 1014 474 683 -160 -193 12 -424 336 48 -75 -304 -47
7489 -47 91 -571 -69 -145 364 845 3 -209 56 -70 -78 -126 281 102 119 -306 17 -142 -291 43 48 -342 -118
7512 -118 -6 -278 -72 28 -71 163 -105 31 -164 78 -43 -168 115 59 -16 69 -126 -136 -33 33 -136 -13
7534 -13 -210 143 -140 102 -24 -89 157 132 13 319 -102 124 70 60 -25 -93 117 98 -47 129 152 -34 -52
7557 -52 148 -14 -73 -98 -23 -234 -238 -90 24 84 59 -235 -84 152 83 -34 208 -21 -61 -92 -259 94 97 105 -123
7582 -123 58 6 2 -70 46 312 -451 -231 -38 -186 337 -370 322 -274 471 -82 123 197 -124 -90 39 -83
7604 -83 418 -40 -65 436 377 -139 64 289 -43 7 140 30 -65 270 100 139 37 -160 70 -98 -236 -237 8
7627 8 134 37 -68 8 18 -58 -91 -129 -19 158 180 -14 161 -85 74 228 28 111 323 65 80 32 35 150 46
7652 46 71 -151 10 -248 81 102 -74 -224 191 17 -178 66 -186 26 94 113 -118 90 182 17 39 187
7674 187 145 -72 127 132 3 -43 -48 18 141 11 43 39 21 -142 -178 -148 -230 105 298 129 -106 -11 111 172 92 -95
7700 -95 -24 -173 -21 -207 -10 -228 -276 245 -99 -84 -154 262 119 171 8 -61 154 53 -140 40 43 108 -4
7723 -4 35 -130 28 201 233 -24 22 -75 -172 -168 -126 108 86 -61 15 186 -155 -144 153 118 117 -107 139 157 -13 94
7749 94 70 5 164 -112 -206 255 200 -13 22 26 -10 -173 -16 276 -413 138 199 127 47 2 158 140 -62 -49 186
7774 186 65 -190 11 38 46 1 14 -16 232 -211 -88 -157 -140 155 -120 -85 18 14 98 -104 48 -133 50 -18
7798 -18 -6 127 90 -171 -43 -53 128 -11 -146 290 -380 -46 -165 -83 -123 -225 72 -70 -33 213 15 -425
7820 -425 -57 29 -357 55 -211 -333 -92 137 -171 565 165 -376 202 -327 29 -37 -182 321 -132 -326 -539
7841 -539 395 -143 -476 256 -251 143 89 -153 2 -130 8 23 -116 -142 224 -67 -102 203 64 151 -8 -169
7863 -169 -173 206 106 -76 -43 118 157 -133 -87 258 -59 -20 289 -64 -42 100 -258 212 24 -103 -160 -18 148
7886 148 0 20 324 -45 116 124 46 -336 32 41 -82 -147 -297 61 -98 -359 206 249 -356 190 202 100 -250
7909 -250 296 -925 -65 -519 -1080 -669 -362 251 -23 202 -880 420 -384 -367 -264 -30 342 125 -590
7928 -590 -76 -346 -412 -129 -208 -50 -349 -320 228 -18 -214 201 -77 4 -8 -76 35 -58 -41 -171 40 -106 197
7951 197 -64 12 -40 -104 105 129 35 91 321 -94 -1 56 194 226 -146 97 17 -3 89 -226 -38 184 -41 -44 -48
7976 -48 127 -269 39 -20 -105 251 -70 17 65 -31 -28 -209 -233 134 215 -96 -24 -312 -70 53 230 79 -105 -18
8000 -18 51 290 -222 189 30 204 -58 14 -126 -154 -19 -243 362 269 -157 -77 113 357 -265 -115 22 -186
8022 -186 -16 94 17 -71 -124 -37 166 133 -194 45 69 37 92 -124 -67 127 -24 -112 186 -77 -297 103 251
8045 251 160 27 -116 1 -27 -220 -15 64 -89 -140 -50 -180 -170 57 179 111 146 101 102 -173 -115 -371 -34 179
8069 179 -289 196 -60 -185 147 -187 -31 46 -34 99 87 -149 -20 155 309 134 195 39 -125 17 -32 -4
8091 -4 103 -1 -36 -64 -280 16 -93 -60 -56 133 -98 6 -68 -125 69 -107 107 274 -40 138 65 -139 171
8114 171 106 35 244 -112 247 -148 314 201 -132 -249 137 -22 -125 -91 -48 -148 41 -29 -120 -80 7 189 120
8137 120 78 -62 150 196 57 21 -48 -73 183 40 -145 -189 21 -2 90 -122 56 17 -203 114 131 29 63 -31
8161 -31 3 -242 -18 108 89 12 71 101 21 -174 101 170 242 -43 47 -23 148 -96 -163 53 -38 62 31 -128 -66
8186 -66 -34 -109 -5 -123 -20
8191b0
$$ Imaginary data points
##PAGE= N=2
##DATA TABLE= (X++(I..I)), XYDATA
0 0 0 0 0 0 0 0 0 0 0 0 0 0 0 0 0 0 -8 8 -8 8 -8 15 -16 16 -20 24 -24 32 -36 40 -48 56 -61 69 -79 88 -97 111
38 111 -122 137 -153 169 -186 207 -230 254 -278 308 -339 372 -412 453 -500 551 -608 673 -748
57 -748 835 -933 1051 -1194 1367 -1588 1878 -2272 2848 -3771 5473 -9648 42761 33497 -41691
72 -41691 34786 26522 -8185 10450 18120 8414 19705 -3304 14935 24905 -5478 2655 19601
85 19601 3798 -7697 10457 8340 -2896 2925 934 4175 -707 -5590 -6201 5068 -10233 -12866
99 -12866 4483 -7343 -7114 -4313 -7809 -3567 -4159 -16833 -1331 -2471 -20823 1965 -1127 -15501
113 -15501 -5219 1704 -6931 -9647 -1257 -2032 -6234 -9093 4721 -2275 -7912 3563 1699 -2154
127 -2154 -4852 4530 799 -5099 -1134 7425 -517 -4965 9975 2079 -1781 3810 4413 -441 1915
142 1915 3076 -3001 5459 4691 89 1509 7512 1194 -1012 7167 -345 2486 979 1896 6410 1435
158 1435 -1240 7959 5501 -6887 6244 6522 -2744 -2239 5672 4613 -3365 2844 3459 2569 -1956 -15
174 -15 1941 -1313 -1515 -1340 1605 -3059 1664 -2086 -3382 1375 -3935 -5008 -902 -909 -8556 -574 -1076
191 -1076 -5341 -3208 -3410 -244 -5233 -5350 -2568 -603 -6407 -3688 1010 -3631 -1797 -1900 75 -2878
207 -2878 -133 -534 -3465 2314 172 -627 862 4343 220 379 2610 2665 2008 -224 5936 2846 645
224 645 3445 6542 2483 -367 6263 3936 1752 -322 5647 3234 -390 3367 2469 2885 552 1958
240 1958 284 1798 -695 -1090 1651 -1615 828 -1633 525 -751 -2098 -1771 -1377 -1022 -4746 -939
256 -939 -1912 -1897 -4123 -905 -429 -4667 -1567 -3088 -1547 -3084 -3000 -2427 -1242 -1978 -2870 215 -2875 521
274 521 -1924 -3057 631 -426 -2708 -753 3310 -1789 14 1630 1097 -381 -590 2940 134 930
290 930 331 3468 2129 295 2282 3060 2908 -821 3197 1766 2825 937 532 4908 1541 383
306 383 1790 3979 -1140 1383 2200 549 1896 -636 2184 1179 603 -1262 1942 551 -2950 154
322 154 259 -616 -3308 641 15 -2167 -1553 -1464 53 -2328 -1519 -2381 -674 -1596 -2354 -942 -2013 -811
340 -811 -3484 30 -1096 -3010 -1851 -205 -1067 -2695 897 -1647 -442 -914 -393 -260 -386 -426 -1849
357 -1849 1731 -163 -233 180 1724 1113 -935 1880 833 1442 -685 1763 1275 1140 2103 263 2406
374 2406 1479 1687 193 2489 1284 91 2458 1690 1999 461 2497 1546 907 602 589 2261 -96
391 -96 591 513 2563 -803 -1039 2313 -10 -1250 -1775 1750 -1196 -1701 -873 238 -952 -2199 317
408 317 -1928 -728 -2517 -2037 -795 -2491 -2218 -2122 -393 -3102 -1647 -1811 -961 -2551 -3227 514 -1783
425 -1783 -2185 -1730 470 -1319 -1349 -191 76 554 -1563 787 -73 1338 130 116 2397 1355 706 826
443 826 2810 542 1350 2455 3144 3158 923 3508 2888 1927 920 3099 3372 -14 949 3152 2578 -1772
461 -1772 2586 2950 -34 203 836 1686 -902 -30 -438 370 -898 -872 171 -1191 -912 -2473 -31 -1824
479 -1824 -2401 -907 -1322 -2114 -2220 -947 -2451 -839 -2487 -1614 -1038 -2158 -1577 -2204 -544 -1895 -930
496 -930 -1000 -1368 -1105 -273 -814 -2242 1291 -621 -1305 338 815 -427 -892 1646 -39 102 -277 1636
514 1636 622 -442 1323 1021 1409 -927 1638 2399 -5 88 2292 1742 -463 1926 983 1662 1177
531 1177 744 1480 1426 1832 -328 1893 1862 816 -164 2261 1477 -421 1704 488 954 -264 507 1030
549 1030 -139 -806 -131 1564 -1481 -899 -85 559 -1784 -2012 472 -1380 -1173 -1740 -924 -1110 -1577 -2131
567 -2131 -1336 -416 -3265 -1482 -1247 -924 -2771 -1617 354 -2480 -2176 -900 -294 -2472 -731 -383 -749
584 -749 -566 -1368 913 -370 -63 -209 922 476 -279 1450 615 1348 761 1650 726 1801 2156 702
602 702 2169 1539 1649 788 2539 1627 1166 2052 1610 1985 206 1676 1287 802 420 1014 1518 -212 820
621 820 18 961 -285 -430 -187 -224 -142 -1952 -45 -474 -804 -1974 -769 -507 -1906 -1234 -1276 -759 -2383
640 -2383 -688 -966 -1622 -1329 -1169 -522 -2331 -489 -1386 -612 -1074 -1176 -188 -821 -20 -1226 337 -346
658 -346 29 -301 -278 983 118 307 -10 1616 255 -264 1514 1212 364 55 2129 879 769 939 1355
677 1355 1165 412 1808 1171 1396 212 1201 1549 446 901 406 1521 231 476 93 1065 285 -641
695 -641 849 332 557 -731 676 -183 -476 -461 -248 -12 -1605 -188 -783 -517 -1179 -636 -331 -1357 -917
714 -917 -1396 -544 -1526 -1125 -1275 -727 -393 -2037 -505 -712 -596 -1567 -575 -84 -537 -558 -880 949 -754
733 -754 -258 -74 103 -6 -102 909 13 518 256 1206 645 511 873 435 1344 6 1341 1140 1373 620
753 620 676 1588 860 910 253 1781 533 412 955 832 924 -118 1292 402 662 13 724 514 -473 419
773 419 -220 631 -716 98 -184 -439 -513 -934 59 -907 -737 -1014 36 -639 -1609 -485 -732 -550 -1742
792 -1742 -656 -682 -820 -1533 -682 -139 -1276 -599 -936 -42 -1028 -677 -253 -694 -280 -663 721 -293 295
811 295 -184 535 499 -487 632 537 859 -62 839 1041 850 452 209 1516 558 949 550 1258 1125 344
831 344 1268 920 1151 405 969 683 412 362 356 1228 -348 511 228 652 -264 -154 775 -246 -304 -843 350
852 350 -649 -486 -537 -497 -239 -1104 -359 -864 -571 -1467 -809 -705 -1139 -845 -959 -489 -1336 -608 -836 -321 -747
873 -747 -967 -199 -475 -355 -803 326 -466 -550 -329 -306 613 -818 268 81 436 -109 132 767 531 389
893 389 -208 1407 573 281 542 1100 1028 -47 1090 715 1007 473 1050 1077 579 697 600 1487 -127 563
913 563 810 536 188 259 853 43 564 -380 715 351 -245 -135 -319 379 -739 -476 -423 -242 -1031 -503
933 -503 -68 -1088 -433 -1050 -255 -1018 -951 -739 -804 -992 -1248 0 -1010 -635 -1105 -266 -501 -938 -56 -724
953 -724 36 -776 -570 -149 79 -252 -491 690 -92 6 21 786 188 -117 988 351 688 228 1126 518
973 518 657 624 878 1178 130 1208 886 944 338 945 767 517 952 190 895 618 703 -334 384 1076
993 1076 -289 133 46 142 -306 155 65 -257 -22 -700 107 -830 -491 -692 -332 -709 -1150 -296 -504 -504 -1145
1014 -1145 -205 -165 -1009 -933 -867 -91 -1115 -684 -793 -27 -657 -810 262 -241 -556 -538 315 -546 -262 224
1034 224 153 219 -233 284 155 520 -128 185 479 331 498 -2 1147 104 395 480 794 575 20 1110
1054 1110 770 835 94 1283 717 137 326 786 688 -271 764 423 386 175 202 833 -380 248 -259 405
1074 405 -273 -6 -309 45 9 -997 -40 -478 -297 -866 -389 -69 -1061 -652 -927 -191 -1135 -645 -418 -349
1094 -349 -545 -800 -148 -1135 64 -571 -462 -744 -602 -345 -648 179 -544 234 -509 279 -144 493 682 -507
1114 -507 547 268 463 107 -58 920 1194 -70 -351 1060 786 124 559 1532 418 -446 1628 -48
1132 -48 863 -337 1346 -399 -4 481 -294 971 -523 1036 -257 1137 -199 -46 404 -135 482
1149 482 -530 23 149 -389 -200 -408 -3 -830 76 -345 -54 -716 -500 -419 -552 -457 -688 -226 -746 -549
1169 -549 -427 -382 -92 -888 -392 -527 -53 -714 221 53 -383 -355 -288 290 -278 -258 34 323 -17 -147 615
1190 615 -17 352 -76 565 345 121 576 278 906 267 542 765 839 283 411 885 432 568 282 1069
1210 1069 326 227 460 437 142 -216 930 391 304 -219 211 -10 -88 -87 -70 326 -367 -322 -362 -428 -339 -427 53
1233 53 -786 -426 -653 -219 -551 -742 -225 -405 -262 -582 -62 -383 -55 -569 -321 -453 -719 -698 -597 707
1253 707 -362 166 -13 -397 49 -621 -396 -596 -82 -121 -11 194 -601 288 460 637 396 100 681 882
1273 882 375 293 425 702 -8 -211 1559 1121 510 484 382 778 -265 607 -83 864 130 267 683 191
1293 191 -257 133 689 -184 243 -8 -198 -83 -789 -127 -724 -562 -970 -80 60 -850 -270 -472 -193 -805
1313 -805 -205 -465 -376 -767 -536 10 -787 -323 -527 -418 -503 -540 -359 -294 -25 -646 -106 -122 -333 -285 -64 150
1335 150 -458 270 148 477 -86 8 455 451 211 -137 597 590 66 94 502 648 153 897 269 730 65 449
1357 449 528 280 298 252 796 -20 199 226 436 397 -55 537 -21 438 -140 653 255 49 87 86 395 -236 -469
1380 -469 -457 -167 -903 -427 33 -593 -39 -542 -6 -660 -426 -510 -373 -430 -726 119 -567 -327 -878 -820 -156
1401 -156 -285 -496 -545 75 -405 -87 -238 259 61 -406 557 -236 701 -724 334 359 -116 741 460 664
1421 664 -112 354 440 506 16 660 454 779 647 266 626 556 240 689 789 468 35 904 430 564 -156
1442 -156 -307 175 430 397 283 1163 -197 187 150 325 -514 -360 -315 -208 160 -353 -334 -31 -253 -104 -1098
1463 -1098 183 167 -421 -521 100 -365 -699 503 -600 -704 180 -300 65 -499 20 -105 -54 -379 149
1482 149 -447 97 -278 109 173 -153 -288 141 312 -201 -417 760 171 528 -51 -27 74 601 511 235 1024
1503 1024 817 1136 38 423 286 132 -89 312 56 380 717 469 804 -693 851 -264 848 364
1521 364 315 458 301 961 72 -324 9 153 340 -238 31 -405 63 -827 -739 -186 -1122 -83 -695 -495
1541 -495 -903 -274 -226 -23 -568 -924 -7 -669 0 -465 -305 -254 -564 -68 71 -37 -563 -4 64 -80 -79 -59
1563 -59 101 -100 345 -67 350 -22 132 434 465 55 -114 528 99 310 154 547 568 274 378 169 322
1584 322 350 341 466 317 378 -121 626 284 285 -191 417 -168 -38 107 -33 218 -302 32 -72 -254 -344 -189
1606 -189 -17 -376 -393 -577 -254 -449 -372 -278 -377 -209 -528 -71 -406 -134 -363 -236 -53 -615 -223 -213 3 -562
1628 -562 -150 -56 -173 -233 -183 117 -143 -11 -73 267 100 -30 238 281 512 -59 419 666 410 165 272 405
1650 405 494 554 230 611 359 382 345 148 495 170 512 40 126 242 225 303 -339 114 -88 -158 -190 47 -37
1673 -37 -82 -205 -328 -3 -479 -261 -55 -73 -181 -689 -342 -425 -155 -332 -2 -441 -542 -368 -160 -122 -659 -166
1695 -166 -271 -302 -391 -270 104 -273 -44 -461 -33 -42 183 106 -58 302 26 372 59 -86 30 249 333 146
1717 146 80 -50 312 58 252 483 384 190 210 415 252 358 263 560 300 306 368 325 408 -90 415 227 416
1740 416 166 161 216 79 199 -188 254 -110 43 -69 236 -186 -292 93 -390 -129 -422 -120 -206 -378 -262
1761 -262 -186 -31 -473 -141 -359 -216 -360 -433 -67 -248 -336 -615 -263 -307 -533 -209 -417 -129 -316 -224 -100 -40
1783 -40 -95 50 117 -167 297 -249 12 -70 292 614 -480 -45 -43 113 345 660 210 218 265 2 303 289 521
1806 521 116 369 378 263 371 40 656 8 449 295 235 315 -164 -68 30 152 -136 -11 -28 33 52 33 -86
1829 -86 -425 126 -51 -66 -264 -185 -52 -319 8 -347 -149 -410 -420 -514 -602 388 -116 -194 -262 -257 -14 -175 122
1852 122 -331 -101 -143 123 -382 16 -250 204 63 -121 278 44 73 -144 22 -23 -131 109 147 403 -6
1873 -6 354 163 265 208 65 298 289 294 251 608 414 364 302 273 283 2 107 12 3 -111 67 172 -293 -77 2
1898 2 81 -260 144 115 -140 -11 -233 272 -172 -93 -303 -137 -235 -409 -388 -341 -64 -542 28 -345 -26 -163 -111
1921 -111 4 -333 -157 -347 -181 -397 -101 -2 -203 5 -227 101 -49 -103 35 -49 -20 -304 -91 -3 108 40
1943 40 251 142 -46 -94 3 394 25 366 243 277 277 101 376 62 237 59 384 219 312 95 265 219 -203
1966 -203 276 -12 140 95 -38 23 -237 140 -302 148 101 -49 19 196 -73 -275 -3 -305 -120 -364 223
1987 223 -162 -406 -142 -426 233 -410 -361 -306 -362 -256 -620 -245 -426 40 -453 -174 -120 -239 -23 -418 65
2008 65 -230 -413 -195 -43 -125 29 130 -120 88 -134 380 -35 151 186 88 68 159 243 -48 641 -121 194
2030 194 314 -72 201 283 260 -99 388 168 371 140 232 237 417 -72 43 338 49 148 487 33 -473 -375
2052 -375 -596 -335 -866 -36 172 47 -98 -134 -155 11 -286 -169 -172 -103 -177 -492 42 -8 -248 -178 -201 -196 -337 -111
2076 -111 -209 117 -131 -115 25 217 -32 -3 33 -138 183 43 282 -162 65 84 264 270 -95 -50 101 282 254
2099 254 343 180 17 301 282 319 140 171 179 167 238 127 408 28 90 257 73 26 -79 265 239 218 -93 -185
2123 -185 9 -96 -19 -163 197 -25 31 -384 -146 -36 -332 -189 -308 -49 -529 -256 -275 -425 -180 -283 92
2144 92 -208 -98 -289 -103 -307 -253 -125 -225 -72 -313 4 -65 -37 96 -364 45 -87 -83 -136 239 -3 -38 14
2167 14 207 148 -40 399 135 348 147 247 450 134 517 105 314 146 181 364 257 268 212 188 18 212
2189 212 -98 242 -65 199 196 101 218 82 -97 -121 -92 -7 18 -176 -403 2 -153 -279 -281 36 -232 -287 0
2212 0 -330 81 -447 -370 -5 -279 -316 -365 -67 -408 -295 -119 2 -323 -274 -66 49 139 -347 181 10 108 -168
2235 -168 -223 82 -22 238 -216 133 21 101 264 -18 314 64 196 207 261 122 171 339 -160 250 290 138
2257 138 -222 290 216 79 260 216 562 -73 387 -24 -179 72 137 217 -185 -10 -12 171 121 -73 78 113 76
2280 76 -439 -97 -146 -34 -399 -231 -147 -78 -133 -302 -289 -575 16 -299 -58 -87 -363 -180 -322 93 -323 -50
2302 -50 -137 -168 -277 -257 56 -185 36 -75 -11 -71 37 320 132 116 -147 121 127 312 -26 238 343 80 381
2325 381 123 118 149 218 115 129 342 -33 204 303 295 337 199 460 -26 -23 75 28 62 29 112 289 202 -193 45 15
2351 15 -5 -125 -111 -121 76 -143 -192 2 23 -165 -26 -268 -330 -162 -65 -459 -232 -298 -143 -157 -140 110 -297 -36
2375 -36 -253 -393 -68 247 -44 -158 -350 27 22 -43 273 6 92 77 -279 147 437 111 -56 149 161 170 29
2398 29 122 23 -11 423 -47 268 306 156 388 86 75 -33 340 55 199 356 -68 205 169 83 -25 261 138
2421 138 46 -47 -263 65 -64 93 -36 106 103 -273 138 -157 -155 -25 -250 -48 -134 -74 -342 -97 -91 -293 -342 -214
2445 -214 -122 -58 -215 -383 -150 -109 206 -79 15 -15 -68 40 230 214 -175 48 155 292 12 -60 299 192 260
2468 260 111 8 146 18 128 336 226 -224 198 94 275 103 93 257 276 87 215 515 218 127 11
2489 11 283 0 464 396 -85 84 28 137 89 -168 44 140 8 -338 61 -295 -25 -251 -93 141 -68 124
2511 124 -66 -101 -67 -227 -136 49 -320 -280 -35 -303 -292 -152 -330 21 -41 -154 -138 -7 -313 107 69 -73 176
2534 176 -104 208 111 4 -75 -48 32 60 15 149 -23 -45 392 131 68 180 31 235 -69 286 203 330 262
2557 262 -50 214 109 16 -51 424 291 -110 135 52 380 -123 200 182 257 -59 -71 221 -119 28 -143 419
2579 419 -166 190 -112 -63 -493 1 -22 -162 18 -248 45 -458 -294 -200 43 -45 -333 204 -1 276 -93
2600 -93 -76 -148 -279 -63 -229 -98 34 157 -25 57 133 -123 99 13 47 27 -20 42 63 -61 15 403 -59 101
2624 101 132 27 228 60 251 70 258 -169 79 17 45 212 120 -154 341 111 -116 382 96 44 229 158
2646 158 262 93 -102 -6 -142 -30 166 14 -284 -120 -162 1 120 -366 -273 -198 -276 -147 12 -157 78 -69
2668 -69 -49 -314 -378 122 -185 -67 -367 -29 -143 92 167 -86 66 -266 -82 -106 41 161 80 22 326 168
2690 168 -86 150 297 42 203 158 52 140 268 -39 340 121 369 -113 -212 32 -3 369 221 111 186 -192
2712 -192 129 88 228 157 244 -139 332 152 94 71 -12 120 -265 104 -325 38 -99 -11 67 -38 34 240 -177
2735 -177 -221 -170 -63 -91 117 -74 -43 -277 -185 -283 -204 -223 -337 -34 -101 125 -196 -28 -311 -123 44 -98 -60
2758 -60 -61 -75 102 168 9 -199 273 -129 -37 64 235 168 -54 87 196 303 -165 192 178 214 -9 20 60 250
2782 250 22 -25 197 129 83 373 267 284 83 166 219 -136 -68 -282 122 -119 -190 -283 125 -128 -71 101 -182
2805 -182 -177 -431 -216 -177 -146 17 27 -182 -320 105 -18 -125 -105 -381 -179 122 -220 -140 21 -40 62 92 220
2828 220 -41 -34 -83 -312 104 72 -51 -122 134 37 212 3 342 331 105 276 -17 140 60 -21 61 289 71
2851 71 241 222 174 230 376 175 355 -37 390 54 -50 50 -155 11 -187 155 -25 247 -45 112 -62
2872 -62 -149 17 -123 230 -23 172 -28 -265 -93 169 259 -94 -79 -363 42 -146 -12 -67 -126 -37 -144 -73 -236
2895 -236 186 -102 -117 -115 -107 -178 -117 -217 158 -180 -44 -51 -61 -180 43 -119 47 -142 16 211 156 66 -14 60 -145
2920 -145 217 49 -34 126 138 27 -26 247 148 108 91 154 104 131 2 -20 294 -24 305 -93 239 22 125
2943 125 252 -10 -220 272 40 98 -110 -37 -22 156 -251 -271 16 -74 -209 -17 -41 -302 -294 58 176 37 177
2966 177 -102 -397 96 -304 -78 -36 -222 21 -126 -7 -202 141 -71 211 -169 192 220 -301 58 5 247
2987 247 69 318 -30 227 48 257 109 271 201 -63 238 252 -132 100 79 445 85 357 244 119 -8
3008 -8 -101 106 134 49 -129 40 39 -130 -136 195 95 -318 -215 -136 -82 -165 119 -102 53 -126 -91 -67 -109 143 -91
3033 -91 256 2 5 -30 -277 -44 -104 -25 -102 -135 -113 68 -171 51 288 170 -83 7 -234 -28 82 30 124 -256
3057 -256 -7 145 124 -153 -8 20 -58 139 66 -143 -106 43 115 14 -99 125 142 239 126 329 302 65 95
3080 95 32 223 27 98 -21 36 -71 26 205 159 46 117 166 -163 33 153 46 -4 -144 121 135 -213 -389
3103 -389 77 -243 15 40 -194 -259 -376 145 -149 -284 -282 -134 -216 129 -248 -90 20 171 134 -24 -156 -210
3125 -210 -183 0 -264 3 -90 222 23 -158 -106 -43 -206 -278 119 -93 4 96 44 35 -103 155 -19 317 207
3148 207 -99 109 -4 149 113 418 13 104 168 22 188 -195 -14 160 -6 213 129 218 -34 261 -159 110
3170 110 113 -141 56 130 -107 -226 147 -55 43 -99 -57 -36 -194 261 -142 18 132 -168 52 -114 244 -111
3192 -111 70 37 -61 -235 -259 -17 -481 129 -30 -48 -86 96 37 63 139 -70 42 -63 110 -54 77 285 204
3215 204 168 64 -83 98 113 137 135 207 -113 30 85 355 -133 313 56 175 42 147 192 105 198 -142 -71 -249
3239 -249 296 -118 22 147 100 65 249 -22 -193 253 55 -64 11 -70 -83 -61 -193 -66 -130 377 -326 123
3261 123 -250 312 -316 -310 -71 109 355 -311 -678 -132 -245 10 -218 -211 69 60 -255 -43 -103 196 27 -587
3283 -587 251 213 1080 298 457 531 200 628 73 133 102 107 -320 142 49 119 426 -28 -44 -155 73 124 325
3306 325 -9 -187 84 -91 77 22 237 -148 16 -70 106 76 21 21 -43 14 -157 -187 89 169 -6 -149 103
3329 103 -52 142 77 346 156 -37 110 339 -530 226 155 -510 25 -166 1 60 -448 102 -562 25 99
3350 99 -50 261 8 55 -243 -171 -117 26 10 -219 86 -195 -186 59 -45 -60 -121 96 -111 71 91 -22 155
3373 155 38 195 85 155 -119 127 319 189 33 -49 47 118 164 47 40 -78 52 70 46 -25 112 47 16 13 -61
3398 -61 89 -110 -153 -30 50 32 -131 197 -214 244 -165 -20 -207 -127 88 40 -218 -140 -15 -142 9 161
3420 161 -144 92 -223 23 -248 -59 85 257 -47 -144 -70 193 215 -87 -96 8 285 -193 192 325 -385 -463
3442 -463 858 97 -43 89 168 -260 -247 54 176 68 30 -26 122 -31 -75 337 65 -132 233 189 142 7
3464 7 207 156 94 -113 139 47 -70 208 62 252 -3 -8 208 -88 -258 190 131 -123 -71 -75 102 209 -70 -168
3488 -168 -55 8 -97 -116 -88 -85 -108 -152 -109 -71 -88 -45 80 48 -389 74 -86 223 20 -98 26 136 -95 91
3512 91 73 102 -181 -340 110 34 -191 -27 -138 65 -155 -51 63 154 0 211 199 196 117 -4 -40 184 -97
3535 -97 43 56 56 -83 -193 121 198 97 -138 -62 -53 -71 39 78 -281 67 -63 69 236 64 9 -182 -163 -15
3559 -15 -22 45 -186 40 -209 -28 -124 -184 52 -11 -45 -85 -114 -201 212 -76 108 -62 -272 -136 54 13 -120 -141
3583 -141 -83 90 12 -76 134 285 104 -239 66 235 -103 28 91 212 -59 159 149 171 4 -196 -34 24
3605 24 126 -40 -45 144 198 -127 -74 101 47 14 -123 98 -60 90 308 25 164 87 139 67 -32 110 -28 138
3629 138 342 -207 -90 -90 46 45 -135 -341 -121 -170 -216 -105 -95 -114 -83 -237 -160 -246 -48 -158 -54 -228 -179 -60
3653 -60 -156 -5 -131 80 98 71 -179 63 91 85 136 -96 75 131 -56 43 236 188 309 153 157 -174 213 -15
3677 -15 155 -35 186 9 39 314 106 20 66 99 -26 -17 18 166 87 56 126 -93 -196 78 -27 65 -127 53
3701 53 85 -145 -91 503 9 -110 18 -31 34 -281 167 -170 -97 158 35 60 -111 -227 15 -353 15 79 -219
3724 -219 -410 -204 -12 -120 9 -96 -23 79 22 -59 -106 -172 -23 110 78 -26 66 85 69 -223 208 322 173
3747 173 73 7 84 18 96 308 231 -83 -307 69 -274 -119 141 2 62 112 42 -165 41 -94 160 -12 -46
3770 -46 115 163 -133 -144 -48 -195 -86 132 201 -387 -138 -95 -135 -361 21 138 -63 208 -12 -303 -301 -146 -142 121
3794 121 13 72 -173 185 -252 -91 -114 171 68 -200 -6 -9 213 -47 -36 -60 -101 269 155 57 -191 23 203
3817 203 -139 -96 -47 -157 -36 158 14 80 -36 163 97 -32 64 -31 161 -84 -53 112 162 -16 -150 -90 -53
3840 -53 241 152 77 -44 79 7 -147 -130 -16 -10 -36 74 -179 -42 127 -51 208 -3 -247 -2 30 -35 247
3863 247 -128 -231 -47 -185 -106 -16 -74 69 -178 74 79 -45 150 59 -150 -12 187 203 230 -163 -86 -99 -6 118
3887 118 -98 -35 148 55 137 -23 -20 59 169 -149 454 -8 -204 -171 110 58 68 192 -262 7 15 -118 204 41
3911 41 6 82 -11 -127 -78 -56 89 -5 -140 178 -65 10 -156 232 -105 -139 -142 -70 205 -195 -16 11 -189 7
3935 7 79 -179 204 -104 53 73 -77 -137 -19 -10 16 -215 78 34 -18 82 -66 103 43 72 -185 47 170 109
3959 109 137 100 66 136 -3 359 54 -92 -40 61 224 46 -5 -76 67 45 -139 -167 83 -180 113 21 103 101
3983 101 95 -42 -8 34 -158 105 124 59 -66 149 -50 -139 -30 -268 98 -227 178 -138 -43 -157 49 -20 -188
4006 -188 -337 -112 244 -284 -53 -53 -77 -242 -284 -396 -199 -206 -74 -90 -241 110 62 49 -24 -164 24 98 116 -35
4030 -35 82 154 211 -49 89 101 -277 270 -200 -17 -9 8 -139 -2 128 -92 -49 94 34 -220 65 249 -1
4053 -1 -4 64 -259 53 193 -44 -173 -2 155 102 -187 -22 -109 -363 -87 172 -29 -298 -246 -485 44 741 -187
4076 -187 -187 -114 64 141 -81 -51 -5 184 -57 102 -285 -51 -93 17 -249 -141 127 -312 29 -147 22 114 -154
4099 -154 -77 98 118 -139 -194 -144 -84 146 -68 -335 65 26 55 122 129 94 -125 0 126 -83 18 28 -3 264
4123 264 -147 175 -97 -13 79 -68 -8 -82 17 160 -84 65 581 -63 290 -99 25 224 98 -165 -173 -114 54
4146 54 65 35 -23 -174 -222 188 51 82 -98 48 -170 42 -132 -184 64 -151 -94 158 -26 -287 24 -197 -153
4169 -153 124 -327 -132 81 -19 -127 147 -37 115 -118 -129 18 -148 168 108 22 10 -34 -108 38 57 43 -19
4192 -19 43 -14 -204 -17 158 173 114 39 7 209 25 -257 244 184 144 56 -137 -81 187 -39 209 -251 72 60
4216 60 78 148 -15 -207 -100 8 -145 57 -74 207 41 79 -96 -85 -24 -238 -30 -122 -217 -111 -81 89 -168
4239 -168 175 1 -66 72 64 41 -10 -34 -62 -60 144 -64 42 6 -39 -115 -49 -122 -143 -168 39 -108 -63 143 30 -58
4265 -58 73 -24 167 -107 175 -42 78 -89 92 51 -303 162 -23 212 125 176 -82 -38 129 75 45 -36 -40 -3
4289 -3 378 46 35 173 -221 -59 -29 -233 -102 101 93 -5 193 -61 74 54 54 97 -69 44 -111 242 27 77
4313 77 -150 -89 -125 68 -4 -117 107 -138 -157 -60 -28 100 -62 -109 39 58 -223 112 -180 96 -8 -64 22 64
4337 64 -29 -16 253 1 42 -20 193 100 13 66 -152 105 270 -9 93 63 -241 104 74 -75 234 136 126 8
4361 8 48 -155 1 -75 -106 -28 209 210 1 7 -39 132 134 -165 13 -76 -164 194 112 89 15 314 -195 12 67 138 -13
4388 -13 -136 -91 -131 35 -110 -20 -260 20 -56 -200 -170 79 305 -99 -46 -254 -88 60 -167 -104 -183 -156 -174 32
4412 32 27 7 -123 -18 238 -30 208 10 63 199 84 113 137 -72 -235 -70 -67 -251 313 230 86 -146 76
4435 76 149 -55 94 -26 -90 77 -160 55 190 -38 -63 45 249 -8 -91 33 -52 -106 95 -175 210 66
4457 66 195 53 134 -100 53 45 -150 8 -42 96 -79 -184 -147 201 -85 -61 -183 -73 5 -133 -34 -288 -34
4480 -34 -154 -70 -359 -125 -145 20 -55 35 -19 77 -61 293 151 -11 137 89 258 230 184 114 27 -194 -95 -119 114
4505 114 40 71 -3 -57 -75 -30 70 -191 341 182 319 -116 -205 147 267 -113 -131 -2 24 -157 -71 -13 -29 -237
4529 -237 161 -71 -214 109 27 -40 -4 -258 -7 -52 -41 28 259 -55 35 -14 90 115 -191 -157 33 84 -151 39
4553 39 -106 -38 179 -9 -210 38 -183 -8 -323 -108 167 95 12 213 -80 15 152 48 105 59 221 -10
4575 -10 135 98 84 -72 -93 -91 -214 211 -90 -150 248 -158 -362 16 -68 -90 141 -63 -52 55 -70 156 45
4598 45 114 -16 40 82 -197 -88 -149 -149 -12 3 -96 -63 83 -214 -188 244 -26 -53 -116 -176 -145 -137 -88 153 -128 -7
4624 -7 -15 50 -45 -113 -276 -25 -104 210 -175 -175 142 144 122 -65 -123 -207 182 128 140 -122 99 158 -52 79 161 153 -87
4651 -87 282 88 75 39 44 220 339 142 -191 466 83 145 205 -25 86 5 94 185 -87 -143 -185 83 -22 -20 -158
4676 -158 -15 -261 3 44 -54 225 40 90 250 143 140 -134 93 -47 -189 11 26 109 -374 67 94 102 211
4699 211 29 162 -103 -131 -115 -40 165 4 -47 228 132 -118 107 -57 173 170 90 94 133 -20 -25 -39 92 -72 164
4724 164 197 223 173 22 63 20 71 55 -12 -270 139 -203 151 -121 113 -124 63 99 93 -10 -135 -62 324 105
4748 105 159 14 -224 -77 -48 116 131 -84 289 -170 -17 1 151 -108 -47 -4 -216 82 41 -31 -158 20 -254
4771 -254 -129 -140 -168 20 -85 -59 -3 -40 -11 257 -186 -119 -41 -29 6 19 -105 36 -3 -118 -22 93 -213 58
4795 58 -55 359 103 -400 11 186 25 -86 -43 -157 73 -49 -97 -18 127 -80 -353 -46 110 187 49 455
4817 455 -297 -528 229 68 380 -253 -91 660 -267 -13 350 -331 32 -243 193 -181 -380 361 -680 -762
4837 -762 -1558 -354 123 -935 878 578 -102 -173 255 361 475 -676 -795 -369 -383 124 -448 222 293 -178
4857 -178 -158 215 178 -25 -197 -13 23 149 38 68 53 127 242 -114 246 140 108 -118 117 -131 40 -29 -48
4880 -48 215 277 182 -172 234 524 -344 51 322 154 174 -706 365 306 -807 -44 27 1074 -393 -369 644
4901 644 -104 -373 -122 -351 -43 -298 -465 -196 180 -690 -435 -352 -150 521 -349 -207 98 -150 -65 -127 -69
4922 -69 -79 -133 23 280 -162 -129 -106 -196 116 -151 -251 22 242 113 229 -195 107 6 -564 -28 -409 626
4944 626 100 132 -4 -194 260 432 393 37 66 -223 -46 701 -279 -647 301 -321 123 244 349 -61 21
4965 21 -506 432 412 -308 28 -312 423 396 -75 453 475 -91 299 -159 25 164 382 243 -440 166 -116
4986 -116 -279 -282 224 301 -328 96 116 51 267 -223 -27 31 -44 -331 1 -116 -197 140 -452 -76 -359 84 -69
5009 -69 272 361 88 10 -68 -245 -185 348 -102 51 -53 63 -175 35 -297 -331 196 30 31 -135 -17 99 -94
5032 -94 18 241 391 161 -171 83 329 -6 16 92 139 -84 33 88 -107 -89 -95 -241 209 -109 -139 47 -51
5055 -51 97 114 -103 -96 -15 -184 35 183 -101 -87 -280 -29 -128 -152 184 170 84 -111 74 -11 47 -73 -60 236
5079 236 -59 -19 -313 -145 87 142 139 61 243 55 -54 -63 -119 -122 45 119 -104 -73 -88 -84 -152 -14 190 164 103 310
5105 310 -14 162 102 -34 87 241 249 -17 179 -79 255 -72 -95 -17 -40 -82 -128 -160 17 117 177 112 -84 10
5129 10 132 61 72 -88 -250 -107 -102 -116 -106 -14 -181 -124 7 -157 -34 -167 25 -143 117 14 -147 154 -172
5152 -172 -193 33 -99 84 71 137 -173 -56 140 178 -72 -75 82 -38 -66 -150 104 187 240 202 335 -201 -11 182
5176 182 -176 128 51 48 -211 -121 55 69 -80 121 -27 191 -135 231 235 64 -192 130 -148 210 -61 154
5198 154 345 72 -66 79 86 -190 -106 -63 -63 119 -232 -47 -53 -130 71 -135 1 144 -20 -219 100 -211 -44
5221 -44 -88 -52 76 138 -211 -111 204 -42 255 -97 -181 39 -280 -259 -151 -19 260 103 -51 101 97 220 -99
5244 -99 145 -42 -11 -130 177 122 70 54 -80 102 59 -65 -187 130 -228 -50 155 -23 143 -28 83 76 9
5267 9 -112 -25 -46 172 -216 -169 -115 108 46 -286 192 -92 31 -63 -110 -50 -55 -9 -87 148 17 -27 128 170 -84
5292 -84 372 -91 215 73 0 -26 -10 39 23 119 206 -129 107 -77 -107 -118 7 31 -48 101 222 -120 132 -25
5316 -25 -136 185 -82 137 7 19 -53 33 45 -274 145 96 141 157 5 -42 41 200 -10 -37 32 -93 85 -35
5340 -35 119 81 -39 187 -73 183 166 -27 10 -39 268 -128 32 16 13 -46 -31 42 -4 43 -98 81 119 -115 151
5365 151 -119 -106 329 -85 -211 1 252 -117 225 34 -170 -37 -50 37 -141 -97 53 108 -153 -71 -5 219
5387 219 -175 -27 139 -177 21 -182 -111 9 -165 100 53 75 -79 106 54 -100 -45 -123 -135 60 152 -95 -35
5410 -35 -238 -16 -47 66 -43 151 161 232 -73 -134 -186 152 459 296 113 -53 108 207 109 -50 -82 -170 44
5433 44 159 -218 -47 -110 -65 2 -187 -126 77 -69 193 34 137 -113 -151 -19 -31 -73 -277 3 -69 -211 -232
5456 -232 114 5 75 -149 -47 48 0 -180 -78 -147 114 67 1 -37 11 -72 119 131 263 -86 -4 135 -110 102
5480 102 112 -107 -63 25 62 266 -49 -157 -13 34 -29 3 362 -52 116 -110 -54 81 83 -53 -19 182 -204 -121
5504 -121 -109 -79 244 -68 58 -66 43 -62 -14 -43 -9 89 -23 95 -79 -296 -223 4 -95 -147 -227 57 -131
5527 -131 61 -18 -80 -190 -122 -146 -95 -139 -171 -33 -75 198 -10 -58 110 22 -290 -143 113 -12 228 82 110 -81
5551 -81 63 172 -112 102 103 2 16 -98 25 -51 151 194 -4 102 -183 0 -182 -168 131 -11 -158 -66 -103
5574 -103 -75 -29 118 57 -47 -410 130 272 157 232 -170 184 -102 296 -295 -84 -45 14 -111 229 -37 -81
5596 -81 368 47 -105 132 -78 125 -10 -175 -83 -131 181 61 -221 -127 209 -145 142 -140 9 -41 207 -40
5618 -40 -21 -83 108 -200 62 111 113 19 -301 162 70 118 256 -135 -130 -4 17 12 84 -182 259 -169 69 -135 -206
5643 -206 15 171 92 -216 -95 -32 291 228 -190 -35 -8 -4 -195 -238 -4 263 446 -82 -223 265 12 -44 24
5666 24 -91 -200 -122 85 -163 -19 92 63 268 248 -249 93 76 95 162 215 90 49 -35 -74 66 -165 156 -189
5690 -189 17 83 -11 -115 104 -62 72 -131 78 1 -8 113 52 62 -54 67 120 59 -9 -162 121 -215 297
5713 297 52 8 -12 -40 128 -18 -114 432 501 78 133 29 -219 74 -190 13 -41 -106 -66 55 -81 -5 50 125
5737 125 126 112 -248 258 -130 -123 28 -236 -62 -70 1 -18 60 -15 -88 117 86 0 14 -83 -34 56 -122 5 -93 -261
5763 -261 -64 44 -338 4 -84 -206 -172 -3 -121 132 6 -280 88 -41 -53 -197 -137 93 152 30 -6 28
5785 28 50 407 -46 -140 -96 -162 113 -32 218 319 -299 -145 17 -242 -216 453 33 8 491 -175 -66 -43 223
5808 223 127 92 176 113 -113 -497 -668 38 -445 -202 15 -361 774 -246 -109 77 -49 -93 -177 -96 49 122
5830 122 65 26 61 -65 -130 -105 23 -114 144 -101 153 -77 -111 123 78 0 35 116 38 79 181 -225 192 187 131
5855 131 210 256 -92 37 94 -247 -333 210 137 -154 46 -159 -81 -107 9 68 -100 85 146 42 45 76 121 -158
5879 -158 178 67 -50 3 115 -105 14 42 -293 -95 -102 -17 -317 33 141 -144 -165 -123 30 -101 -193 243 -169
5902 -169 -74 -4 -31 110 -183 -26 -186 -502 -112 -247 32 95 41 683 -226 -272 175 -69 -205 -42 322 144
5924 144 -396 -28 155 -198 73 153 -180 76 -129 -199 -1 0 143 -84 -122 57 -80 -53 -360 -76 -199 124
5946 124 -150 123 139 55 286 176 -47 135 46 -20 -237 -76 120 -40 226 -61 -102 -189 49 37 -152 6
5968 6 24 68 27 -45 20 -50 -145 -220 108 -346 -240 -279 8 -71 15 224 -140 2 -102 0 -169 132 5 97 -39
5993 -39 328 0 -99 -202 263 25 84 64 -100 -70 -195 29 397 -63 -6 28 158 93 376 70 114 125 101 -256
6017 -256 -152 -15 -281 79 -41 -72 -23 99 166 -39 -40 -123 -131 -3 61 -81 -212 197 -57 -101 -127 -26 48 -146
6041 -146 41 -70 -9 -124 -70 -101 -49 25 -138 150 -57 209 31 204 95 -117 13 55 -107 11 61 -144
6063 -144 32 -156 70 4 -69 -105 206 103 -76 103 141 -84 68 -39 146 45 223 98 -50 -182 13
6084 13 72 -130 -48 -62 275 -172 28 33 -219 162 -147 -5 10 -131 343 11 -146 80 134 -4 304 17 -222
6107 -222 211 -124 218 221 226 10 -220 -84 -146 45 -102 33 -74 -12 148 -161 11 37 21 -70 2 -318 -210
6130 -210 -186 313 -143 -93 -76 -128 165 -143 44 251 -129 -41 55 168 -107 -54 -45 -45 117 -60 -80 35 -17 90
6154 90 35 -8 -42 53 -247 232 -8 17 -53 -26 -89 -33 17 152 -96 -80 -133 188 50 189 -59 -149 -168 165 -54
6179 -54 -155 166 48 190 -51 41 238 100 -115 -86 26 271 -275 -71 -120 41 9 -127 1 -2 154 -399
6201 -399 -251 204 -49 -72 -83 153 100 33 100 -266 -149 154 57 -240 -108 171 -110 -36 -60 -226 -173 -101 130
6224 130 36 -44 197 148 202 -79 207 -49 -54 13 -49 -30 36 -37 -27 27 -49 -191 337 -7 -50 -123 -208 102 -370 106
6250 106 -54 35 75 90 39 -24 -53 -106 185 139 72 -174 37 63 -188 294 28 41 111 147 33 -50 175 -81 11
6275 11 -222 178 -267 112 146 60 -23 -77 -82 -176 39 -53 219 379 138 -444 366 78 -240 116 22 -560 -86
6298 -86 272 242 106 289 -39 63 332 87 -609 -20 126 473 351 -309 113 -147 -544 408 -113 40 570
6319 570 -348 -231 -402 175 588 -107 395 500 -753 159 -277 -118 -205 373 -392 -169 433 -403 378 267
6339 267 -4 -202 41 -117 275 41 -186 -77 468 -354 608 -682 -370 -387 289 523 -839 265 -338
6358 -338 146 570 -306 91 -160 256 -103 -127 -20 -83 -121 54 214 -389 -122 -289 350 -261 233 532 97
6379 97 -293 -327 260 -46 130 164 -76 -372 174 -281 -612 -273 200 -54 -349 -317 -271 258 232 273 -131 -68 585
6402 585 -30 765 -593 -226 586 -111 324 -333 265 -450 390 -67 94 273 310 -29 -292 -343 -223 -89
6422 -89 678 -949 290 -138 -325 162 320 536 -246 286 -28 -75 -344 134 -114 9 -57 37 117 30 2 177
6444 177 -114 -332 -200 -2 -27 95 -180 2 255 -241 168 410 -154 788 -156 302 -34 158 -981 111
6464 111 261 -318 515 -115 320 -377 -404 -197 126 -94 157 19 -21 171 48 75 -303 447 -238 250 -528
6485 -528 -127 40 -84 503 -334 -225 -294 14 -36 -184 26 263 26 -983 666 -110 -247 -976 245 -519
6505 -519 -182 247 389 135 562 295 -95 -600 -395 -289 522 -448 -52 589 82 -399 -424 82 37 269 101
6526 101 -785 -292 -487 -244 -133 113 253 -66 -166 -130 -189 -260 138 -38 71 21 -130 35 172 -54 121
6547 121 -168 -55 -291 -9 -12 11 139 72 -193 75 -87 -64 43 216 150 -218 -17 -71 185 -31 34 263 85
6570 85 191 112 13 -75 38 204 -40 -191 -56 -42 70 143 -91 -5 44 27 -237 -50 37 -154 79 -88 52
6593 52 -41 109 181 77 -53 -4 -22 14 173 -293 -231 213 258 261 -105 -345 140 -84 -367 477 102 -277 129
6616 129 11 -269 1 -226 206 218 -17 377 97 -300 -533 110 -15 100 -12 -263 38 260 -136 467
6636 467 255 -682 504 126 -155 -89 121 67 -280 9 -160 -189 27 -93 -8 25 223 -67 24 58 -1 -29 308
6659 308 11 -109 -126 -65 -100 41 337 38 81 -103 336 143 -331 -120 -105 -5 -383 56 179 -87 38 -346
6681 -346 182 194 13 269 190 253 101 143 50 16 -357 299 -158 -213 -173 610 327 302 -449 -413 849 -141 204
6704 204 -249 -707 143 -303 -141 -187 -134 369 185 154 262 -146 7 -252 -82 -164 -342 -144 257 14 186
6725 186 -265 250 403 401 399 13 -143 126 107 -294 406 -182 465 -270 -96 131 176 -259 65 -247 -259 -135
6747 -135 38 175 -27 -11 -7 485 -346 -439 -694 59 963 -317 -261 -92 -365 -299 97 264 354 389 417 351 388
6770 388 322 -198 299 -241 -643 302 -267 130 358 123 294 59 167 -210 95 -168 -97 104 -169 -272 123
6791 123 5 348 267 0 150 228 -55 -77 111 143 131 -30 -6 -242 97 -38 -90 354 -53 -63 -34 231 133
6814 133 -41 134 115 96 -145 -232 -200 -108 -98 -96 -66 -233 -223 -9 32 238 31 -157 172 17 16 -254 74 -170
6838 -170 22 313 -87 135 -86 -6 121 -290 79 168 155 218 229 105 20 42 -136 -33 191 -186 -78 95
6860 95 -117 -181 -131 32 113 193 -53 107 64 106 281 -156 -137 -91 -15 -12 61 -224 18 -82 -10 -15 -325 42 -20 -27
6886 -27 57 444 -193 248 -59 -695 812 -646 -423 342 -26 -537 -193 178 -228 262 -137 182 -261 38
6906 38 24 -437 387 -493 15 332 -91 -198 -777 72 -34 486 130 31 398 33 29 244 -360 -652 -84 -132
6928 -132 -458 199 -204 -71 14 -58 -223 454 -298 -123 -54 259 37 314 -22 439 -500 -188 -414 -4 -143
6949 -143 -264 166 79 -220 -283 286 -175 18 -277 -332 247 129 251 -2 -44 245 -127 -19 -42 -184 -114 -150
6971 -150 50 -117 -70 188 -178 -148 -249 161 115 54 292 155 -205 22 -129 -140 87 26 231 7 8 -101 -115
6994 -115 98 -130 -1 20 -107 -195 -17 -245 95 -9 -137 49 -5 247 129 139 329 -53 -104 34 -13 -113
7016 -113 -51 104 140 -182 -9 47 82 -163 3 193 -128 149 140 -78 -176 34 145 -284 231 51 48 -124 102
7039 102 267 17 55 -594 -459 -283 284 53 194 -101 54 108 -161 18 -171 -299 375 -169 339 482 163
7060 163 86 -3 -9 97 208 205 -86 -78 -838 132 137 619 21 233 192 25 221 -12 173 10 -266 -309 217 20
7084 20 -110 -167 -199 33 148 -159 -134 -158 -57 15 177 87 113 87 -99 -233 246 -279 -311 55 132 -171 -53 219
7108 219 -109 231 112 -65 -227 -14 -85 31 42 147 -130 154 -48 257 -44 -5 -169 -85 -22 -246 -30 -33
7130 -33 -22 24 -33 23 46 -176 -88 10 72 146 53 112 118 172 46 21 -24 -152 -34 168 -88 -320 46 55 80 -88 136
7157 136 116 200 39 191 -65 -140 127 27 -203 -254 -203 33 -85 -61 154 76 21 62 -94 -29 171 -117 93
7180 93 -106 -185 2 202 168 -88 -250 -51 -138 -6 -113 -38 24 148 -150 -8 218 24 164 189 -94 278
7202 278 15 22 70 -67 -45 -243 76 -273 -61 88 87 14 93 -87 -171 -32 292 -7 -119 79 97 147 20 95
7226 95 133 -244 -183 -163 208 -21 -100 -95 94 -31 -10 -8 198 -158 -171 2 98 35 -51 -233 12 63 92 -158 48
7251 48 64 37 -43 59 -228 43 144 -4 -301 11 -60 -321 58 -115 -40 9 101 -127 -195 -72 -228 115 189
7274 189 203 -65 -50 97 -163 -157 -93 440 -124 -98 97 -32 -249 -78 9 -39 -190 146 -322 326 -307 283 -419
7297 -419 -229 302 -371 -260 579 418 -302 339 449 326 -8 597 -170 326 -390 -198 122 184 -405 -239
7317 -239 -305 115 -179 -30 -157 177 2 -107 -85 184 -215 -36 -242 -209 237 -476 697 -262 -405 -1072 8
7338 8 -154 -192 -473 -882 -143 -235 -213 249 51 -292 213 -222 1369 -180 -104 -823 -113 150 -323 76 396
7359 396 -272 -526 -245 172 -609 183 465 -89 -269 394 504 -118 -188 338 236 -225 97 31 -385 405 -54
7380 -54 1138 -353 127 -139 -325 -17 -249 -333 367 -274 -125 329 -43 443 -130 -465 531 200 -17 440
7400 440 -167 -269 -363 4 -45 225 293 -152 -204 -68 -103 177 -162 -252 2 168 -275 711 384 190 69 238
7422 238 369 -616 -577 -210 -220 114 428 139 -155 -536 -549 270 65 154 -62 216 67 -83 288 -385 22
7443 22 168 240 4 195 881 384 129 209 -421 -375 -119 406 -316 -568 -450 229 29 -309 378 -1002 153
7464 153 -1012 -539 -161 80 -104 -663 -474 167 227 -75 318 -97 -142 -441 45 -597 -151 8 117 200 -58
7485 -58 -363 33 -11 223 195 318 117 184 209 -135 -54 -18 384 366 -43 -38 152 289 -111 -203 31 395 123 149
7509 149 222 98 16 154 71 52 168 232 67 17 33 -40 -89 -148 22 -131 -23 172 38 -57 -100 22 68 -157
7533 -157 -96 267 12 -39 94 32 234 -52 -90 11 -59 -220 -5 65 -37 230 194 -84 24 150 -15 68 -71
7556 -71 -89 -31 32 -213 -41 -63 -173 -33 -101 61 -275 29 138 -248 214 155 -134 -101 95 24 151 -189 66
7579 66 -101 177 387 -45 240 70 -185 -168 157 69 -158 -345 210 108 278 -323 106 -312 -443 -243 -91
7600 -91 -216 -169 174 138 -129 273 109 20 -199 -68 -4 73 -122 -253 -158 -116 -24 177 401 -17 -32 -255 13
7623 13 -101 -78 81 -206 -128 63 78 -206 59 77 -75 -11 -229 -137 -54 138 43 -39 -182 164 18 84 51 51 69
7648 69 -62 20 -170 -113 132 -6 15 -40 -70 -20 -217 33 -111 -154 -35 29 65 -203 97 -71 -184 56 214
7671 214 52 -72 25 -87 -73 98 -198 -144 -25 279 -30 97 -50 -213 -211 -118 -54 223 -39 -2 12 -75 -102 -21
7695 -21 -232 -44 144 76 -85 282 123 -154 99 -178 -202 -173 218 -2 -108 -124 35 -121 -244 73 41 -79
7717 -79 -142 -26 -126 -139 207 22 40 -206 -87 59 -55 -93 24 -147 175 -201 83 131 -93 -207 325 -24
7739 -24 -40 -164 92 196 -67 343 126 147 -76 106 -5 35 -26 -7 -90 -98 174 44 163 187 -79 90 37 142
7763 142 33 -79 -196 4 178 -110 185 -56 51 -179 -10 -100 24 -18 47 106 -189 -16 100 -100 114
7784 114 9 -31 134 88 93 49 52 403 12 -20 203 -90 -117 30 30 57 9 -185 -53 230 37 -26 45 -112 -92
7809 -92 178 117 -204 64 53 175 -146 -95 -217 -76 -136 105 -85 112 -128 302 -59 -295 262 -331 -108 -300
7831 -300 466 698 -217 -530 244 -92 -99 79 -241 43 258 -487 175 -456 -501 16 27 287 58 -66 -138 -151
7853 -151 -178 147 -81 -73 56 187 115 183 134 7 -82 -53 233 -186 -150 -114 -58 -138 -134 11 240 108 17 248 -126
7878 -126 81 115 -239 131 75 1 206 -106 56 71 -248 229 311 -80 56 89 161 -266 -85 18 -276 -448
7900 -448 -97 111 -419 139 -380 -240 220 288 73 330 443 -411 -263 141 -422 -377 185 -749 -455 -254 342
7921 342 -146 -199 -999 -259 -261 234 133 -597 -452 393 -353 104 -99 -55 -219 -2 -60 -137 89 56 110 -148 -107
7944 -107 24 204 29 85 30 90 -57 105 1 13 239 0 -33 55 105 208 -73 -60 -35 -202 69 102 144 179
7968 179 109 -11 178 -211 92 -13 -366 82 -23 6 42 -49 -116 216 53 -123 -71 -59 176 127 -194 -157 -89
7991 -89 150 7 130 63 84 10 145 260 -24 -72 -9 -151 229 -63 -182 26 -11 -153 111 -179 -48 -136 -9
8014 -9 -68 -311 5 -9 -62 26 -23 83 80 28 -224 -107 189 -87 63 60 -59 -17 87 -156 -17 85 -265 -30
8038 -30 34 244 217 38 -35 9 -286 110 118 218 43 123 0 22 -143 -84 152 -102 83 -76 -51 -67 -30 -121 189
8063 189 -353 138 26 -188 69 -145 -258 -292 -190 -20 29 83 89 81 -93 -115 253 -143 64 93 138 -166 -39
8086 -39 -179 -24 53 -23 -2 145 118 16 -42 -50 63 -35 -80 158 -64 195 -58 -23 -117 -5 -40 -113 55 140 -52
8111 -52 -130 45 116 122 151 -37 234 140 -20 -80 -110 -7 114 149 -134 59 66 151 4 126 108 241 -15 219 -31
8136 -31 -162 83 -135 -275 47 18 -128 32 246 38 -169 127 7 -135 -64 51 -100 163 -75 296 -151
8157 -151 161 -79 190 9 198 71 53 54 20 -91 55 20 126 -310 -267 94 -129 -64 -82 -103 -79 19 190 -82
8181 -82 15 138 155 -3 -105 -18 -132 119 -41 -29
8191b9
##END NTUPLES=NMR FID
##END=
