##TITLE=1H_Pr AmBn2
 CDCl3, 8 sc, 
 25.11.2020
##JCAMPDX= 6.0         $$ Bruker NMR JCAMP-DX V2.0
##DATA TYPE= NMR FID
##DATA CLASS= NTUPLES
##ORIGIN= UXNMR, Bruker Analytische Messtechnik GmbH
##OWNER= root
$$ XWIN-NMR		Version 3.5
$$ Wed Nov 25 11:59:31 2020 Russian Standard Time (UT+4h)  she@DPX200
##.OBSERVE FREQUENCY= 200.1315066352
##.OBSERVE NUCLEUS= ^1H
##.DELAY= (6, 6)
##.ACQUISITION MODE= SIMULTANEOUS
##.ACQUISITION SCHEME= undefined
##.AVERAGES= 8
##.DIGITISER RES= 18
##SPECTROMETER/DATA SYSTEM= spect
##.PULSE SEQUENCE= zg30
##.SOLVENT NAME= CDCl3
##.SHIFT REFERENCE= (INTERNAL, CDCl3, 0, 15.7039)
##AUDIT TRAIL= $$ (NUMBER, WHEN, WHO, WHERE, WHAT)
$$ ##TITLE= Audit trail, XWIN-NMR		Version 3.5
$$ ##JCAMPDX= 5.01
$$ ##ORIGIN= Bruker BioSpin GmbH
$$ ##OWNER= she
$$ F:/spectra/data/she/nmr/H-F/1/audita.txt
$$ ##AUDIT TRAIL=  $$ (NUMBER, WHEN, WHO, WHERE, WHAT)
(   1,<2020-11-25 11:58:02.87 +0400>,<she>,<DPX200>,
      <created by zg, POWCHK disabled, PULCHK disabled
       configuration hash MD5:
       00 E9 B6 7A A2 85 ED C7 34 08 36 98 17 FE 4E 26
       data hash MD5: 16K
       6D B2 F7 F1 15 4C 4F 10 FC 59 3C 79 C7 94 80 2D>)
$$ ##END=
$$ 
$$ hash MD5
$$ 3F 4C 6E CE 0F DA 37 0B 53 55 89 57 04 0E 88 B6
##$RELAX= 
##$RELAX= 
##$RELAX= 
##$RELAX= 
##$RELAX= 
##$RELAX= 
$$ Bruker specific parameters
$$ --------------------------
##$DU= <F:/spectra>
##$EXPNO= 1
##$NAME= <H-F>
##$PROCNO= 1
##$TYPE= <nmr>
##$USER= <she>
##$AMP= (0..31)
100 100 100 100 100 100 100 100 100 100 100 100 100 100 100 100 100 100 
100 100 100 100 100 100 100 100 100 100 100 100 100 100 
##$AQSEQ= 0
##$AQ_mod= 1
##$AUNM= <au_zg>
##$AUTOPOS= <>
##$BF1= 200.13
##$BF2= 200.13
##$BF3= 200.13
##$BF4= 200.13
##$BF5= 200.13
##$BF6= 200.13
##$BF7= 200.13
##$BF8= 200.13
##$BYTORDA= 1
##$CFDGTYP= 0
##$CFRGTYP= 5
##$CHEMSTR= <none>
##$CNST= (0..31)
1 1 145 1 1 1 1 1 1 1 1 1 1 1 1 1 1 1 1 1 1 1 1 1 1 1 1 1 1 1 1 1 
##$CPDPRG= <>
##$CPDPRG1= <>
##$CPDPRG2= <>
##$CPDPRG3= <>
##$CPDPRG4= <mlev>
##$CPDPRG5= <mlev>
##$CPDPRG6= <mlev>
##$CPDPRG7= <mlev>
##$CPDPRG8= <mlev>
##$CPDPRGB= <>
##$CPDPRGT= <>
##$D= (0..31)
0 1.2 0 0 0 0 0 0 0 0.06 0 0.03 0 0 0 0 0.0002 0 0 0 0 0 0 0 0 0 0 0 0 
0 0 0 
##$DATE= 1606291082
##$DBL= (0..7)
120 120 120 120 120 120 120 120 
##$DBP= (0..7)
150 150 150 150 150 150 150 150 
##$DBP07= 0
##$DBPNAM0= <>
##$DBPNAM1= <>
##$DBPNAM2= <>
##$DBPNAM3= <>
##$DBPNAM4= <>
##$DBPNAM5= <>
##$DBPNAM6= <>
##$DBPNAM7= <>
##$DBPOAL= (0..7)
0.5 0.5 0.5 0.5 0.5 0.5 0.5 0.5 
##$DBPOFFS= (0..7)
0 0 0 0 0 0 0 0 
##$DE= 6
##$DECBNUC= <off>
##$DECIM= 32
##$DECNUC= <off>
##$DECSTAT= 4
##$DIGMOD= 1
##$DIGTYP= 9
##$DL= (0..7)
0 120 120 120 120 120 120 120 
##$DP= (0..7)
150 150 150 150 150 150 150 150 
##$DP07= 0
##$DPNAME0= <>
##$DPNAME1= <>
##$DPNAME2= <>
##$DPNAME3= <>
##$DPNAME4= <>
##$DPNAME5= <>
##$DPNAME6= <>
##$DPNAME7= <>
##$DPOAL= (0..7)
0.5 0.5 0.5 0.5 0.5 0.5 0.5 0.5 
##$DPOFFS= (0..7)
0 0 0 0 0 0 0 0 
##$DQDMODE= 0
##$DR= 18
##$DS= 0
##$DSLIST= <SSSSSSSSSSSSSSS>
$$ [...]
##$SUBNAM2= <"">
##$SUBNAM3= <"">
##$SUBNAM4= <"">
##$SUBNAM5= <"">
##$SUBNAM6= <"">
##$SUBNAM7= <"">
##$SUBNAM8= <"">
##$SUBNAM9= <"">
##$SW= 16.9725356469052
##$SWIBOX= (0..15)
0 0 2 0 0 0 0 0 0 0 0 0 0 0 0 0 
##$SW_h= 3396.73913043478
##$TD= 16384
##$TD0= 1
##$TE= 0
##$TE2= 300
##$TE3= 300
##$TEG= 300
##$TL= (0..7)
0 120 120 120 120 120 120 120 
##$TP= (0..7)
150 150 150 150 150 150 150 150 
##$TP07= 0
##$TPNAME0= <>
##$TPNAME1= <>
##$TPNAME2= <>
##$TPNAME3= <>
##$TPNAME4= <>
##$TPNAME5= <>
##$TPNAME6= <>
##$TPNAME7= <>
##$TPOAL= (0..7)
0.5 0.5 0.5 0.5 0.5 0.5 0.5 0.5 
##$TPOFFS= (0..7)
0 0 0 0 0 0 0 0 
##$TUNHIN= 0
##$TUNHOUT= 0
##$TUNXOUT= 0
##$USERA1= <user>
##$USERA2= <user>
##$USERA3= <user>
##$USERA4= <user>
##$USERA5= <user>
##$V9= 5
##$VALIST= <valist>
##$VCLIST= <CCCCCCCCCCCCCCC>
##$VD= 0
##$VDLIST= <DDDDDDDDDDDDDDD>
##$VPLIST= <PPPPPPPPPPPPPPP>
##$VTLIST= <TTTTTTTTTTTTTTT>
##$WBST= 1024
##$WBSW= 4
##$XGAIN= (0..3)
0 0 0 0 
##$XL= 0
##$YL= 0
##$YMAX_a= 296527
##$YMIN_a= -309878
##$ZGOPTNS= <>
##$ZL1= 120
##$ZL2= 120
##$ZL3= 120
##$ZL4= 120
##$ABSF1= 10
##$ABSF2= 0
##$ABSG= 5
##$ABSL= 3
##$ALPHA= 0
##$AQORDER= 0
##$ASSFAC= 0
##$ASSFACI= 0
##$ASSFACX= 0
##$ASSWID= 0
##$AUNMP= <proc_1d>
##$AZFE= 0.1
##$AZFW= 0.1
##$BCFW= 1
##$BC_mod= 2
##$BYTORDP= 1
##$COROFFS= 0
##$CY= 11.3945322036743
##$DATMOD= 1
##$DC= 2
##$DFILT= <>
##$DTYPP= 0
##$F1P= 15.9154993809931
##$F2P= -4.1035820241983
##$FCOR= 0.5
##$FTSIZE= 0
##$FT_mod= 4
##$GAMMA= 1
##$GB= 0.15
##$INTBC= 1
##$INTSCL= 1
##$ISEN= 128
##$LB= 0.24
##$LEV0= 0
##$LPBIN= 0
##$MAXI= 10000
##$MC2= 0
##$MEAN= 0
##$ME_mod= 0
##$MI= 1.114404
##$NCOEF= 0
##$NC_proc= 0
##$NLEV= 6
##$NOISF1= 3.799351
##$NOISF2= 2.8
##$NSP= 1
##$NTH_PI= 0
##$NZP= 0
##$OFFSET= 15.70392
##$PC= 1
##$PHC0= -11047.92
##$PHC1= 10.40089
##$PH_mod= 1
##$PKNL= yes
##$PPARMOD= 0
##$PSCAL= 0
##$PSIGN= 0
##$REVERSE= no
##$SF= 200.130013532006
##$SI= 16384
##$SIGF1= 3
##$SIGF2= 2
##$SINO= 400
##$SIOLD= 16384
##$SREGLST= <1H.CDCl3>
##$SSB= 0
##$STSI= 0
##$STSR= 0
##$SW_p= 3612.71676300578
##$SYMM= 0
##$S_DEV= 0
##$TDeff= 0
##$TDoff= 0
##$TI= <>
##$TILT= no
##$TM1= 0
##$TM2= 0
##$TOPLEV= 0
##$USERP1= <user>
##$USERP2= <user>
##$USERP3= <user>
##$USERP4= <user>
##$USERP5= <user>
##$WDW= 1
##$XDIM= 8192
##$YMAX_p= 0
##$YMIN_p= 0
$$ End of Bruker specific parameters
$$ ---------------------------------
##NTUPLES= NMR FID
##VAR_NAME=  TIME,          FID/REAL,        FID/IMAG
##SYMBOL=    X,             R,               I
##VAR_TYPE=  INDEPENDENT,   DEPENDENT,       DEPENDENT
##VAR_FORM=  AFFN,          ASDF,            ASDF
##VAR_DIM=   8192,          8192,            8192
##UNITS=     SECONDS,       ARBITRARY UNITS, ARBITRARY UNITS
##FACTOR=    0.0002944,     1,               1
##FIRST=     0,             0,               0
##LAST=      2.4114304,     0,               0
##MIN=       0,             -309878,         0
##MAX=       2.4114304,     296527,          0
$$ Real data points
##PAGE= N=1
##DATA TABLE= (X++(R..R)), XYDATA
$$ [...]
2161C48j624L71J062j061L95k48O37K08o19o28J708q35m49Q17k21L62q75O33Q29
$$ 348 -1276 -905 157 -904 -509 -757 -120 88 -531 -1159 549 -286 -735 82 -139 223 -652 -19 810
2180H10o78n67O61M63j96k03KJ366j180l37J065l27r5n34P82k62l11n9O03ko88
$$ 810 132 -435 226 689 493 290 292 1658 478 141 1206 879 784 250 1032 770 459 400 1003 1001 313
2201C13L78J83J37j021L61O84p62l12%M80o97J16j40N51m10p94P38P4m48q14J073
$$ 313 691 874 1011 -10 351 1035 273 -39 -39 441 -256 -140 -280 271 -139 -933 -195 -121 -569 -1383 -310
2222c10K21o92l32O08K18o64R0J74L54p24p8R68n74j28l27J247l99k03K50L58
$$ -310 -89 -781 -1113 -505 -287 -951 -861 -687 -333 -1057 -1135 -167 -741 -869 -1196 51 -348 -551 -301 57
2242E7J2n54P73Lj98m62O25L85l74m23N18M97p42L9L16L68o20P7M19k1j53n74
$$ 57 69 -485 288 291 93 -369 256 641 267 -156 362 859 117 156 472 840 220 297 716 695 542 -32
2264c2P57l28m02M1N79J21r58P31o3J10p55PO75m73k82K36N66m60l37J88N58m27
$$ -32 725 397 -5 36 615 736 -222 509 446 556 -199 -192 483 10 -272 -36 530 70 -267 -79 479 52
2286E2p74J052k62l76l81P07J68m02m55O94M7q59M16J79L25o48m04J078l66l73
$$ 52 -722 330 68 -308 -689 18 186 -216 -671 23 70 -789 -373 -194 131 -517 -921 157 -209 -582
2306e82K46J65r5j79l21R87j28j102Q96m6J47m63J42Q03p61l71R60l52m50N67
$$ -582 -336 -171 -266 -445 -766 221 93 -1009 -113 -159 -12 -475 -333 470 -291 -662 298 -54 -504 63
2326F3j44N39k47o56J322m70m96L24K24L60r44o8J216k40j353J390l02J65l84
$$ 63 -81 458 211 -445 877 407 -89 235 459 819 -125 -193 1023 783 -570 820 518 683 299
2345B99o53J772p95j055J180j05m12o7n66J204j53j135J169n07n5J01p83R44l09
$$ 299 -354 1418 623 -432 748 643 231 164 -402 802 649 -486 683 176 121 222 -561 383 74
2364G4o97N37L3j185J578q45j37N43r42J541j185n84J587o46l55K68l72J260l78
$$ 74 -623 -86 -53 -1238 340 -505 -642 -99 -1041 500 -685 -1269 318 -328 -683 -415 -787 473 95
2383I5j869K775j162j012P49l32J468l90j749K366l66j402N68k36J355m98j806
$$ 95 -1774 1001 -161 -1173 -424 -756 712 322 -1427 939 573 -829 -261 -497 858 360 -1446
2400a446K475j33j298J150r10R28K88j727Q53Q09j347J542j387J00J674j889P99
$$ -1446 1029 896 -402 748 -162 766 1054 -673 180 989 -358 1184 -203 -103 1571 -318 481
2417D81j56p91J677q33j254K016p65l41L95j534L157j290k166K261n20j03k38
$$ 481 325 -466 1211 378 -876 1140 375 34 429 -1105 2052 762 -1404 857 337 234 -4
2434dj190K351k52k905K307j74l27N27k346K729L37k742J561L24l81P38k076J305
$$ -4 -1194 1157 905 -2000 307 133 -194 333 -2013 716 1053 -1689 -128 196 -185 553 -1523 -218
2452b18J506k926J625j94o37J931k379O91J245j520R10l36j103K419j102j071
$$ -218 1288 -1638 -13 -207 -844 1087 -1292 -601 644 -876 34 -302 -1405 1014 -88 -1159
2468a159J971j372J091m81k000L304p77j858J565m98Q88J28k735K776Q24l045
$$ -1159 812 -560 531 50 -1950 1354 577 -1281 284 -214 674 802 -1933 843 1667 -1378
2484a378J761p48J332J62k937K379Q87j800O88n29P58J040k859J169J464k126
$$ -1378 383 -365 967 1129 -1808 571 1458 -342 346 -183 575 1615 -1244 -75 1389 -737
2500g37J432r53P9J646k058K81J229j354J407q70j330K759j672l01J042j534J967
$$ -737 695 -258 -179 1467 -591 -310 919 -435 972 102 -1228 1531 -141 -442 600 -934 1033
2517A033n98k180K324l1j136N00j081J957K42l044K182K10n72K54j485J824J044
$$ 1033 435 -1745 579 548 -588 -88 -1169 788 1030 -2014 168 378 -194 60 -1425 399 1443
2534A443k972J096J340j563R23j704J322J451k659Q26O69k45N70j384M09J660
$$ 1443 -1529 -433 907 -656 267 -1437 -115 1336 -1323 -497 172 -73 497 -887 -478 1182
2550A182k038K49J173j377J764j406k4J298j172O46M9j214J646J74k095J789l82
$$ 1182 -856 -607 566 -811 953 -453 -477 821 -351 295 344 -870 776 950 -1145 644 262
2567B62M7N00j994J843N42j620P67j50K13N54k069J069J449k267O89N24k84R08
$$ 262 309 809 -1185 658 1200 -420 347 197 410 964 -1105 -36 1413 -854 -165 359 75 983
2585I83k227J034J040j453L1N69l43J035j198p8J309j484P47o3n59O81n83j34
$$ 983 -1244 -210 830 -623 -592 -23 -366 669 -529 -607 702 -782 -35 -98 -657 24 -559 -693
2603f93J092r94L32N15j014Q92j62p56J205j231R48L45j479O34N55l37K42o54
$$ -693 399 -595 -263 252 -762 130 -32 -788 417 -814 134 479 -1000 -366 189 -148 94 -560
2621e60M54R14j667Q43O69p43J89l04O36L46j265L40R18p27kl17M76P46j459O00
$$ -560 -106 808 -859 -16 653 -90 99 -205 431 777 -488 -148 770 43 41 -276 200 946 -513 87
2641H7N15o72K08%K45j49l12k5R92j017R8N15m89J21n02P64pp13J42N95n01pj81
$$ 87 602 -70 138 138 383 234 -78 -103 889 -128 -30 485 -4 117 -385 379 372 -341 -199 396 -105 -112 -293
2664b93j20Q09q25P8O07o55n4l9O83n10j5k75P74m41k81L21J48K09p54M65q6n5
$$ -293 -413 396 -429 -351 256 -399 -453 -492 191 -319 -334 -609 165 -276 -557 -236 -88 121 -633 -168 -254 -309
2686c09j69L48P0k30j5N1M67o18M11K7n8K9j44N76l64j31J92L49j18m69N31q6
$$ -309 -478 -130 -60 -290 -305 -254 213 -405 6 33 -25 4 -140 436 72 -59 133 482 364 -105 426 340
2708C40J05j35mK94m14l8R8J29k21K54j79L19m04l66N71L8l76k20O14M8m05k33
$$ 340 445 310 306 600 186 148 246 375 154 408 229 548 144 -222 349 387 11 -209 405 453 48 -185
2730a85M05K98o93J79j53K48k93j48N55m42R3k02O18l55k29j03O48m31l58L27
$$ -185 220 518 -175 4 -149 99 -194 -342 213 -229 -136 -338 280 -75 -304 -407 241 -190 -548 -221
2750b21l8J60o59O37J80p07j48O48L17o85M85J6L3j35j41N00m81P4p0M83r7m30
$$ -221 -259 -99 -758 -121 59 -648 -796 -148 169 -516 -31 -15 18 -117 -258 242 -239 -165 -235 248 151 -279
2772b79ON34k69l00N35j57K13l27R0L27k73l3N1J24j25K2j26L59l09l27R67n17
$$ -279 -273 261 -8 -308 227 70 283 -44 46 373 100 67 118 242 117 139 13 372 63 -264 703 186
2794A86J62j79o0M47k59m42O98j36m41J12J28J38j90m36O38k86j67K84j88M45
$$ 186 348 169 109 556 297 -145 553 417 -24 88 216 354 164 -272 366 80 -87 197 9 454
2814D54o96j3M32l87n80P73m91L93K7j65L11o78M3O32l75k84Q35m33K93m76k41
$$ 454 -242 -255 177 -210 -790 -17 -508 -115 -88 -253 58 -620 -577 55 -320 -604 231 -202 91 -385 -626
2835f26J247j023j47M08m1n5o9j38J040m50r34J031j47r9k3o63J522o70p80J013
$$ -626 621 -402 -549 -141 -182 -237 -306 -444 596 146 -788 243 96 -3 -26 -689 833 163 -617 396
2855C96n1k06K50p60Q87J09r68J145q44L4O01r65N96J60m69Q54q65r8J042r49
$$ 396 345 139 389 -371 516 625 -343 802 -42 -8 593 -372 224 384 -85 769 -96 -194 848 -101
2875a01o1O07o65J079j196r0J509q46m60K32j34O78n57j212J942n09r08O79m91
$$ -101 -162 445 -220 859 -337 -427 1082 236 -224 8 -126 552 -5 -1217 725 216 -692 -13 -504
2894e04J189q64r73J441k51o71O35o96Q84n3j586J526p4o99P02q40P86Q17j928
$$ -504 685 -179 -1152 289 38 -633 2 -694 190 137 -1449 77 3 -696 6 -834 -48 769 -1159
2913a159R24M80j163J608r78l08J413j287O39j94m23J524j299n71J627p82k97
$$ -1159 -235 245 -918 690 -288 -596 817 -470 169 -25 -448 1076 -223 -794 833 51 -246
2930b46M78j151K309r72j387K042o62m2l8r86J745j75k115J826J15p19O85j760
$$ -246 232 -919 1390 418 -969 1073 411 369 331 -655 1090 915 -1200 626 741 22 707 -1053
2948a053J591M90j839J394m92J37P50j809P86J126j712Q47j83m70J720k180M56
$$ -1053 538 1028 -811 583 91 228 978 -831 -45 1081 -631 216 33 -437 1283 -897 -441
2965d41R38j061J120p61q66J991j002j113J626r64R40n35j552K562p67q88O29
$$ -441 497 -564 556 -205 -1071 920 -82 -1195 431 -533 407 -128 -1680 882 115 -773 -144
2982a44k44O15J2j842K052P3j398J092p58P53L93j994J437N58j129N88m47M12
$$ -144 -388 227 239 -1603 449 522 -876 216 -542 211 604 -1390 47 605 -524 64 -383 29
3000B9J060k127Q32Q90j223J086r61P7J386j164L5P23j150R27l3q47J705j246
$$ 29 1089 -1038 -206 684 -539 547 -414 -337 1049 -115 -80 643 -507 420 387 -460 1245 -1
3018aO7L85q40J338o86j203J452J43o58M84q07J009P9j667J158L3q9m3r03J317
$$ -1 66 451 -389 949 263 -940 512 655 -3 481 -326 683 762 -905 253 286 197 154 -749 568
3038E68K29j519N32N93q85P32r55P97P00j800R83J52n02M36l39p1R24j146J31
$$ 568 797 -722 -190 403 -482 250 -705 92 792 -1008 -25 127 -375 61 -278 -349 575 -571 -440
3057d40N48q42J448j094j25R09q36M61J45p08O14pp31Q78l34K90K29j162J134
$$ -440 108 -734 714 -380 -505 404 -432 29 174 -534 80 73 -658 220 -114 176 405 -757 377
3076C77K9q93M40J78J90J82q28L02J039j320O20k60K66O91j561P49M41q58M29
$$ 377 406 -487 -47 131 321 503 -325 -23 1016 -304 316 56 322 1013 -548 201 642 -216 213
3095B13L26o30O35n50k59J116j179O61L0m78M60m57j27O23m91L35J37o46L83k4
$$ 213 539 -91 544 -6 -265 851 -328 333 363 -115 345 -112 -239 384 -107 228 365 -281 102 78
3115G8k15L04p53O52Kl42M4L32l80M8j3K28J24m48J78r7l2J28l51M61J69o47K32
$$ 78 -137 167 -586 66 68 -274 -230 102 -278 -230 -243 -15 109 -339 -161 -258 -290 -162 -513 -52 117 -530 -298
3138b98N03n74J62J2J75K16o44K96K04k05K31j77K30j07l5j55L76k34O2J79l90
$$ -298 205 -369 -207 -195 -20 196 -448 -152 52 -153 78 -99 131 24 -11 -166 210 -24 38 217 -173
3159a73M10k68K42P2j07q3L15j36k76M12j37L6l57L05M45n11J14k49K21r2k98
$$ -173 237 -31 211 283 176 93 408 272 -4 408 271 307 -50 255 700 189 303 54 275 183 -115
3180a15j14J84J07l33M21m7j0l52m2K39k59P7L61L6l86k9R4J08k61l27N50M8l66
$$ -115 -229 -45 62 -271 150 103 93 -259 -301 -62 -321 -244 117 153 -233 -262 -168 -60 -321 -648 -98 -50 -416
3203d16J07J20J18k72K42j37J14k67N36n00O00p47K56L84j13o7k43M42m30K37
$$ -416 -309 -189 -71 -343 -101 -238 -124 -391 145 -355 245 -502 -246 138 25 -42 -285 157 -273 -36
3223c6k21K61j65k7N86m07Q3j06L51j77r9L7n0J48j75K30j52K16k12p8J27m5J24
$$ -36 -257 4 -161 -188 398 -9 74 -32 319 142 43 80 30 178 3 233 81 297 85 7 134 89 213
3246B13P7J20j98j52j2M22m71j07O06m46L98m27J05o0j98m8J10J0r6J7l8K58k46
$$ 213 290 410 212 60 48 470 -1 -108 498 52 450 23 128 68 -130 -178 -68 -58 -154 -137 -175 83 -163
3269a63l13M89l46L20k75K14j60k59L42J33j92j83L06m41O13j1q21O36l23l2N80
$$ -163 -476 13 -333 -13 -288 -74 -234 -493 -151 -18 -210 -393 -87 -528 85 74 -747 -111 -434 -466 114
3290A14l84N86m40j28J03k64L1O92l90j04p0J59N24n20k79J084o20p1J47k69O34
$$ 114 -270 316 -124 -252 -149 -413 -382 310 -80 -184 -254 -95 429 -91 -370 714 94 23 170 -99 535
3311E35l44l21O93n42J51N1k45N13k00j93L57L26o19N67q27K49L21l97M37o64
$$ 535 191 -130 563 21 172 223 -22 491 291 98 455 781 162 729 -98 151 472 75 512 -152
3331a52K1M72n36p3O73l61J8Q2m80Q33r00M7P10m35L19p03qP33k95q55J005m33
$$ -152 -131 341 -195 -268 405 44 62 144 -336 497 -403 -356 354 -81 238 -465 -473 260 -35 -890 115 -318
3353c18K92j91o74J232m85m64O41m43O8L70p20O31q5m43Q62n85K69M17q59O03
$$ -318 -26 -217 -891 341 -144 -608 33 -410 -342 28 -692 -61 -146 -589 273 -312 -43 374 -485 118
3373A18R4l37M34l84n1Q77j090K58N26n43Q09r32k88J282n81k45M67m33N33l76
$$ 118 212 -125 309 -75 -126 751 -339 -81 445 -98 711 -221 -509 773 192 -53 414 -19 514 138
3393A38p18J432r36M9M01m67R44m96q33Q88Oq13N98l86N25J7j192J280l75k59
$$ 138 -580 852 -84 -35 366 -101 843 347 -486 402 408 -405 193 -193 332 349 -843 437 62 -197
3413a97O14j025M35N25q75K26L46l45Q64j268J44J223j110L31m2n13J203q00o48
$$ -197 417 -608 -173 352 -523 -297 49 -296 568 -700 -556 667 -443 -112 -154 -667 536 -264 -912
3432i12J358m99k67K41r63J523n73j034J459k78m7l04l70J120j26r14P43p5j96
$$ -912 446 -53 -320 -79 -1042 481 -92 -1126 333 55 8 -296 -666 454 328 -586 157 82 -114
3451a14O67j426J201L21j302O27N6J63M57j092O38N37j031P84l87l20J298j192
$$ -114 553 -873 328 649 -653 -26 30 193 650 -442 196 733 -298 486 99 -221 1077 -115
3469a15O5O90p17P08n12n73J317q34n92J152p53O49l92o93J464p22n73M11k04
$$ -115 -50 640 -77 631 119 -454 863 29 -563 589 -164 485 93 -600 864 142 -431 -20 -224
3488b24M35lj161J047K91j169R82m55L94J51j209O23M68q55O62l26q2Q50j026
$$ -224 211 208 -953 94 385 -784 198 -257 137 288 -921 -298 170 -685 -23 -349 -431 419 -607
3507f07L67M72j033J088q00L52N68p20N7L37m82Q34l40o12J069n07k58L38l69
$$ -607 -240 232 -801 287 -513 -161 407 -313 -256 81 -401 433 93 -519 550 43 -215 123 -246
3526b46O31p7r72J135l27j85L62o08P10J49j331J293j52l62M13o84O81L16j176
$$ -246 385 308 -664 471 144 -41 321 -287 423 572 -759 534 382 20 433 -251 430 746 -430
3545d30N19M08o27N05o47P27k0q06P17l26m8J06J4k34K70j86M1J75l91N69l16
$$ -430 89 497 -130 375 -272 455 435 -371 346 20 -28 78 92 -142 128 -58 -17 158 -233 336 20
3566B0m39O95m53J72R1n93N44m9n71M43K20j134R97q92J104j88m60K74J26j56
$$ 20 -419 276 -177 -5 86 -507 37 -12 -583 -140 80 -1054 -57 -949 155 -33 -493 -219 -93 -249
3586b49K80p21J173l24p96J031j458R42M12p16P26J67p17N32r4L08o36N83q74
$$ -249 31 -690 483 159 -637 394 -1064 -122 290 -426 300 467 -250 282 188 496 -140 443 -431
3605d31J094j007P57q7o58J336j248J95N77l06l51L88k95k25M22k10QQ12n70J81
$$ -431 663 -344 413 326 -332 1004 -244 -49 528 222 -129 259 -36 -261 161 -49 -41 771 201 382
3625C82q14N21K49j09j4p0j84M79m08j40K41m00K62k57K31R3m34M08k35N5l50
$$ 382 -432 89 338 229 215 145 -39 440 32 -108 133 -267 -5 -262 -31 62 -372 36 -199 -144 -494
3646d94L83J71j53k99K54N4k29n8P4P3l1J02n3P5k70N8L72k01K55l83N8N9K71
$$ -494 -111 60 -93 -392 -138 -84 -313 -371 -297 -224 -255 -153 -206 -131 -401 -343 29 -172 83 -300 -242 -183 88
3669H8k09K34p6j14J58j34L83l12k77N93j39l25K99Q4j5j60NL54k46l0K90l71
$$ 88 -121 113 37 -77 81 -53 330 18 -259 334 195 -130 169 253 238 78 83 437 191 161 451 80
3691H0K76k65j59K81l29N7K66k9j13J95j76K52k67J37Onj43k73N15l26k5j33K03
$$ 80 356 91 -68 213 -116 -59 207 178 65 260 84 336 69 206 212 207 64 -209 306 -20 -45 -178 25
3714B5l16j09J82M3P1N8k33J74k31J36J57m3l62K09J1P5L8L9k40J15Q7j92N33
$$ 25 -291 -400 -218 -175 -104 -46 -279 -105 -336 -200 -43 -86 -448 -239 -228 -153 -115 -76 -316 -201 -114 -306 227
3737B27j58j45J65p4j38r9P5L2L53n38M08j18rJ57n1P8j8k23j05N55k27l13N46
$$ 227 69 -76 89 15 -123 -222 -147 -115 238 -300 108 -10 -19 138 87 165 147 -76 -181 374 147 -166 380
3760C80k17K47l91N5L33m76K45K5O7k7pk40L07l47O5L38n50L40q6k1K24q3N7o1
$$ 380 163 410 19 74 407 -69 176 201 268 241 234 -6 301 -46 19 357 -193 147 61 40 264 181 238 177
3784A77j97J2J39k09R0k4n1L07p16N87j05k78k6Q1L16j06j69j07M54n24J91Qk48
$$ 177 -20 -8 131 -78 12 -12 -63 244 -472 115 10 -268 -294 -213 103 -3 -172 -279 175 -349 -158 -150 -398
3807c98M04m05n0N14J5k72J43l44M61l68j37L21k30J88J18kM35j49n00L67L8m7
$$ -398 6 -399 -449 65 80 -192 -49 -393 68 -300 -437 -116 -346 -158 -40 -42 393 244 -256 111 149 102
3829A02K83j47k43M00m32M34n92N04L99p35N9M51l60M2m3P5O63q03k1L32j7q2
$$ 102 385 238 -5 395 -37 397 -195 309 708 -27 32 483 123 165 122 197 860 57 36 368 351 269
3851B69j65m7L68k58k69M99m77J08K5l89P13n04k55M02j74K65j31l77L93J00m25
$$ 269 104 57 425 167 -102 397 -80 28 53 -336 377 -127 -382 20 -154 111 -20 -397 -4 96 -329
3872c29L82m80J92N73r98K33L85m07N60p22k3J146r32r7N64l56O20n44q8N16k18
$$ -329 53 -427 -235 338 -660 -427 -42 -449 111 -611 -634 512 -420 -517 47 -309 311 -233 -321 195 -23
3893b3l3p3K08P1j25m87J101n77j06J18l31R20l11o78R70J28p80L19n15L10M78
$$ -23 -56 -129 79 150 25 -462 639 62 -44 74 -257 663 352 -326 644 772 -8 311 -204 106 584
3914E84p47P00k27l94N60q61M76M67q23L23J86j91K91n23k98J062q17L65q4q6
$$ 584 -163 537 310 -84 476 -385 91 558 -265 58 244 53 344 -179 -477 585 -232 133 49 -37
3934c7M58r13J35O79m33P2p4k39Q79p06l51O91m95K57j37l83Q71l8p70M60j40
$$ -37 421 -492 -357 322 -111 -39 -113 -352 527 -179 -530 161 -334 -77 -214 -597 274 236 -534 -74 -214
3955b14o5M47r40Q57N9p52L64l24L33L35n40L95M6o41P39k88j55R18p11j4K25
$$ -214 -279 168 -772 85 144 -608 -244 -568 -235 100 -440 -45 1 -640 99 -189 -344 574 -137 -151 74
3976G4p4M59n82q6P42k07o51N88l76M37%n43Q68k19m82J03L1J96L00j035J026
$$ 74 0 459 -123 -209 533 326 -325 263 -113 324 324 -219 649 430 -52 51 82 278 578 -457 569
3997E69j34p25P52n25M54r6p28P52J17m99K79l44m4O13p29J41M60o86M60l17K1
$$ 569 435 -290 462 -63 391 295 -433 319 436 -63 216 -128 -172 441 -288 -147 313 -373 87 -230 -209
4018b09L03j21k47K62m34M30k60l36N78j13L11m30r4M76j84k08J93K2P7n3m31
$$ -209 94 -27 -274 -12 -446 -16 -276 -612 -34 -147 164 -266 -360 116 -68 -276 -83 -61 16 -37 -468
4039d68M96k4n88N79l2j4J25k11K46m1m00L45L51k76J49k13J52K08m65L59k21
$$ -468 28 4 -584 -5 -37 -51 74 -137 109 68 -332 13 364 88 237 24 176 384 -81 278 57
4060E7P1K39j99j55L07m61N21J28n69N53k07l20L88k00k1k1l47L82O9n83N75j34
$$ 57 128 367 168 13 320 -141 380 508 -61 492 285 -35 353 153 132 111 -236 146 215 -368 207 73
4082G3q0Q6k34Q1J12j15N5r7K07K40m73j33M93o30K84M6N1jl34K21m9l17K69J44
$$ 73 -7 79 -155 -74 38 -77 -22 -119 88 328 -145 -278 215 -415 -131 -85 -34 -35 -369 -148 -197 -514 -245 -101
4106a01j38K05k40kJ08j20M9J74j39L63n8j54N0NJ73j61j07r5K73j65L91o40J57
$$ -101 -239 -34 -274 -276 -168 -288 -239 -65 -204 159 101 -53 -3 2 175 14 -93 -188 85 -80 311 -329 -172
4129a72q7K73L24k19p3l8K50q2K51m03k8K27k37L4J09K0Q7kj01K66j39l79L25
$$ -172 -259 14 338 119 46 8 258 176 427 24 -4 223 -14 20 129 149 236 234 133 399 260 -119 206
4152B06l04J45J52j17N7j08K21q3k65k2O6P2L34k21m34J31N8J45k41L78n05P1
$$ 206 -98 47 199 82 139 31 252 169 -96 -118 -52 20 354 133 -301 -170 -112 33 -208 170 -335 -264
4174b64J18J98j13k72M18j68n8j31M7O2q3L58n0k46j6M2L62r1l36k0K79p3O2p9
$$ -264 -146 52 -61 -333 85 -83 -141 -272 -225 -163 -246 112 62 -184 -200 -158 204 113 -223 -243 36 -37 25 -54
4198e4K90K50m20kL10k77k19O50q93P13m77K19K32m4p6j39P8K22k70r3L00j61
$$ -54 236 486 66 64 374 97 -122 528 -365 348 -129 90 322 278 202 63 141 363 93 0 300 139
4220A39N8n9k1K76j50M4l30J49R4j8M4j62J73n29N5J55l26M10k65K96k20J68J23
$$ 139 197 138 117 393 243 287 -43 106 200 182 226 64 237 -292 -237 -82 -408 2 -263 33 -187 -19 104
4243A04k30j91L08k24j42L69Mm1k03p5J88l18K43L1K53P4n31J67O2k07lL58k23
$$ 104 -126 -317 -9 -233 -375 -6 -2 -43 -246 -321 -133 -451 -208 -177 76 150 -381 -214 -152 -359 -362 -4 -227
4266b27J31l6K77L36m82k3K74j26j78L16k43J45k19k53N56k45K39K03j16j51p4
$$ -227 -96 -132 145 481 -1 -24 250 124 -54 262 19 164 -55 -308 248 3 242 445 329 178 104
4287A04K8Ok08N8M05l33m1k9M8L79m34l2L88p4k59M52o76N43l80p2M96l85j85
$$ 104 132 138 -70 -12 393 60 19 -10 38 417 -17 -49 339 265 6 458 -218 325 -55 -127 369 -16 -201
4310b01K70m27L18m8j19J88j58J4K72m49K37J71m88N83m54J87l6o08P45Q6n20
$$ -201 69 -358 -40 -88 -207 -19 -177 -163 109 -340 -103 68 -420 163 -291 -104 -140 -748 -3 83 -437
4331d37K47N0j54M85n69K23J06K6N9p1n4K45l55J59r2p8K02P3m01J032o65M8P8
$$ -437 -190 -140 -294 191 -378 -155 -49 -23 36 -35 -89 156 -199 -40 -132 -210 -8 65 -336 696 31 79 157
4354A57m6l2K9l31P68k92m21O33l99J26K17o09P40l29l89N19k87J36L12o20J2
$$ 157 111 79 108 -223 545 253 -168 465 66 192 409 -200 540 211 -178 341 54 190 502 -118 -106
4375a06K53k59N81n98J28L48n08J89J73j60n8l5j05O01p82J57L41l40J94k24j34
$$ -106 147 -112 469 -129 -1 347 -161 28 201 41 -17 -52 -157 444 -338 -181 160 -180 14 -210 -344
4396c44K57q9n0J1m2L30k15m40P97k56k08L91n10N78j21n78M07J88k34j15Q4J56
$$ -344 -87 -176 -226 -215 -257 73 -142 -582 215 -41 -249 142 -368 210 89 -489 -82 106 -128 -243 -159 -3
4418cK03m56M84l83p7K63k79J21P11q24K43qk1M38k26n10M52k45N67j73l16Q43
$$ -3 200 -256 228 -155 -232 31 -248 -127 584 -240 3 -5 -26 412 186 -324 128 -117 450 277 -39 804
4440H04q16k50L99J39k32J53k63N73k42n89Q44o93N4M96o63M49M7n40K83L98m83
$$ 804 -12 -262 137 276 44 197 -66 507 265 -324 520 -173 -119 377 -286 163 210 -330 -47 351 -132
4461a32L10l65J92jj53K94k48K61N6n44n5J80q2K17j13M9P3k92N6K41J62j01k34
$$ -132 178 -187 5 4 -149 145 -103 158 214 -330 -385 -205 -287 -70 -183 -134 -61 -353 -297 -56 106 5 -229
4484b29k36N78q3n73O54j35J54l7n16M54p6j01J44j05M21j43l51M61j03l18M74
$$ -229 -465 113 30 -543 111 -24 130 93 -423 31 -45 -146 -2 -107 314 171 -180 281 178 -140 334
4505C34l49J6J59k36M48j05l82L20j2j38K84k60Q5K1q7J75j82K3R1p1j00L2L3
$$ 334 -15 1 160 -76 372 267 -115 205 193 55 339 79 164 185 98 273 91 114 205 134 34 66 99
4528I9J96l64l99O92k20p4N4L1O8o6o45O74K60o09K58j12L80K4p97N87j59J39
$$ 99 295 -69 -468 224 4 -70 -16 15 83 17 -628 46 306 -303 -45 -157 223 247 -550 37 -122 17
4550A7M8l62L73j35j20K17Q8m64M18m29J56K29k9J37k58J92q8q5R7j62M7J43K5
$$ 17 65 -297 76 -59 -179 38 126 -338 80 -349 -193 36 7 144 -114 78 -10 -95 2 -160 -113 30 55
4573E5j36J30ql3L9j05KO4k68K38L74m43J63l9PJ79j83K17J34k13L1k9j89r7J28
$$ 55 -81 49 41 8 47 -58 -56 8 -260 -22 352 -91 72 33 40 219 36 253 387 174 205 176 -13 -110 18
4598A8J31N2j23K91N0m37Q5m11M23O0q2p5K13Jl30R5j7J28m89K94q1q6M9L33q1
$$ 18 149 201 78 369 419 -18 67 -344 79 139 57 -18 195 196 -134 -39 -56 72 -417 -123 -204 -290 -241 92 11
4623A1K48n01J89k23o4K73j4k85L23L2k09J25l7J55j76K2q3R2J2J06j03k02M26
$$ 11 259 -242 -53 -276 -340 -67 -81 -366 -43 -11 -220 -95 -132 23 -153 -131 -214 -122 -110 -4 -107 -309 117
4646A17l34K24m9K12l16J9L63q1j08j12L02j16N4j90J53K8QK5j08q9L5qj3Q8J70
$$ 117 -217 7 -42 170 -146 -127 236 155 47 -65 237 121 175 -15 138 166 174 199 91 2 37 29 16 104 274
4671B74K2k65Q2J3k40K99j30m6j81K05k24J29j3j0L1N8o0J44k10K40m57OL55k09
$$ 274 296 31 113 126 -114 185 55 9 -172 33 -191 -62 -75 -85 -54 4 -56 88 -122 118 -339 -333 22 -187
4695a87J59j29J02J02j23k9L0l41M28Q1p2j89J29J98j51Q5K9k76p7M50k50J3J02
$$ -187 -28 -157 -55 47 -76 -105 -75 -416 12 93 21 -168 -39 159 8 93 122 -154 -231 219 -31 -18 84
4718H4o8j19J55j99j14N82l35m6J40j2k97L86l25L34j26j5R4R8J33j13k4m7j03
$$ 84 16 -103 52 -147 -261 321 -14 -60 80 68 -229 157 -168 166 40 25 119 217 350 237 213 166 63
4741F3R4K46n64L10j70J48J11k27l8K71j30k49M30k55m1MJ22j34R0j5mj15K50
$$ 63 157 403 -161 149 -21 127 238 11 -27 244 114 -135 295 40 -1 3 125 -9 81 66 62 -53 197
4764A97m46J53N2l54K11R0j76R2N4k58M03j39r9M09n26L50Pk2r5L4j20N05p05
$$ 197 -249 -96 -44 -398 -187 -97 -273 -181 -127 -385 18 -121 -220 189 -337 13 20 -2 -97 -63 -183 322 -383
4787c83L08j9J97l36J67P2p7J43j00K50l87O3J52l68M20j15j21M18j06k03K36
$$ -383 -75 -94 103 -233 -66 6 -71 72 -28 222 -165 -102 50 -318 102 -13 -134 284 178 -25 211
4808B11m0K45m27j13K28j09Q0P4J24K65n03k80M73j95J54k04P1J57k0k01J63k09
$$ 211 171 416 -11 -124 104 -5 75 149 273 538 35 -245 228 33 187 -17 54 211 191 -10 153 -56
4830e6k00L88l48L59r7k15L75k73L1M19l91l1J44m17L61l05m5N05k58k55K84k86
$$ -56 -256 132 -216 143 46 -169 206 -67 -36 383 -8 -39 105 -312 49 -256 -301 204 -54 -309 -25 -311
4852c11K35n5q8K45j9l06N03l69R0J9N0J31P5o29O53l23K15M6l39N15m21j03L28
$$ -311 -76 -131 -219 26 7 -299 204 -165 -75 -56 -6 125 200 -429 224 -99 116 162 -177 338 -83 -186 142
4875A42j11k00M88l63j99J48j65N7J40j49P48l34j76L16l89K80l80j4N39l39J24
$$ 142 31 -169 319 -44 -243 -95 -260 -203 -63 -212 536 202 26 342 -47 233 -147 -161 378 39 163
4896A63l9k34N03m35q8L51o8k84L39l99J46P1l50N10j02k04K92m98L77k08n5J46
$$ 163 124 -110 393 -42 -130 221 153 -131 208 -191 -45 26 -324 186 84 -120 172 -326 51 -157 -212 -66
4918f6j32J28j08J87j22M33l86q2L1o6N12l85K67j36k69j95L90k21N13m34l7K81
$$ -66 -198 -70 -178 9 -113 320 -66 -148 -117 -183 329 -56 211 75 -194 -389 1 -220 293 -141 -178 103
4940A03k25M45m23j80L59l35j21K09L2Q2J60k0M13m68k69K95j14L73m07L5J85
$$ 103 -122 323 -100 -280 79 -256 -377 -168 -136 -54 106 86 499 31 -238 57 -57 316 -91 -56 129
4961A29L5k80J49Q7o0K69k94j4K25l06J93k50J12M8qJ26K4k71l3P7K9K36l77Q5
$$ 129 164 -116 33 120 60 329 35 21 246 -60 133 -117 -5 43 35 161 185 -86 -119 -42 -13 223 -154 -69
4985f9k49J5J50L46m78L22o3P5j22l46M87ml77Q0M3j2J68k32K46K08k24n5K7l01
$$ -69 -318 -303 -153 193 -285 37 -26 49 -73 -419 68 64 -313 -233 -190 -202 -34 -266 -20 188 -36 -91 -64 -365
5009c65N65n03L03Nk00N9P7%R3k03l7K19p6j25L80n02M39j91m9K40k70K18pP4
$$ -365 200 -303 0 5 -195 -136 -59 -59 34 -169 -206 13 -63 -188 192 -310 129 -62 -111 129 -141 77 70 144
5033A44k12M02l92K63L1l41P8J55O8m4j86R0J35k07K14l23J89K81j59k85Q37m64
$$ 144 -68 334 -58 205 236 -105 -27 128 196 152 -34 56 191 -16 198 -125 64 345 186 -99 738 274
5055B74Qp5l67L16q82J083j26k12L61N53j100J121r87M54p96L93k43J83M6P3k81
$$ 274 282 207 -160 156 -726 357 231 19 380 933 -167 954 -33 421 -375 18 -225 -42 4 77 -204
5076b04J87n8j26l2L61l94M66m22J23j31j41K78K50k28L2l4p3K97Mj63l54K58
$$ -204 -17 -75 -201 -233 128 -266 200 -222 -99 -230 -371 -93 157 -71 -39 -73 -146 151 155 -8 -362 -104
5098a04k7K20O2r2j07n3M94m59J18K21j74J79m84K60j65J10J40j44J47K6o9K26
$$ -104 -131 89 151 59 -48 -101 393 -66 52 273 99 278 -206 54 -111 -1 139 -5 142 168 99 325
5120C25r0l60L02j8l28J88K32j43o5k4L8O8q5J07j37m54O58k05j89J30l7j20J84
$$ 325 235 -125 177 159 -169 19 251 108 43 19 57 125 40 147 10 -444 214 9 -180 -50 -87 -207 -23
5143b3o5J42k70J79j08J30l09K16q6L3QJ7j25k1Q3J07O0k33J76l73K61p8N81k53
$$ -23 -88 54 -216 -37 -145 -15 -324 -108 -194 -161 -153 -136 -261 -282 -199 -92 -32 -265 -89 -462 -201 -279 302 49
5167D9L3o6j96n67O81k73K94K29l94L94M51m28L97m93p08P79n25J32M13n7k25
$$ 49 82 16 -180 -747 -66 -339 -45 184 -210 184 635 207 604 111 -597 182 -343 -211 202 145 -80
5188h0J78J89m34K63NK21K96l09l64L42r3k43N83k81l0j52l30K66r5J91Lj44k15
$$ -80 98 287 -147 116 121 342 638 329 -35 307 214 -29 554 273 243 91 -239 27 -68 123 126 -18 -233
5211b33J89L73L4n00j1L5N3K59l98J92qk1k56P5M9k8O2J39j36J23R2l06J60jj22
$$ -233 -44 329 363 -137 -148 -113 -60 199 -199 -7 -15 -36 -292 -217 -168 -196 -134 5 -131 -8 84 -222 -62 -63 -185
5236a85J2n4J47J20O8k49J39K28l71J54j17L29n4k05k0j84L07P2R7j22N6l05K23
$$ -185 -173 -227 -80 40 108 -141 -2 226 -145 9 -108 221 167 -38 -58 -242 65 137 234 112 168 -137 86
5259H6l17L00j19k02N76L7l72kJPJ77l1J25k4k73J83k18L79k14k49L45Q3k54K12
$$ 86 -231 69 -50 -252 324 361 -11 -13 -12 -5 172 141 266 242 -31 152 -66 313 99 -150 195 278 24 236
5283B36k73J87J2l8k78K33k15K12k9l3j24k75K85J50o9J05j53l38O99l77p3L1
$$ 236 -37 150 162 124 -154 79 -136 76 47 14 -110 -385 -100 50 -19 86 -67 -405 294 -83 -156 -125
5305a25l8J64j94L2J52j20J83rl05K75J08n87Q06n47J47J75k13r9K24k01J44o4
$$ -125 -163 1 -193 -161 -9 -129 54 45 -260 15 123 -464 342 -205 -58 117 -96 -195 29 -172 -28 -92
5327i2M7K61k67K92j28k25L99j84L9p9j60P3J85j98K74j02l54O44k40k99K51j71
$$ -92 -45 216 -51 241 113 -112 287 103 142 63 -97 -24 161 -37 237 135 -219 425 185 -114 137 -34
5349c4P6J8J8K29l74j92M46l09J49R1m75N14J68k84Q8j04K1q5l34L10J18l24J74
$$ -34 42 60 78 307 -67 -259 187 -122 27 118 -357 157 325 41 129 25 46 -39 -373 -63 55 -269 -95
5372i5J06j58R3r1L52k03k27K32k40R4L80m71L78l48J17O2k66k2N82m62P8P8j30
$$ -95 11 -147 -54 -145 207 4 -223 9 -231 -137 243 -228 150 -198 -81 -19 -285 -307 275 -187 -109 -31 -161
5395a61K02J0p8L81l24p6J54k94N56m44p8N96l38k77K43m10L78K06n67M23N7j59
$$ -161 41 51 -27 354 30 -46 108 -186 370 -74 -152 444 106 -171 72 -338 40 246 -321 102 159 0
5417@K04n7qQ1k73K86j29J17M1l55J91r3m9j23K41nK24l86m0L90l34r0J11j67
$$ 0 204 147 139 220 -53 233 104 221 262 -93 98 5 -44 -167 74 69 293 -93 -133 257 -77 -167 -56 -223
5441b23M42l23j04K46m9J27k02j77O77l77l33O11k70m2r5N2j27k0j03L32j53p8
$$ -223 219 -104 -208 38 -11 116 -86 -263 414 37 -296 315 45 3 -92 -40 -167 -187 -290 42 -111 -189
5463a89K22k55J07O7r7P8J69k02J32k95R4K47j19q1J57K24p1j11K9j4K73j25j80
$$ -189 33 -222 -115 -48 -145 -67 102 -100 32 -263 -169 78 -41 -122 35 259 188 77 106 92 365 240 60
5486F0k36K05p0k7L66j50J33l1l20J45r7J28j34N7L4J94l53J19K57l59P7j30Q2
$$ 60 -176 29 -41 -68 298 148 281 250 -70 75 -22 106 -28 29 63 257 -96 23 280 -79 -2 -132 -50
5509e0M6L6k36k2L08m51K43K16K3Q0l09Q0kJ61l72J06K18j30O1n5k40J31J02j00
$$ -50 -4 32 -204 -226 82 -369 -126 90 113 193 -116 -36 -38 123 -249 -143 75 -55 6 -49 -289 -158 -56 -156
5533a56M6o5M1J36j20J32j10MJ22P5j64o7M7o5K0q2L00o0k30J08n2J70j7J70k50
$$ -156 -110 -175 -134 2 -118 14 -96 -92 30 105 -59 -126 -79 -144 -124 -206 94 34 -196 -88 -140 30 13 183 -67
5558f7K57j29K16n33M01J11k05K8k5N2j64J12k54L71q0L30k98P6j76nJ73j97J24
$$ -67 190 61 277 -256 145 256 51 79 54 106 -58 54 -200 171 91 421 123 199 23 18 191 -6 118
5581A18j80J9k27K83Kr9n6P9R9o0n5L4K41l39R3N5r5Q9k60L00J70n02K50k64K13
$$ 118 -62 -43 -270 13 15 -84 -140 -61 38 -22 -77 -43 198 -141 -48 7 -88 1 -259 41 211 -291 -41 -305 -92
5606i2no4J4j34L07j54L8j78K21k3J95K08o53L38o19P10l5l35k78Q37j35k70J47
$$ -92 -97 -161 -147 -281 26 -128 -90 -268 -47 -70 125 333 -320 18 -601 109 74 -261 -539 298 163 -107 40
5629D0l94O64K72q63K16P5O8K01k27j43K34j80K07J26l48M01k60k0Q9j00j97J58
$$ 40 -354 310 582 -281 -65 10 78 279 52 -91 143 -37 170 296 -52 349 89 69 158 58 -139 19
5651A9l3M39m21n5J80o8k68L92l11P8l5j3K30j37k87P9K95l9j39R9NNl1O4O9q9
$$ 19 -14 425 4 -51 129 61 -207 185 -126 -48 -83 -96 134 -3 -290 -211 84 45 -94 5 10 15 -16 48 117 28
5677B8k7R8k27J26j16k17N1M1J77J50J08k16m7n9J13j45r7J14N1J22k3K69k36
$$ 28 1 99 -128 -2 -118 -335 -284 -243 -66 84 192 -24 -71 -130 -17 -162 -259 -145 -94 28 5 274 38
5700C8k38M10j92j46J42j51L93l68K13J77O1k88j17L92k07M9M2j80J12k10o5J74
$$ 38 -200 210 18 -128 14 -137 256 -112 101 278 339 51 -66 326 119 168 210 30 142 -68 -133 41
5722D1r1L12m16L97k38J46j39K3K34l11N2%l3J38j54j23K74j87J22n2J06l5j22
$$ 41 -50 262 -154 243 5 151 12 35 269 -42 10 10 -23 115 -39 -162 112 -75 47 -5 101 66 -56
5745e6M0r2kKn1r5N6M32n42M15k00m9J72j45k83M20M4m41L19j87M02j95k27J24
$$ -56 -16 -108 -110 -108 -159 -254 -198 234 -308 107 -93 -142 30 -115 -398 22 66 -375 -56 -243 159 -36 -263 -139
5769a39l8K5L64l06J69ok9J38j28q0O0j20J77l6k32L63j23j06M11m71K48p4k02
$$ -139 -177 -152 212 -94 75 69 40 178 50 -30 30 -90 87 51 -181 182 59 -47 364 -107 141 67 -135
5792a35K74j0L9J06n96L86P5j89j04K26k7o6J06k8K67j82j62j42M50k29j41j84
$$ -135 139 129 168 274 -322 64 139 -50 -154 72 45 -21 85 57 324 142 -20 -162 288 59 -82 -266
5814b66L95J04n56L91Q8rj91l6J68l09L17N7m08K71K13j25j61QJ16K3o4r9K39
$$ -266 129 233 -323 68 156 147 -44 -80 88 -221 96 153 -255 16 229 104 -57 -49 67 90 26 -73 166
5837A66l56J45J68J9K9l44J96J90j88j46K11J4q3P2J24j04k51J36j77M59k21r0
$$ 166 -190 -45 123 142 171 -173 23 213 25 -121 90 104 21 93 217 113 -138 -2 -179 280 59 -31
5859c1j02K48l04L49j63n0R5Q7l41L36k78K70L12o23N38k63l7J54j03J28P2l84
$$ -31 -133 115 -189 160 -3 -53 42 129 -212 124 -154 116 428 -195 343 80 43 197 94 222 294 -90
5881i0L91j39k86L29j56j06J78l17J09J17n7O6n1r2L35l31k90O10l62J5J4j5%
$$ -90 301 162 -124 205 49 -57 121 -196 -87 30 -27 39 -12 -104 231 -100 -390 220 -142 -127 -113 -128 -128
5904a28K76l98M29l24J62j01l7Q9O4r7Q4OJ67k60j74J83J93l18L75k54qJ75j87
$$ -128 148 -250 179 -145 17 -84 -121 -32 32 -65 19 25 192 -68 -242 -59 134 -184 191 -63 -71 104 -83
5927h3J3Q3j97L17k92P7K82k14n3O5P0K33j65k29K2R0J85J61l03MP7j78K54M8
$$ -83 -70 13 -184 133 -159 -82 200 -14 -67 -2 68 301 136 -93 -71 19 204 365 62 66 143 -35 219 267
5951B67l46M13m67L96Q8n69J06J95r8o32K69O79j67o80L09P0J02j66k26Q1K66
$$ 267 -79 334 -133 263 351 -218 -112 83 -15 -647 -378 301 134 -546 -237 -167 -65 -231 -457 -376 -110
5972a10m04L24J47q01K46M47K22L92m74l5j28j07M52l75K55k62L19k19R3k36K33
$$ -110 -514 -190 -43 -844 -598 -151 71 463 -11 -46 -174 -281 171 -204 51 -211 108 -111 -18 -254 -21
5993b1k8k98N08k0j57k19K99K0j16j51J76Q0lJ08n5Q8o6j17P4M4k17N7k72L27
$$ -21 -49 -347 161 141 -16 -235 64 84 -32 -183 -7 73 70 178 123 211 145 28 102 146 -71 -14 -286 41
6017D1L27n72M70l15K23QJ69l82L80j29k05N4l9j50J25J42m8p5K72k56l5k4J36
$$ 41 368 -204 266 -49 174 182 351 -31 349 220 15 69 30 -120 5 147 99 24 296 40 5 -19 117
6040A17r2k28M6J02L36m88J00J17j35K34j81J14j92L7J72q7J06j99J97r9k56K63
$$ 117 25 -203 -157 -55 281 -207 -107 10 -125 109 -72 42 -150 -113 59 -28 78 -121 76 -23 -279 -16
6062a6j83J30j15J28q3O6j4J94R1j57j76K11j2j82J96K4j92R3j77J2J21K2J07
$$ -16 -199 -69 -184 -56 -139 -73 -87 107 198 41 -135 76 64 -118 78 102 -90 3 -174 -162 -41 -19 88
6085H8j03m3J45j42O5K58l78R1L9L33l45K67J29m74K09J76k43j66J07K27l67K93
$$ 88 -15 -58 87 -55 10 268 -110 -19 20 353 8 275 404 -70 139 315 72 -94 13 240 -127 166
6107A66j98K04o4j69J15M9p7k24K73l17J85j78K72m19K65J02o6j52R8j43L26j48
$$ 166 -32 172 108 -61 54 103 26 -198 75 -242 -57 -235 37 -382 -117 -15 -81 -233 -135 -278 48 -100
6129a00L4j18J25k03R0J7J56K4j38k9Q1j94M27k14PQ2l18L04q2J36k05J57nk82
$$ -100 -66 -184 -59 -262 -172 -155 1 25 -113 -142 -61 -255 172 -42 -35 47 -271 33 -49 87 -118 39 34 -248
6153b48j4K70L8j10J52j74O4J46j57J93l7n2j90K22j24l7KJ81j08k66J8J60M6
$$ -248 -262 8 46 -64 88 -86 -22 124 -33 160 123 71 -119 103 -21 -58 -56 125 17 -249 -231 -71 -25
6176b5K33k34m3o6J94j6J87j43J06l4k75N4K52l48J29N1k13K84j63J12j79K10
$$ -25 208 -26 -69 -135 59 43 230 87 193 159 -116 -62 190 -158 -29 22 -191 93 -70 42 -137 73
6198G3kN4k7k67K70k88j48K63k11J03K68J33l01M0n3PQ9n9L86j50k21k6o7K12
$$ 73 71 125 98 -169 101 -187 -335 -72 -283 -180 88 221 -80 -40 -93 -86 3 -56 330 180 -41 -67 -134 78
6222G8pj92N9k2nK91k36o3Q8j59K63L40k86Pk60p7J31O7k89J45Q0K22J3k23K66
$$ 78 71 -121 -62 -84 -89 202 -34 -97 -9 -168 95 435 149 156 -104 -181 -50 17 -272 -127 -47 175 188 -35 231
6247B31k38L66l01p1mK93j16K22l65j18L30k65P4j58P9J99j21m2P8k19J33K5r9
$$ 231 -7 359 58 -13 -17 276 160 382 17 -101 229 -36 38 -120 -41 158 37 -5 73 -146 -13 12 -87
6270h7o0M9l3L26j66l05K20j09K26j02n3K50r2j41P3j20j7K37j91K55k5p7J38
$$ -87 -147 -98 -131 195 29 -276 -56 -165 61 -41 -94 156 64 -77 -4 -124 -141 96 -95 160 135 58 196
6293A96m57M77l24JK07j68k21K55k53K84K14j82j1O7q0K26j69M2J15J04n47P03
$$ 196 -261 216 -108 -107 100 -68 -289 -34 -287 -3 211 29 18 85 5 231 62 104 219 323 -224 479
6315D79o34L64k89K8L44l3j39L1j99J89j98r7L14j16J35l21o7J03L17j64n6J25
$$ 479 -155 209 -80 -52 292 259 120 151 -48 141 -57 -154 160 44 179 -142 -209 -106 211 47 -9 116
6337A16j76J56l80J87M35n42J43Q3J06o5k56K11J55j95K85n07K44J91k75j68L65
$$ 116 -60 96 -284 -97 338 -204 -61 22 128 63 -193 18 173 -22 263 -244 0 191 -84 -252 113
6358A13j99J46l56J33J14M13k97j64J30m52K89l8n3L02J7r4O1l7M6l00K70Q7l02
$$ 113 -86 60 -296 -163 -49 364 67 -97 33 -419 -130 -168 -221 81 98 4 65 28 74 -226 44 131 -171
6381a71K37r3j28K51k83M58m26K88L05l86K9k6K5Q3k68K0P2k8J66j05N6J4q0j20
$$ -171 66 -27 -155 96 -187 271 -155 133 438 52 81 55 80 163 -105 -85 -13 -41 125 20 76 90 10 -110
6405a10J74J33l19K22L9m05L68j87K31J2k30K9J72l13Rk2K01J46l39P9j97L01
$$ -110 64 197 -122 100 139 -266 102 -85 146 158 -72 -43 129 -184 -175 -197 4 150 -189 -110 -307 -6
6427fO7m99K50J63L4j5j51p1K17k07k8L08Rk06J52j22J78j25j54J52Q4o5L6r6
$$ -6 61 -438 -188 -25 9 -6 -157 -228 -11 -218 -246 62 71 -135 17 -105 73 -52 -206 -54 30 -35 1 -95
6451i5K28j21j99K22k50K00o7J22P5j6m42P10k51j49M3m5K08j53q9M56k38J9L5
$$ -95 133 12 -187 35 -215 -15 -82 40 115 99 -343 367 116 -33 10 -35 173 20 -69 387 149 168 203
6474B03l2k68O4r8L63l22J36o8K85k76m9L21p3k35q4R6J31n2R2j12k53M15m35
$$ 203 171 -97 -33 -131 232 -90 46 -22 263 -13 -62 259 186 -49 -133 -37 94 42 134 22 -231 184 -251
6497b51J56j88M41j16k49m8J72k36L27j44L43k16j55J06m42N22l44L26J04j165
$$ -251 -95 -283 158 42 -207 -255 -83 -319 8 -136 207 -9 -164 -58 -500 22 -322 4 108 -1057
6517a057L75P07k94K95k02J46j9Nl3Q6n4%Q0J43o8j79J38j13J45q6L0l1m5j09
$$ -1057 -682 25 -269 26 -176 -30 -49 -44 -77 9 -45 -45 35 178 110 -69 69 -44 101 15 45 14 -31 -140
6541a40l0J79k04L54Kj34p5J68J6L4j24r4J15J43j04k29J31P4k8k51J16K45l41
$$ -140 -170 9 -195 159 161 27 -48 120 136 170 46 -48 67 210 106 -123 8 82 54 -197 -81 164 -177
6564a77L41j55M4Q3k20J22r0J90j21J8J82k63J45j13k27J79k52R0L00k63J66j01
$$ -177 164 9 53 136 -84 38 -52 138 17 35 217 -46 99 -14 -241 -62 -314 -224 76 -187 -21 -122
6586a22J02k80L15j81J20L12n08ML47p1l37J46K17k36J88j97Q2O7P5Q7k02K23
$$ -122 -20 -300 15 -166 -46 266 -242 -238 109 38 -299 -153 64 -172 16 -181 -99 -32 43 130 -72 151
6608A51j90k8K18kj7l3q5K89j77K90m09J24n7Q9L7k83J33l5K53k15J35M0q9k30
$$ 151 -39 -67 151 149 132 99 14 303 126 416 7 131 74 163 200 -83 50 15 268 53 188 228 139 -91
6632i1n1k1K95j06j9j03J48k39J41K7n0j08J44J48J89r8k89L84n24L34m05K44
$$ -91 -142 -163 132 26 7 -96 52 -187 -46 -19 -69 -177 -33 115 304 206 -83 301 -223 111 -294 -50
6654e0j34j45P61p24Q7K38l91J23n01K20Q49r8l61q9K23r3j51L73j65K08j70j35
$$ -50 -184 -329 432 -292 -205 33 -358 -235 -736 -516 333 235 -126 -215 8 -85 -236 137 -28 180 10 -125
6676a25L00K03m79p75M04J45K66J36pj09O0M2j02l1K8m0K21j50J88k39J39j28
$$ -125 175 378 -101 -876 -472 -327 -61 75 68 -41 19 61 -41 -72 -44 -84 137 -13 175 -64 75 -53
6698e3j51M22k41M0K29k16r2K09j97J16j73J96NK30m39J08J01j18Q0j72J48J95
$$ -53 -204 218 -23 17 246 30 -62 147 -50 66 -107 89 94 324 -115 -7 94 -24 56 -116 32 227
6720B27m06J26k12K42K1p1J09k93L63J94j85L9m3l14j8L21m6k07j8L56k65oPL9
$$ 227 -179 -53 -265 -23 -2 -73 36 -257 106 300 115 154 111 -203 -221 100 54 -153 -171 185 -80 -86 -79 -40
6744d0j5K29l07J75k28M10j90jJ61l31K20l18J66K26j15j09P5p5L85k49ROj72
$$ -40 -55 174 -133 42 -186 224 34 33 194 -137 83 -235 -69 157 42 -67 8 -67 318 69 78 84 -88
6767h8R5k14K2L55Q8l20K65l17K08k01mN33j17l37J95j79J03Q5k62j10K06m1P2
$$ -88 7 -207 -185 170 258 -62 203 -114 94 -107 -111 422 305 -32 163 -16 87 172 -90 -200 6 -35 37
6790C7k48M84o5l79J27M6j2J37j50j45J20j51M85m38L4j78J88P9k80L67m0J46
$$ 37 -211 273 208 -171 -44 2 -10 127 -23 -168 -48 -199 286 -152 -118 -296 -108 -29 -309 58 18 164
6812A64j57J81n00K40K71l11j36K99m67Q61o73K30J21j60j28R8J0k1J70j64K35
$$ 164 7 188 -312 -72 199 -112 -248 51 -416 445 -228 2 123 -37 -165 -67 -57 -78 92 -72 163
6833A63l33M49n3l94J63k5K4J11%j34L82l11l6m4k02L54Nk39N52m52L63M9m03
$$ 163 -170 279 226 -168 -5 -30 -6 105 105 -29 353 42 6 -38 -240 114 119 -120 432 -20 343 392 -11
6856a1m59L79K55j84j33M32j10o30M87j74N7Q3jk73J40j46K57J05l32M09l59J57
$$ -11 -470 -91 164 -20 -153 279 169 -461 26 -148 -91 -8 -9 -282 -142 -288 -31 74 -258 151 -208 -51
6878e1M4M8P8o1m3o8J1o0K1pj3J38J68k03j35k14K96l2Q2L8k19J96j59J96j5k9
$$ -51 -7 41 119 58 15 -53 -42 -102 -81 -88 -101 37 205 2 -133 -347 -51 -83 -1 37 -182 14 -145 51 36 7
6904Gj93K59m18K26J30J27j04n9l2M1O5l50K78j78L24K86o66L74k32L04j10p9
$$ 7 -186 73 -345 -119 11 138 34 -25 -57 -16 49 -301 -23 -201 123 409 -257 117 -115 189 79 0
6926@N2K81n54K33K09k58L77m02J33J17l27J17J9J20j44j12P1K80l44R6J20J88
$$ 0 52 333 -221 12 221 -37 340 -62 71 188 -139 -22 -3 117 -27 -139 -68 212 -132 -36 84 272
6948B72k27K4j36P9k60L23j42j08J65j60K86j92l6J20l0r7M7J53j05j02oK61k05
$$ 272 45 69 -67 12 -248 75 -67 -175 -10 -170 116 -76 -112 8 -22 -119 -72 81 -24 -126 -132 129 -76
6971g6J6K21l12J29J33j98j9j32K21J09J35j83K37k96O1P1k64L64k86j2L77k74
$$ -76 -60 161 -151 -22 111 -87 -106 -238 -17 92 227 44 281 -15 46 117 -147 217 -69 -81 296 22
6993B2O3n3j62J89p8j35L00rk91K74j6p5n1j69L03R2L9l38k07J24K39l6k33L25
$$ 22 85 32 -130 59 -19 -154 146 137 -154 120 104 29 -22 -191 112 204 243 -95 -302 -178 61 25 -208 117
7017A17J5n4j14j75K13k03L25r8J69j55k34q9J19P3Q1k3q7p6N7J79p9O5J00k00
$$ 117 132 78 -36 -211 2 -201 124 26 195 40 -194 -283 -164 -91 -10 -33 -120 -196 -139 40 -39 26 126 -74
7041g4n7K87n08K83j08M32k25J14o1k25O0J3L14l51M9J86j18rj33J47J75m62L81
$$ -74 -131 156 -352 -69 -177 255 30 144 83 -142 -82 -69 245 -106 -57 129 11 2 -131 16 191 -271 110
7064A10k97J48J06K4k6j96K52Lo1M3n0o8L1J0p9J41k26J42j9J17Q5q9j14J7O0
$$ 110 -187 -39 67 91 65 -131 121 124 63 106 56 -12 19 29 -50 91 -135 7 -12 105 190 101 -13 4 64
7089F4j5p7j66J30l1j89M00N4m08L11j1M7k76J96k18P9J33k1j3K3ORl13K05J47
$$ 64 49 -28 -194 -64 -95 -284 116 170 -238 73 62 109 -167 29 -189 -110 23 2 -11 12 18 27 -286 -81 66
7114F6j11J35k17j43K59j13l7J59j85K56o8P8r7J64j50j26Q5j27J33j60L35o9
$$ 66 -45 90 -127 -270 -11 -124 -161 -2 -187 69 1 79 -18 146 -4 -130 -45 -172 -39 -199 136 67
7136F7q1nJ51K12l07l00L41k2m1m6N5%O1J0L7r0Ml21K35M5K52l25n8L06k85L94
$$ 67 -14 -19 132 344 37 -263 78 56 15 -31 24 24 85 95 132 42 46 -275 -40 5 257 -68 -126 180 -105 289
7162B89m03J89jJ78k84l7J51O6N6k59P4Q7k48K28j36M3o0K7l00K58n6N31m63j22
$$ 289 -114 75 74 252 -32 -69 82 148 204 -55 19 106 -142 86 -50 -7 -67 -40 -340 -82 -138 393 -70 -192
7186a92L92k63k40J36J52J90j46j04J76j2j80K37k14L2Q4j42q4J19j53J19N8N5
$$ -192 200 -63 -303 -167 -15 175 29 -75 101 89 -91 146 -68 -36 48 -94 -178 -59 -212 -93 -35 20
7208B0L15m25K99J1j46j25M5K13k9k06j25K51P3q6r9j8J38J4j15M3M4J30l63K64
$$ 20 335 -90 209 220 74 -51 -6 207 178 -28 -153 98 171 85 -14 -32 106 120 5 48 92 222 -141 123
7232A23R1j77Q1k48J06K59k24m24K27m4J96J34M4j16k9l1j45J60j17OK9J05J83
$$ 123 214 37 118 -130 -24 235 11 -413 -186 -230 -34 100 144 28 -1 -32 -177 -17 -134 -128 -99 6 189
7255A89k52P8m3P7Rj08j91K04k1j13J32K28N6l13k15L74j27J25o5K6J51m93K16
$$ 189 -63 15 -28 49 58 -50 -241 -37 -58 -171 -39 189 245 -68 -283 91 -36 89 24 50 201 -292 -76
7278g6J20k08J08j23P6O2r4N3J61k06J55rj33J95j76K09j2k51Q4J11Rj9J38k23
$$ -76 44 -164 -56 -179 -103 -41 -135 -82 79 -127 28 19 -114 81 -95 114 102 -149 -65 46 55 36 174 -49
7302d9n7l6J99k33O4j78K75k11J13j03R9J81l84M13n6MPJ23l07J62j30JJ46k79
$$ -49 -106 -142 57 -176 -112 -290 -15 -226 -113 -216 -117 64 -320 93 37 41 48 171 -136 26 -104 -103 43 -236
7326b36M16k63n4K38j26L10m11J79j46Q7l92K25L0l0J50k0n3K34k3j18R2j43K63
$$ -236 180 -83 -137 101 -25 285 -126 53 -93 -6 -398 -173 -143 -173 -23 -43 -96 138 115 -3 89 -54 209
7349B09k91J54K4q2J17j76k41M34k81O7P1o8J83k34K8K44N1m37K52J19k07j07
$$ 209 -82 72 96 14 131 -45 -286 148 -133 -66 5 -63 120 -114 -86 158 209 -228 24 143 -64 -171
7371a71J60M1L2l14K99j48K33k13o3J49J56j75p9P4O1q6QP4P7K2q1j71K40j38
$$ -171 -11 30 62 -252 47 -101 132 -81 -144 5 161 -14 -93 -19 42 -44 -36 38 115 137 56 -115 125 -13
7395a3l08N80r3p9n1j60n4K87k82M4L8o0rM34k88j52L35l34J39p3O1p9M0o9J9
$$ -13 -321 259 166 87 36 -124 -178 109 -173 -129 -91 -151 -160 274 -14 -166 169 -165 -26 -99 -38 -117 -77 -146 -127
7420a27N8q5r2L70n1j79J94K5k00L16o36M41j07K61l33L83l52L28k51m8L10l83
$$ -127 -69 -154 -246 124 73 -106 88 113 -87 229 -407 34 -73 188 -145 238 -114 214 -37 -85 225 -158
7442a58K24%K7j09J41L4j37P2k61K93j42J78j08p7K69k55r6J10j06j3J29k83K50
$$ -158 66 66 93 -16 125 159 22 94 -167 126 -16 162 54 -23 246 -9 -105 5 -101 -114 15 -268 -18
7465a8R6l28L40k06J34J30m41M29q2p0kJ25J13j91Q1j73K6J39n6l8J38l14K84
$$ -18 78 -250 90 -116 18 148 -293 136 54 -16 -18 107 220 29 110 -63 -37 102 46 8 146 -168 116
7488A16k94K54m37L30k34R7J51RJ05j55N1J88j93l34L58J25j56J87k08j2n0P0
$$ 116 -178 76 -361 -31 -265 -168 -17 -8 97 -58 -7 181 -12 -346 12 137 -19 168 -40 -52 -102 -32
7510c2l1k1K78o2j07J42p6k42m6L83p5k65R6p6K07P5j07l05L96J56k6k50O9K5
$$ -32 -63 -84 194 132 25 167 91 -151 -197 186 111 -154 -58 -134 73 148 41 -264 132 288 262 12 81 106
7534A06p3j45l8K52n8LK7j0l27J97N8n7o7j4J92j10L4J20j05J08k34K37j08j24
$$ 106 33 -112 -150 102 44 47 74 64 -263 -66 -8 -65 -132 -146 46 -64 -30 90 -15 93 -141 96 -12 -136
7558a36K14j03j20o1K02k84K93n1l1J78L9l28n3N1L83j93j18K32k95J64L1l1K1
$$ -136 78 -25 -145 -206 -4 -288 5 -46 -77 101 140 -188 -241 -190 193 0 -118 114 -181 -17 14 -17 4
7581DM41k31k98K36k82K09K59j71m8P8m5k9j13J3l43P74j64l41m29O63k73K32
$$ 4 445 214 -84 152 -130 79 338 167 119 197 152 123 10 23 -320 454 290 -51 -480 183 -90 142
7603A42m84L82K84l58N13k50lp0m8q36J546o12j77Q4n99N20N15n26j38K56n63
$$ 142 -342 40 324 -34 479 229 226 156 108 -728 818 206 29 113 -486 34 549 23 -115 141 -422
7624d22J367r74K91l41j00Q2j97M77n22M89K0kj46k01N77o20N10l42j05k37J59
$$ -422 945 -29 262 -79 -179 -97 -294 183 -339 150 170 168 22 -179 398 -222 288 -54 -159 -396 -237
7645b37J84J64J41J84l30k60j0J06K73j27l3K64p15L59J07K6k34j8j49P68l15
$$ -237 -53 111 252 436 106 -154 -164 -58 215 88 55 319 -396 -37 70 96 -138 -156 -305 463 148
7666A48l06q3K41J12l14J47L3P8j24J48j44L52m40L17k94J0K77j4j44m93L35J26
$$ 148 -158 -241 0 112 -202 -55 -22 56 -68 80 -64 288 -152 165 -129 -119 158 144 0 -493 -158 -32
7688c2P2j70L33l3k88J28kL3M4k47K70j33L2k50M31j25k2J40j7l47K03J0r7j57
$$ -32 40 -130 203 170 -118 10 8 41 85 -162 108 -25 7 -243 188 63 41 181 164 -183 20 30 -67 -224
7712b24L19J80k19j77J21J50k04M7k56J94P5m5l5K11j53K11j91J76k54J69j96
$$ -224 95 275 56 -121 0 150 -54 -7 -263 -69 6 -39 -74 137 -16 195 4 180 -74 95 -101
7733a01L9J2J46l6K4k4j06J79j90K05K7kJ14k44J66j15l3r5L67j61j81R7j64J
$$ -101 -62 -50 96 60 84 60 -46 133 -57 148 175 173 287 43 209 94 61 -34 333 172 -9 88 -76 -75
7757g5K47k41R3K44p3j66J26J84k63q5p5j73K52R4k70K62j36j85L22j7J42k07
$$ -75 172 -69 24 268 195 29 155 339 76 -9 -84 -257 -5 89 -181 81 -55 -240 82 65 207 0
7779@j46K85j50n3N7p0K74l62j25M05p8q0j9q2R4K37j37n8j22L45l28J58k30K25
$$ 0 -146 139 -11 -64 -7 -77 197 -165 -290 115 37 -43 -62 -144 -50 187 50 -8 -130 215 -113 45 -185 40
7803D0j51M2J84j14J94m36J54J79k02J50O3j74j06J62J47Np3R6j46k1J71m8o1
$$ 40 -111 -69 115 1 195 -241 -87 92 -110 40 103 -71 -177 -15 132 137 64 160 14 -7 164 116 55
7826E5J98j46q8r1JK28k7r2j4j50rM4J2qo4J57j7R8j53J62rK8j48l2M07l93o8
$$ 55 253 107 19 -72 -71 157 130 38 24 -126 -135 -91 -79 -87 -151 6 -11 87 -66 96 87 115 -33 -65 342 -51 -119
7853a19m0L28k38j81j80K4J70QL89K41l43m45K43M72j44n62O98j2J92j20p4o8
$$ -119 -159 169 -69 -250 -430 -406 -236 -228 161 402 59 -386 -143 329 185 -377 321 309 501 381 307 239
7875B39j66J17k06K53l08O1K52n9k73o1K78q0q4J03K6k02J41n4L63Ll78J23j81
$$ 239 73 190 -16 237 -71 -10 242 183 -90 -151 127 47 -37 66 92 -110 31 -23 340 343 -35 88 -93
7898i3K92L2k92K95j36J09j30k35R4J50p5j48K82m04J75j01m3K11K85k90J85r
$$ -93 199 231 -61 234 98 207 77 -158 -64 86 11 -137 145 -259 -84 -185 -228 -17 268 -22 163 154
7920A54n8k18K15j01k34J36P7n4K3J08j06K07k53J90k74lO2l8L30k92j20K46J21
$$ 154 96 -122 93 -8 -242 -106 -29 -83 -60 48 -58 149 -104 86 -188 -191 -129 -167 163 -129 -249 -3 118
7943A18m55J38L63j78k75L05N1Kl16J06Q2L0j35L08j92K28k47K10K7J2j56o5R5
$$ 118 -337 -199 164 -14 -289 16 67 69 -247 -141 -59 -29 -164 144 -48 180 -67 143 170 182 26 -39 56
7966E6j60J92J78o3j73J59n4L9o8m1j12K97k76L80j60j23nk8n7On2O2K3M7R2O6
$$ 56 -104 88 266 203 30 189 135 174 106 65 -47 250 -26 354 194 71 66 38 -19 -13 -65 -3 20 67 159 225
7992B25j89n59M98k1nN6k77N09l12R7l6j9K92j43m27J50L48m49M21l55K04K52
$$ 225 36 -523 -25 -46 -51 5 -272 237 -75 22 -14 -33 259 116 -311 -161 187 -262 159 -196 8 260
8014B60j76j18l1M8m1l08J13L01k92L40l0k14K04oj13J17J28n1n6r3M5M5k51L11
$$ 260 84 -34 -65 -17 -58 -366 -253 48 -244 96 66 -148 56 50 -63 54 182 131 75 -18 27 72 -179 132
8038A32j17J1J89k46P4K3m7NK9k97L51j25K85l13r9M92k63j82j9J91k00L37m4
$$ 132 15 26 215 -31 43 66 19 24 53 -244 107 -18 267 -46 -145 347 84 -98 -117 74 -126 211 167
8061A67R8n04K26K98m56J90L4N5o5Q8k12P7J20k55K34k08L46k36k1m8j28J85J15
$$ 167 265 -239 -13 285 -171 19 53 108 43 131 -81 -4 116 -139 95 -113 233 -3 -24 -72 -200 -15 100
8084A00m87M42Q7j37q2K21l5j89l9J26J05l65L82q1L1k9j9o6M2P7k84o8J60J1
$$ 100 -387 55 142 5 -77 144 109 -80 -119 7 112 -253 129 48 79 50 31 -35 7 84 -200 -268 -108 -97
8108i7K51r5l6M8j34J49M8l25L05J32j20J42M9m5k58N5k3O4j25KQ0N9p8j1J58
$$ -97 154 59 23 71 -63 86 134 -191 114 246 126 268 317 272 14 69 46 110 -15 -13 67 126 48 37 195
8133A95r4j27j24L2K44m75L08J30j99O1Q3PJ16k74P7J92r7j46K82j65Rm94K31
$$ 195 101 -26 -150 -118 126 -349 -41 89 -110 -49 34 41 157 -117 -40 152 55 -91 191 26 35 -459 -228
8156b28J63PJ6j08LJ36L3P9j78L2R3qq7R2k4k6r0j61K37j65M00j73J42k75K13
$$ -228 -65 -58 -42 -150 -147 -11 22 101 -77 -45 48 40 -47 45 21 -5 -95 -256 -19 -184 216 43 185 -90 123
8181A23l25K47O5k30R1n2K46p8Q9j46
$$ 123 -202 45 110 -120 -29 -81 165 87 176 30
8191C0
$$ Imaginary data points
##PAGE= N=2
##DATA TABLE= (X++(I..I)), XYDATA
0@%%%%%%%%%Kj0J6j6K4l2M0m9N7p2Q8j05J29j53J78k11K50k90L32l87M46n10N80
$$ 0 0 0 0 0 0 0 0 0 0 2 -8 8 -8 16 -16 24 -25 32 -40 48 -57 72 -81 97 -114 136 -154 178 -209 237 -273 307
32C07o57P45q41R48j066J195j336J491j660J845k047K268k510K773l061L375l718
$$ 307 -350 395 -446 502 -564 631 -705 786 -874 971 -1076 1192 -1318 1455 -1606 1769 -1949
49a949M097m513M969n476O042o674P386q193R119j0194J1455j2959J4794j7092
$$ -1949 2148 -2365 2604 -2872 3170 -3504 3882 -4311 4808 -5386 6069 -6890 7904 -9188
63i188K0061k4057K9750l8553N4022q8779K97104l0657n19581N14219l15k73206
$$ -9188 10873 -13184 16566 -21987 32035 -56744 240360 209703 -309878 204341 204026 -69180
75f9180R8882P0168n162o392j19531J39911J8860j49517K4028Q6633n4375q8600
$$ -69180 29702 99870 94708 88316 -31215 108696 127556 -21961 2067 88700 34325 -54275
87e4275P5491O8252j38409L1901Q2635q7323j477K411l6937R2726j07641m1115
$$ -54275 21216 89468 -48941 -17040 65595 -21728 -23205 -20794 -57731 34995 -72646 -113761
99a13761J68129q4357o3547Q4197k2150J9783m2680o0652J45429m5436j31028
$$ -113761 54368 -29989 -93536 -9339 -31489 -11706 -54386 -115038 30391 -15045 -146073
110a46073J52050K1450j05484M6743O3209n3128m2651Q2448k571r8588P9272O5982
$$ -146073 5977 27427 -78057 -31314 31895 -21233 -63884 18564 15993 -82595 -3323 62659
122F2659j07712K0694P0853j4729l5540l5587Q6276O35j22383P6402P7179j10474
$$ 62659 -45053 -24359 46494 31765 -3775 -39362 46914 47549 -74834 1568 78747 -31727
134c1727J5311P8037n9447j0100L8905k4463l0420M0787j482n1131N3765J2514
$$ -31727 -16416 61621 2174 -7926 30979 6516 -23904 16883 15401 -35730 18035 30549
146C0549n6234M1947J4504n5082L1427O275k6734J8096k1490L2123K1484o6617
$$ 30549 -25685 16262 30766 -24316 7111 13386 -13348 4748 -16742 15381 36865 -29752
158b9752L0805O6210o4534m7897P6574K4282q6411n255J01751l7814o5825O7724
$$ -29752 1053 67263 2729 -45168 31406 55688 -30723 -35978 65773 27959 -37866 29858
170B9858O797k8914n865o352K5312j2412k9055L2837l083j6235K9978l6127O568
$$ 29858 36655 7741 1876 -4476 20836 8424 -20631 12206 9123 -7112 22866 -13261 -6693
183f693L4341n5307j343M5158k9136k7574L9900Q924l2843j568L3062j1209l3884
$$ -6693 27648 -27659 -29002 16156 -12980 -40554 -654 8270 -24573 -26141 6921 -4288 -38172
196c8172J8803J3106o911k1966J4282L8030l3952j4251M6662j6784k6667L6222
$$ -38172 -19369 -6263 -13174 -35140 -20858 17172 -16780 -31031 15631 -1153 -27820 8402
208H402k0556o951L7269k5236p778L4911K631k8992K883K9071n669l7441J4881
$$ 8402 -12154 -19105 18164 -7072 -14850 20061 22692 -6300 -3417 25654 19985 -17456 -2575
221b575M0560k9194k3660L4315K4179m2184j3104M9878j7131m0185K4833K0968
$$ -2575 37985 8791 -14869 19446 43625 1441 -11663 38215 21084 -19101 5732 26700
233B6700k7591k798J5642K918p840j1503J1412j037j0470n546M928P114o848m447
$$ 26700 -891 -3689 11953 14871 7031 -4472 6940 5903 -4567 -10113 -5185 1929 -4919 -9366
247i366O164R946j1204q227N329J0297j3108j5631K5173M409k1160N278K2651
$$ -9366 -3202 6744 -4460 -12687 -7358 2939 -10169 -25800 -627 3782 -17378 -12100 10551
260A0551j2596j1437J1803j656j766l904N60O466M335p501M837O570q827Q446
$$ 10551 -2045 -13482 -1679 -3335 -5101 -9005 -8445 -1979 2356 -5145 -308 6262 -2565 5881
274E881j0862m593K3382j4246k1578L6012N983l8852K1078K0359k1481j0412J3118
$$ 5881 -4981 -9574 13808 -438 -22016 13996 19979 -18873 2205 22564 1083 -9329 3789
287C789O395j1195o850R681J4442j4307r006J6535N926j8570n524J7366l148p363
$$ 3789 10184 -1011 -7861 1820 16262 1955 -7051 9484 15410 -3160 -8684 8682 5534 -1829
301a829o185J4188J2590k5601l168L1070j3121k8808K6025K794j4702M339l694
$$ -1829 -8014 6174 18764 -6837 -10005 21065 7944 -20864 5161 7955 -6747 -2408 -6102
314f102J3512M050k6346R692K8167l1958j2002L1775n294j9084M813J8653n848
$$ -6102 7410 11460 -14886 -5194 22973 -8985 -20987 10788 5494 -13590 -8777 9876 4028
327D028j2554N407R970p085r199N425L823K802r783J433J2737k243j0667j96J6520
$$ 4028 -8526 -3119 6851 -234 -9433 -4008 -185 2617 -7166 -5733 7004 4761 -5906 -6102 10418
342A0418r716j6669J6086J1050k2788O189J6821j6033N350K363r199Q461O32j4483
$$ 10418 702 -15967 119 11169 -11619 -5430 11391 -4642 708 3071 -6128 2333 2965 -11518
356a1518Q373J1930j3304j400R720N274j4913m41J5556r609q215Q273M128n805
$$ -11518 -3145 8785 -4519 -5919 3801 9075 -5838 -6279 9277 -332 -8547 -274 3854 -1951
370a951L947r14L17N933o319n327P386O664j6686K899J6404p925o523N358O644
$$ -1951 1996 1082 1399 7332 1013 -4314 3072 9736 -6950 -4051 12353 4428 -2095 3263 9907
385I907l899o412k918J1557q62j4161M288J3926k139k1898J4763J5275k3189o875
$$ 9907 6008 -404 -3322 8235 7373 -6788 -2500 11426 9287 -12611 2152 17427 -5762 -12637
399a2637J8449k16j6010K222J2190k85j5902P963R462j2428P65l147O478M016
$$ -12637 5812 5596 -10414 -8192 3998 3713 -12189 -4226 5236 -7192 -6427 -9574 -3096 920
413I20j7843P132J9086j6771q096J6418J314m646j5357J5601J6718k9599L053
$$ 920 -16923 -9791 9295 -7476 -15572 846 2160 -2486 -17843 -2242 14476 -15123 -12070
426a2070K5784r239j0528O168N430N298j3792N83J3917p388K710o189M684J5466
$$ -12070 13714 4475 -6053 115 5545 10843 -2949 -2366 11551 4163 6873 684 5368 20834
440B0834j8862l340J8928j0288n023M533n485J4124j2749p961K3837j2817j0607
$$ 20834 1972 -1368 17560 7272 2249 6782 1297 15421 2672 -5289 18548 5731 -4876
453d876J0506K253o773j3052J3555J5093l5478N550L6519l2037r271K1209j762
$$ -4876 5630 7883 1110 -11942 1613 16706 -18772 -13222 23297 -8740 -18011 3198 1436
466A436n970j3357R367J6743j8693o635J5794J073n21j6958Q613K3011k9366K419
$$ 1436 -4534 -17891 -8524 8219 -10474 -17109 -1315 -242 -763 -17721 -9108 13903 -15463 -13044
480a3044J8148j2480O833j371q043J8288p916r239J4612j0564O331K687j0822
$$ -13044 5104 -7376 -543 -1914 -9957 8331 415 -8824 5788 -4776 1555 4242 -6580
493f580J0727l669N958j277j7963K4880K358l4391K5078R537k5655J4270R7k809
$$ -6580 4147 478 6436 5159 -12804 12076 14434 -19957 5121 14658 -10997 3273 3370 561
507E61K164m245R464j1590k665K0063j5688q738J8488l764K090j2525j097L5304
$$ 561 2725 -1520 7944 -3646 -6311 13752 -1936 -10674 7814 4050 6140 -6385 -7482 27822
521B7822l0244j7655L8462p772j6964O896K490J1167q816j2766J7801k555P22
$$ 27822 -2422 -20077 18385 10613 -6351 545 3035 14202 5386 -7380 10421 7866 8588
534H588q940q162L1273j5629k2440K9899l788j5180J0604p819O753J03j6382J8321
$$ 8588 -352 -8514 22759 7130 -15310 14589 10801 -4379 6225 -1594 5159 5262 -11120 7201
548G201q690p879J4521r425j246M47k098J0126j8013k455K8021k2143q687J9623
$$ 7201 -1489 -9368 5153 -4272 -5518 -5071 -7169 2957 -15056 -17511 10510 -11633 -20320 -697
562f97r041P569r098r425K4063m847j8899P178J2660N822k2191m620M1468j9878
$$ -697 -9738 -2169 -11267 -20692 3371 -1476 -20375 -13197 -537 5285 -16906 -21526 19942 64
576F4k3701K9456j18p258j556o65J5173o516r570J7151o918j695R267j0671P251
$$ 64 -23637 5819 5701 -1557 -3113 -3778 11395 4879 -4691 12460 5542 3847 13114 2443 9694
591I694k397O03P148j6165J0726J1894k2891Q584R563j6695J2280m410r953J3643
$$ 9694 7297 7900 15048 -1117 9609 21503 -1388 7196 16759 64 12344 7934 -2019 11624
605A1624o146j069l041j957J4049j2979j1530J8114k877r266pj692J5837j3940
$$ 11624 5478 4409 1368 -589 13460 481 -11049 7065 4188 -5078 -5085 -6777 9060 -4880
619d880j0927K0067o731m129J210p576J4585j078k0598J7058N626j1379K157k824
$$ -4880 -15807 4260 -2471 -6600 -5390 -12966 1619 541 -20057 -2999 2627 -8752 -6595 -9419
633i419J2763n857j3913J8561j466j2570J2114j197l873N072m366P252n881l797
$$ -9419 3344 -2513 -16426 2135 669 -11901 213 -984 -4857 215 -4151 3101 -2780 -6577
647f577J4674j1305j589R465n495K864K66o939J1680l669p658R637o118N259J118
$$ -6577 8097 -3208 -4797 4668 -827 2037 2303 -4636 7044 3375 -4283 5354 -764 4495 5613
662E613j2663J2068N948j2876j222R484K744r794o725J8583k592j7328J2841L260
$$ 5613 -7050 5018 10966 -1910 -3132 6352 9096 -698 -7423 11160 8568 -8760 4081 7341
676G341m889j442k122P105p13r655O443L457o004K803l625L931K152r348N359
$$ 7341 2452 1010 -1112 5993 5280 -4375 2068 5525 -479 2324 -1301 2630 4782 -4566 793
691G93L623n625k914M973K679o179l865J0784j798j1195P631K962l691m227J235
$$ 793 4416 -1209 -4123 850 3529 -2650 -6515 4269 2471 -8724 -1093 1869 -1822 -6049 -4814
706d814Q823o388o683Q856K618q257J954J713J238q45m459M359J645q22l342J361
$$ -4814 4009 -2379 -9062 -206 2412 -5845 -3891 -2178 -940 -1785 -6244 -1885 -240 -1062 -4404 -3043
722c043N837l116o284O174M617p596K01L493L886n131l823J0512k314p344M457
$$ -3043 2794 -322 -6606 -432 4185 -3411 -3210 283 4169 -962 -4785 5727 3413 -3931 526
737E26M394m571o56J674K019M30n152L732J601j044l034M41M747k631l439J878
$$ 526 4920 349 -307 1367 3386 3816 -1336 2396 3997 2953 -81 360 5107 2476 -963 915
753I15N146m013l254K812M500m586o246Q586J028o930k58O547j163n816J278M166
$$ 915 6061 2048 -1206 1606 6106 1520 -4726 3860 4888 -2042 -2300 4247 3084 -2732 -1454 2712
769B712l98o496K647L729k268l639J154M883l293k528R45L942k790l915K420L716
$$ 2712 2314 -4182 -1535 2194 -74 -3713 -2559 2324 -969 -3497 -2552 1390 -1400 -5315 -2895 821
785H21j807o151N866L341n027l180N433K473o176m02M990J642o205J136N170q22
$$ 821 -986 -7137 -1271 2070 -2957 -6137 -704 1769 -4407 -4809 181 1823 -4382 -3246 1924 1102
801A102l743l12O126k100l916J712M941k210l634K524L383n80o242M530M437m843
$$ 1102 -2641 -2953 3173 1073 -2843 -1131 3810 1600 -2034 490 3873 3293 -2949 1581 6018 1175
817A175k826L957L347m857j253L171K769n090j544N022n26k893k087M888J02m074
$$ 1175 -1651 2306 5653 796 -457 2714 5483 393 -1151 3871 3345 452 -1635 3253 3355 -719
833g19p0L903n06m622J111K509Q42n774J607M669l034l071Q58M840k934m056L024
$$ -719 -789 3114 2608 -2014 -903 1606 2448 -3326 -1719 2950 -84 -3155 -2297 2543 -391 -4447 -1423
850a423L363m342j389L540l40l75l237L462J851m119Q5K482R65l045k17K696J799
$$ -1423 1940 -2402 -3791 -251 -591 -966 -4203 -741 1110 -3009 -2924 -442 523 -2522 -2739 -43 1756
867A756n478J908L610k397m82k095N055L67p024M021N104n064j263K779L26J787
$$ 1756 -3722 -1814 1796 -601 -1083 -3178 1877 2244 -4780 -759 4345 -719 -1982 797 1123 2910
883B910o357L451M994n752J059j97J801K815o700p0J0148p441m617P745p86j041
$$ 2910 -3447 4 4998 -754 305 108 1909 4724 -1976 -2046 8102 661 -3956 3789 3003 1962
899A962m242M066M449p977J038M936k799j317n28J897L842j0201L866R426j3105
$$ 1962 -2280 1786 6235 -1742 -704 4232 1433 116 -412 1485 5327 -4874 -1008 8418 -4687
914d687J859O910m501j000o13J253M020o329j217O238k202l10n908N164P921j3987
$$ -4687 -2828 4082 -419 -1419 -2032 -779 3241 -3088 -4305 1933 -269 -579 -6487 -1323 6598 -7389
930g389Q52J0975n305l424J698P57N631p915k026J0521o037n80M68m09N650n761
$$ -7389 -6537 4438 -867 -4291 -2593 -1836 3795 -4120 -6146 4375 -1662 -2242 -1774 -2183 3467 -2294
946b294o44O291m610O47K971o089P481k218m822P703m317m70M166k551o57j016
$$ -2294 -2938 3353 -1257 -610 2361 -3728 3753 1535 -3287 4416 99 -371 3795 1244 587 -429
962d29L158L168j0922M550J0846j2962R28M743q88K799r929L675J0868j0996l323
$$ -429 2729 5897 -5025 -475 10371 -2591 -1663 3080 2192 4991 -4938 -1263 9605 -1391 -4714
977d714Q824k664P71m694n26R615q314N16J178k505R038r076n474J5842o964q119
$$ -4714 4110 1446 2217 -2477 -3003 6612 -1702 -1186 -8 -2513 6525 -2551 -8025 7817 853 -7266
993g266J0225m259J665L68n626P268l201q75K776n255M773J427o386N258k435
$$ -7266 2959 -1300 365 733 -4893 2375 -826 -1701 1075 -4180 593 2020 -4366 892 -1543
1008a543j162P556j0959L604O563p554L997k928q78R575r432m116J1523l521q37
$$ -1543 -2705 4851 -6108 -2504 4059 -3495 502 -2426 -3304 6271 -3161 -7277 4246 725 -112
1023a12m792J201J4849j5509n228J7212n382n877K283K27O784n761n783J1268
$$ -112 -4904 -3703 11146 -4363 -9591 7621 2239 -3638 -1355 -1128 5656 -105 -5888 5380
1037E380l915p75Q00n283J0463m624o084Q470l202l60L311p384O907J004q485
$$ 5380 1465 690 1490 -3793 6670 2046 -4038 4432 1230 870 4181 -3203 3704 4708 -3777
1052c777R554n318k558Q547o560j167K900L89K297q259J030J2211j1508k598Q328
$$ -3777 5777 459 -2099 6448 -112 -1279 1621 2010 4307 -3952 -2922 9289 -2219 -4817 3511
1067C511m204M088p214j316J2107p923n059P162k784L164l391o944J3431l595
$$ 3511 -693 3395 -3819 -5135 6972 -951 -6010 1152 -1632 1532 -1859 -8803 4628 1033
1081A033q212O607j12K149m566l737J0246l354o454P790l153l34L887n627M784
$$ 1033 -7179 -572 -684 1465 -3101 -6838 3408 54 -6400 1390 -1763 -2097 1790 -3837 947
1096I47j682j520N284n878J609N242o569K058K469m597P435n004k732O888k917
$$ 947 -735 -2255 3029 -2849 -1240 4002 -2567 -509 1960 -2637 4798 -206 -2938 3950 1033
1111A033K74k045k90P548n154o317R400k56m167k43M02P214p157m863J0779l119
$$ 1033 1307 -738 -1028 6520 1366 -4951 4449 4193 26 -217 185 7399 242 -4621 6158 3039
1127C039l835K072j383L477j004o307O997o11l425K812l925M586p43n535N867
$$ 3039 -796 1276 -107 3370 2366 -3941 3056 2445 -980 1832 -2093 2493 1750 -3785 2082
1142B082p72l738K491k64l65J68k909O091m176l906Q650m515k621L420j021J321
$$ 2082 1310 -2428 63 -201 -566 -398 -3307 2784 -1392 -5298 3352 -1163 -3784 -364 -1385 -64
1158f4j931k584N927j523m531M535j317J803j771k747N844j239l304J640J630
$$ -64 -1995 -4579 1348 -175 -4706 -171 -1488 315 -1456 -4203 1641 402 -2902 -1262 368
1173C68M71j838k785O431n97o173N203N23o97j531o69M698k078m221N689J85m506
$$ 368 839 -999 -3784 2647 2050 -4123 1080 1603 906 -625 -1294 3404 1326 -2895 2794 2979 -1527
1190a527L327o78N6L08k080K592k56j358l81J307J010k146j414M050ln440L479
$$ -1527 1800 1122 1178 1486 -594 1998 1742 384 3 1310 2320 174 -1240 2810 2807 -2633 846
1207H46J365j235j842k42L886k229l286L254K229m165j44J763Q94j259k674L725
$$ 846 2211 976 -866 -1108 2778 549 -2737 517 2746 -1419 -1563 200 1094 -165 -2839 886
1223H86j02k021n22J964R06k354n61K201L69k685R88R48N29j451j514L590l8l469
$$ 886 784 -1237 -1759 205 1111 -1243 -1804 397 766 -1919 -931 17 546 -905 -2419 1171 1133 -2336
1241b336J074L675k552k310K602J172j308k176K817J74j195j013J087J558j772
$$ -2336 -1262 2413 -139 -2449 153 1325 17 -2159 658 832 -363 -1376 -289 1269 -503
1256e03o66R77J817k487k32J635R45j952j708L849k78k779L15K825q63k693J600
$$ -503 -1169 -192 1625 -862 -1094 541 1486 -466 -2174 1675 1397 -1382 -1067 1758 895 -1798 -198
1273a98J427R3k771Q50K505q43k355J035K877k927o14J451J561k070r26J738O89
$$ -198 1229 1322 -1449 -599 1906 1063 -1292 -257 2620 -307 -921 530 2091 21 -905 833 1522
1290A522j121k042K914P21k297r80K748L4k649M94J923n4k877P32K507j163j960
$$ 1522 401 -1641 1273 1994 -303 -1283 1465 1499 -1150 -656 1267 1213 -1664 -932 1575 412 -1548
1307a548L18K726j771j491J080J513j453j211R55J339q36k548K595J310k745P3
$$ -1548 -1230 1496 -275 -1766 -686 827 -626 -1837 -882 457 -379 -2927 -332 978 -1767 -1694
1323a694J362Q96k056k52J825J129k726L8K631p87r18p14K935m14k293J114J853
$$ -1694 -332 564 -1492 -1744 81 1210 -1516 -1478 1153 366 -552 -1266 1669 1255 -1038 76 1929
1340A929o99j227J5J837P86l936J806K717k242n96J55J677j020j994K064J233
$$ 1929 1230 3 18 1855 2641 -1295 511 3228 986 390 545 2222 1202 -792 1272 2505
1356B505k444l53J698r32O15k631K374N37l053J395P05o73j120O36M88O82l185
$$ 2505 61 -292 1406 474 1089 -1542 832 1369 -1684 -289 416 -257 -1377 -741 -253 429 -2756
1373b756J545K218k835M26j009K820n05m330L193L131m274j84K619l98N92l387
$$ -2756 -1211 1007 -1828 -1402 -2411 409 -96 -4426 -1233 1898 -2376 -2560 59 -339 253 -3134
1389c134K454K780l875M98J348P05l1k733J813L445m368Q31K196k145K431k490
$$ -3134 -680 2100 -1775 -1277 71 776 745 -1988 -175 3270 -1098 -267 1929 -216 2215 -275
1405b75M80L186m287J299K421k780O27P51n98J256m055L381K343o964L494J942
$$ -275 205 3391 -896 403 2824 44 671 1422 824 2080 -1975 1406 3749 -3215 279 2221
1421B221k256M75j620J779K348n481J073L987l350N23k191K455L382p169K293
$$ 2221 -35 440 -1180 599 2947 -2534 -1461 2526 -824 -301 -2492 -37 3345 -3824 -1531
1436a531L602k797J87j349N45M984o413n44O374m657R41K11j102L632l269k26
$$ -1531 2071 -726 -539 -1888 -1343 3641 -2772 -3316 3058 -1599 -658 -447 -1549 2083 -1186 -1412
1452a412K907l168K215M84l913M884k238j161L790n311L502K149n493K688O27
$$ -1412 1495 -1673 542 1026 -2887 1997 -241 -1402 2388 -2923 579 2728 -2765 -77 550
1467E50q97K455n127K160N570o915P54J975N8J840o949L520O397p671j73M118
$$ 550 -347 2108 -3019 -859 4711 -2204 -1450 525 583 2423 -4526 -1006 5391 -2280 -2453 1665
1483A665j937K075l837PO438n199p50K078j229L927m365j983P418m059j880L771
$$ 1665 -272 1803 -2034 -2027 4411 -788 -1538 540 -689 3238 -1127 -3110 4308 249 -1631 2140
1499B140l664L645p09m143N598k949l95L033m710K662K053m107K200j159M44M240
$$ 2140 -1524 2121 1412 -2731 2867 -82 -477 2556 -2154 508 2561 -1546 654 -505 -61 4179
1515D179q126L169M911n900J611r81N11M732o811q40O935l801n40j033m3O095
$$ 4179 -3947 -778 4133 -1767 -156 -1137 -626 4106 -2705 -3545 3390 -411 -951 -1984 -2027 4068
1531D068o339k037P289l402q66m74p6N013m688k723O922m060M82J468m184N547
$$ 4068 -2271 -4308 2981 -421 -1287 -1761 -1837 3176 -1512 -4235 2687 -1373 -891 577 -3607 1940
1547A940j456l427M563k399J03L027m787K916J586l641L786l383N91M677n330
$$ 1940 484 -2943 1620 -779 -676 2351 -2436 480 2066 -1575 2211 -1172 -581 4096 -1234
1562a234P23K363j200K069m059J14O760n875j412M313j750J923m242j27O642m855
$$ -1234 -511 1852 652 2721 -1338 -1224 5536 -339 -1751 2562 812 2735 -1507 -1634 5008 153
1578A53k047L954j682J497j538l480O777k659l307L420j447J763j700k364M735
$$ 153 -1894 2060 378 1875 337 -3143 3634 975 -2332 1088 -359 1404 -296 -2660 2075
1593B075j835k905M171k434N00J382l486L264j260j445L499l687J33L516k738
$$ 2075 240 -2665 1506 -928 -428 954 -2532 732 -528 -1973 1526 -2161 -2028 1488 -1250
1608a250o0Q34j227L324l170j238M312k748N39m43n55L962l367k277M721q76j685
$$ -1250 -1310 -476 -1703 1621 -1549 -2787 1525 -1223 -684 -1127 -1682 2280 -1087 -3364 1357 481 -1204
1625a204L73r78M114l130k553N332j455j830J048K46J283r24k265L665r72j748
$$ -1204 -831 -1809 2305 -825 -3378 1954 499 -1331 -283 -37 1246 322 -1943 1722 750 -998
1641i98K243j576J720j94j782K275n91j438J911l49n20R29j105K079j405j972
$$ -998 1245 -331 1389 1195 -587 1688 1097 -341 1570 1221 701 1630 525 2604 1199 -773
1657g73L724j744j109J054M02K70j219j108K700m79k779K162l45K66j209q85K584
$$ -773 2951 1207 98 1152 1554 1824 605 -503 2197 1718 -1061 1101 756 1022 -187 -1072 1512
1674A512j459j249Q83N25m53r78q06K234o23k665K392J81j062m88N34J009q05
$$ 1512 53 -1196 -313 212 -241 -1219 -2025 209 -414 -3079 -687 -506 -1568 -2056 -1522 -513 -1318
1691a318j037J339L27j571P83M50K37p69l98J957o84q16O98Q20k71k99J04J375
$$ -1318 -2355 -1016 -689 -2260 -1477 -1027 -790 -1559 -1957 0 -684 -1500 -802 18 -253 -552 -448 927
1709I27j71j527J623L07k75q80O65J468j402p22J292P79j556j0Q62J80o61r96
$$ 927 756 -771 852 1159 884 4 669 2137 735 13 1305 2084 528 518 1380 1560 899 -97
1727i7J955n70p20o23J275K81j700K59J024lj819N88Q12k69p60o58J773p80j220
$$ -97 1858 1288 568 -55 1220 1501 -199 60 1084 1081 -738 -150 662 393 -367 -1025 748 -32 -1252
1746a252L81J763j411q43J450J34o12j279J718l1n36n61Q52O88j095k42Q79J174
$$ -1252 -871 892 -519 -1362 88 222 -390 -1669 49 18 -518 -1079 -227 461 -634 -876 3 1177
1764A177j962J71J347r29q40L51J727j196j001J518O09J16j776P50J87p1j220
$$ 1177 -785 -614 733 -196 -1036 -685 1042 -154 -1155 363 972 1088 -688 62 249 178 -1042
1781a042Q91P55j037n78P40J280j768j61R44N86j345j5R83N9m24q77J573K86j290
$$ -1042 -151 604 -433 -1011 -271 1009 -759 -920 24 610 -735 -750 233 292 -132 -1009 564 850 -440
1800d40j00J085J35r81K59P74M38j681R29Q36q18j96Q0J182r22p51R27L22o85
$$ -440 -540 545 680 -301 -42 732 1170 -511 418 1254 436 240 320 1502 580 -171 756 1078 393
1819C93o53P36J66j95j320J314K39j133RN54M40q81q17J268K17k007J121R58j047
$$ 393 -260 476 642 447 -873 441 680 -453 -444 110 550 -331 -1148 120 337 -1670 -549 409 -638
1838f38j35r25J423k13j131J029O46m66o10J73Q86L16k370J855R02j589J083n41
$$ -638 -773 -1698 -275 -488 -1619 -590 56 -410 -1020 -847 39 355 -2015 -160 742 -847 236 -305
1856c05P73K61j552J106R57j423M27Q49p34M99r48J260J41k051K018J2j209O97
$$ -305 468 729 -823 283 1240 -183 244 1093 359 858 -90 1170 1311 -740 1278 1290 81 778
1874G78k55L15Q13k491J635J189k597J155o40J080k95k534K380R36k729N44P00
$$ 778 523 838 1651 -840 795 1984 -613 542 -98 982 687 -1847 533 1469 -1260 -716 -16
1891a6j47Q30k686J612J997l144P12O05j57Q17j727N41J543k021N68O85j325K673
$$ -16 -163 667 -2019 -407 1590 -1554 -842 -237 -394 423 -1304 -763 780 -1241 -673 12 -1313 1360
1909A360k128k4J917k679J620N15k136J934K96j626J573j677J656J164m000K604
$$ 1360 -768 -792 1125 -1554 66 581 -1555 379 675 -951 622 -1055 601 1765 -2235 369
1925C69R91j540M50j224J693J555m600J961K730k781Q17j445J071K509m403R62
$$ 369 1360 -180 270 -954 739 2294 -2306 -345 2385 -396 421 -1024 47 2556 -1847 -885
1941h85K601j950L97p98L5L169l970k7L316k572J502r46j383L253k359o7J756
$$ -885 1716 -234 163 -635 -600 2569 -1401 -1428 1888 -684 818 -128 -1511 1742 -617 -684 1072
1958A072k381J926N71l126K947p43r07J747l336L328O01l908K724K5o24J566l574
$$ 1072 -1309 617 1188 -1938 1009 266 -641 1106 -2230 1098 1699 -2209 515 540 -84 1482 -2092
1975b092J936L165n038J447J132o11J609l933K143L447m031q20K145r53K250l229
$$ -2092 -156 3009 -2029 -582 550 -61 1548 -2385 -242 3205 -826 -1646 499 -454 1796 -1433
1991a433l69M857m091LJ445j500K434j801j569L608j747o00J325k429L035n24
$$ -1433 -1802 3055 -1036 -1033 412 -1088 1346 -455 -2024 1584 -163 -763 562 -1867 1168 644
2007F44k617L336j995L33J711l517K198J553k841J380n33K66K741n111J876L061
$$ 644 -1973 1363 -632 -299 1412 -2105 93 1646 -1195 185 -348 -82 2659 -2452 -576 2485
2023B485l295R25r14J030K458m273M69M060k868o8m74k58M079l985j101L802j895
$$ 2485 -810 115 -799 231 2689 -1584 -1115 2945 77 9 -465 -723 3356 -629 -1730 2072 177
2040A77K31q65m58L187k360j766L443k289P03O70k478L208j298j423J972j604
$$ 177 408 -457 -915 2272 -88 -1854 1589 -700 3 673 -1805 1403 105 -1318 654 -950
2056i50O78J138k950J562R78j723J673k157Q57K584l525J010R57n08J089k368
$$ -950 -272 866 -2084 -522 456 -1267 406 -1751 -894 1690 -1835 -825 132 -376 713 -1655
2072a655L6L959l287q09K527j070J581k451J74L554k869q12K055m21N35n81j594
$$ -1655 -1619 2340 -947 -1756 771 -299 1282 -1169 -995 2559 -310 -1122 933 512 1047 466 -1128
2089a128L479j739j276J681j078J309o70j217K287o76j479K090j761O70Q00j933
$$ -1128 2351 612 -664 1017 -61 1248 578 -639 1648 972 -507 1583 -178 492 1292 -641
2105f41J714r95l55J475j884M8J805j204k66K71l96J620k089l32K212j483R8l92
$$ -641 1073 78 -277 1198 -686 -638 1167 -37 -303 -32 -428 1192 -897 -1229 983 -500 -402 -794
2123g94mJ600j511q54K021m08j046N03m68J744j263j261K603j233p87O26P4M35
$$ -794 -798 802 -709 -1563 458 50 -996 -493 -961 783 -480 -1741 862 -371 -1158 -532 -458 -23
2141b3k64p68J459r07n77J347j068O99j58o11J156p30l27R76l16m17P89m81R30
$$ -23 -287 -1055 404 -503 -1080 267 -801 -102 -260 -871 285 -445 -772 204 -112 -529 260 -221 709
2160G09q69n31J548n70l18nR76J59j082RJ366o26j208J167QK91p07k14J374q83
$$ 709 -160 -691 857 287 -31 -36 940 1099 17 26 1392 766 -442 725 733 1024 317 103 1477 594
2180E94m46O38M09n76j52q0P37k47j046Q65k53k74j92K21K01p42J8L94L38j235
$$ 594 148 786 1195 619 467 387 1124 877 -169 696 443 169 -23 198 399 -343 -325 69 407 -828
2200h28J79M03j17n67q9R38o84k79J4P58m65n90O16J74J19j072Q73J19k28l30
$$ -828 -649 -246 -363 -930 -1019 -81 -765 -1044 -1030 -272 -737 -1327 -711 -537 -418 -1490 -617 -498 -726 -1056
2220a056N65N71p27J45J6N42n49J67N27Q1j81n77J320m92k06N0N54R0p63M44M32
$$ -1056 -491 80 -647 -502 -486 56 -493 -326 201 282 101 -476 844 352 146 196 750 840 77 521 953
2241I53k7j081J026N8j44o26K41Q30p18m66J88Q13q72j00N63r0k99n93R63j81
$$ 953 926 -155 871 929 785 159 400 1230 512 46 234 1047 175 75 638 548 249 -344 619 438
2261D38n69j62O55L5r97L40N76r3q82J41O59l03m25p9R25l85m12J33L42k69l70
$$ 438 -131 -293 362 397 -600 -260 316 223 -659 -518 141 -162 -587 -666 259 -126 -538 -405 -63 -332 -702
2282g02O68M2j74r43J273o8r09J57L68N49r54J3M46M08p02j3N36J94l32o33J277
$$ -702 -34 8 -166 -1109 164 96 -813 -656 -288 261 -693 -680 -234 174 -528 -541 -5 189 -143 -776 501
2303E01k11j038P47J66k0k47m1M61J66r15O83L91o49J35j83J003o16m92R22Pq12
$$ 501 290 -748 -1 165 145 -102 -143 318 484 -431 252 643 -6 129 -54 949 333 -159 763 770 -42
2324d2K52J26J92L0r06J147k96n42M38J7J02o76m2P95K11j577Q66O37j238P05
$$ -42 210 336 528 558 -348 799 503 -39 399 416 518 -158 -200 595 806 -771 95 732 -506 199
2344A99q90J335m30j524J250L62j047L91k43L98M67j316Q41N01j098M90k82K64
$$ 199 -691 644 214 -1310 -60 302 -745 -354 -597 -199 268 -1048 -207 294 -804 -314 -596 -332
2362c32J61r10M54Q63j312Q13L57r15Q79p55R51Qj251J392j29q78L67J87O18j72
$$ -332 -171 -1081 -627 236 -1076 -263 94 -821 58 -697 254 262 -989 403 274 -604 -237 -50 568 396
2382C96j823K249N21k118J352q11K49P12j430J212O99j500J081O90j091P41k097
$$ 396 -1427 822 1343 -775 577 -234 15 727 -703 509 1208 -292 789 1479 388 1129 -968
2399i68J290J354k247J534n86J07P74j821K10J557j599M33O86j496J782j406j61
$$ -968 322 1676 -571 963 377 484 1258 -563 -353 1204 -395 38 724 -772 1010 -396 -557
2416e57J088j151J155l57j716K033O8j711J314j240J253N98k801K002N50j159
$$ -557 531 -620 535 178 -1538 495 563 -1148 166 -1074 179 777 -2024 -22 528 -631
2432f31L72r87J305R55k852J308J459j650P24j331J281J425k847Q18J327j064
$$ -631 -259 -1246 59 1014 -1838 -530 929 -721 3 -1328 -47 1378 -1469 -651 676 -388
2448c88M77j066M49K171k246m1J626j760J718j048r41K612j685j54J054j425J332
$$ -388 89 -977 -528 1643 -603 -644 982 -778 940 -108 -1049 1563 -122 -276 778 -647 685
2465F85K62k476K329k39p26J209k450K247O31k677J299N90l72Q05k368J430K392
$$ 685 947 -1529 800 561 -165 1044 -1406 841 1472 -1205 94 684 312 1117 -1251 179 2571
2482B571l750J025P17j26P22k941J767K133k932K79J034q74J605k038k98L012
$$ 2571 -1179 -154 563 437 1159 -1782 -15 2118 -814 -535 499 -375 1230 -808 -1106 1906
2498A906k655M24O56j134J888j309j126K267j132k61J021k009K245k79j922J956
$$ 1906 -749 -325 331 -803 1085 -224 -1350 917 -215 -476 545 -1464 781 502 -1420 536
2514E36j308Q12R09k789J811J164k071R54q23P70J446l001J201J691k190O66n29
$$ 536 -772 40 949 -1840 -29 1135 -936 18 -805 -35 1411 -1590 -389 1302 -888 -222 -751
2531g51N96J470k521M06J866j305R5p9k85K405k574k19J890j234N79k63o05J827
$$ -751 -155 1315 -1206 -800 1066 -239 -144 -223 -508 1897 -677 -896 994 -240 339 76 -529 1298
2549A298j352p89K105j343L97N08j747K121q39n61R83j377Q48Q27j890R59P39
$$ 1298 -54 -843 1262 -81 316 824 -923 1198 359 -202 781 -596 252 1079 -811 148 887
2566H87j229R66j346N82J538k247N68N26k60M14j426J93K119k087k26J491r51
$$ 887 -342 624 -722 -140 1398 -849 -281 245 -15 399 -1027 -834 1285 -802 -1028 463 -488
2583d88O95j021k34K044j639o54J280m64M11n77m43J820q62p26J247j034J048
$$ -488 207 -814 -1048 996 -643 -1297 -17 -481 -70 -647 -1090 730 -132 -858 389 -645 403
2600D03j84o44Q35o11n59J431r39L67M10q39R07n61J9Q29j387N20Q50o74p6k63
$$ 403 219 -425 410 -201 -760 671 -268 99 509 -330 577 16 35 864 -523 -3 847 173 97 -166
2620a66o5J218j193k21J390j140M04k08k9M95o01l16J146m31m84M17l79P42n95
$$ -166 -231 987 -206 -427 963 -177 227 19 -10 485 -116 -432 714 283 -201 216 -163 579 -16
2639a6l96J122p09j59P3O1M5l55q9O42j89o43Q83q78N49q4o7M10q69L07O16k72
$$ -16 -412 710 1 -158 -85 -24 21 -334 -423 219 30 -613 270 -608 -59 -143 -210 200 -669 -362 254 -18
2661a8n49M47k88M40k55k38Q78o03k53K65M20l93l35L1P58k31n64O18j02L23p53
$$ -18 -567 -120 -408 32 -223 -461 417 -186 -439 -174 246 -147 -482 -451 307 76 -488 130 28 351 -402
2682d02L05O88m66l24N07J16m89J98J15K81l24m26R02k53l40J26J12M25o77k24
$$ -402 -97 591 125 -199 308 424 -65 133 248 529 205 -221 681 428 88 214 326 751 74 -150
2702a50P34r2q06O69j9Lm84Q5L41n73K89L4K98l79k16L12J9l61m4L81q7j87l02
$$ -150 584 492 -314 355 336 339 -145 -60 281 -292 -3 31 329 -50 -266 46 65 -296 -340 41 -46 -233 -535
2725e35K52M45p34J03J37O2j78o1K67M1j75l60N16lj11j97K84L18n29K63K28M4
$$ -535 -283 162 -572 -469 -332 -270 -448 -509 -242 -201 -376 -736 -220 -223 -334 -531 -247 71 -458 -195 33 77
2747G7o51O6P82m77L1qM27j87l62K57N25m57j29M80k49J38m66P14k15k49J57M10
$$ 77 -574 -508 274 -203 -172 -180 247 60 -302 -45 480 23 -106 374 125 263 -203 511 296 47 204 614
2769F14j27o12L72K98j78o26M40O8j98J07k71P27p47k2L98k13j65Q0J43O9k10
$$ 614 487 -125 247 545 367 -259 181 249 51 158 -113 614 -133 -155 243 30 -135 -55 88 157 -53
2790e3l92R30o78k40L71N6L30n93l03O11K42q85P13k08K11o0p81R36j75q18P95
$$ -53 -445 485 -193 -433 -62 -6 324 -269 -572 39 281 -604 109 -99 112 52 -729 207 32 -786 9
2811Im24L72r2l97O49k02m92M17J3n41P93o39N70q0l65O61k24m63N70k27k29M52
$$ 9 -415 -43 -135 -532 117 -85 -577 -160 -147 -688 105 -534 36 -44 -409 252 28 -435 135 -92 -321 131
2833A31p08J208l72j022J277k70k88J08k89R07k27r04R91J14o46M08p66R71r7
$$ 131 -577 631 259 -763 514 244 -44 64 -225 682 455 -449 542 656 10 418 -348 623 526
2852E26j052J022J07q08L33k28J67P53j196P63J11o94R35r47p3P20q73O33j29
$$ 526 -526 496 603 -205 128 -100 67 820 -376 387 498 -196 739 -208 -281 439 -434 199 70
2871G0q40J209l38q69R75o41M82K05j170J432l40j084P86k54J95M21j510J587
$$ 70 -770 439 101 -768 207 -434 48 253 -917 515 175 -909 -123 -377 -182 239 -1271 316
2889C16J59j483Q49j10K02K94j301J151M92j387N43K97k91Q84j680R00J039j654
$$ 316 475 -1008 -159 -269 -67 227 -1074 77 569 -818 -275 22 -269 615 -1065 -165 874 -780
2907g80J158m68j38J320j253r3J216j149O09j13q43J737r44l29P52q87J177n24
$$ -780 378 -90 -228 1092 -161 -254 962 -187 422 309 -534 1203 259 -70 682 -205 972 448
2925D48j433J802j77j174J065o53R36P8k099J795R8q23J52o41J106M56k089Q75
$$ 448 -985 817 640 -534 531 -122 814 892 -1207 588 686 -137 15 -626 480 936 -1153 -278
2943b78J282j547P95j013L78J724k313M26J016p37O75r88j36J669j460k90J449
$$ -278 1004 -543 252 -761 -383 1341 -972 -546 470 -267 408 -580 -716 953 -507 -797 652
2960F52j476J290r16o97J991j140r7N71j129J235K67j936J606j88k83Q11j730
$$ 652 -824 466 -450 -1147 844 -296 -393 178 -951 284 551 -1385 221 33 -250 561 -1169
2977a169J582M82j774Q76P4M6j5j279J277J372k218L96N05J45M46j387O92J194
$$ -1169 413 895 -879 -3 71 117 102 -1177 100 1472 -746 -350 155 300 746 -641 51 1245
2995A245j765N42R1k44J235j258k5J282j248L30J75q15J646j254n02J237p62l1
$$ 1245 -520 22 113 -131 1104 -154 -179 1103 -145 185 360 -455 1191 -63 -565 672 -90 -121
3013a21M68j306J458j13j136J361j041R29J11j545J245L14j356P35k58j12J086
$$ -121 347 -959 499 386 -750 611 -430 499 610 -935 310 624 -732 3 -255 -367 719
3030G19j946P85J381j418M87m95J00Q88j587K74J227q96L60l75k2J352j564J6
$$ 719 -1227 -442 939 -479 8 -487 -387 501 -1086 -812 415 -481 -121 -496 -518 834 -730 -714
3048g14J243p57K47l23m9J077q84j86Q69j131P11L59j215J462o37k53N55m73M77
$$ -714 529 -228 19 -304 -353 724 -160 -346 523 -608 103 462 -753 709 72 -181 374 -99 378
3067C78L50j028M52M73p94Q90j129O78P26j445N08J6R7K26m86pJ208j327j75Q98
$$ 378 728 -300 152 625 -169 721 -408 270 996 -449 59 75 172 398 -88 -95 1113 -214 -389 509
3087E09p41N77o91J99Q67r84l4M23m48O56k20q26J364q70j57M81m07M96n04kJ97
$$ 509 -232 345 -346 -147 720 -264 -298 125 -323 333 113 -713 651 -219 -376 105 -302 194 -310 -312 -115
3108a15n0m0L45o11k3O38m70K34k12n4O98r34M03K33j46k24J76P3K92l12o3N76
$$ -115 -165 -205 140 -471 -494 144 -326 -92 -304 -358 340 -594 -191 42 -104 -328 -152 -79 213 -99 -162 414
3130D14m36J39k23L22J14n83P0O04l14j98M78k01L37m23J27K23k71o5J1J56Q5
$$ 414 -22 117 -106 216 330 -253 -183 421 107 -91 387 186 523 100 227 450 179 114 125 281 366
3151C66q0j46J96j84l74L99N8j26l2j8mk50K59P5J86o29K67J08K85o30j15N39
$$ 366 286 140 336 152 -222 177 235 109 77 59 55 -195 64 139 325 -304 -37 71 356 -274 -389 150
3173A50m26L7K87L3j47m88K34L32k44k15K03M1lj69K55J83n27M7L94p2l39K4M12
$$ 150 -276 -239 48 81 -66 -554 -320 12 -232 -447 -244 -203 -206 -375 -120 63 -464 -417 -23 -95 -434 -410 2
3196BJ34k80l32O93j89j89J80j02O9l16L86J45K23n15M39l77J95k88K28L53k86
$$ 2 136 -144 -476 217 28 -161 19 -83 -14 -330 56 201 424 -91 348 -29 166 -122 106 459 173
3217A73j02K81K01l57j17L02k7j00j77L45n6l87J52L3K27l38L28m60L96l06pK76
$$ 173 71 352 553 196 79 381 354 254 77 422 366 -21 131 164 391 53 381 -79 317 11 4 280
3239B80J8j83k25N59n72j1K91l10K6j81K51j01j08k27N87k74n4J2k27K91m06O5
$$ 280 298 115 -110 449 -123 -134 157 -153 -127 -308 -57 -158 -266 -493 94 -180 -234 -222 -449 -158 -564 -499
3261d99K89P0j80K10J32L2l82k36N35q0o2r7K8K59m56L72J05J60m01N78k05l87
$$ -499 -210 -140 -320 -110 22 54 -328 -564 -29 -109 -171 -268 -240 19 -437 -65 40 200 -201 377 172 -215
3283b15N54n96O87O6n01J25K62j74l09M2L00q85J51J268l71n46N25j80M37o09
$$ -215 339 -257 430 496 -5 120 382 208 -101 -59 241 -644 -493 775 404 -142 383 203 640 31
3303C1j58K76K99q06R10l86J21O0m50N78j80m55K94J76j54j33k52J81K86p48Q01
$$ 31 -127 149 448 -358 552 166 287 347 -103 475 295 -160 134 310 156 23 -229 -48 238 -510 291
3324B91l18k64M25m54J12l5k46O03l45m21O32k45j49M46o93P52j44p92J139l77
$$ 291 -27 -291 134 -320 -208 -243 -489 114 -231 -652 -20 -265 -414 32 -661 91 -53 -845 294 -83
3344h3m47L56l37N47J49q67P22J97l41J89p63O92J77p45P91J26n59N40o50N95
$$ -83 -530 -174 -511 36 185 -682 40 237 -104 85 -678 14 191 -554 237 363 -196 344 -306 289
3364B89L95r57N02J46l63P43p42J7M93o81L64J59o70J044l01q81R48o76O78j17
$$ 289 684 -273 229 375 12 755 13 30 523 -158 206 365 -305 739 438 -443 505 -171 507 390
3384C90q90J102l85o53O04l69M61j80j125J490j18j065J016l88R1M28j212Q17
$$ 390 -500 602 217 -436 168 -201 260 80 -1045 445 327 -738 278 -110 -19 409 -803 14
3402A4N07j133K20K36ML38j032M71Q47j379J103k64k77N91q46P3J013j025O26
$$ 14 521 -612 -392 -156 -152 186 -846 -375 472 -907 196 -68 -345 246 -600 -527 486 -539 87
3421H7k59o09J405p27n56P34n49Q48j80j100J307on77N93n53P17j93j445J508
$$ 87 -172 -781 624 -103 -659 75 -474 374 194 -906 401 395 -182 411 -142 575 382 -1063 445
3440D45k00l21M27p52J015N2j323Q17P56j083N59p70N29R38j710O43N21n36N29
$$ 445 245 -76 351 -401 614 666 -657 160 916 -167 392 -378 151 1089 -621 22 543 7 536
3459E36p59J5J256j227J94M04r64J133n94q62J439l71l97K99o76P60J04j438J253
$$ 536 -223 -208 1048 -179 15 419 -545 588 -6 -868 571 200 -197 102 -574 186 290 -1148 105
3478A05j14m70P23j310J306j07r91M77M39l12M02r03N89M93r95N39l4l6M07j182
$$ 105 -9 -479 244 -1066 240 133 -858 -381 58 -254 148 -755 -166 327 -668 -129 -163 -199 208 -974
3498i74Q36R24j091K56K22j58M46n34j97J186j122M12j12l88O98l42k18Q10o42
$$ -974 -138 786 -305 -49 173 15 461 -73 -270 916 -206 206 94 -294 404 62 -156 654 12
3517A2K71R3p50Q57N6r91J067m50L02j16r24R43K78q55L06j16K42M50q56K83M06
$$ 12 283 376 -374 483 539 -452 615 165 467 351 -573 370 648 -207 99 -17 225 675 -181 102 508
3538E08p38K52k62P6P13j169M30N10p41M18j52oL52n97j65M59j12J59k45R7J92
$$ 508 -230 22 -240 -164 549 -620 -190 320 -421 -3 -155 -161 191 -406 -571 -112 -224 -65 -310 -213 -21
3559b1k53n4Q36j014K45M59p88O98r0o7Q9m17L67M84r53K97L26m33m6K50J06L76
$$ -21 -274 -328 508 -506 -261 198 -590 108 18 -49 40 -377 -10 474 -479 -182 144 -289 -335 -85 21 397
3581C97o93M36M7J36P4r96P70L53p21M5P29p42K83j32K55l6Q8k55o0j80L17j34
$$ 397 -296 140 187 323 397 -599 171 524 -197 -152 577 -165 118 -14 241 205 293 38 -22 -202 115 -19
3603a9j75l6k3j48N68L04p17L39N2k69R7n74M01R9N99K28r70O62k95O2r28J85
$$ -19 -194 -230 -253 -401 167 471 -246 93 145 -124 -27 -601 -200 -101 498 726 -244 418 123 185 -743 -558
3625e58K08J51l32K0j20P64l3n71K11K10j67q6r3K56J59l46M1K96q9j25K84k59
$$ -558 -350 -199 -531 -511 -631 133 100 -471 -260 -50 -217 -303 -396 -140 19 -327 -286 10 -79 -204 80 -179
3647a79J08J63m30M08l52n6O2N67l24j5J81J69k47J17L0k4Q2M8q6J14m89M00K01
$$ -179 -71 92 -338 70 -282 -338 -276 291 -33 -48 133 302 55 172 202 178 260 308 222 336 -153 247 448
3670D48km20J56j4N5j31K7J65j83lj33J54o6PLN1j03NK68l40m4J38l9J33m41K82
$$ 448 446 26 182 168 223 92 119 284 101 98 -35 119 53 60 63 114 11 16 284 -56 -100 38 -1 132 -309 -27
3696b7K87k80l10J16J29K04k58o7J49k95K04n8K90l22q8Q1J10L0j70J53k3j86
$$ -27 260 -20 -330 -214 -85 119 -139 -206 -57 -352 -148 -206 84 -238 -326 -245 -135 -105 -275 -122 -145 -331
3718c31J55lK72k58m8K54l3k65K91O1J22l2k05P0R3l0J96j09O6j62J1n1J69o3
$$ -331 -176 -179 93 -165 -213 41 8 -257 34 95 217 185 -20 50 143 113 309 200 266 104 115 64 233 170
3742A70J49j1MM5m05N97o04M25l0mj96m7j93K17J46m27M88j58k30J07o3M62l23
$$ 170 319 308 312 357 -48 549 -55 370 340 336 140 93 -100 117 263 -164 324 166 -64 43 -20 442 119
3765A19k74J78K82m15o9J80m3N9k26J85j33J4M0q7p2J06O8J46l33k22K93lJ78
$$ 119 -155 23 305 -110 -179 1 -42 17 -209 -24 -157 -143 -103 -190 -262 -156 -88 58 -275 -497 -204 -207 -29
3788b9J7l39L21j43l9L61k75k9N2N7j25Nk70P10k02o25O18j85J30p0j26L27J54
$$ -29 -12 -351 -30 -173 -212 149 -126 -155 -103 -46 -171 -166 -436 274 72 -553 65 -120 10 -60 -186 141 295
3811B95l15K81j98K51J08p01Q21l17NK31j73q7R9o5kJ7j00J88l60J41L93q17N00
$$ 295 -20 261 63 314 422 -279 542 225 230 461 288 201 300 235 233 250 150 338 -22 119 512 -305 195
3834A95k3l97O89k01l58O18m59j41J73k90O14m02o35R85l32nj54k53M74Nq18O97
$$ 195 172 -225 464 263 -95 523 64 -77 96 -194 420 18 -617 368 36 31 -123 -376 98 103 -715 -18
3856a8J31m19K83n45M91K84r43Q88j83j93K82m11J29K05k65R9K65m86Q86p92O
$$ -18 113 -306 -23 -568 -77 207 -736 152 -31 -224 58 -353 -224 -19 -284 -185 80 -406 480 -312 -306
3877c06N06m32J96J61k52M28L1q79R31k72L26l07p79J137J89j053P29J17k00l6
$$ -306 200 -232 -36 125 -127 301 332 -547 384 112 438 131 -648 489 678 -375 354 471 271 235
3897B35m56R15N7r88L42j45J84M81q87N50K57p34J97n0k47P81r50L67O79q27M40
$$ 235 -221 694 751 -237 105 -40 144 625 -262 288 545 -189 8 -42 -289 492 -458 -91 588 -239 201
3918B01n50j14Q09n22k42M92l72P56m23o28P96k29m75N02l60N59k68n05P69O7
$$ 201 -349 -463 346 -176 -418 74 -298 458 35 -593 203 -26 -501 1 -359 200 -68 -573 196 263
3938B63n59K3k66O47K43j145R59R6p06M56m85P37J23j259P30N04o28M87p01M50
$$ 263 -296 -273 -539 108 351 -794 165 261 -445 11 -474 263 386 -873 -143 361 -267 220 -481 -31
3958c1N33q38L38J48j42L12n55j09J021o32N6M34o54Q41n87m41Q48j33k19K51
$$ -31 502 -336 2 150 8 320 -235 -344 677 45 101 535 -119 722 135 -306 542 409 190 441
3978D41o24P14j00o96O89k37O6j63o29Q74j39n08J68K36J31n8n88L02N20j059
$$ 441 -183 531 431 -265 424 187 253 90 -539 335 196 -312 -144 92 223 165 -423 -121 399 -660
3998f60O12j70k21O29q86N33M59q26L49J11l86N56n70J33N88l87J15K7m04N74
$$ -660 -48 -218 -439 190 -696 -163 296 -530 -181 -70 -456 100 -470 -337 251 -136 -21 6 -398 176
4018A76k80QL30m79J69K61o08K26J62k72L94m26M54M00j010Q14j15j49q6m6K44
$$ 176 -104 -96 234 -245 -76 185 -423 -197 -35 -307 87 -339 115 515 -495 319 204 55 -31 -77 167
4039A67M23o98K03M50m02J41k58J72J69k87k02M76k73J56J23l48L92n09J41k4
$$ 167 590 -108 95 545 143 284 26 198 367 80 -122 354 81 237 360 12 404 -105 36 12
4059A2k7M3K58j15Nk74l06M25k32K52j01k61N90k64j76O6n5J94l5n81P56j91M8
$$ 12 -15 28 286 171 176 -98 -404 21 -211 41 -60 -321 269 5 -171 -105 -160 34 -1 -582 174 -17 31
4082C1p4n28M69R0n05L82J36j47j26J24J63N9l10n6L87k70L46m61J36Q6O5j05
$$ 31 -43 -571 -102 -12 -517 -135 1 -146 -272 -148 15 74 -236 -292 95 -175 171 -290 -154 -68 -3 -108
4104a08K14j03J35Qj06K89l76J59L07n03K49L6m16N45J78l52j27J70p6P1k03M36
$$ -108 106 3 138 146 40 329 -47 112 419 -84 165 201 -215 330 508 156 29 199 123 194 -9 427
4126D27k25p5q5k44L41O1N9k61j5J23J72k03P1l1jj15J09j7k34N0r1Q3M5r0R5
$$ 427 202 127 42 -202 139 200 259 -2 -17 106 278 75 146 115 114 -1 108 91 -143 -93 -184 -101 -56 -146 -51
4151e1j14K50k78j85L48P2k3M1j70k46L23j83J42j87LL54l36M08l95P4K16j14
$$ -51 -165 85 -193 -378 -30 42 19 60 -110 -356 -33 -216 -74 -261 -258 96 -240 168 -227 -153 63 -51
4173e1R4j56j05LJ72K76k24O1j72J84o7P4J05j69J3j4m1K09k76J13K11k00L42
$$ -51 43 -113 -218 -215 -43 233 9 70 -102 82 15 89 194 25 38 24 -17 192 -84 29 240 40 382
4196C82J20k99J00j51J26j09M8j02J74k24Q7k86Q9L93k87j34%J82k36J67j10J57
$$ 382 502 203 303 152 278 169 217 115 289 65 152 -134 -45 348 61 -73 -73 109 -127 40 -70 87
4218H7N4l76p7J57m8L76n33Q1o3M13j28rk27J91K0Rk45r2K93p3j80J77J11K46
$$ 87 141 -235 -312 -155 -203 173 -360 -279 -342 71 -57 -66 -293 -102 -82 -73 -318 -410 -117 -190 -370 -193 -82 164
4242A64l57J16o1J28l16K28R9lL11n00N24o17P9N35j68l9m81L73K29j03j46J11
$$ 164 -193 -77 -138 -10 -326 -98 1 -2 309 -191 333 -284 -205 330 162 123 -358 15 244 141 -5 106
4264A06K88l85K01j27K80j71J06k6m3l07N65k55l3l1k88Q7R0J71K00m84J05K8
$$ 106 394 9 210 83 363 192 298 272 229 -78 487 232 199 168 -120 -33 57 228 428 -56 49 77
4286G7j24K95m17NN28m78j77L82J0p4k39l6J27k06j93J26K20J16j27j63K60j84
$$ 77 -47 248 -169 -164 364 -114 -291 91 101 27 -212 -248 -121 -327 -520 -394 -174 -58 -185 -348 -88 -272
4308b72k53P47n50K69o6k19K42n0l8J21j93L70O0n30M01L84o77L19lJ12j42r1
$$ -272 -525 222 -328 -59 -125 -344 -102 -152 -190 -69 -262 108 168 -362 39 423 -254 65 62 174 32 -59
4330e9J39L9r2J02Q5l20N43l64j04J43n3M30l70j43M55j78j5Q1n76N26J35n41
$$ -59 80 119 27 129 214 -106 437 73 -31 112 59 489 119 -24 431 253 238 319 -257 269 404 -137
4352a37O22m57J8l8m07O27O9l05rJ45j92M73o89M80J46o70K52J35j44M20o66J64
$$ -137 485 28 46 8 -399 228 297 -8 -17 128 -64 409 -280 200 346 -324 -72 63 -81 339 -327 -163
4374a63N01o02P5qj07L41l90q3L11j47J58n6j50N54l58j59K46l5J8r7l80P46q1
$$ -163 338 -264 -189 -197 -304 37 -353 -436 -125 -272 -114 -170 -320 234 -124 -283 -37 -72 -54 -151 -531 215 134
4397A34l82K88l69M78M1n79M67J2l72N01l95L37J52m36J62K22n40M37P7m63O20
$$ 134 -248 40 -329 149 190 -389 78 90 -282 219 -176 161 313 -123 39 261 -279 158 235 -228 392
4418C92m49j17M26r2K95m38j68M93l26q7O57n59L86l97k25P09l80k32K04k12N44
$$ 392 -57 -174 252 160 455 17 -151 342 16 -71 586 27 413 16 -209 500 120 -112 92 -120 424
4439D24m07k37N47j19m17L52k16J61nm79N25P2k78K12m38j8M10q90O81K02l35
$$ 424 17 -220 327 208 -209 143 -73 88 83 -396 129 201 -77 135 -303 -321 89 -801 -120 82 -253
4460b53N29o24K18L51o36M10j41L04Q9k83k87N08l06J64J83l54M82l59nK89j64
$$ -253 276 -348 -130 221 -415 -5 -146 158 247 -36 -323 185 -121 43 226 -128 354 -5 -10 279 115
4481A15j51K54k85N70m12m75O32j24j23K36n17N07L19n39J21J63l62K68k41PM61
$$ 115 -36 218 -67 503 91 -384 248 124 1 237 -280 227 546 7 128 291 -71 197 -44 -37 424
4502D24n59J51J82j04L77o76M03j09l29K02Q4j44L74j66r1J6k91K55J93l49J18
$$ 424 -135 16 198 94 471 -205 198 89 -240 -38 46 -98 276 110 19 35 -256 -1 192 -157 -39
4523c9J2J13l1j78N6J46l29L43j96m5L51o45N06jm18K32k6j28K57pk5Q1k82R2
$$ -39 -27 86 55 -123 -67 79 -250 93 -103 -148 203 -442 64 63 -355 -123 -149 -277 -20 -27 -52 29 -253 -161
4547a61K82l69L06j26L8M2l5j43K91j44O2J05p5K38l73J72N3k65K40k42j24K60
$$ -161 121 -248 58 -68 -30 12 -23 -166 125 -19 43 148 73 311 -62 110 163 -102 138 -104 -228 32
4569C2J70k54L61j72n5o9j04L26l4J3j76J52K2L0j40j88J58o1J48k22K84N1m19
$$ 32 202 -52 309 137 82 13 -91 235 201 214 38 190 212 242 102 -86 72 11 159 -63 221 272 -147
4592a47J24j51J6R2j43KK03k25k38K96m6K98k56Qk5kk2r5L12q3Q1k28J52j0k9
$$ -147 -23 -174 -158 -66 -209 -207 -4 -229 -467 -171 -217 81 -175 -167 -192 -194 -216 -311 1 -82 -1 -229 -77 -87 -116
4617a16L14m54J77j72K95P1j31O2n3j3j64J77r0j4K13q5P6j49r2L8M19j21j35
$$ -116 198 -256 -79 -251 44 115 -16 46 -7 -20 -184 -7 -97 -111 102 17 93 -56 -148 -110 309 188 53
4640E3L9o9J86j23J10p9j12N5o6M8O8k1P4j5q4r6L8m24L37K17K3k07J42j37K20
$$ 53 92 23 209 86 196 117 5 60 -6 42 110 89 163 148 64 -32 6 -418 -81 136 159 -48 94 -43 177
4665A77k88r0K32Q9l00j07L01k5j06J36m84L21j44J43J1P8j10J73J16k56J13m6
$$ 177 -111 -201 31 120 -180 -287 14 -11 -117 19 -465 -144 -288 -145 -134 -56 -166 7 123 -133 -20 -66
4687f6j49J15J90j47J06q8j57J65L8q7n9J28o5k25J80O6N6j27J21j6N3l4L9j07
$$ -66 -215 -100 90 -57 49 -39 -196 -31 7 -80 -139 -11 -76 -301 -121 -55 1 -126 -5 -21 32 -2 37 -70
4711g0J83j22J8K65k11O5O1j5l9j62J79j48K55j58J25jl59K30k60M29K5j51m6
$$ -70 113 -9 9 274 63 128 189 174 135 -27 152 4 259 101 226 225 -134 96 -164 265 290 139 93
4734I3O5q0j43J20n4K57k66J79j43l2J06k55rN4L4R5k57J66o3R5p5J64j2k41k8
$$ 93 158 78 -65 55 1 258 -8 171 28 -4 102 -153 -162 -108 -74 21 -236 -70 -133 -38 -113 51 39 -202 -230
4759b30P4J40Q5l8k37m2L06j78j8J22L2j12M7P6M7l50R3J37K6k1L23n41J13N50
$$ -230 -156 -16 69 31 -206 -248 58 -120 -138 -16 16 -96 -49 27 74 -276 -183 -46 -20 -41 282 -259 -146 404
4783D04l69j2q0O1J93l65K8K30j09K45K0l26M37n38j43L73J90O2k54P9K09j80
$$ 404 35 23 -57 4 197 -168 -140 90 -19 226 246 -80 357 -181 -324 49 239 301 47 126 335 155
4805A55j82K33j24K5J22l24M99k79k03P7J6k7N8k13K78%j67J52m36L21K70n41
$$ 155 -27 206 82 107 229 -95 404 125 -78 -1 15 -12 46 -167 111 111 -56 96 -340 -19 251 -290
4827b90M93j60q2J84k22J00J7l05K65k29M5L38k89k05N63j49j65O8j59M06m35
$$ -290 203 43 -39 145 -77 23 40 -265 0 -229 -184 154 -135 -340 223 74 -91 -23 -182 224 -211
4848b11l93P09J20l20L17l30K01m5m57M72q3P9K61k14J16K5n02K54K74k48K66
$$ -211 -604 105 225 -95 222 -108 93 48 -409 63 -20 59 320 106 222 247 -255 -1 273 25 291
4869B91o06M89K15p14M08j88P3K09j68l84P73m45K40R3n98O78l59k52R24n96l71
$$ 291 -315 174 389 -325 83 -105 -32 177 9 -375 398 -47 193 286 -312 366 7 -245 679 83 -288
4890b88K80l21L10J31m35M01j64J12m7m54N13J88m39Q2j07L03Qq03O99L29n68
$$ -288 -8 -329 -19 112 -323 78 -86 26 -21 -475 38 226 -213 -131 -238 65 73 -730 -31 298 -270
4911b70r4J17L44m5l05L63ml23J61j62J18K25k32r4M22m41M80j62l47N51m12n3
$$ -270 -364 -247 97 52 -253 110 106 -217 -56 -218 -100 125 -107 -201 221 -220 260 98 -249 302 -110 -163
4933a63N5J23K14k39k12N96j46j06L96n18K59k25k31J48K61k35O2R3q8L39m24
$$ -163 -108 15 229 -10 -222 374 228 122 518 0 259 34 -197 -49 212 -23 39 132 44 383 -41
4954d1K71Q4j95o0j99J78K41l19K27q6k09J71k63L05K3j9M5jl80L04k35k1K44
$$ -41 230 314 119 59 -140 38 279 -40 187 101 -108 63 -200 105 128 109 154 153 -227 77 -158 -179 65
4977F5o6j28m0R4J62p5k53L79lj11m6l38K98J91o73N56r0J02J4l75J97L13l22
$$ 65 -1 -129 -169 -75 87 12 -241 138 135 24 -22 -360 -62 129 -544 12 -78 24 38 -337 -140 173 -149
5000a49j4K17k89K56k62J39Q9l8J27%K3m8j71p7M07j72J48l09RL29o03J77L47
$$ -149 -163 54 -235 21 -241 -102 -13 -51 76 76 99 51 -120 -197 210 38 186 -123 -114 215 -388 -211 136
5023A36o4K73n0n53N03l2k02K15j02j27J43j01N0K1k58R7R6N37q72R6K08J09l50
$$ 136 72 345 295 -258 245 213 11 226 124 -3 140 39 89 110 -148 -51 45 582 -290 -194 14 123 -227
5046b27O2j89M59rK25k00J70l08k12M19k10K85k30j94PR1r5No45J015j06m06Q10
$$ -227 -165 -354 105 96 321 121 291 -17 -229 190 -20 265 35 -159 -152 -61 -156 -151 -796 219 113 -293 517
5069E17m73n7P4Kj76J04j62K19j94K08R5j48q6J47j3K16k76n5Q8l7J25p8Lj24
$$ 517 44 -13 61 63 -113 -9 -171 48 -146 62 157 9 -77 70 57 273 -3 -58 30 -7 118 40 43 -81
5093h1K01k2K04k52Q3m4r3J15r7j53J76O6Q4j42j23K72j11n2M5l2j60j2K96k83
$$ -81 120 98 302 50 133 89 -4 111 14 -139 37 103 187 45 -78 194 83 31 76 44 -116 -128 168 -115
5117a15K19P9o5N5j48J73j62j53o5M3q2K64K0m6M1k50K51j20j44O7K51k16p9L3
$$ -115 104 183 118 173 25 198 36 -117 -182 -139 -221 43 63 17 58 -192 59 -61 -205 -138 113 -103 -182 -149
5141a49J87p8j76J88j53K0K2K95k37J96k33J04M1j05R9j17L66j81l57N53qo5p8
$$ -149 38 -40 -216 -28 -181 -161 -139 156 -81 115 -118 -14 27 -78 21 -96 270 89 -268 285 277 212 134
5164A34k25R2l4M0m1M94q07K16K52l14q8M15P6k73j7L4k10N95M6m74M08k33L59
$$ 134 -91 1 -33 7 -34 460 -347 -131 121 -193 -281 134 210 -63 -80 -46 -256 339 385 -89 319 86 445
5187D45N3k60m28K20m18M1k6M25K2n11N21k96J34j89K01k5k0L3r3j64M18j80L64
$$ 445 498 238 -190 30 -388 -347 -373 52 74 -437 84 -212 -78 -267 -66 -91 -111 -78 -171 -335 83 -97 267
5210B67p62J81K0J72K41l55J86N0j99K20r9n6J2K9J26O7j35q9L11r2k35J28J10
$$ 267 -495 -314 -294 -122 119 -236 -50 0 -199 21 -78 -134 -122 -93 33 100 -35 -124 187 95 -140 -12 98
5233I8j75J4R3o7K36r1O3k70J37N9j3Lj23O7k05J39K20m1j42nJ90r3K01q9K23
$$ 98 -77 -63 30 -37 199 108 171 -99 38 97 84 87 -36 31 -174 -35 185 144 2 -3 187 94 295 206 429
5258D29l32J48r0k85L25j04k42J55KJ35j22m49N99r2q1j00J18J2j62M3q7K12l20
$$ 429 97 245 155 -130 195 91 -151 4 6 141 19 -430 169 77 -4 -104 14 26 -136 -93 -180 32 -288
5281b88K40p2K10P7m57M08j8m17J42n0n6L69k79J63J51k19O1k8j10J52mP1J77
$$ -288 -48 -120 90 167 -290 118 100 -317 -175 -225 -281 88 -191 -28 123 -96 -35 -63 -173 -21 -25 46 223
5304B23k21J3K00k94M34m21J22k6J41k41K28n6l6K30n92M04n1N7N6m48M30J36
$$ 223 2 15 215 -79 355 -66 56 30 171 -70 158 102 66 296 -296 108 57 114 170 -278 152 288
5326B88l83P9Kn4K32l77L05J21R5K0k52J67j69M1o6l45M1L19mk52L24j46lj11
$$ 288 -95 -16 -14 -68 164 -213 92 213 308 328 76 243 74 115 49 -296 -255 64 60 -192 132 -14 -17 -128
5350a28o7M96l52p0P7J76j27N2l40L28J2l03K77j31j03K90k38J46J13j38o8K00
$$ -128 -195 301 -51 -121 -44 132 5 57 -283 45 57 -246 31 -100 -203 87 -151 -5 108 -30 -98 102
5372A02j4k63j99K85R8k79J61J43k71L79l21J1K51k73J97O0m31O41j73m3K88l29
$$ 102 88 -175 -374 -89 9 -270 -109 34 -237 142 -179 -168 83 -190 7 67 -364 277 104 61 349 20
5394B0K55p2l50R8L28k41J94k62J24Q0r8o5L16j63l04J92k55K49j19L31K51n27
$$ 20 275 203 -147 -49 279 38 232 -30 94 174 76 11 327 164 -140 52 -203 46 -73 258 509 -18
$$ [...]
8191B68
##END NTUPLES=NMR FID
##END=
