##TITLE=1H_Pr AmBn
 CDCl3, 8 sc, 
 9.07.2021
##JCAMPDX= 6.0         $$ Bruker NMR JCAMP-DX V2.0
##DATA TYPE= NMR FID
##DATA CLASS= NTUPLES
##ORIGIN= UXNMR, Bruker Analytische Messtechnik GmbH
##OWNER= root
$$ XWIN-NMR		Version 3.5
$$ Fri Jul  9 08:37:05 2021 Russian Standard Time (UT+4h)  she@DPX200
##.OBSERVE FREQUENCY= 200.131506
##.OBSERVE NUCLEUS= ^1H
##.DELAY= (6, 6)
##.ACQUISITION MODE= SIMULTANEOUS
##.ACQUISITION SCHEME= undefined
##.AVERAGES= 8
##.DIGITISER RES= 18
##SPECTROMETER/DATA SYSTEM= spect
##.PULSE SEQUENCE= zg30
##.SOLVENT NAME= CDCl3
##.SHIFT REFERENCE= (INTERNAL, CDCl3, 0, 15.7039)
##AUDIT TRAIL= $$ (NUMBER, WHEN, WHO, WHERE, WHAT)
$$ ##TITLE= Audit trail, XWIN-NMR		Version 3.5
$$ ##JCAMPDX= 5.01
$$ ##ORIGIN= Bruker BioSpin GmbH
$$ ##OWNER= she
$$ F:/spectra/data/she/nmr/H-F/1/audita.txt
$$ ##AUDIT TRAIL=  $$ (NUMBER, WHEN, WHO, WHERE, WHAT)
(   1,<2021-07-09 08:36:06.54 +0400>,<she>,<DPX200>,
      <created by zg, POWCHK disabled, PULCHK disabled
       configuration hash MD5:
       00 E9 B6 7A A2 85 ED C7 34 08 36 98 17 FE 4E 26
       data hash MD5: 16K
       E7 F6 6E 88 B9 6E EF FC B8 CB 61 EC AE A8 D5 1A>)
$$ ##END=
$$ 
$$ hash MD5
$$ 3C 30 46 44 0A 81 3F 68 1E AD 7A D9 24 43 7C B6
##$RELAX= 
##$RELAX= 
##$RELAX= 
##$RELAX= 
##$RELAX= 
##$RELAX= 
$$ Bruker specific parameters
$$ --------------------------
##$DU= <F:/spectra>
##$EXPNO= 1
##$NAME= <H-F>
##$PROCNO= 1
##$TYPE= <nmr>
##$USER= <she>
##$AMP= (0..31)
100 100 100 100 100 100 100 100 100 100 100 100 100 100 100 100 100 100 
100 100 100 100 100 100 100 100 100 100 100 100 100 100 
##$AQSEQ= 0
##$AQ_mod= 1
##$AUNM= <au_zg>
##$AUTOPOS= <>
##$BF1= 200.13
##$BF2= 200.13
##$BF3= 200.13
##$BF4= 200.13
##$BF5= 200.13
##$BF6= 200.13
##$BF7= 200.13
##$BF8= 200.13
##$BYTORDA= 1
##$CFDGTYP= 0
##$CFRGTYP= 5
##$CHEMSTR= <none>
##$CNST= (0..31)
1 1 145 1 1 1 1 1 1 1 1 1 1 1 1 1 1 1 1 1 1 1 1 1 1 1 1 1 1 1 1 1 
##$CPDPRG= <>
##$CPDPRG1= <>
##$CPDPRG2= <>
##$CPDPRG3= <>
##$CPDPRG4= <mlev>
##$CPDPRG5= <mlev>
##$CPDPRG6= <mlev>
##$CPDPRG7= <mlev>
##$CPDPRG8= <mlev>
##$CPDPRGB= <>
##$CPDPRGT= <>
##$D= (0..31)
0 1.2 0 0 0 0 0 0 0 0.06 0 0.03 0 0 0 0 0.0002 0 0 0 0 0 0 0 0 0 0 0 0 
0 0 0 
##$DATE= 1625805365
##$DBL= (0..7)
120 120 120 120 120 120 120 120 
##$DBP= (0..7)
150 150 150 150 150 150 150 150 
##$DBP07= 0
##$DBPNAM0= <>
##$DBPNAM1= <>
##$DBPNAM2= <>
##$DBPNAM3= <>
##$DBPNAM4= <>
##$DBPNAM5= <>
##$DBPNAM6= <>
##$DBPNAM7= <>
##$DBPOAL= (0..7)
0.5 0.5 0.5 0.5 0.5 0.5 0.5 0.5 
##$DBPOFFS= (0..7)
0 0 0 0 0 0 0 0 
##$DE= 6
##$DECBNUC= <off>
##$DECIM= 32
##$DECNUC= <off>
##$DECSTAT= 4
##$DIGMOD= 1
##$DIGTYP= 9
##$DL= (0..7)
0 120 120 120 120 120 120 120 
##$DP= (0..7)
150 150 150 150 150 150 150 150 
##$DP07= 0
##$DPNAME0= <>
##$DPNAME1= <>
##$DPNAME2= <>
##$DPNAME3= <>
##$DPNAME4= <>
##$DPNAME5= <>
##$DPNAME6= <>
##$DPNAME7= <>
##$DPOAL= (0..7)
0.5 0.5 0.5 0.5 0.5 0.5 0.5 0.5 
##$DPOFFS= (0..7)
0 0 0 0 0 0 0 0 
##$DQDMODE= 0
##$DR= 18
##$DS= 0
##$DSLIST= <SSSSSSSSSSSSSSS>
$$ [...]
##$SUBNAM2= <"">
##$SUBNAM3= <"">
##$SUBNAM4= <"">
##$SUBNAM5= <"">
##$SUBNAM6= <"">
##$SUBNAM7= <"">
##$SUBNAM8= <"">
##$SUBNAM9= <"">
##$SW= 20.0188882624521
##$SWIBOX= (0..15)
0 0 2 0 0 0 0 0 0 0 0 0 0 0 0 0 
##$SW_h= 4006.41025641026
##$TD= 16384
##$TD0= 1
##$TE= 0
##$TE2= 300
##$TE3= 300
##$TEG= 300
##$TL= (0..7)
0 120 120 120 120 120 120 120 
##$TP= (0..7)
150 150 150 150 150 150 150 150 
##$TP07= 0
##$TPNAME0= <>
##$TPNAME1= <>
##$TPNAME2= <>
##$TPNAME3= <>
##$TPNAME4= <>
##$TPNAME5= <>
##$TPNAME6= <>
##$TPNAME7= <>
##$TPOAL= (0..7)
0.5 0.5 0.5 0.5 0.5 0.5 0.5 0.5 
##$TPOFFS= (0..7)
0 0 0 0 0 0 0 0 
##$TUNHIN= 0
##$TUNHOUT= 0
##$TUNXOUT= 0
##$USERA1= <user>
##$USERA2= <user>
##$USERA3= <user>
##$USERA4= <user>
##$USERA5= <user>
##$V9= 5
##$VALIST= <valist>
##$VCLIST= <CCCCCCCCCCCCCCC>
##$VD= 0
##$VDLIST= <DDDDDDDDDDDDDDD>
##$VPLIST= <PPPPPPPPPPPPPPP>
##$VTLIST= <TTTTTTTTTTTTTTT>
##$WBST= 1024
##$WBSW= 4
##$XGAIN= (0..3)
0 0 0 0 
##$XL= 0
##$YL= 0
##$YMAX_a= 365009
##$YMIN_a= -604845
##$ZGOPTNS= <>
##$ZL1= 120
##$ZL2= 120
##$ZL3= 120
##$ZL4= 120
##$ABSF1= 10
##$ABSF2= 0
##$ABSG= 5
##$ABSL= 3
##$ALPHA= 0
##$AQORDER= 0
##$ASSFAC= 0
##$ASSFACI= 0
##$ASSFACX= 0
##$ASSWID= 0
##$AUNMP= <proc_1d>
##$AZFE= 0.1
##$AZFW= 0.1
##$BCFW= 1
##$BC_mod= 2
##$BYTORDP= 1
##$COROFFS= 0
##$CY= 11.3945322036743
##$DATMOD= 1
##$DC= 2
##$DFILT= <>
##$DTYPP= 0
##$F1P= 17.5019972093344
##$F2P= -2.517084195857
##$FCOR= 0.5
##$FTSIZE= 0
##$FT_mod= 4
##$GAMMA= 1
##$GB= 0.15
##$INTBC= 1
##$INTSCL= 1
##$ISEN= 128
##$LB= 0.24
##$LEV0= 0
##$LPBIN= 0
##$MAXI= 10000
##$MC2= 0
##$MEAN= 0
##$ME_mod= 0
##$MI= 1.114404
##$NCOEF= 0
##$NC_proc= 0
##$NLEV= 6
##$NOISF1= 3.799351
##$NOISF2= 2.8
##$NSP= 1
##$NTH_PI= 0
##$NZP= 0
##$OFFSET= 15.70392
##$PC= 1
##$PHC0= -12276.49
##$PHC1= 14.20101
##$PH_mod= 1
##$PKNL= yes
##$PPARMOD= 0
##$PSCAL= 0
##$PSIGN= 0
##$REVERSE= no
##$SF= 200.130013532006
##$SI= 16384
##$SIGF1= 3
##$SIGF2= 2
##$SINO= 400
##$SIOLD= 16384
##$SREGLST= <1H.CDCl3>
##$SSB= 0
##$STSI= 0
##$STSR= 0
##$SW_p= 3612.71676300578
##$SYMM= 0
##$S_DEV= 0
##$TDeff= 0
##$TDoff= 0
##$TI= <>
##$TILT= no
##$TM1= 0
##$TM2= 0
##$TOPLEV= 0
##$USERP1= <user>
##$USERP2= <user>
##$USERP3= <user>
##$USERP4= <user>
##$USERP5= <user>
##$WDW= 1
##$XDIM= 8192
##$YMAX_p= 0
##$YMIN_p= 0
$$ End of Bruker specific parameters
$$ ---------------------------------
##NTUPLES= NMR FID
##VAR_NAME=  TIME,          FID/REAL,        FID/IMAG
##SYMBOL=    X,             R,               I
##VAR_TYPE=  INDEPENDENT,   DEPENDENT,       DEPENDENT
##VAR_FORM=  AFFN,          ASDF,            ASDF
##VAR_DIM=   8192,          8192,            8192
##UNITS=     SECONDS,       ARBITRARY UNITS, ARBITRARY UNITS
##FACTOR=    0.0002496,     1,               1
##FIRST=     0,             0,               0
##LAST=      2.0444736,     0,               0
##MIN=       0,             -604845,         0
##MAX=       2.0444736,     365009,          0
$$ Real data points
##PAGE= N=1
##DATA TABLE= (X++(R..R)), XYDATA
$$ plain form
0 0 0 0 0 0 0 0 0 0 0 3 -8 8 -16 16 -18 24 -32 40 -48 56 -70 81 -97 114 -136 160 -185 214 -247 284 -326
31 -326 370 -422 478 -537 608 -681 764 -853 953 -1062 1178 -1306 1450 -1604 1772 -1955
47 -1955 2156 -2377 2617 -2883 3177 -3500 3865 -4266 4724 -5240 5833 -6522 7331 -8298
61 -8298 9481 -10965 12891 -15495 19235 -25093 35624 -60426 244894 -70889 -479023 245390
73 245390 354984 -89434 -140050 209789 103889 -111387 -48324 105839 89919 49457 -74208
84 -74208 -126695 24162 193830 46727 -188600 -97417 163614 64331 -155962 -55263 101777
95 101777 -33380 -132160 -3515 38216 -69714 -53706 -44319 -106087 -466 65220 -156346
106 -156346 -199773 74381 95475 -164966 -150710 43177 -5257 -94343 -18714 -17884 -70374 -27542
$$ packed form
0@%%%%%%%%%Lj1J6k4L2l4M2n6P2q8J04j26J51j78K11k50K96l45L99m61N31o10
31c26O96p92R00j015J145j289J445j617J806k015K240k484K756l054L376l727
47a955M111m533M994n500O060o677P365q131Q990r964J1073j2355J3853j5629
61h298J7779k0446K3856k8386L4730m4328O0717r6050L05320l15783m08134P24413
73B45390J09594m44418n0616L49839j05900k15276O3063J54163j5920m0462j23665
84g4208n2487J50857J69668j47103k35327R1183K61031r9283k20293J00699J57040
95A01777j35157r8780J28645M1731j07930J6008R387o1768J05621O5686k21566
106a56346m3427K74154K1094k60441J4256J93887m8434q9086P5629Q30n2490M2832
$$ plain form
118 -27542 -28000 -61981 10809 41103 -84635 -128854 27072 86712 -64671 -110575 21329 43938
130 43938 -56333 -24280 70932 -25379 -103699 67251 111233 -87218 -49271 147464 25859
141 25859 -136487 68548 192629 -67322 -140389 125567 144265 -66390 -41163 82776 33360
152 33360 -14654 43997 44370 -5392 18014 28843 -8435 40331 94372 5210 -71111 22694
164 22694 114207 25329 -58778 32561 70766 -38828 -29222 86876 42231 -66657 -15695 49459
176 49459 -12471 -18159 44843 -10142 -60229 21219 40115 -32586 -20654 23967 -16452 -39957
188 -39957 18669 22575 -33125 -16641 10626 -23858 -20462 15077 -10575 -43660 -3185 26166
200 26166 -32271 -53682 18503 20261 -52948 -27798 42206 -9888 -80902 -539 72390 -22111
$$ packed form
118b7542m58l3981P2790L0294j25738m4219J55926N9640j51383m5904J31904K2609
130D3938j00271L2053R5212r6311p8320J70950M3982j98451L7947J96735j21605
141B5859j62346K05035J24081k59951p3067K65956J8698k10655K5227J23939m9416
152C3360m8014N8651L73m9762K3406J0829l7278M8766N4041q9162p6321R3805
164B2694R1513q8878q4107R1339L8205j09594R606J16098m4645j08888N0962O5154
176D9459o1930n688O3002n4985n0087Q1448J8896p2701J1932M4621m0419k3505
188c9957N8626L906n5700J6484K7267l4484L396L5539k5652l3085M0475K9351
200B6166n8437k1411P2185J758p3209K5150P0004n2094p1014Q0363P2929r4501
$$ plain form
212 -22111 -73467 17177 31605 -38902 -17936 36169 -1175 -43808 -7144 18676 2967 5328
224 5328 -11504 -40580 2055 42633 -4175 -39806 4176 26683 -23151 -21914 44096 22869
236 22869 -49980 -22455 42907 22990 -22542 -4344 15651 -8420 1235 26950 -7807 -25530
248 -25530 16890 21448 -14988 -6269 23097 -5741 -30759 17925 38041 -13233 -27372 4318
260 4318 15763 12652 8464 -6249 -15908 9302 28185 -3568 -13350 19733 6688 -26622 4888
273 4888 46380 5117 -48862 -6848 44782 7189 -21670 6872 9551 -10867 1247 21415
285 21415 6126 -11443 4196 8665 548 13424 9629 -13049 -3248 20396 13499 -10037 -9118
298 -9118 6880 1733 2011 13423 -3761 -18802 1060 15900 494 -9664 5996 4225 -18135
$$ packed form
212b2111n1356R0644J4428p0507K0966N4105l7344m2633L6664K5820j5709K361
224E328j6832k9076M2635M0578m6808l5631M3982K2507m9834J237O6010k1227
236B2869p2849K7525O5362j9917m5532J8198J9995k4071R655K5715l4757j7723
248b5530M2420M558l6436Q719K9366k8838k5018M8684K0116n1274j4139L1690
260D318J1445l111m188j4713r659K5210J8883l1753r782L3083j3045l3310L1510
273D888M1492m1263n3979M2014N1630l7593k8859K8542K679k0418J2114K0168
285B1415j5289j7569J5639M469q117J2876l795k2678R801K3644o897k3536R19
298i118J5998n147K78J1412j7184j5041J9862J4840j5406j0158J5660j771k2360
$$ plain form
311 -18135 2767 28683 -2961 -27790 -1146 20490 3381 -12042 -1027 -2009 -10980 1672 4909
324 4909 -5916 -4529 -8042 -12242 -612 8791 -3373 -19680 -5667 13592 -2849 -14501 453
337 453 4685 -5074 -5956 5235 2744 -13921 -5186 8661 -2915 -6512 1200 -5373 -9216 2232
351 2232 8281 -7621 -12381 7382 5997 -7297 1388 5116 -2834 -756 6475 6350 -501 83 3954
366 3954 -1259 3370 9554 91 -3455 3252 5344 318 -3173 6448 8847 -4178 -773 8517 1877
381 1877 -1915 6153 9840 129 -3726 7585 6077 -1605 4269 3248 -1264 3200 2942 -413 -999
396 -999 418 1286 -1679 1419 2946 -4177 -4205 1395 3472 1753 -5362 -3474 3682 -479 -1502 -480
412 -480 -4637 -1793 2748 -75 -6320 -4182 1858 -4987 -7078 5957 2221 -10712 -8507 -20 5747
$$ packed form
311a8135K0902K5916l1644k4829K6644K1636j7109j5423J1015r82q971J2652L237
324D909j0825J387l513m200J1630R403j2164j6307J4013J9259j6441j1652J4954
337D53M232r759q82J1191k491j6665Q735J3847j1576l597P712o573l843J1448
351B232O049j5902m760J9763j385j3294Q685L728p950K078P231j25o851N84L871
366C954n213M629O184r463l546O707K092n026l491R621K399j3025L405R290o640
381A877l792Q068L687r711l855J1311j508p682N874j021m512M464k58l355n86
396i99J417Q68k965L098J527p123k8N600K077j719p115J888P156m161j023J022
412d80m157K844M541k823o245K138O040o845k091J3035l736j2933K205Q487N767
$$ plain form
427 5747 1553 -9493 -8414 4335 7474 -5318 -10632 3887 5949 -6006 -3867 3701 4213 -4777
441 -4777 -12164 2866 17129 516 -17407 -6054 12981 7223 -6718 -3787 1100 2015 3458 -3055
455 -3055 -24 9502 -1715 -11355 4231 15139 2079 -12366 -4528 8412 9261 1805 -9065 -3578
469 -3578 11097 939 -8487 4364 5957 -4566 -3756 2602 1700 -1048 -633 -3933 -1260 9349 493
484 493 -12355 -1672 6707 2814 110 -6823 -5700 6007 5114 -6240 -4404 4574 -1955 -6551 5070
499 5070 2253 -6956 935 -2028 -7351 9685 11063 -12998 -15975 9584 17540 -4142 -13950 630
513 630 12157 4269 -12441 -2233 20974 855 -22841 4040 23599 -103 -17505 -1782 12114
526 12114 7866 313 -8896 -5881 15241 8460 -15037 -1373 18631 3300 -15045 -5162 16020
$$ packed form
427E747m194j1046J079J2749L139j2792n314J4519K062j1955K139P568N12q990
441d777p387J5030J4263j6613j7923J1353J9035n758j3941K931M887R15J443o513
455c055L031R526j1217r640J5586J0908j3060j4445P838J2940Q49p456j0870N487
469c578J4675j0158r426J2851J593j0523Q10O358r02k748M15l300K673J0609q856
484D93j2848J0683Q379l893k704o933J123J1707q93j1354J836Q978o529m596J1621
499E070k817r209P891k963n323J7036J378k4061k977K5559P956k1682r808J4580
513F30J1527p888j6710J0208K3207k0119k3696K6881J9559k3702j7402J5723J3896
526A2114m248p553r209L015K1122o781k3497J3664K0004j5331j8345R883K1182
$$ plain form
539 16020 12959 -11998 -15881 10541 20908 -10824 -24509 13150 21480 -14580 -17282 7127 8605
552 8605 -3078 -7462 -4274 2551 4563 -5796 -10761 5219 9574 -11030 -14132 2197 10966 3295
566 3295 -16751 -16489 11300 11680 -16487 -12342 13762 2318 -24467 -2682 20959 -3342 -16788
579 -16788 1270 5306 -3584 -1552 4489 988 -7147 43 9102 1619 -7716 532 12286 -316
593 -316 -13096 8198 16865 -6745 -6802 10280 4647 -2547 7424 7495 -3057 3103 11277 -2753 -2203
608 -2203 18569 11023 -11946 -7384 14987 18435 -3189 -12145 7407 14649 -2610 -8690 9877
621 9877 15160 -8148 -12995 9875 13597 250 -7173 -6322 3544 10545 1763 -10432 -5511 8040
635 8040 1625 -12437 -3545 9371 1532 -15194 -14633 9615 12457 -17193 -19758 10074 10153 -18726
$$ packed form
539A6020l061k4957l883K6422J0367l1732j3685L7659Q330l6060k702K4409J478
552H605j1683m384L188O825K012j0359m965J5980M355k0604l102J6329Q769p671
566C295k0046K62K7789L80k8167M145K6104j1444k6785K1785K3641k4301j3446
579a6788J8058M036q890K032O041l501q135P190R059p483r335Q248J1754j2602
593c16j2780K1294Q667k3610n7J7082n633p194R971P1j0552O160Q174j4030N50
608b203K0772p546k2969M562K2371L448k1624q956J9552P242j7259o080J8567
621I877N283k3308m847K2870L722j3347p423Q51R866P001q782j2195M921J3551
635H040o415j4062Q892J2916p839j6726N61K4248K842k9650k565K9832P9k8879
$$ plain form
649 -18726 -16586 11740 5165 -19016 -8813 5743 -2822 -7607 -2554 -2421 -6855 -4307 1307 -3025
663 -3025 -5428 -430 -3615 -7711 -1483 6184 2987 -9666 -8644 5515 4020 -1678 3605 1417 -8045
678 -8045 -2588 12447 7334 -7453 -53 7592 -1581 1350 10694 4974 -3381 -1562 5251 9823 8055
693 8055 548 -4402 4435 11476 4148 1800 4931 2743 2937 3129 2156 7387 8098 -1754 -5205 5702
709 5702 12539 -402 -7044 4405 8890 48 -6733 -308 11527 3480 -12932 -3460 11394 1975
723 1975 -10848 -1467 6142 -5592 -7643 3518 961 -3992 -3398 -8000 -4919 5202 2053 -9387
737 -9387 -8920 -137 -1149 -4723 -1320 -2617 -6327 -5301 -4444 198 669 -6915 -7812 -1585 -659 -1800
753 -1800 -2081 -3993 -5557 -842 2998 -3164 -3901 1770 -3056 -4133 3710 1475 -3327 -590 1742 -170
$$ packed form
649a8726K140K8326o575k4181J0203J4556q565m785N053J33m434K548N614m332
663c025k403M998l185m096O228P667l197j2653J022J4159j495n698N283k188r462
678h045N457J5035n113j4787P400P645r173K931R344n720q355J819O813M572j768
693H055p507m950Q837P041p328k348L131k188J94J92r73N231P11r852l451J0907
709E702O837j2941o642J1449M485q842o781O425J1835q047j6412R472J4854r419
723A975j2823R381P609j1734k051J1161k557m953N94m602L081J0121l149j1440
737i387M67Q783j012l574L403j297l710J026Q57M642M71p584q97O227R26j141
753a800k81j912j564M715L840o162p37N671m826j077P843k235m802K737K332j912
$$ plain form
769 -170 59 2601 -426 -730 4616 728 -2058 4256 2763 -688 4066 4720 195 244 4797 5087 868
786 868 806 3646 3471 3430 1540 2450 3714 -916 1188 7968 2533 -2975 1224 4426 1957 1020 4376
803 4376 880 -2959 2387 4062 132 1359 -442 -2420 2337 3267 -1137 -3488 446 1694 -2405
818 -2405 -1146 1752 -2267 -3531 -1880 210 1729 -3662 -4826 792 763 -3326 -3426 -1028 -566 -2765
834 -2765 -1419 -1259 -4030 -1968 -726 -2075 36 -1656 -4347 -1952 46 434 -1083 -2444 -1939 -1453
850 -1453 1510 1134 -3529 -1454 1056 -559 -406 646 -223 -589 -1183 1509 1766 -563 -274 -944 936
867 936 2707 243 -44 304 772 3061 1219 -1172 828 2082 1982 1334 1260 1122 -849 353 3780
884 3780 1442 397 617 -1102 1390 3319 2001 -910 -1607 2861 2756 -1438 272 1924 402 -324
$$ packed form
769a70K29K542l027l04N346l888k786O314j493l451M754O54m525M9M553K90m219
786H68o2K840j75m1j890R10J264m630K104O780n435n508M199L202k469r37L356
803D376l496l839N346J675l930J227j801j978M757R30m404k351L934J248m099
818b405J259K898m019j264J651K090J519n391j164N618k9m089j00K398M62k199
834b765J346J60k771K062J242j349K111j692k691K395J998L88j517j361N05M86
850a453K963l76m663K075K510j615J53J052q69l66n94K692K57k329K89o70J880
867I36J771k464k87L48M68K289j842k391K000J254j00o48p4j38j971J202L427
884C780k338j045K20j719K492J929j318k911o97M468j05m194J710J652j522p26
$$ plain form
900 -324 318 2622 784 -2888 426 3108 733 -1279 -1510 1128 1646 -60 -127 -961 166 1701 -672
917 -672 411 1878 -1732 -2390 1311 3411 45 -3754 -880 1785 313 -169 -328 -667 -398 -1359 -91
934 -91 1012 -1143 -1057 -783 -169 1127 -1133 -2271 -1117 936 939 -2494 -2367 839 -606 -1348 -317 -775
952 -775 -1120 -1246 -983 263 63 -940 -3069 -1844 2975 881 -3811 -1964 -58 374 -231 -1051 -199
969 -199 -1034 -1338 310 -402 -203 441 -1143 -1353 -201 1545 559 -3515 -77 4308 25 -2867 -214
986 -214 2130 1102 -487 666 -8 -495 2359 889 -1038 2779 1729 -1787 -346 4323 4071 -2302
1002 -2302 -2772 3977 4326 1117 -1185 -9 2946 1656 -275 1279 1979 1758 -288 -978 3089 3938
1018 3938 -967 -2490 1457 4585 153 -3262 1278 2189 -483 769 -133 -1180 803 1852 -1430
$$ packed form
900c24O42K304j838l672L314K682k375k012k31K638N18j706o7q34J127J535k373
917f72J083J467l610o58L701K100l366l799K874K665j472m82j59l39K69r61J268
934i1J103k155Q6K74O14J296k260j138J154K053Ll433J27L206j445p42J031m58
952g75l45j26K63J246k00j003k129J225M819k094m692J847J906M32o05q20Q52
969a99q35l04J648p12J99O44j584k10J152J746r86m074L438M385m283k892K653
986b14K344j028j589J153o74m87K854j470j927L817j050l516J441M669k52o373
1002b302m70O749L49l209k302J176K955j290j931J554P00k21k046o90M067Q49
1018C938m905j523L947L128m432l415M540R11k672J252r02j047J983J049l282
$$ plain form
1033 -1430 -2658 2444 2124 -4911 -1563 4227 -884 -4621 -458 2351 -1193 -3360 -452 -391 -2733 779
1049 779 864 -3117 -3415 671 2231 -2338 -4097 1793 160 -4865 -846 2887 -1441 -4990 -1490 1761
1065 1761 -826 -491 -103 -4744 -1410 4501 116 -4059 -314 1404 -796 -1907 1526 1821 -735 -1743
1081 -1743 -1944 1861 4668 -1864 -4615 2685 4280 -1161 -2978 2111 3687 -1080 -2269 1900 3229
1096 3229 771 -1671 1089 2502 -805 806 3414 -1277 -28 3690 -1590 -3162 5689 6553 -5502
1111 -5502 -4635 7808 2855 -5543 2702 4933 -3801 -3085 4447 3437 -2189 -1517 1309 -568 -96 2796
1127 2796 1017 -2396 -3345 1691 4234 -1991 -2526 2443 -1123 -3685 3053 3284 -3671 -3060 2846 -836
1143 -836 -3343 3903 1081 -5427 -165 2587 -1933 -455 711 -2215 -1254 1521 -1794 -2808 3794
$$ packed form
1033a430j228N102l20p035L348N790n111l737M163K809l544k167K908O1k342L512
1049G79Q5l981k98M086J560m569j759N890j633n025M019L733m328l549L500L251
1065A761k587L35L88m641L334N911m385m175L745J718k200j111L433K95k556j008
1081a743k01L805K807o532k751P300J595n441j817N089J576m767j189M169J329
1096C229k458k442K760J413l307J611K608m691J249L718n280j572Q851Q64j2055
1111e502Q67J2443m953q398Q245K231q734P16P532j010n626O72K826j877M72K892
1127B796j779l413r49N036K543o225n35M969l566k562O738K31o955O11N906l682
1143h36k507P246k822o508N262K752m520J478J166k926R61K775l315j014O602
$$ plain form
1158 3794 1205 -6751 -411 4831 -1558 -2490 1066 195 -1923 -2274 798 2513 -457 -3483 -1713 1591
1174 1591 409 -229 1954 -3032 -4603 4485 2020 -5438 1417 4617 -6444 -4807 8210 3803 -8561
1189 -8561 -1598 5443 -2543 -2306 4173 -262 -3841 56 1401 -195 201 897 -1018 -1592 869 1701
1205 1701 1133 -1227 -1605 3270 471 -3767 2925 4293 -2913 -1474 3709 407 -1769 3443 2434
1220 2434 -3464 1190 3505 -2026 1700 4992 -2666 -2624 4684 2895 -2073 1745 3069 -3010 -630
1235 -630 5548 1780 -2142 650 836 909 1262 1110 1042 -605 -1123 1907 2636 -708 -1412 1719 -101 -2572
1253 -2572 3955 2656 -5650 -1024 5576 -2120 -4079 3724 1717 -5657 -604 4272 -1967 -3555 2494
1268 2494 -651 -3967 891 948 -2695 -1432 435 -1046 -2961 -1038 1123 -861 -2494 -1628 -229 -747
$$ packed form
1158C794k589p956O340N242o389r32L556q71k118l51L072J715k970l026J770L304
1174A591j182o38K183m986j571R088k465p458O855L200j1061J637J3017m407j2364
1189h561O963P041p986K37O479m435l579L897J345j596L96O96j915n74K461Q32
1205A701n68k360l78M875k799m238O692J368p206J439N183l302k176N212j009
1220B434n898M654K315n531L726L292p658M2P308j789m968L818J324o079K380
1235f30O178l768l922K792J86P3L53j52o8j647n18L030P29l344p04L131j820k471
1253b572O527j299q306M626O600p696j959P803k007p374N053M876o239j588O049
1268B494l145l316M858N7l643J263J867j481j915J923K161j984j633Q66J399n18
$$ plain form
1284 -747 -2204 530 518 -4220 -2126 2452 -883 -2020 389 -1286 -3885 975 3305 -2391 -2936 2025
1300 2025 -1240 -2483 3343 1679 -3839 -1596 2435 676 -845 1697 1104 -2503 344 2611 652
1315 652 56 688 587 582 498 2149 1577 -812 968 2426 56 -1 2749 2893 -1270 -330 3714 46
1333 46 -940 4015 2060 -2495 507 3462 434 -798 3131 1272 -3020 1226 4378 -234 -1541 1019
1349 1019 988 -978 53 2347 -143 -2215 670 1077 -1235 -707 394 -682 -2203 6 1734 -2430
1365 -2430 -2970 1249 -1 -2784 -1251 162 -2041 -2703 686 -120 -3706 -1168 241 -2760 -1515 703
1381 703 -1986 -3037 -466 1049 -1565 -2705 -322 -910 -1992 -136 -238 -1465 -1052 -256 -293 -1405 -198
1398 -198 520 -1475 -909 1548 86 -1363 191 1535 100 -1479 1070 1501 -1216 1051 2424 -391
$$ packed form
1284g47j457K734j2m738K094M578l335j137K409j675k599M860K330n696n45M961
1300B025l265j243N826j664n518K243M031j759j521K542n93l607K847K267j959
1315F52n96O32j01nq4J651n72k389J780J458k370n7K750J44m163R40M044l668
1333D6r86M955j955m555L002K955l028j232L929j859m292M246L152m612j307K560
1349A019l1j966J031K294k490k072K885M07k312N28J101j076j521K209J728m164
1365b430n40M219j250k783J533J413k203o62L389q06l586K538J409l001J245K218
1381G03k689j051K571J515k614j140K383n88j082J856j02j227M13P96l7j112J207
1398a98P18j995N66K457j462j449J554J344j435j579K549M31k717K267J373k815
$$ plain form
1414 -391 -832 1757 1803 377 788 2214 -284 -660 3102 2130 -329 777 1858 698 338 2194 2169
1431 2169 -694 514 2869 745 -182 1794 1678 -227 -282 2243 1160 -1404 1272 2415 -685 -550
1447 -550 1201 678 -523 574 1492 -854 -1734 1514 902 -1052 -136 196 -913 -1447 546 1045 -1667
1464 -1667 -1572 329 -495 -854 -328 -710 -1184 -1405 -136 -454 -1470 -236 -170 -1358 -748 -280 -1276 -940 -676
1483 -676 110 -841 -1514 -64 -546 -565 -14 -901 -1180 -331 3 -133 -502 63 -654 -1151 814 1206 -438
1502 -438 -828 157 829 170 234 1062 -203 -731 1419 1191 -123 145 983 493 -49 683 1487 -207 -310
1521 -310 1783 896 -439 459 1292 910 -76 893 1099 -539 508 1651 90 178 252 421 163 596 1019
1540 1019 -68 -767 459 452 393 223 -492 214 310 -48 536 -174 -494 40 24 69 -245 -29 -515 -643 379
$$ packed form
1414c91m41K589M6j426M11J426k498l76L762r72k459J106J081j160l60J856k5
1431B169k863J208K355k124r27J976j16j905n5K525j083k564K676J143l100J35
1447e50J751n23j201J097R18k346q80L248o12j954R16L32j109n34J993M99k712
1464a667R5J901q24l59N26l82m74k21J269l18j016J234O6j188O10M68r96L36K64
1483f76P86r51o73J450m82j9N51q87k79Q49L34j36l69N65p17m97J965L92j644
1502d38l90R85O72o59O4Q28j265n28K150k28j314K68Q38m90n42P32Q04j694j03
1521c10K093q87j335Q98Q33l82r86R69K06j638J047J143j561Q8P4J69k58M33M23
1540A019j087o99J226pn9j70p15P06R6l58N84p10l20N34j6M5l14K16m86j28J022
$$ plain form
1561 379 520 -1171 -381 298 -404 -71 104 -333 -896 -105 418 -726 -724 818 -726 -628 674 546 -1054
1580 -1054 -769 -425 750 -22 -757 -253 14 132 -1169 253 542 -1320 -448 1165 -704 -862 757
1597 757 -67 -898 -37 562 -570 -730 761 600 -580 -231 -963 172 1066 -603 -180 140 -727 -354
1615 -354 1083 294 -1372 -513 1009 -235 -349 1806 -384 -2216 219 1040 167 -450 -740 -47 -54 -184
1633 -184 146 369 375 -1490 -337 1751 -192 -948 1177 -242 -1335 704 1203 -1009 -857 1140 82
1650 82 -1438 963 1471 -752 -254 -5 265 847 -249 -43 1054 -356 -1358 822 2046 -565 -1217
1667 -1217 1306 -326 -1302 1984 1259 -2018 -670 1450 416 -169 374 384 -783 -345 1329 707 356
1684 356 -1191 -1031 1108 510 -447 620 6 -1775 263 2099 -124 -1489 702 304 -1537 433
$$ packed form
1561C79J41j691P90O79p02L33J75m37n63P91N23j144KJ542j544R8J302j28j600
1580a054K85L44J175p72p35N04K67J18j301J422K89j862Q72J613j869j58J619
1597G57q24q31Q61N99j132j60J491j61j180L49p32J135Q94j669M23L20q67L73
1615c54J437p89j666Q59J522j244j14K155k190j832K435Q21q73o17k90O93pj30
1633a84L30K23Oj865J153K088j943p56K125j419j093K039M99k212J52J997j058
1650H2j520K401N08k223M98K49K70N82j096K06J097j410j002K180J224k611o52
1667a217K523j632r76L286p25l277J348K120j034n85N43J0j167M38J674o22l51
1684C56j547J60K139n98r57J067o14j781K038J836k223j365K191l98j841J970
$$ plain form
1700 433 1668 -928 -1086 37 -64 248 14 110 -552 -412 -426 -445 436 151 -1622 -151 408 -1063 593
1719 593 1327 -1231 -1491 589 489 -570 128 810 -1369 -1268 697 695 198 28 -1368 -471 794 -168
1737 -168 470 213 -1254 -976 995 1302 -726 -165 847 -1189 -473 2578 639 -1041 143 598 191
1754 191 447 1179 11 -604 249 284 774 1087 -256 130 489 -273 491 1585 456 -590 314 1069 -243
1773 -243 490 1933 -123 -1048 1279 795 41 930 423 -739 -206 899 443 205 397 -801 -908 1034
1791 1034 575 -614 326 -609 -1340 846 877 -629 -805 -181 -260 -421 845 -17 -1448 -547 -358 -414 585
1810 585 -108 -1459 -407 111 -686 -201 863 -958 -1677 615 37 -1494 654 191 -1837 -422 567
1827 567 -200 -648 254 69 -959 -96 566 -263 164 97 -993 348 725 -171 373 112 -1014 -55 1095
$$ packed form
1700D33J235k596j58J123j01L12k34R6o62J40j4j9Q81k85j773J471N59j471J656
1719E93P34k558k60K080j00j059O98O82k179J01J965km97j70j396Q97J265r62
1737a68O38k57j467K78J971L07k028N61J012k036P16L051j939j680J184M55m07
1754A91K56P32j168o15Q53L5M90L13j343L86L59p62P64J094j129j046R04P55j312
1773b43P33J443k056r25K327m84p54Q89n07j162N33J105m56k38J92j198j07J942
1791A034m59j189R40r35p31K186L1j506j76O24p9j61J266q62j431R01J89n6R99
1810E85o93j351J052N18p97M85J064j821p19K292n78j531K148m63k028J415R89
1827E67p67m48R02j85j028Q63O62q29M27o7j090J341L77q96N44k61j126R59J150
$$ plain form
1846 1095 421 -134 823 -238 -677 1193 1405 -751 350 766 -465 281 1250 116 -347 341 285 -105
1864 -105 776 891 -1117 341 1204 -274 82 939 -154 -236 558 513 -343 -112 423 -320 159 464 -498
1883 -498 302 380 -890 162 486 -568 -349 679 -512 -1333 -21 208 -1135 -263 534 -1140 -809 734
1901 734 -461 -851 -85 -339 -702 -341 -323 -633 -1168 -643 -631 -597 108 -876 -775 174 -810 -159 332 -472 -686
1922 -686 -206 -4 -158 -250 108 -626 -329 519 -242 -258 802 -356 -332 669 105 148 38 374 141 -372
1942 -372 505 29 -370 355 402 11 552 337 681 582 165 495 689 470 483 644 662 -22 214 1182 478
1963 478 25 990 466 112 484 508 170 -58 380 670 138 375 332 -254 472 208 106 143 -616 -201 199
1984 199 0 -286 -29 -146 -34 -175 -64 -45 -473 -185 -129 51 -260 -618 -484 -177 -406 -116 -151 -310 -499
$$ packed form
1846A095o74n55R57j061m39J870K12k156J101M16j231P46R69j134m63O88n6l90
1864a05Q81J15k008J458Q63j478L56Q57j093q2P94m5q56K31N35p43M79L05r62
1883d98Q00P8j270J052L24j054K19J028j191q21J312K29j343Q72P97j674L31J543
1901G34j195l90P66k54l63L61J8l10n35N25J2L4P05r84J01R49r84O51M91q04k14
1922f86M80K02j54r2L58p34K97Q48p61j6J060j158K4J001n64M3j10L36k33n13
1942c72Q77m76l99P25M7l91N41k15L44r9m17L30J94k19J3J61J8o84K36R68p04
1963D78m53R65n24l54L72K4l38k28M38K90n32K37m3n86P26k64j02L7p59M15M00
1984A99j99k86K57j17J12j41J11J9m28K88N6J80l11l58J34L07k29K90l5j59j89
$$ plain form
2005 -499 -657 -22 -190 -841 -82 -292 -690 -432 -280 -201 -342 -435 -119 -363 -712 12 -341 -374 17 -249 -156
2026 -156 -258 -235 723 -178 -256 127 -120 333 -20 187 403 -87 387 706 152 340 205 176 556 221 516
2047 516 241 104 748 315 364 491 164 442 400 172 604 367 274 524 461 586 282 -99 358 496 286
2068 286 106 -169 370 71 -84 194 106 -165 20 223 -297 57 -181 13 -443 -270 89 -458 -406 -63 -328
2089 -328 -179 -491 -338 -57 -470 -194 -80 -450 -514 -470 -79 135 -800 -433 -140 -339 -421 250 -473 -619 -614 -62
2111 -62 -419 -309 -14 -297 -364 -449 -404 -284 -37 -316 -119 149 -90 -255 65 409 16 -399 657 103 -476
2132 -476 320 631 16 55 633 319 -287 210 680 104 139 213 153 366 -23 197 341 -43 -2 463 481 -106
2154 -106 -20 597 315 -335 244 804 -282 -49 -53 -168 -90 223 294 109 -410 -189 113 -12 -140 -81 -55 -405
$$ packed form
2005d99j58O35j68o51P59k10l98K58J52P9j41r3L16k44l49P24l53l3L91k66R3
2026a56j02K3R58r01p8L83k47M53l53K07K16m90M74L19n54J88j35k9L80l35K95
2047E16k75j37O44m33M9J27l27K78m2k28M32k37r3K50o3J25l04l81M57J38k10
2068B86j80k75N39k99j55K78q8k71J85K03n20L54k38J94m56J73L59n47N2L43k65
2089c28J49l12J53K81m13K76J14l70o4M4L91K14r35L67K93j99q2O71p23j46NN52
2111f2l57J10K95k83o7q5M5J20K47k79J97K68k39j65L20L44l93m15J056n54n79
2132d76P96L11o15L9N78l14o06M97M70n76L5P4o0K13l89K20J44l84M1M65J8n87
2154a06Q6O17k82o50N79N60j086K33mj15P8L13P1j85n19K21L02j25j28N9K6l50
$$ plain form
2176 -405 -642 269 317 -921 -132 227 -271 -434 -304 193 -766 -515 771 -587 -518 -77 -451 -280 -549 -590
2196 -590 38 -168 -590 56 98 -224 -579 -267 284 -727 -363 617 -669 -928 325 98 -326 460 245
2215 245 -104 -296 227 -197 152 646 -272 -24 274 -196 81 798 -42 -720 474 724 -196 596 1228 -154
2235 -154 -438 1179 359 -91 697 70 -283 326 560 573 295 402 61 279 720 -415 209 644 -594
2254 -594 -540 1215 196 -763 323 62 -463 68 813 23 -594 243 -220 -503 1009 35 -976 -85 -390
2273 -390 -708 339 175 -710 -748 135 -393 -320 687 -539 -1102 109 52 -533 541 -152 -1171 -328 214
2292 214 -479 -201 863 -966 -730 936 207 -625 621 -99 -1405 442 606 -378 -217 361 -404 -286
2310 -286 1030 352 -368 172 -117 -428 937 777 -197 375 103 -387 751 915 -376 -314 948 76 -371
$$ packed form
2176d05k37R11M8j238P89L59m98j63J30M97r59K51J286j358O9M41l74J71k69m1
2196e90O28k06m22O46M2l22l55L12N51j011L64R80j286k59J253k27m24P86k15
2215B45l49j92N23m24L49M94r18K48K98m70K77P17q40o78J194K50r20P92O32j382
2235a54k84J617q20m50P88o27l53O09K34J3k78J07l41K18M41j135O24M35j238
2254e94N4J755j019r59J086k61n25N31P45p90o17Q37m63k83J512r74j011Q91l05
2273c90l18J047j64q85l8Q83n28P3J007j226n63J211n7n85J074o93j019Q43N42
2292B14o93K78J064j829K36J666p29q32J246p20j306J847J64r84J61N78p65J18
2310b86J316o78p20N40k89l11J365j60r74N72k72m90J138J64j291O2J262q72m47
$$ plain form
2329 -371 1136 417 -810 529 682 -590 631 994 -522 -475 548 339 96 507 346 -782 45 690
2347 690 -69 -101 271 -966 -434 696 -2 -118 -270 -318 -686 243 303 -428 295 -151 -955 678 448 -967
2367 -967 89 69 -680 -331 944 41 -1206 79 420 -1010 70 975 -643 -474 663 -387 -216
2384 -216 230 232 -370 -257 223 167 359 135 -448 -199 366 119 446 255 -468 -237 395 182 -87 351 134
2405 134 -636 484 900 -270 233 453 -190 -242 923 15 -111 -87 143 -451 109 638 -142 -570 208 37
2425 37 -373 248 99 18 -149 39 237 -300 -204 -296 -25 -201 -162 127 14 -669 -47 342 -333 -328 329 -173
2447 -173 -810 -228 332 -506 -604 337 -284 -878 143 58 -453 -335 -267 -262 -381 -234 189 -9 -262 111 42 -318
2469 -318 -376 -26 -4 -84 -95 -62 -66 74 24 -40 -39 281 364 -79 -67 400 285 -18 416 233 -21 512 378 -134
$$ packed form
2329c71J507p19j227J339J53j272J221L63j516M7J023k09k43M11j61j128Q27O45
2347F90p59l2L72j237N32J130o98j16j52m8l68R29O0p31P23m46q04J633k30j415
2367i67J056k0p49L49J275r03j247J285L41j430J080R05j618J69J137j050J71
2384b16M46Ko02J13M80n6J92k24n83K49N65k47L27j91p23K31O32k13k69M38k17
2405A34p70J120M16j170N03K20o43n2J165r08j26K4K30n94N60N29p80m28P78j71
2425C7m10O21j49q1j67J88J98n37R6r2K71j76L9K89j13o83O22L89o75NO57n02
2447a73o37N82N60q38r8R41o21n94J021q5n11J18O8Nj19J47M23j98k53L73o9l60
2469c18n8L50K2q0j1L3mJ40n0o4JL20Q3m43J2M67j15l03M34j83k54N33j34n12
$$ plain form
2493 -134 -45 559 535 -71 166 996 34 102 523 150 14 114 578 -26 -1 422 420 -325 157 241 -177 -213 -41
2516 -41 194 -189 182 99 -6 -434 19 162 -57 -248 11 -133 -82 -219 273 -168 -214 253 -209 -401 -224
2537 -224 50 -431 -421 15 -239 -534 21 -312 -221 -115 81 -176 -406 -285 -158 -234 -338 13 -124 -227 -204
2558 -204 102 -108 -200 -32 177 -270 -132 252 -162 -156 213 50 92 -109 615 54 -253 192 -136 -61 111 262
2580 262 37 1 8 193 -33 -109 335 117 -75 259 201 276 29 385 151 -281 337 130 -3 152 157 142 16
2603 16 -62 209 -75 -132 195 -124 -263 332 221 -96 -156 144 -96 -254 154 108 -428 -109 311 -264 113 -10
2625 -10 156 -186 -251 47 -43 -93 197 97 -118 -183 10 3 -250 -253 173 -92 -514 148 90 -204 -233 205 53 -399
2649 -399 210 134 -41 -449 -18 84 2 94 -195 151 -192 -18 13 -214 203 -153 -39 130 5 178 3
$$ packed form
2493a34Q9O04k4o06K37Q30r62O8M21l73j36J00M64o04K5M23kp45M82Q4m18l6J72
2516d1K35l83L71q3j05m28M53J43k19j91K59j44N1j37M92m41m6M67m62j92J77
2537b24K74m81J0M36k54k95N55l33R1J06J96k57k30J21J27p6j04L51j37j03K3
2558b04L06k10r2J68K09m47J38L84m14OL69j63M2k01P24n61l07M45l28P5J72J51
2580B62k25l6PJ85k26p6M44k18j92L34n8P5k47L56k34m32O18k07j33J55Nj5j26
2603A6p8K71k84n7L27l19j39N95j11l17o0L00k40j58M08m6n36L19M20n75L77j23
2625a0J66l42o5K98r0n0K90j00k15o5J93pk53lM26k65m22O62n8k94k9M38j52m52
2649c99O09p6j75m08M31J02q2R2k89L46l43J74L1k27M17l56J14J69j25J73j75
$$ plain form
2670 3 -30 191 -197 -52 356 -213 49 410 85 42 -283 0 100 -112 297 363 -298 -39 410 -303 -211 86
2692 86 166 -536 -140 249 21 -350 497 138 -171 432 95 243 110 -76 63 140 -229 -91 206 344 -283
2713 -283 149 435 -443 163 253 -318 -364 129 84 -166 215 210 -185 95 320 -578 -528 17 -250 -403 197 -574
2735 -574 -50 174 -225 -85 -194 -150 -112 -448 217 -164 -461 389 -349 -543 -18 -1 -64 203 -92 -30 18 76
2757 76 -226 203 -42 -470 -28 367 -72 -108 313 0 -112 352 293 -203 -126 262 -158 -134 372 233 -120 -8
2779 -8 35 -250 291 235 -97 162 -21 -66 192 213 -112 -359 347 -17 -78 569 -99 -399 207 307 -1 127
2801 127 341 -302 -351 329 -76 -105 219 -109 -291 5 248 -140 -297 -193 -204 -302 131 71 -356 -103 -320 -625
2823 -625 37 -2 -282 104 -262 -274 139 319 89 -389 138 -122 -198 255 138 -258 12 -144 -174 510 26
$$ packed form
2670Cl3K21l88J45M08n69K62L61l25m3l25K83J00k12M09O6o61K59M49p13R2K97
2692H6Q0p02L96L89k28l71Q47l59l09O03l37J48j33j86J39P7l69J38K97J38o27
2713b83M32K86q78O06R0n71m6M93m5k50L81nl95K80K25q98N0N45k67j53O00p71
2735e74N24K24l99J40j09M4L8l36O65l81k97Q50p38j94N25J7o3K67k95O2M8N8
2757G6l02M29k45m28M42L95m39l6M21l13j12M64n9m96P7L88m20K4N06j39l53J12
2779hM3k85N41n6l32K59j83m5K58K1l25k47P06l64o1O47o68l00O06J00l08J28
2801A27K14o43m9O80m05k9L24l28j82K96K43l88j57J04j1r8M33o0m27K53k17l05
2823f25O62l9k80L86l66j2M13J80k30m78N27k60p6M53j17l96K70j56l0O84m84
$$ plain form
2844 26 -238 -112 -210 203 203 512 248 -335 380 161 -53 289 324 -297 -29 310 268 28 -98 119 22 340
2866 340 379 -10 461 48 -111 164 306 -218 44 -5 30 -68 116 64 -236 31 -173 -228 -70 538 165 -292
2888 -292 246 -89 127 79 73 -189 -195 -102 145 -9 307 -112 -286 -13 -224 -221 -100 64 -400 -35 -53 -273 -277 -104
2912 -104 -219 -496 247 -109 -94 -61 -372 -153 -152 -30 56 39 -311 -234 -199 364 -143 14 -209 -109 -186 327 94
2935 94 -343 119 2 -28 -94 139 165 -292 70 141 -126 165 281 -269 18 120 146 384 452 98 -298 435
2957 435 357 72 58 39 -66 71 358 -222 406 208 48 136 347 237 -66 392 30 -384 512 222 -212
2978 -212 211 257 -40 -165 272 -241 -415 -121 174 -333 -30 172 -422 -255 -141 -200 103 116 -333 22 -117
2999 -117 -190 -120 -37 -130 -570 35 264 -505 -141 96 -417 -136 176 -56 -268 98 -110 -400 -345 368 -423 -278
$$ packed form
2844B6k64J26r8M13%L09k64n83P15k19k14L42L5o21K68L39m2k40j26K17r7L18
2866C40L9l89M71m13j59K75J42n24K62m9L5r8J84n2l00K67k04n5J58O08l73m57
2888b92N38l35K16m8ok62oR3K47j54L16m19j74K73k11LJ21J64m64L65j8k20mJ73
2912a04j15k77P43l56J5L3l11K19JJ22Q6j7l50P7L5N63n07J57k23J00p7N13k33
2935I4m37M62j17l0o6K33K6m57L62P1k67K91J16n50K87J02K6K38O8l54l96P33
2957D35p8k85j4j9j05J37K87n80O28j98j60Q8K11j10l03M58l62m14Q96k90m34
2978b12M23M6k97j25M37n13j74K94K95n07L03K02n94J67J14n9L03J3m49L55j39
2999a17p3P0Q3r3m40O05K29p69L64K37n13K81L12k32k12L66k08k90N5P13p91J45
$$ plain form
3021 -278 99 -35 -228 342 -76 -193 65 -2 -26 -166 151 -108 168 -138 -112 52 223 91 -97 251 -155
3042 -155 193 509 82 -152 183 -48 -61 130 313 -168 -179 561 -32 -106 312 -213 -126 -189 175 161 -230 135
3064 135 135 -243 94 182 46 9 -242 111 178 -150 -94 -92 -321 -33 -182 68 -207 -279 101 8 -111 -15 -77 -256
3088 -256 16 88 -218 -176 -134 -211 -35 -26 -161 -29 -44 -402 -224 225 -298 -235 -93 -258 -124 -68 -299 -32 -152
3111 -152 -246 -247 -76 -74 -258 117 314 -164 -284 277 -41 87 111 280 278 -285 195 -27 117 277 276 -163 -83 138
3135 138 272 135 257 333 16 -88 280 12 211 172 189 283 30 -139 313 -19 -154 -52 357 137 -115
3156 -115 93 112 -18 33 51 -162 27 7 -220 200 -82 -271 -157 -217 9 -237 -122 84 -200 215 -9 -291
3178 -291 -141 -242 7 -184 -5 -71 -65 -177 -110 66 -254 -413 106 1 -181 -533 -45 24 -153 -87 -38 126
$$ packed form
3021b78L77j34j93N70m18j17K58o7k4j40L17k59K76l06K6J64J71j32j88L48m06
3042a55L48L16m27k34L35k31j3J91J83m81j1P40n93p4M18n25Q7o3L64j4l91L65
3064A35%l78L37Q8j36l7k51L53O7l28N6Kk29K88j49K50k75p2L80r3j19R6o2j79
3088b56K72P2l06M2M2p7J76Rj35J32j5l58J78M49n23O3J42j65J34N6k31K67j20
3111a52r4jJ71Kj84L75J97m78j20N61l18J28K4J69kn63M80k22J44J60jm39Q0K21
3135A38J34j37J22P6l17j04L68k68J99l9J7R4k53j69M52l32j35J02M09k20k52
3156a15K08J9j30N1J8k13J89k0k27M20k82j89J14o0K26k46J15K06k84M15k24k82
3178b91J50j01K49j91J79o6Oj12O7J76l20j59N19j05j82l52M88O9j77O6M9J64
$$ plain form
3200 126 -310 107 58 -99 -325 362 -148 -282 -13 80 -168 49 -298 211 -88 116 398 -64 71 225 184
3221 184 0 58 104 56 347 277 290 106 33 103 328 -118 160 124 -76 98 356 -62 14 44 199 181 -74 -148
3245 -148 -103 3 59 55 64 177 121 -189 -57 -19 -240 -125 194 73 -28 -109 67 159 14 -277 -37 -235 -208 -321
3269 -321 97 43 -23 159 80 -372 -119 -399 -13 -294 -195 -441 -280 8 -24 -203 25 -81 103 -300 182 95
3291 95 -299 -114 29 -69 -145 347 -43 -4 -155 -161 -139 242 -256 66 70 288 7 117 33 -240 158 138 -43 285
3315 285 72 -325 -138 -44 -19 190 205 76 -41 60 275 58 375 157 -178 241 293 -285 3 24 316 344
3337 344 129 21 363 -121 137 -23 182 45 12 -283 46 -241 68 -175 138 -404 -44 57 -251 -3
3357 -3 240 -286 86 302 -268 132 -22 -389 -390 70 -136 -5 84 -124 -153 -165 186 -126 -362 372 -247 -410
$$ packed form
3200A26m36M17m9j57k26O87n10j34K69R3k48K17l47N09k99K04K82m62J35J54m1
3221A84j84N8M6m8K91p0J3j84p3P0K25m46K78l6k00J74K58m18P6L0J55j8k55p4
3245a48M5J06N6mRJ13n6l10J32L8k21J15L19j21j01q1J76R2j45k91K40j98K7j13
3269c21M18n4o6J82p9m52K53k80L86k81R9k46J61K88l2j79K28j06J84m03M82q7
3291I5l94J85J43r8p6M92l90L9j51oK2L81m98L22MK18k81J10q4k73L98k0j81L28
3315B85k13l97J87R4K5K09J5j29j17J01K15k17L17k18l35M19N2n78K88K1K92K8
3337C44k15j08L42m84K58j60K05j37l3k95L29k87L09k43L13n42L60J01l08K48
3357cK43n26L72K16n70M00j54l67jM60k06J31Q9k08k9j2L51l12k36P34o19j63
$$ plain form
3379 -410 -108 40 -70 7 -18 -252 -163 18 -185 -272 -100 -126 -189 538 327 -17 -148 -50 -183 72 346 15
3401 15 -9 23 -65 161 115 -118 -51 437 54 -43 148 171 -398 152 373 241 -37 218 -88 3 549 159 -349
3424 -349 397 -16 -475 148 668 198 -80 76 -306 -324 370 338 -465 212 -137 -207 94 4 -213 180 238 -162
3446 -162 78 188 5 -231 142 -434 -233 235 249 -766 -100 230 -10 -64 239 -232 -647 -114 136 -279
3466 -279 -100 181 -302 -30 -74 -5 -44 -20 -520 168 368 -97 -228 224 -206 -427 191 130 -220 275 -4 -381
3488 -381 209 580 4 -226 308 -71 -168 298 210 -226 120 426 -24 323 335 -59 -195 309 273 23 582
3509 582 302 -142 73 150 18 34 265 -458 365 255 -125 274 167 -206 40 -175 191 -167 -108 138 -388
3530 -388 -47 302 -293 218 72 -195 -111 -59 438 -293 -243 -180 -100 -248 350 -97 -97 172 -242 -295 252 -119 -262
$$ packed form
3379d10L02J48j10P7k5k34Q9J81k03q7J72k6o3P27k11l44j31R8j33K55K74l31
3401A5k4L2q8K26m6k33O7M88l83r7J91K3n69N50K21j32k78K55l06R1N46l90n08
3424c49P46m13m59O23N20m70k78J56l82j8O94l2q03O77l49p0L01r0k17L93N8m00
3446a62K40J10j83k36L73n76K01M68J4j015O66L30k40n4L03m71m15N33K50m15
3466b79J79K81m83K72m4O9l9K4n00O88K00m65j31M52m30k21O18o1l50M95k79l77
3488c81N90L71n76k30N34l79r7M66q8m36L46L06m50L47J2l94j36N04l6k50N59
3509E82k80m44K15P7j32J6K31p23Q23j10l80L99j07l73K46k15L66l58N9K46n26
3530c88L41L49n95N11j46k67Q4N2M97p31N0O3Q0j48N98m47%K69m14n3N47l71j43
$$ plain form
3553 -262 220 -227 -130 2 -143 -318 -126 -25 -260 -103 276 -27 9 -40 38 206 117 -287 -54 -281 293 -125
3575 -125 46 -201 138 109 62 28 83 179 21 130 260 111 81 1 -31 -92 35 86 169 267 209 -302 293 194 -17
3600 -17 96 -17 -5 185 -159 345 125 -173 252 199 -140 65 356 317 -135 -103 62 113 -14 220 -80 -159
3622 -159 71 -144 -14 5 -51 -26 -141 9 176 238 -162 -311 -35 -228 -294 144 -299 -501 317 -160 -163 57
3644 57 52 93 61 -39 2 -15 -204 -31 100 118 40 236 126 -63 -328 46 -161 128 120 46 121 218 183 157 10
3669 10 250 193 -70 178 317 -51 255 -75 183 -27 143 410 179 186 359 -2 440 23 -115 -2 116
3690 116 218 -97 -254 273 525 7 121 372 83 -80 25 196 16 -275 348 -93 -335 289 -9 -32
3710 -32 -64 -44 46 -173 -175 -263 -493 -71 318 -88 -61 -151 -86 -132 -327 -43 31 -371 -176 -31 -370 -256 59 -76
$$ packed form
3553b62M82m47R7J32j45j75J92J01k35J57L79l03L6m9P8J68q9m04K33k27N74m18
3575a25J71k47L39k9m7l4N5R6j58J09J30j49l0q0l2o1J27N1Q3R8n8n11N95r9k11
3600a7J13j13J2J90l44N04k20k98M25n3l39K05K91l9m52L2J65N1j27K34l00p9
3622a59K30k15J30J9n6K5j15J50J67O2m00j49K76j93o6M38m43k02Q18m77lK20
3644E7nM1l2j00M1j7j89J73J31J8p8J96j10j89k65L74k07K89qp4P5R7l5k6j47
3669A0K40n7k63K48J39l68L06l30K58k10J70K67k31PJ73l61M42m17j38J13J18
3690A16J02l15j57N27K52n18J14K51k89j63J05J71j80k91O23m41k42O24k98k3
3710c2l2K0R0k19kq8k30M22L89m06K7r0O5m6j95K84P4m02J95J45l39J14L15j35
$$ plain form
3734 -76 204 -193 -245 -363 -153 195 -60 168 104 -232 -80 -140 191 -138 -303 107 104 216 13 -105 6 174
3756 174 -131 461 70 -143 233 157 41 -45 274 -32 208 99 268 78 -158 379 85 61 166 -7 172
3777 172 196 139 225 224 92 340 -65 149 224 -22 61 -50 340 -33 83 46 23 39 248 163 -34 46 9 94 -528
3802 -528 132 -254 36 72 -38 -26 97 184 -167 68 56 -224 -207 12 -144 -83 -362 29 -262 -93 -42 -17 -1
3825 -1 -179 -29 31 176 -101 55 -31 65 -11 14 38 -176 -44 200 -36 -129 -12 153 106 247 293 134 198 124
3849 124 -59 146 286 86 60 -143 -194 155 278 324 75 -22 279 129 -12 210 -143 -89 351 221 196 169
3871 169 -139 212 93 109 541 313 103 -70 -60 335 -141 151 432 -87 -242 155 -149 -72 113 64 -159
3892 -159 122 -40 -22 -66 -127 -179 -134 68 -197 -179 212 -211 -192 87 -62 -214 -285 -30 -173 -364 74 -368 -514
$$ packed form
3734g6K80l97n2j18K10L48k55K28o4l36J52o0L31l29j65M10lJ12k03j18J11J68
3756A74l05N92l91k13L76p6j16q6L19l06K40j09J69j90k36N37k94k4J05j73J79
3777A72K4n7Q6jj32K48m05K14P5k46Q3j11L90l73J16l7k3J6K09q5j97Q0l7Q5o22
3802e28O60l86K90L6j10J2J23Q7l51K35j2k80J7K19j56O1k79L91k91J69N1K5J6
3825aj78J50O0J45k77J56q6R6p6K5K4k14J32K44k36r3J17J65m7J41M6j59O4p4
3849A24j83K05J40k00k6k03n1L49J23M6k49r7L01j50j41K22l53N4M40j30k5k7
3871A69l08L51j19J6M32k28k10j73J0L95m76K92K81n19j55L97l04P7J85m9k23
3892a59K81j62J8m4o1n2M5K02k65J8L91m23J9K79j49j52p1K55j43j91M38m42j46
$$ plain form
3915 -514 9 -79 -167 79 -91 -376 -118 -123 204 -66 36 -25 -119 159 -129 209 92 -287 -432 54 -124 43
3937 43 -148 -169 102 -68 182 279 211 175 105 206 110 112 -39 333 143 -57 -107 269 140 25 136 68 51 244
3961 244 107 -57 73 15 -127 212 134 -142 52 121 -40 45 148 -88 -234 138 -275 -53 334 -239 -62
3982 -62 -167 293 -30 -98 147 -203 -257 -102 409 -110 67 -225 -484 -232 -111 161 -220 -225 -86 -189 60 -16
4004 -16 -183 -250 -55 -53 -95 110 -350 -303 -63 2 72 -109 282 -236 -366 -84 -112 85 -59 -156 -238 -112 -80 130
4028 130 174 -138 -158 -18 172 224 202 50 -249 121 302 -30 51 166 65 -25 127 203 99 -230 157 -203
4050 -203 18 495 -46 -21 46 -252 -379 97 249 -56 8 57 -46 118 233 -80 -58 223 142 -68 89 -212
4072 -212 120 112 -299 246 -77 158 -57 -329 -60 -89 -198 171 -298 -277 41 206 -41 -23 -136 -8 -134 122
$$ packed form
3915e14N23q8q8K46j70k85K58nL27k70J02o1r4K78k88L38j17l79j45M86j78J67
3937D3j91k1K71j70K50R7o8l6p0J01r6Kj51L72j90k00n0L76j29j15J11o8j7J93
3961B44j37j64J30n8j42L39p8k76J94O9j61Q5J03k36j46L72m13K22L87n73J77
3982f2j05M60l23o8K45l50n4J55N11n19J77k92k59K52J21K72l81nJ39j03K49p6
4004a6j67o7J95Km2K05m60M7K40O5P0j81L91n18j30K82k8J97j44r7q2J26L2K10
4028A30M4l12k0J40J90N2k2j52k99L70J81l32Q1J15j01r0J52P6j04l29L87l60
4050b03K21M77n41K5O7k98j27M76J52l05O4M9j03J64J15l13K2K81q1k10J57l01
4072b12L32qm11N45l23K35k15k72K69k9j09L69m69K1L18J65k47J8j13J28j26K56
$$ plain form
4094 122 30 -133 109 -73 -314 2 149 35 50 -197 6 -62 128 -62 -45 -45 -51 -196 68 174 -147 9 -106
4117 -106 -66 248 146 -111 -112 317 -58 160 148 189 186 -98 200 161 288 -68 55 154 -37 114 7 178 127
4140 127 -302 20 293 -55 21 276 -23 366 386 196 138 75 -50 100 91 -73 -563 20 -94 -244 -107 182
4162 182 -136 53 159 -69 27 -176 -259 -190 -179 270 -116 -1 54 -149 -94 112 166 183 -80 -136 0 -171 -87
4185 -87 144 0 -68 -213 155 133 21 -118 335 -237 62 203 -307 -43 -249 142 -208 29 249 -107 -170
4206 -170 87 -295 161 -26 -48 131 209 12 216 -33 -5 -52 -51 -74 289 -97 361 146 112 102 -388 144 289
4229 289 73 166 34 250 176 187 161 148 -44 142 208 -319 259 -207 -139 -232 -124 185 -132 -21 84 -105 80
4252 80 167 -107 209 -202 47 134 -82 60 -211 3 -126 111 -33 40 -166 144 50 -14 236 -143 -243 -298
$$ packed form
4094A22r2j63K42j82k41L16J47j14J5k47K03o8J90j90J7%oj45K64J06l21J56j15
4117a06M0L14j02k57jM29l75K18j2M1lk84K98l9J27l56J23R9j91J51j07J71n1
4140A27m29L22K73l48P6K55k99L89K0j90n8o3j25J50rj64m90N83j14j50J37K89
4162A82l18J89J06k28R6k03q3O9J1M49l86J15N5k03N5K06N4J7k63n6J36j71Q4
4185h7K31j44o8j45L68k2j12j39M53n72K99J41n10K64k06L91l50K37K20l56o3
4206a70K57l82M56j87k2J79P8j97K04k49K8m7Jk3L63l86M58k15l4j0m90N32J45
4229B89k16R3j32K16p4J1k6j3j92J86O6n27N78m66O8r3J08L09l17J11J05j89J85
4252H0Q7k74L16m11K49Q7k16J42k71K14j29K37j44P3k06L10r4o4K50l79j00n5
$$ plain form
4274 -298 -6 -5 4 -204 -132 -317 -71 -124 -369 -125 -106 -309 284 -89 -176 -17 -130 62 -167 -268 239 -9 70
4297 70 125 -96 242 -29 31 154 -66 4 141 -14 49 68 -269 -171 404 47 150 -146 403 293 75 -37
4319 -37 149 205 233 350 -18 20 -192 299 -1 -66 62 81 68 -3 -16 47 -185 35 -41 -218 -201 -31 -63 45
4343 45 110 -7 -74 33 61 31 -214 311 -160 -35 17 -191 -257 -98 142 -109 -373 -166 3 -173 -60 205
4365 205 225 -126 65 -69 161 -193 -275 -49 -230 432 6 30 4 -257 -32 -8 -164 135 205 132 62 107 324
4388 324 -23 -19 369 -175 -9 308 266 -135 131 216 170 141 134 22 44 284 -43 -9 338 -84 112 200 64 242
4412 242 170 -61 -342 -431 79 9 -99 244 -233 50 -145 89 -47 209 209 -171 88 -39 -95 66 -41 -175
4434 -175 -408 312 -239 -40 -35 -75 47 -286 -97 -281 -86 -108 -179 -56 -94 -69 -192 -240 -167 -220 -157 -17 12 -100
$$ packed form
4274b98K92JRk08P2j85K46n3k45K44J9k03N93l73q7J59j13J92k29j01N07k48P9
4297G0N5k21L38k71O0J23k20P0J37j55O3J9l37R8N75l57J03k96N49j10k18j12
4319c7J86N6K8J17l68L8k12M91l00o5J28J9j3p1j3O3k32K20p6j77J7J70l2J08
4343D5O5j17o7J07K8l0k45N25m71J25N2k08o6J59K40k51k64K07J69j76J13K65
4365B05K0l51J91j34K30l54q2K26j81O62m26K4k6k61K25K4j56K99P0p3p0M5K17
4388C24l47ML88n44J66L17m2m01K66Q5m6k9pj12K2K40l27L4L47m22J96Q8j36J78
4412B42p2k31k81q9N10p0j08L43m77K83j95K34j36K56%l80K59j27n6J61j07j34
4434a75k33P20n51J99Nm0J22l33J89j84J95k2p1J23l8K5j23m8P3n3O3J40K9j12
$$ plain form
4458 -100 -409 99 -280 13 179 -194 -71 81 -175 384 216 -301 -78 223 -101 95 251 93 -220 112
4478 112 171 -127 243 123 -267 -95 479 -199 254 63 -246 -208 51 55 109 100 340 -82 -89 20 28 133 189 -113
4502 -113 149 206 252 34 189 113 102 165 260 -209 -30 39 -236 48 37 -64 -122 184 73 286 128 203 -349
4525 -349 -80 -206 -109 72 253 24 -393 195 -248 -139 330 -13 -38 192 -160 -111 -143 -103 -388 -83 76 83
4547 83 63 230 -324 -127 62 -71 -61 14 149 -33 4 243 -45 -246 152 -105 -144 149 231 -126 249 -38
4569 -38 -105 308 163 60 -258 201 -42 -130 418 -137 -42 341 157 142 144 50 -144 -105 421 151 -46 167 -194
4592 -194 -159 454 105 326 173 61 -104 109 401 19 133 301 -122 -71 -100 -269 -56 220 -144 -82 53
4613 53 -5 266 61 -31 -104 48 181 215 -305 160 263 -202 40 -35 -8 -162 -249 -85 -20 214 138 -301 -77
$$ packed form
4458a00l09N08l79K93J66l73J23J52k56N59j68n17K23L01l24J96J56j58l13L32
4478A12N9k98L70j20l90J72N74o78M53j91l09L8K59MN4rK40m22pJ09QJ05N6l02
4502a13K62N7M6k18J55p6j1O3R5m69J79O9k75K84j1j01n8L06j11K13j58P5n52
4525c49K69j26R7J81J81k29m17N88m43J09M69l43k5K30l52M9l2M0k85L05J59P
4547H3k0J67n54J97J89j33J0P5J35j82L7K39k88k01L98k57l9K93Q2l57L75k87
4569c8o7M13j45j03l18M59k43q8N48n55R5L83j84j5Kr4j94L9N26k70j97K13l61
4592a94L5O13l49K21j53j12j65K13K92l82J14J68m23N1k9j69K13K76l64O2J35
4613E3n8K71k05r2p3J52J33L4n20M65J03m65K42p5K7j54q7J64O5K34p6m39K24
$$ plain form
4636 -77 -190 -201 381 161 31 294 89 8 30 23 -202 -7 -55 -257 -284 263 42 -217 313 -41 48 18 59 -47
4660 -47 276 79 31 -265 -125 15 344 -101 154 -46 173 433 -143 185 219 10 25 151 -85 52 165
4681 165 26 -194 193 178 -39 -158 -41 -472 137 -106 189 134 245 -56 -26 -43 184 -147 -16 20 -115 174
4703 174 403 -226 261 -8 76 -264 -182 -154 -257 -205 -45 -14 -56 57 -43 153 -212 -92 -343 330 143 126
4725 126 -127 -57 249 222 -14 65 -217 -131 212 -316 152 -25 96 -235 -207 81 -59 384 -8 57 -222 -31
4747 -31 114 -101 -226 129 -35 -55 15 48 65 224 129 307 -97 80 -60 100 78 -22 91 19 -192 -144 133
4770 133 194 45 -96 373 92 -139 135 -11 -88 -82 -136 8 -75 41 94 26 -209 -64 -237 137 -19 44 -128
4793 -128 167 -14 -55 -69 -7 -91 -59 -117 35 -17 -50 154 80 -201 20 178 74 -53 -104 -146 -348 -136 -29 -24
$$ packed form
4636g7j13j1N82k20j30K63k05q1K2pk25J95m8k02k7N47k21k59N30l54Q9l0M1j06
4660d7L23j97m8k96J40J40L29m45K55k00K19K60n76L28L4k09J5J26k36J37J13
4681A65j39k20L87j5k17j19J17m31O09k43K95n5J11l01L0j7K27l31J31L6j35K89
4703A74K29o29M87k69Q4l40Q2K8j03N2J60L1m2J13j00J96l65J20k51O73j87j7
4725A26k53P0L06k7k36P9k82Q6L43n28M68j77J21l31K8K88j40M43l92O5k79J91
4747c1J45k15j25L55j64k0P0L3J7J59r5J78m04J77j40J60k2j00J13p2k11M8K77
4770A33O1j49j41M69k81k31K74j46p7On4J44q3J16N3o8k35J45j73L74j56O3j72
4793a28K95j81m1j4O2q4L2n8J52n2l3K04p4k81K21J58j04j27n1m2k02K12J07N
$$ plain form
4817 -24 52 -26 -95 155 -9 -266 -79 -141 11 180 -85 52 -165 400 233 85 68 30 -58 -133 -348 -34 178
4840 178 -180 42 18 -110 42 -116 60 -72 142 7 63 117 198 157 76 -58 237 271 -283 -107 238 141 4
4863 4 95 -238 205 -109 14 298 -238 -104 -5 107 122 38 67 10 -22 189 44 41 -22 -216 139 54 37 94 -91
4888 -91 -70 -192 -73 -117 -91 -82 -136 -29 -107 -338 -55 -313 -165 -229 -10 113 -162 341 -175 40 -217 -246 45
4911 45 -23 -241 -16 5 71 360 -56 145 -146 63 -137 -7 183 59 59 141 31 -242 194 302 54 247
4933 247 -106 224 104 -120 5 150 62 126 58 135 -60 233 262 175 32 101 133 -70 126 -193 66 -134 87
4956 87 -118 -73 -107 148 -196 36 119 -37 20 -95 -248 -30 245 -11 55 53 -28 -91 180 -42 -269 -238 72 -364
4980 -364 32 299 -91 151 213 -152 -141 128 -1 -79 -128 69 -121 -65 -79 -154 -115 -95 23 -219 -225 -37 -197 -150
$$ packed form
4817b4P6p8o9K50j64k57J87o2J52J69k65J37k17N65j67j48j7l8q8p5k15L14K12
4840A78l58K22k4j28J52j58J76j32K14j35N6N4Q1m1q1j34K95L4n54J76L45r7j37
4863DR1l33M43l14J23K84n36J34R9J12J5q4K9n7l2K11j45lo3j94L55q5j7N7j85
4888i1K1j22J19m4K6Rn4J07p8k31K83k58J48o4K19J23k75N03n16K15k57k9K91
4911D5o8k18K25K1O6K89m16K01k91K09k00J30J90j24%Q2j10k73M36J08k48J93
4933B47l53L30j20k24J25J45q8O4o8P7j95K93K9q7j43O9L2k03J96l19K59k00K21
4956H7k05M5l4K55l44K32Q3j56N7j15j53K18K75k56O6kq1o3K71k22k27L1L10m36
4980c64L96K67l90K42O2l65J1K69j29p8m9J97j90N6j4p5L9K0J18k42oJ88j60M7
$$ plain form
5004 -150 133 -40 14 217 -147 85 -199 -282 84 43 -91 -23 -16 53 18 223 155 87 189 227 -81 -231 111 144
5028 144 -69 117 106 -79 51 -77 -69 231 345 154 432 457 -133 -95 -39 -274 322 220 18 82 43 132 57
5051 57 152 273 81 -111 -92 63 -170 75 72 11 -28 38 -23 -3 0 -216 189 -187 -345 200 -285 -95 165 47
5075 47 -56 65 -91 44 109 -261 -98 -144 -27 299 27 -60 57 199 -101 41 -165 -124 -30 -90 70 98 278
5098 278 -168 -131 43 195 -4 -32 -60 -91 -127 242 238 -8 -229 -100 -284 98 218 97 269 144 146 24 114
5121 114 -10 -187 76 -127 289 195 101 -66 311 201 -121 243 293 14 -61 28 171 108 287 255 -59 447
5143 447 259 87 263 63 40 51 -178 -115 94 319 -158 0 102 -24 -213 -180 207 -248 49 198 20
5164 20 -131 45 -355 -60 27 128 -1 21 19 13 -158 41 33 -424 96 -18 -104 309 -9 -268 -138 104 -336
$$ packed form
5004a50K83j73N4K03l64K32k84q3L66m1j34O8PO9l5K05o8o8J02L8l08j50L42L3
5028A44k13J86j1j85J30j28QL00J14j91K78K5n90L8N6k35N96j02k02O4l9Q9p5
5051E7R5J21j92j92J9J55k33K45lo1l9O6o1K0Lk16M05l76j58N45m85J90K60j18
5075D7j03J21j56J35O5l70J63m6J17L26k72q7J17J42l00J42k06M1R4o0J60K8J80
5098B78m46L7J74J52j99k8k8l1l6L69mk46k21J29j84L82J20j21J72j25Kj22R0
5121A14j24j77K63k03M16r4r4j67L77j10l22L64N0k79p5Q9J43o3J79l2l14N06
5143D47j88j72J76k00k3J1k29O3K09K25m77J58J02j26j89L3L87m55K97J49j78
5164B0j51J76m00K95Q7J01j29K2koj71J99qm57N20j14q6M13l18k59J30K42m40
$$ plain form
5187 -336 -116 141 -76 -373 -49 312 52 50 -220 105 -2 115 72 223 -101 -117 -147 68 90 -43 449 40
5209 40 -38 -17 95 113 -180 -100 32 198 302 20 119 252 58 -28 175 71 28 115 -27 196 142 -48 170
5232 170 8 194 -69 -14 75 -182 107 -174 91 -69 160 -95 32 -110 -163 104 -351 56 54 -391 -10 -185
5254 -185 -318 59 -205 46 3 193 9 -18 -60 -222 -231 172 3 -172 -420 -168 -258 -63 92 -135 -179 -152 159
5277 159 154 406 190 -225 -29 42 35 74 15 -82 89 -98 22 -24 -64 111 -118 -212 115 14 -19 234 -218 186
5301 186 -111 87 102 46 167 453 79 -99 125 42 160 -138 106 70 172 185 153 51 14 86 165 -29 351
5324 351 17 258 85 -169 -163 -201 230 -74 -164 247 -227 278 53 -425 6 -140 10 173 189 -83 -168 67
5346 67 -37 -319 234 111 -107 159 -157 -231 -226 60 93 -192 -62 -8 -53 45 29 -220 51 76 163 166 159 -196 -37
$$ packed form
5187c36K20K57k17k97L24L61k60kk70L25j07J17m3J51l24j6l0K15K2j33M92m09
5209D0p8K1J12J8k93Q0J32J66J04k82R9J33j94q6K03j04m3Q7j42K23n4j90K18
5232A70j62J86k63N5Q9k57K89k81K65j60K29k55J27j42n3K67m55M07km45L81j75
5254a85j33L77k64K51m3J90j84k7m2j62rM03j69j75k48K52r0J95J55k27m4K7L11
5277A59nK52k16m15J96P1pL9n9r7J71j87J20m6m0J75k29r4L27j01l3K53m52M04
5301A86k97J98J5n6J21K86l74j78K24q3J18k98K44l6J02J3l2j02l7P2P9j94L80
5324C51l34K41j73k54Ol8M31l04r0M11m74N05k25m78M31j46J50J63J6k72q5K35
5346F7j04k82N53j23k18K66l16p4NK86L3k85J30N4m5R8j6k49K71K5Q7Lpl55J59
$$ plain form
5371 -37 -45 47 -307 79 -200 -239 -145 120 12 25 -16 -45 -13 -153 240 -274 32 123 -68 263 317 -87 165 262
5395 262 38 120 55 -62 55 84 49 -177 87 -28 306 163 121 32 218 229 -94 183 -63 -309 56 222
5417 222 -64 62 -121 -5 163 146 210 -151 97 175 -139 -126 113 -226 296 121 -64 -198 -42 -119 -30 323
5439 323 -86 -423 -275 -136 -102 -172 -26 -73 26 -6 -166 -87 -191 248 88 -313 -15 -332 102 134 -47 95
5461 95 49 176 -268 -171 -16 12 -24 -169 297 -171 -86 -21 -15 70 62 140 176 -80 231 5 35 67 -98 214 -16
5486 -16 134 319 56 -74 41 84 72 34 -14 -155 96 78 150 91 162 203 8 25 -13 -96 288 33 103 -48 255
5511 255 145 -137 103 103 -17 -30 -310 -47 143 -22 52 -62 22 14 43 -55 81 -249 33 43 -283 -487 170
5534 170 -35 311 -195 20 33 -280 -11 -151 -7 -40 69 0 0 -157 21 -240 100 -98 -172 154 20 -179
$$ packed form
5371c7qR2l54L86k79l9R4K65j08J3m1k9L2j40L93n14L06R1j91L31N4m04K52R7
5395B62k24Q2o5j17J17K9l5k26K64j15L34j43m2q9J86J1l23K77k46k46L65J66
5417B22k86J26j83J16J68j7O4l61K48P8l14J3K39l39N22j75j85j34J56p7Q9L53
5439C23m09l37J48J39L4p0J46m7R9l2j60P9j04M39j60m01K98l17M34L2j81J42
5461I5m6J27m44R7J55K8l6j45M66m68Q5O5OQ5qP8L6k56L11k26L0L2j65L12k30
5486a6J50J85k63j30J15M3j2l8m8j41K51j8P2n9P1M1j95J7l8q3L84k55P0j51L03
5511B55j10k82K40%j20j3k80K63J90j65P4j14Q4qK9r8J36l30K82J0l26k04O57
5534A70k05L46n06K15J3l13K69j40J44l3J09o9%j57J78k61L40j98p4L26j34j99
$$ plain form
5556 -179 -45 -214 -21 -140 -23 263 -38 -59 -279 -12 362 122 -11 245 14 -267 -107 -254 10 58 142
5577 142 109 53 84 101 191 122 125 131 4 117 77 32 368 -98 139 305 -38 -33 46 -22 -136 100 -91 136 -110
5602 -110 -241 -84 9 48 -96 99 260 68 246 43 -470 -203 -100 -118 -90 157 -18 -100 59 73 -86 78
5624 78 -98 -102 229 -20 -12 -98 -96 -187 -146 -221 192 -313 57 -28 -143 -26 -142 -22 -254 -8 32 -205 -107 35 -128
5649 -128 447 11 112 39 117 -170 92 75 -104 -84 64 -73 -57 238 17 -147 -159 247 101 62 131 309 28
5672 28 219 9 96 89 181 311 -30 223 -106 252 198 -236 -49 -11 -169 88 291 66 85 18 79 95 -238 265
5696 265 -271 -60 -47 -234 23 -19 -12 -233 20 -160 47 267 -134 -69 -73 219 -373 -15 165 -313 -258 69 -2
5719 -2 -31 -24 -272 212 -53 -64 -40 -218 34 -475 -9 139 19 26 57 -176 131 227 -128 164 -143 -151 173 122 142
$$ packed form
5556a79J34j69J93j19J17K86l01k1k20K67L74k40j33K56k31k81J60j47K64M8Q4
5577A42l3n6L1J7R0o9LOj27J13m0m5L36m66K37J66l43NP9o8j14K36j91K27k46
5602a10j31J57R3L9j44J95J61j92J78k03n13K67J03j8K8K47j75q2J59J4j59J64
5624G8j76mL31k49Qq6Kr1M1p5M13n05L70q5j15J17j16J20k32K46M0k37R8J42j63
5649a28N75m36J01p3P8k87K62j7j79K0J48j37J6K95k21j64j2M06j46l9O9J78k81
5672B8J91k10Q7pR2J30l41K53l29L58n4m34J87L8j58K57K03k25J9o7O1J6l33N03
5696B65n36K11J3j87K57m2Pk21K53j80K07K20m01O5mK92n92L58J80m78N5L27p1
5719bk9Pk48M84k65j1K4j78K52n09M66J48j20PL1k33L07R6l55K92l07qL24n1K0
$$ plain form
5744 142 -73 -153 306 49 -220 318 60 -163 156 -54 -195 -138 81 9 44 307 50 -52 366 269 -203 192
5766 192 18 -140 -17 78 61 36 304 11 -170 -96 -9 85 205 -266 98 -52 -247 -165 172 -7 -78 -188 69
5789 69 -12 -231 163 -49 -257 -31 81 -156 -89 -15 -17 -20 142 231 -459 80 123 208 61 -158 -25 -80 -34 53 -64
5814 -64 -290 -70 28 -191 -131 80 0 52 72 -44 -188 -200 -152 511 -203 173 140 37 109 469 198 -111 180
5837 180 83 -115 126 136 23 33 -17 -3 242 3 39 12 -50 249 -153 64 -47 81 276 144 137 25 -37 -12
5861 -12 259 280 22 -2 -149 428 -342 78 129 104 79 208 86 142 159 139 -206 64 64 140 137 -117 21 85 1
5886 1 -274 -85 -47 -89 -62 -20 -130 119 -37 100 -301 128 105 -135 -175 138 1 16 -169 66 124 22 110 -198
5910 -198 -137 -87 94 10 -130 -39 58 210 171 -209 95 -56 4 78 -271 256 131 -253 -52 -153 -72 84 224
$$ packed form
5744A42k15q0M59k57k69N38k58k23L19k10j41N7K19p2L5K63k57j02M18r7m72L95
5766A92j74j58J23R5j7k5K68k93j81P4Q7R4J20m71L64j50j95Q2L37j79p1j10K57
5789F9q1k19L94k12k08K26J12k37O7P4klJ62Q9o90N39M3Q5j47k19J33n5M6Q7j17
5814f4k26K20R8k19O0K11q0N2K0j16j44j2M8O63p14L76l3j03P2L60k71l09K91
5837A80r7j98K41J0j13J0n0J4K45k39L6k7o2K99m02K17j11J28J95j32pj12o2K5
5861a2K71K1k58k4j47N77p70M20N1k5k5J29j22N6J7k0l45K70%P6lk54J38O4q4
5886Ak75J89L8m2K7M2j10K49j56J37m01M29k3k40m0L13j37J5j85K35N8j02Q8l08
5910a98O1N0J81q4j40R1R7J52l9l80L04j51O0P4l49N27j25l84K01j01Q1J56J40
$$ plain form
5933 224 262 -67 91 -18 -75 139 140 -86 -203 56 -169 272 -94 194 35 -130 65 202 188 74 -151 118
5955 118 61 170 -18 219 -198 -31 -10 98 -25 37 287 -109 188 -56 205 118 -87 -134 140 5 -8 -50
5977 -50 231 7 59 -16 -90 -226 1 -181 -14 147 -113 140 -394 -97 -144 42 -166 -33 -181 58 -157 -121
5999 -121 -226 199 10 88 -131 -65 -58 31 -29 216 -57 106 -182 -225 76 -47 -8 250 111 -97 -16 7 141
6022 141 25 20 -16 123 -56 68 92 -226 -19 49 -148 -84 65 -363 -192 196 23 -165 225 -126 87 243
6044 243 -146 266 -189 -204 22 -132 83 -21 -33 -116 -16 50 -57 -195 -167 -161 129 273 103 -182 -246 -262 67
6067 67 30 -102 17 123 83 -114 179 -82 -126 89 -108 -217 172 -159 1 -106 -271 -94 -14 35 -63 -67 -193
6090 -193 308 -46 -9 167 27 117 3 -36 166 -24 49 -91 -24 -41 107 -186 110 238 48 -48 -138 47 -24
$$ packed form
5933B24L8l29J58j09n7K14Jk26j17K59k25M41l66K88j59j65J95J37j4j14k25K69
5955A18n7J09j88K37m17J67K1J08j23O2K50l96K97k44K61q7k05m7K74j35j3m2
5977e0K81k24N2p5p4j36K27j82J67J61k60K53n34K97m7J86k08J33j48K39k15L6
5999a21j05M25j89P8k19O6PQ9o0K45k73J63k88m3L01j23L9K58j39k08Q1K3J34
6022A41j16nl6J39j79J24K4l18K07O8j97O4J49m28J71L88j73j88L90l51K13J56
6044B43l89M12m55j5K26j54K15j04j2q3J00O6j07j38K8OK90J44j70k85o4j6L29
6067F7l7j32J19J06m0j97K93k61m4K15j97j09L89l31J60j07j65J77Q0M9r8mj26
6090a93N01l54L7J76j40R0j14l9K02j90P3j40O7j7J48k93K96J28j90r6r0J85p1
$$ plain form
6113 -24 -99 -67 -229 -331 205 99 54 137 -107 -30 167 -90 126 92 101 285 -284 85 177 335 219 -18 -61 -135
6137 -135 -127 175 124 51 237 -263 -316 166 -31 -31 -146 -58 -135 150 -70 -183 317 -75 -210 -113 158 -117 -117 71
6161 71 18 -178 -97 -267 45 -182 -193 48 9 92 -36 -1 -215 -184 9 -34 -85 -124 60 33 -6 -44 -204 83 93
6186 93 30 58 -69 119 -54 254 127 -165 -203 19 -30 19 374 -66 -89 -149 84 28 50 86 -15 282 293 70
6210 70 -74 38 223 216 -58 -123 136 182 121 147 -93 93 20 9 -333 -99 -17 -51 -197 -160 242 -47 -12 -259
6234 -259 -9 -120 -100 130 11 -152 -28 -51 -72 -110 -99 117 -138 -82 199 -185 -83 -119 -10 -32 113 120 157 -237
6258 -237 -15 -78 116 -189 -288 17 16 -332 -125 -22 -173 76 -137 -139 -134 196 176 70 144 -173 58 158 185 -244
6282 -244 -123 -42 195 86 278 187 -88 246 167 99 261 -34 -368 -79 -35 -335 -166 -27 144 -162 -56 129
$$ packed form
6113b4p5L2j62j02N36j06m5Q3k44P7J97k57K16l4RJ84n69L69R2J58j16k37m3p4
6137a35QL02n1p3J86n00n3M82j97%j15Q8p7K85k20j13N00l92j35R7K71k75%J88
6161G1n3j96Q1j70L12k27j1K41l9Q3j28L5k14L1J93m3n1l9J84k7l9l8j60K87J0
6186I3o3K8j27J88j73L08j27k92l8K22m9M9L55m40k3o0K33n6K2L6j01K97J1k23
6210G0j44J12J85pk74o5K59M6o1K6k40J86p3j1l42K34Q2l4j46L7M02k89L5k47
6234b59K50j11K0K30j19j63J24k3k1l8J1K16k55N6K81l84J02l6J09k2J45PL7l94
6258b37K22o3J94l05r9L05jl48K07J03j51K49k13kNL30k0j06P4l17K31J00K7m29
6282b44J21Q1K37j09J92r1k75L34p9o8J62k95l34K89M4l00J69J39J71l06J06J85
$$ plain form
6304 129 60 -87 18 48 -113 97 -162 -57 63 -113 264 36 200 6 -185 -192 -71 249 178 25 -42 -20
6326 -20 -205 -4 130 -98 214 -111 18 37 -75 -86 124 103 135 -206 -88 194 -4 -13 -40 -135 50 -62 -84
6349 -84 236 131 170 21 33 -188 -185 -76 246 50 232 -74 -138 -205 137 -190 -30 186 -253 -55 72 -51
6371 -51 -66 114 34 134 -103 48 259 -102 215 147 -93 -54 48 124 293 137 9 -68 184 173 -53 19 -178
6394 -178 -32 63 54 -60 128 52 -24 282 -292 104 -87 211 -9 -41 86 -22 65 103 207 -267 -322 61 134
6417 134 111 119 64 145 248 -82 -126 235 62 230 -95 -84 76 -23 148 54 -81 5 -30 99 -100 60 125 95
6441 95 89 75 148 -53 101 88 -93 113 14 39 78 83 31 194 47 24 0 18 172 -37 88 -56 253 281 -38
6466 -38 84 -26 -66 238 264 -151 180 102 31 152 -42 129 69 58 127 -71 73 -89 -208 -11 52 2 -74 14
$$ packed form
6304A29o9j47J05L0j61K10k59J05J20j76L77k28J64j94j91pJ21L20p1j53o7K2
6326b0j85K01J34k28L12l25J29J9j12j1K10k1L2l41J18K82j98rk7r5J85j12k2
6349h4L20j05L9j49J2k21LJ09L22j96J82l06o4o7L42l27J60K16m39J98J27j23
6371e1j5J80q0J00k37J51K11l61L17o8k40L9J02P6J69j56j28p7K52j1k26P2j97
6394a78J46R5rj14J88p6p6L06n74L96j91K98k20l2J27j08Q7L8J04m74n5L83P3
6417A34k3Qn5Q1J03l30m4L61j73J68l25J1J60r9J71r4j35Q6l5J29j99J60O5l0
6441I5oj4P3k01J54j3j81K06r9K5L9Nn2J63j47k3k4J8J54k09J25j44L09K8l19
6466c8J22j10m0L04K6m15L31p8p1J21j94J71o0j1O9j98J44j62j19J97O3n0p6Q8
$$ plain form
6490 14 -32 402 98 41 -63 -164 56 225 239 22 -315 28 -50 -69 -288 152 37 -23 -33 54 -29 85 -120
6513 -120 -128 -114 -281 -82 93 -243 57 -193 157 -150 96 143 -34 -153 147 -46 -278 -135 -199 -65 70 -91
6535 -91 -36 55 -71 -3 81 70 -137 215 -61 -75 90 102 193 153 -78 7 68 208 -63 -128 169 -126 2 102
6559 102 -3 -96 -91 16 2 305 71 -142 -80 -47 98 86 258 -100 -75 -20 282 257 170 -106 68 35 -93 -113
6583 -113 -88 -17 28 -52 -31 -120 83 35 -168 43 71 -175 -170 -173 -100 -107 -133 -139 -95 36 97 -174 -235 14 24 27 274 -257
6611 -257 7 -89 254 125 120 33 198 166 -36 -105 -43 54 16 198 49 -6 -73 -93 -114 97 -62 208 -15 175
6635 175 65 -148 -61 -3 -56 84 71 -84 0 -6 -204 -116 -152 -8 103 -66 115 -184 -98 257 82 15 -3 202
6659 202 48 -109 16 -71 49 -28 31 -5 -41 -248 121 -159 -135 91 -35 96 233 -102 74 -154 -55 -121 -201
$$ packed form
6490A4m6M34l04n7j04j01K20J69J4k17l37L43p8j9k19M40j15o0j0Q7q3J14k05
6513a20qJ4j67J99J75l36L00k50L50l07K46M7j77j19L00j93k32J43o4J34J35j61
6535i1N5R1j26O8Q4j1k07L52k76j4J65J2R1m0k31Q5O1J40k71o5K97k95J28J00
6559A02j05r3NJ07j4L03k34k13O2L3J45j2J72l58K5N5L02k5q7k76J74l3j28k0
6583a13K5P1M5q0K1q9K03m8k03K11K8k46NlP3pk6oM4J31O1k71o1K49J0LK47n31
6611b57K64r6L43j29nq7J65l2k02o9O2R7l8J82j49n5o7k0k1K11j59K70k23J90
6635A75j10k13Q7N8n3J40j3j55Q4oj98Q8l6J44J11j69J81k99Q6L55j75o7j8K05
6659B02j54j57J25q7J20p7N9l6l6k07L69k80K4K26j26J31J37l35J76k28R9o6q0
$$ plain form
6682 -201 86 472 -93 156 20 -402 -114 -149 136 276 -210 73 -6 -246 246 2 1 -52 -138 259 121 -346
6704 -346 -205 27 90 21 153 130 48 -39 -315 -42 -80 -314 15 37 45 -210 -380 -86 216 -147 248 -181 46
6727 46 20 -67 191 187 -3 -64 -108 167 192 446 -126 -14 56 291 30 -339 -58 -175 122 289 130 194 274 -49
6751 -49 14 61 120 183 -258 -79 181 51 181 -37 35 -153 73 29 226 -138 55 -69 -171 -61 -114 175 92
6774 92 39 -17 59 221 3 147 -53 -116 111 -216 15 -266 -136 48 44 -35 -97 -110 52 145 -333 -155 23 35
6798 35 282 246 -17 -69 -120 -114 65 197 181 -103 154 10 -175 -86 -206 -153 -65 -33 137 -15 90 34 -137 155
6822 155 -96 33 -96 -30 -5 120 -87 -202 -98 -195 -211 -83 -54 15 -106 -68 38 9 -118 82 -231 6 -112
6845 -112 -131 18 -136 220 30 -42 147 10 -61 -95 -108 142 -300 211 112 92 -110 -11 136 145 93 -116 20 -59
$$ packed form
6682b01K87L86n65K49j36m22K88l5K85J40m86K83p9k40M92k44jn3q6L97j38m67
6704c46J41K32O3o9J32k3q2q7k76K73l8k34L29K2Qk55j70K94L02l63L95m29K27
6727D6k6q7K58mj90o1m4K75K5K54n72J12P0K35k61l69K81j17K97J67j59O4Q0l23
6751d9O3M7N9O3m41J79K60j30J30k18P2j88K26m4J97l64J93j24j02J10n3K89q3
6774I2n3n6P6J62k18J44k00o3K27l27K31k81J30J84mp9o2j3J62R3m78J78J78J2
6798C5K47l6k63n2n1OJ79J32j6k84K57j44j85Q9j20N3Q8L2J70j52J05n6j71K92
6822A55k51J29j29O6K5J25k07j15J04r7j6J28K9O9j21L8J06k9j27K00l13K37j18
6845a12j9J49j54L56j90p2J89j37p1l4j3K50m42N11r9k0k02R9J47Rn2k09J36p9
$$ plain form
6869 -59 -262 20 222 14 125 -10 140 -119 -41 -184 -44 -324 42 -6 137 -92 -39 122 71 267 -99 -361
6891 -361 -151 -144 -181 240 -82 -64 210 -131 -197 -97 309 200 103 -11 3 -50 -100 23 108 182 -3 -230 181 16
6915 16 -116 79 -91 -91 -20 -35 -23 123 9 -24 -161 -121 -269 3 -35 -190 -227 12 -182 234 -25 -26 22 384
6939 384 132 -61 74 19 76 157 161 -268 -12 -265 81 309 -89 37 -13 213 62 129 -18 42 -166 -126 61
6962 61 -22 -81 -249 -243 -54 -190 -10 173 -378 -9 -208 29 -124 85 159 -27 28 -150 -138 -96 -120 -113 -2 -194
6986 -194 -136 77 -70 11 -93 -106 122 152 -227 -218 -11 234 -137 -94 -6 356 -9 -254 78 -11 24 -179 83
7009 83 189 244 53 147 52 -94 -1 25 246 157 77 -25 -96 106 14 341 -152 -6 -30 -236 -61 36 -56 35 -44
7034 -44 -53 245 -149 -18 -58 -76 220 100 127 -89 104 17 -30 -146 110 59 -7 -85 -73 298 -109 96 76 65 -194
$$ packed form
6869e9k03K82K02k08J11j35J50k59P8j43J40k80L66m8J43k29N3J61n1J96l66k62
6891c61K10Pl7M21l22J8K74l41o6J00M06j09r7j14J4n3n0J23Q5P4j85k27M11j65
6915A6j32J95j70%P1j5J2J46j14l3j37M0j48K72l8j55l7K39j94M16k59jM8L62
6939C84k52j93J35n5N7Q1Mm29K56k53L46K28l98J26n0K26j51O7j47O0k08M0J87
6962F1q3n9j68OJ89j36J80J83n51L69j99K37j53K09P4j86N5j78J2M2k4PJ11j92
6986a94N8K13j47Q1j04j3K28L0l79RK07K45l71M3Q8L62l65k45L32q9L5k03K62
7009H3J06N5j91R4r5j46R3K6K21q9q0j02p1K02r2L27m93J46k4k06J75R7r2R1p9
7034d4rK98l94J31m0j8K96j20K7k16J93q7m7j16K56n1o6p8J2L71m07K05k0j1k59
$$ plain form
7059 -194 106 6 -64 81 92 13 -44 115 44 -66 136 -27 268 -251 -53 129 -55 -39 5 -55 58 -45 -18
7082 -18 144 -110 -198 -274 -293 27 -23 -113 61 -76 111 -97 -72 -1 12 165 18 -81 18 -4 -26 27 -17 144 -175
7107 -175 186 -207 -23 34 70 98 -71 -57 -412 -83 -90 -38 0 146 -76 11 -86 133 -92 -60 248 -21 45 124
7131 124 -118 -161 -152 -42 227 121 -44 -77 86 54 -6 138 -111 33 104 90 62 -37 -112 -133 66 379 171 100
7155 100 142 -116 -53 -131 -123 80 19 18 55 29 -126 -122 37 -55 -74 -56 -150 13 -68 31 31 -52 214 -172 -17 84 -314
7182 -314 104 -163 -248 -92 38 42 -75 86 193 77 14 -167 -25 14 7 240 -266 -20 155 220 54 -216 -121
7205 -121 -132 95 247 64 -142 -65 -109 175 96 103 121 -83 83 -104 -183 164 -25 62 235 130 -25 -37 246
7228 246 38 -329 -97 10 -70 196 -223 -14 -167 -54 -86 -40 -92 -127 136 169 -25 -104 -302 69 40 54 21
$$ packed form
7059a94L00j00p0J45J1p9n7J59p1j10K02j63K95n19J98J82j84J6M4o0J13j03K7
7082a8J62k54q8p6j9L20n0r0J74j37J87k08K5P1J3J53j47r9R9k2k2N3m4J61l19
7107a75L61l93J84N7L6K8j69J4l55L29pN2L8J46k22Q7r7K19k25L2L08k69O6P9
7131A24k42m3RJ10K69j06j65l3J63l2o0J44k49J44P1j4k8r9p5k1J99L13k08p1
7155A00M2k58O3p8QK03o1jL7k6j55MJ59r2j9J8r4J63q1R9%q3K66l86J55J01l98
7182c14M18k67q5J56J30Mj17J61J07j16o3j81J42L9pK33n06K46J75O5j66k70R5
7205a21j1K27J52j83k06P7m4K84p9PJ8k04J66j87p9L47j89Q7J73j05j55j2K83
7228B46k08l67K32J07q0K66m19K09j53J13l2M6n2l5K63L3j94p9j98L71k9J4l3
$$ plain form
7251 21 43 -92 -217 120 152 -294 209 75 -42 -20 -111 3 123 48 118 12 125 -62 -60 6 40 -71 141 39
7275 39 -358 -471 121 42 -252 -186 40 0 -64 -23 -105 71 91 -183 146 -57 -230 -13 243 15 -216 62 66
7298 66 236 87 40 341 -352 78 10 297 -75 86 -73 -164 107 -42 -134 136 32 136 -56 207 -4 -231
7320 -231 -137 -133 153 -69 38 167 -236 -224 166 30 -73 -1 -28 3 -81 -47 -62 5 -141 125 -37 -54 -123 -132 -62
7345 -62 49 -215 66 -73 -65 189 -72 92 -265 -130 -37 87 -173 -38 -230 -15 -120 -27 27 -140 -12 -112
7367 -112 -106 -98 127 114 139 -4 -230 -31 262 -195 -62 -62 -59 72 17 -97 -107 -106 51 251 -47 132 -17 191 45
7392 45 51 107 -51 -84 -167 22 -171 -218 -74 -51 -174 -89 24 148 1 -27 119 182 -80 -256 0 -25 92 -113
7416 -113 -216 -40 61 47 153 54 -46 109 -118 13 -80 -60 26 66 -208 -196 -82 -96 -64 -57 -67 80 81 76 -242
$$ packed form
7251B1K2j35j25L37L2m46N03j34j17K2r1J14J20p5P0j06J13j87KO6L4j11K12j02
7275C9l97j13N92p9k94O6K26m0o4M1q2J76K0k74L29k03j73K17K56k28k31K78M
7298F6J70j49m7L01o93M30o8K87l72J61j59r1K71j49r2K70j04J04j92K63k11k27
7320b31R4MK86k22J07J29m03J2L90j36j03P2k7L1q4L4j5O7j46K66j62j7o9rP0
7345f2J11k64K81j39QK54k61J64l57J35R3J24k60J35j92K15j05R3N4j67J28j00
7367a12OQK25j3K5j43k26J99K93m57J33%LJ31n5j14j0JJ57K00k98J79j49K08j46
7392D5ON6j58l3q3J89j93m7J44K3j23Q5J13J24j47k8J46O3k62j76K56k5J17k05
7416a13j03J76J01j4J06r9j00J55k27J31r3K0Q6M0k74J2J14j4L2Pj0J47Jnl18
$$ plain form
7441 -242 240 -331 -285 259 -117 -197 -310 109 -122 157 -87 111 -112 57 -36 151 236 -167 241 69 -167
7462 -167 51 208 221 -98 94 4 3 88 -198 -2 -96 147 -55 -151 -95 -57 -47 -141 -94 -90 21 118 -241 -128 -60
7487 -60 56 -75 98 4 73 -19 79 208 -141 -7 191 18 -25 267 22 47 -87 -17 39 111 -102 18 86 -20
7511 -20 190 -181 53 201 29 169 21 -35 71 180 6 -112 107 -3 -5 -98 -168 130 -21 50 -25 -97 -49
7534 -49 203 395 16 222 -131 -57 -182 -193 100 -86 -93 11 151 -9 -139 -169 -277 266 44 -126 -14 150
7556 150 345 -60 -149 -133 -65 27 344 -42 -97 -72 86 -2 -81 -33 -128 51 60 -70 -13 -206 -165 246 -103 -209 -91
7581 -91 81 -253 113 173 -367 88 -17 -98 -131 -134 -77 182 -312 -46 -65 -269 -174 82 -168 228 91 -109 -14
7604 -14 -118 238 53 144 -156 146 -59 294 94 -91 -36 -427 -221 -178 112 107 -42 -8 18 -288 33 183 44
$$ packed form
7441b42M82n71M6N44l76q0j13M19k31K79k44J98k23J69r3J87Q5m03M08j72k36
7462a67K18J57J3l19J92r0jQ5k86J96r4K43k02r6N6L8J0r4M7MJ11R7l59J13O8
7487f0J16j31J73r4O9r2R8J29l49J34J98j73m3K92k45K5j34P0N6P2k13J20O8j06
7511b0K10l71K34J48j72J40j48n6J06J09j74j18K19j10kr3p0K98j51P1p5p2M8
7534d9K52J92l79K06l53P4j25j1K93j86pJ04J40j60j30l0j08N43k22j70J12J64
7556A50J95m05q9J6O8R2L17l86n5K5J58q8p9M8r5J79Rj30N7j93M1M11l49j06J18
7581i1J72l34L66O0n40M55j05q1l3lN7K59m94K66j9k04R5K56k50L96j37k00R5
7604a4j04L56j85R1l00L02k05L53k00j85N5l91K06M3K90nj49L4K6l06L21J50j39
$$ plain form
7627 44 -122 -237 -39 -145 139 70 -144 112 81 29 -68 -39 117 -100 69 -22 -74 87 -103 -123 7 152 3
7650 3 103 -27 -138 -46 -64 94 -140 49 -323 20 -12 -180 -141 35 -13 -27 -46 40 -66 -91 177 -58 10 49
7674 49 -99 12 -148 -32 146 -271 -96 -231 123 -58 91 157 26 85 -45 -292 -151 17 52 -95 61
7695 61 -160 -172 152 -47 256 -23 61 290 -245 -136 -1 205 91 73 303 -214 -19 -185 117 10 -64 -101
7717 -101 -60 -193 10 220 145 -16 -22 -151 -115 -200 -159 166 -142 11 -298 160 -127 -172 -117 -290 -166 -70 181
7740 181 -69 -100 -104 -195 -135 160 -302 41 114 -175 -37 148 16 43 -161 -94 16 18 33 -43 144 119 33 -72 -88
7765 -88 106 109 -123 -24 98 -12 -171 136 -104 264 -10 -8 50 -296 -96 66 3 -24 -211 -21 -139 -138 -229 -59
7789 -59 281 -268 62 -58 -115 6 28 54 -110 2 -135 135 14 5 -74 242 -28 -121 -56 31 -66 -84 -109 -4
$$ packed form
7627D4j66j15J98j06K84o9k14K56l1n2r7K9J56k17J69r1n2J61j90k0J30J45j49
7650CJ00j30j11R2j8J58k34J89l72L43l2j68L9J76m8j4j9Q6j06k5K68k35O8L9
7674D9j48J11j60J16J78m17J75j35L54j81J49O6j31N9j30k47J41J68L5j47J56
7695F1k21j2L24j99L03k79Q4K29n35J09J35K06j14j8K30n17J95j66L02j07p4l7
7717a01M1j33K03K10p5j61oj29L6q5M1L25l08J53l09M58k87m5N5j73J24R6K51
7740A81k50l1mr1O0K95m62L43P3k89J38J85j32K7k04O7J10KJ5p6J87k5q6j05j6
7765h8J94Lk32R9J22j10j59L07k40L68k74KN8l46K00J62o3k7j87J90j18Jr1J70
7789e9L40n49L30j20n7J21K2K6j64J12j37K70j21rp9L16k70r3O5Q7r7j8k5J05
$$ plain form
7813 -4 -83 -237 -1 132 150 147 81 -13 268 70 197 128 41 -151 53 122 25 50 127 -150 11 193 -184 -40 156
7838 156 -111 189 -18 -71 -188 -69 -117 -77 148 139 212 112 101 149 -219 62 16 186 172 65 -245 -79 -80 -356
7862 -356 -25 372 121 131 13 68 115 24 -199 -161 149 -178 -143 -12 85 -23 103 -25 4 0 176 38 -44 -13
7886 -13 17 -249 -57 -185 232 150 38 -164 81 -134 95 -83 52 112 -170 252 157 -30 -28 -218 -8 -195
7908 -195 33 100 78 55 77 -58 -19 -88 -163 68 -25 131 -56 325 -81 58 126 -141 -11 118 10 -383 282
7931 282 88 38 -167 46 -188 157 -104 243 79 40 -29 93 -212 -66 20 -190 297 203 78 -161 141 180
7953 180 145 81 -20 91 103 106 -29 185 81 -147 -138 -62 129 -62 148 32 -281 131 51 -165 209 239 -47
7976 -47 120 -20 -250 -146 194 -35 -16 -204 -4 374 -280 -96 197 -55 52 -156 -160 -211 46 410 -115 13
$$ packed form
7813dp9j54K36J33J8lo6r4K81j98J27o9q7j92K04O9r7K5P7k77J61J82l77J44J96
7838A56k67L00k07n3j17J19m8M0K25rP3j00j1M8l68K81m6J70j4j07l10J66jk76
7862c56L31L97k51J0j18N5M7r1k23L8L10l27L5J31R7j08J26j28K9mJ76j38q2L1
7886a3L0k66J92j28M17q2j12k02K45k15K29j78J35O0k82M22r5j87Kj90K10j87
7908a95K28O7k2k3K2j35L9o9p5K31r3J56j87L81m06J39O8k67J30J29j08l93O65
7931B82j94n0k05K13k34L45k61L47j64l9o9J22l05J46Q6k10M87r4j25k39L02L9
7953A80l5o4j01J11J2Lj35K14j04k28RP6J91j91K10j16l13M12q0k16L74L0k86
7976d7J67j40k30J04L40k29J9j88K00L78o54J84K93k52J07k08mn1K57L64n25J28
$$ plain form
7998 13 -42 105 18 -141 -47 125 58 -153 -12 -201 175 54 -201 -66 -229 -173 -12 32 57 279 -91 -7 335
8021 335 240 50 184 -11 -24 -43 24 135 -47 -169 10 -82 -166 216 12 308 203 111 -25 -147 301 -239
8043 -239 -27 -30 -63 -123 -216 -193 146 96 40 25 19 35 26 44 64 -121 -85 280 3 41 29 -14 -269 173 -107 -95 108
8070 108 -63 -56 1 106 -230 162 -31 97 96 55 156 115 -34 -151 1 -7 -30 -384 -111 -72 355 27 -164 -150
8094 -150 -49 273 97 -19 -10 -148 71 29 70 106 47 18 114 -59 -86 -155 -71 -420 5 325 -255 11 148 -46
8118 -46 -336 238 165 -109 -213 -50 -189 -191 10 162 -165 -32 222 -233 129 210 61 -17 141 -1 38 57 26
8141 26 -80 -99 69 96 -108 -131 102 -27 44 121 136 20 68 106 34 440 -108 -372 -180 -9 -228 418 269
8164 269 -162 -34 -371 -73 183 122 27 165 95 -45 -134 -57 159 -233 4 -50 -43 11 -112 -57 -146 -213 -31 55
$$ packed form
7998A3n5J47q7j59R4J72o7k11J41j89L76j21k55J35j63N6J61M4K5K22l70Q4L42
8021C35r5j90J34j95j3j9O7J11j82j22J79r2q4L82k04K96j05r2j36j22M48n40
8043b39K12ll3o0r3K3L39n0n6j5oJ6rJ8K0j85L6L65k77L8j2m3k55M42k80J2K03
8070A08j71PN7J05l36L92j93J28jm1J01m1j49j17J52qk3l54K73L9M27l28j91J4
8094a50J01L22j76j16Rj38K19m2M1L6n9k9R6j73k7o9Q4l49M25L20n80K66J37j94
8118d6k90N74p3k74j04J63j39kK01J52l27J33K54m55L62Q1j49p8J58j42L9J9l1
8141B6j06j9J68K7k04k3K33j29P1P7J5j16M8L8p2M06n48k64J92J71k19O46j49
8164B69m31J28l37K98K56o1r5J38p0j40q9P7K16l92K37n4PN4j23N5q9o7J82Q6
$$ plain form
8188 55 46 123 100
$$ packed form
8188E5rP7k3
8191A00
$$ Imaginary data points
##PAGE= N=2
##DATA TABLE= (X++(I..I)), XYDATA
$$ plain form
0 0 0 0 0 0 0 0 0 0 0 0 8 -8 8 -8 8 -16 16 -21 24 -32 34 -40 48 -56 69 -80 91 -104 121 -139 157 -179 202
33 202 -229 257 -289 324 -362 405 -450 500 -553 615 -679 750 -828 913 -1005 1109 -1220 1344
51 1344 -1482 1635 -1806 1997 -2216 2465 -2755 3098 -3504 4000 -4620 5419 -6487 8000 -10294
66 -10294 14158 -21855 42888 -216936 -604845 151763 365009 -191718 -292195 112132 60218
77 60218 -208115 -121515 70742 15547 -77708 -139878 -139722 3898 120878 -38239 -243114
88 -243114 -128282 130232 37629 -205745 -108448 84496 -34292 -158267 -22287 51939 -71578
99 -71578 -81306 -13891 -53095 -4829 67681 -97859 -149720 109537 145360 -127425 -128338 107213
111 107213 78363 -62618 6232 48655 -18666 11734 42783 2512 40451 70988 -30179
$$ packed form
0@%%%%%%%%%%Qj6J6j6J6k4L2l7M5n6O6p4Q8j04J25j49J71j95K25k60K96l36L81
33B02m31M86n46O13o86P67q55R50j053J168j294J429j578J741j918K114k329K564
51A344k826L117l441L803m213M681n220N853o602P504q620J0039j1906J4487j8294
66a0294K4452l6013O4743k59824l87909P56608K13246n56727j00477M04327n1914
77F0218k68333Q6600J92257n5195r3255o2170J56J43620J16980j59117k04875
88b43114J14832K58514r2603k43374R7297J92944j18788j23975J35980P4226j23517
99g1578r728O7415l9204M8266P2510j65540n1861K59257L5823k72785r13K35551
111A07213k8850j40981O8850M2423o7321L0400L1049m0271L7939L0537j01167
$$ plain form
122 -30179 -64618 81177 136493 -19380 -74097 70189 107625 -6373 -4256 91758 30157
133 30157 -58390 77839 144206 -46908 -53890 147158 65932 -117063 46916 189613 -49571
144 -49571 -151514 117469 161478 -85048 -80984 85212 44243 -40089 14262 33441 -24357
155 -24357 -11639 21527 -9980 8104 52162 -22598 -88672 5401 89877 -2483 -96287 -9468
167 -9468 53717 -48041 -62281 50934 19116 -97402 -48856 41781 -14370 -51014 13042 -13251
179 -13251 -71639 2296 38370 -41398 -44129 15710 -10174 -43399 8933 23019 -37311 -31263
191 -31263 12460 -14657 -25763 10722 -4291 -38048 -4696 27114 -20314 -46576 21235 35288
203 35288 -38067 -24868 47243 10012 -58607 9070 83158 -6278 -71126 24240 58203 -23580
$$ packed form
122c0179l4439J45795N5316j55873n4717J44286L7436j13998K117R6014o1601
133C0157q8547J36229O6367j91114o982K01048q1226j82995J63979J42697k39184
144d9571j01943K68983M4009k46526M064J66196m0969q4332N4351J9179n7798
155b4357J2718L3166l1507J8084M4058p4760o6074R4073Q4476r2360r3804Q6819
167i468O3185j01758j4240J13215l1818j16518M8546R0637n6151l6644O4056k6293
179a3251n8388P3935L6074p9768k731N9839k5884l3225N2332J4086o0330O048
191c1263M3723k7117j1106L6485j5013l3757L3352L1810m7428k6262O7811J4053
203C5288p3355J3199P2111l7231o8619O7677P4088q9436o4848R5366L3963q1783
$$ plain form
215 -23580 -18651 42693 10951 -37436 1504 37663 8816 -3420 -3208 -19670 12665 50260 3792
228 3792 -35505 9938 40864 -4243 -15539 42445 29370 -42087 -15896 54121 29343 -27515
240 -27515 -10613 22253 946 -5120 21121 -3086 -25201 15338 26229 -13753 -11875 21263
252 21263 3645 -23805 16281 39345 -13835 -30838 12378 25017 7952 -1679 -9187 -12224 7975
265 7975 23463 -5696 -22844 10520 9334 -24037 -243 36045 -1102 -49368 -6728 49308
277 49308 9119 -33178 237 14822 -8713 -2864 16759 1887 -18307 -2896 9614 -3657
289 -3657 860 2343 -16833 -8746 14841 5644 -18181 -15499 6057 4666 -4367 4150 -5577 -19913
303 -19913 993 16298 -1965 -15293 -1016 4732 -14448 -3147 21430 -6795 -32487 -1678
$$ packed form
215b3580M929O1344l1742m8387L8940L6159k8847j2236K12j6462L2335L7595m6468
228C792l9297M5443L0926m5107j1296N7984j3075p1457K6191P0017k4778n6858
240b7515J6902L2866k1307o066K6241k4207k2115M0539J0891l9982J878L3138
252B1263j7618k7450M0086K3064n3180j7003M3216J2639j7065r631p508l037K0199
265G975J5488k9159j7148L3364j186l3371K3794L6288l7147m8266M2640N6036
277D9308m0189m2297L3415J4585k3535N849J9623j4872k0194J5411J2510j3271
289c657M517J483j9176Q087K3587r197k3825K682K1556j391r033Q517r727j4336
303a9913K0906J5305j8263j3328J4277N748j9180J1301K4577k8225k5692L0809
$$ plain form
315 -1678 21336 3 -18903 -5755 2205 -7715 242 7285 -6841 -7205 -2580 -5389 3819 10268
329 10268 -1986 -15107 -2432 17092 1684 -14703 2179 9901 -1911 -4035 5494 5344 -8657
342 -8657 -2818 13457 2865 -5986 4200 1857 -2716 6779 11253 -2361 -8308 10217 12674 -4995
356 -4995 428 9720 517 348 7880 5998 -780 -1432 4826 1998 1662 7745 -87 -5703 2808 4927
372 4927 -274 -3640 3186 6930 -5427 -5265 6909 1322 -5013 2332 5220 -3320 -7871 2801 4388
387 4388 -6513 -2011 1179 -5201 -1933 -569 -4821 -4635 -2659 -1358 -4017 -3274 -184 -6403 -6291 937
403 937 1503 -1762 -6445 -4807 3294 103 -4337 -1305 -3384 -1782 2626 -440 -5807 -4113 2431 -1280
419 -1280 -6096 4858 3565 -9881 -5457 5347 7131 1716 -7338 -4266 8167 9232 -3025 -8094
$$ packed form
315a678K3014k1333j8906J3148P960r920P957P043j4126l64M625k809R208O449
329A0268j2254j3121J2675J9524j5408j6387J6882P722j1812k124R529j50j4001
342h657N839J6275j0592q851J0186k343m573R495M474j3614n947J8525K457j7669
356d995N423R292r203j69P532j882o778o52O258k828l36O083p832n616Q511K119
372D927n201l366O826L744j2357J62J2174n587o335P345K888q540m551J0672J587
387D388j0901M502L190o380L268J364m252J86J976J301k659P43L090o219J12P228
403I37N66l265m683J638Q101l191m440L032k079J602M408l066n367J694O544l711
419a280m816J0954j293j3446M424J0804J784n415r054L072J2433J065j2257n069
$$ plain form
433 -8094 5947 10376 -3953 -3467 6081 4179 -3155 -7150 4459 15797 -905 -17432 -2835 16377
447 16377 8264 -9111 -4899 4714 3644 3053 -864 -1435 7730 224 -9713 4656 13973 -1387 -14140
462 -14140 -3659 10576 6542 -3982 -10002 -3977 9283 2021 -10689 1741 6885 -5215 -4876
475 -4876 3644 2500 -1825 -1106 -1321 -741 6710 1254 -11862 -1087 10016 1550 -3509 -5671 -4246
490 -4246 6331 5618 -6208 -5292 5258 2221 -5488 4439 5586 -6145 376 4229 -2957 7502
504 7502 10391 -11026 -12670 12712 18306 -6309 -15510 2849 12920 2293 -11094 -3549 17066
517 17066 1854 -22071 2593 24552 -2221 -20554 -49 15573 5119 -6016 -8312 -4003
529 -4003 11337 7549 -16160 -6304 15992 383 -18171 -5444 14021 7356 -15523 -15824 9509
$$ packed form
433h094J4041M429j4329M86R548j902p334l995J1609J1338j6702j6527J4597J9212
447A6377q113j7375M212R613j070n91l917n71R165p506r937J4369R317j5360j2753
462a4140J0481J4235m034j0524o020O025J3260p262j2710J2430N144j2100L39
475d876Q520j144m325P19k15N80P451n456j3116J0775J1103q466n059k162J425
490d246J0577p13j1826R16J0550l037p709R927J147j1731O521L853p186J0459
504G502K889k1417j644K5382N594k4615r201J8359J0071j0627j3387P545K0615
517A7066j5212k3925K4664K1959k6773j8333K0505J5622j0454j1135k296M309
529d003J5340l788k3709R856K2296j5609j8554J2727J9465o665k2879l01K5333
$$ plain form
542 9509 16901 -11506 -24192 10742 21832 -16121 -21010 10278 11450 -6290 -9253 -2273 3698
555 3698 3494 -4617 -8950 4285 9793 -9259 -12295 7856 12538 296 -13560 -10301 15120 15778
569 15778 -12322 -10879 16014 8750 -17674 -766 25569 1663 -17592 4773 13467 11 -225
582 -225 6492 3598 -3329 2165 11389 3412 -5704 2342 12745 2671 -10276 6423 18059 -5753
596 -5753 -10054 10818 7525 -4715 2855 6065 -4419 -2206 7808 -1891 -6556 11167 5563 -16798
610 -16798 -9473 12840 11991 -9967 -17579 3065 11251 -7423 -13855 3019 8552 -12227 -17876 6219
624 6219 10338 -9152 -14402 -7040 1820 5452 -4464 -13753 -7272 5515 481 -13466 -5623 7920
638 7920 -1652 -15483 -10960 9473 11617 -15923 -19034 11959 13381 -15400 -14515 14618 10690 -16036
$$ packed form
542I509P392k8407j2686L4934J1090l7953m889L1288J172j7740k963O980N971
555C698k04q111m333J3235N508j9052l036K0151M682j2242j3856L259K5421O58
569A5778k8100J443K6893p264k6424J6908K6335k3906j9255K2365Q694j3456k36
582b25O717k894o927N494R224p977r116Q046J0403j0074j2947J6699J1636k3812
596e753m301K0872l293j2240P570L210j0484K213J0014r699m665J7723n604k2361
610a6798P325K2313q49k1958p612K0644Q186j8674o432J6874N533k0779n649K4095
624F219M119j9490n250P362Q860L632r916r289O481J2787n034j3947P843J3543
638G920r572j3831M523K0433K144k7540l111L0993J422k8781Q85K9133l928k6726
$$ plain form
652 -16036 -6894 13295 3315 -5844 1463 3328 -496 1297 6416 2977 -1317 3848 3536 -997 4441
667 4441 10270 4982 -4796 -2746 11748 10608 262 3749 5065 -2049 2202 14542 9053 -6730
681 -6730 -761 10892 2429 -42 9838 3634 -5465 -1198 5981 7820 2974 -4050 -5937 2352 8876
696 8876 506 -5260 146 -262 -1905 -205 -1168 1006 1106 -7045 -8990 1534 6682 -5939 -13201
711 -13201 -825 4388 -5874 -11055 -3660 5514 -1692 -16420 -6903 9061 -593 -14542 -5314 5092
725 5092 -5442 -9797 1943 1174 -6976 -4711 -4425 -3313 4961 1718 -9548 -7290 2832 3072 -2871
740 -2871 -246 711 -3065 -895 2028 3277 3881 -2609 -3321 4525 5158 1636 1183 462 317 3706 7133
757 7133 1613 -1673 4931 3110 -162 6748 5956 -1097 1661 5293 3174 2096 4434 2445 1039
$$ packed form
652a6036R142K0189r980r159P307J865l824J793N119l439m294N165l12m533N438
667D441N829n288r778K050J4494j140j0346L487J316p114M251J2340n489j5783
681f730N969J1653q463k471R880o204r099M267P179J839m846p024j887Q289O524
696H876q370n766N406m08j643J700r63K174J00q151j945J0524N148j2621p262
711a3201J2376N213j0262n181P395R174p206j4728R517J5964r654j3949R228J0406
725E092j0534m355J1740p69q150K265K86J112Q274l243j1266K258J0122K40n943
740b871K625R57l776K170K923J249O04o490p12P846O33l522m53p21j45L389L427
757G133n520l286O604j821l272O910p92p053K758L632k119j078K338j989j406
$$ plain form
772 1039 5094 3456 -1359 3975 4657 -968 2615 4280 -645 -859 3491 3433 -1406 -1592 1906 1351 177
789 177 -550 -980 1147 -1832 -1871 4050 29 -6725 -2199 2543 -870 -3371 -846 -1618 -5597 -1133 1964
806 1964 -3150 -3204 -2416 -4305 -145 1082 -3742 -5234 -1133 963 -3091 -3030 683 -2450 -4158 -1110
822 -1110 74 626 -3301 -4731 1474 2085 -2760 -2504 210 1357 -1193 -695 713 -1569 -126 2069
838 2069 158 610 674 -1826 587 2958 2137 364 -813 723 1859 2600 2419 -1118 -211 3912 1696
855 1696 582 1865 982 595 958 2875 2976 -160 202 1157 1387 2934 645 -631 1195 1492 2049
872 2049 951 -1675 790 2540 1379 203 30 129 -456 83 3231 498 -1665 -269 -1168 368 2536
889 2536 47 -2359 -1882 1452 2137 -2738 -1593 1518 -781 -1420 -198 1055 -230 -3538 -878 2925
$$ packed form
772A039M055j638m815N334O82n625L583J665m925k14M350n8m839j86L498n55j174
789A77p27m30K127k979l9N921m021o754M526M742l413k501K525p72l979M464L097
806A964n114n4P88j889M160J227m824j492M101K096m054O1L713l133j708L048
822a110J184N52l927j430O205O11m845K56K714J147k550M98J408k282J443K195
838B069j911M52O4k500K413K371q21j773j177J536J136P41j81l537R07M123k216
855A696j114J283q83l87L63J917J01l136L62R55K30J547k289j276J826K97N57
872B049j098k626K465J750j161j176j73R9n85N39L148k733k163J396q99J536K168
889B536k489k406M77L334O85m875J145L111k299o39J222J253j285l308K660L803
$$ plain form
905 2925 -497 -2517 -2059 98 1035 -1550 -1955 -1589 -750 615 -1228 -1648 664 -1826 -2694 1007 1763
922 1763 -1048 -4337 -1582 2117 -92 -1409 -678 -1041 -739 -1133 -333 798 -1378 -1523 -387 -128 627
939 627 -814 -2498 -193 1524 987 -1986 -2116 1390 752 -1304 296 170 -509 -26 76 922 531 -768
957 -768 -1421 -340 3228 1786 -3182 -878 2267 1693 672 -249 693 697 124 1766 1653 734 1296 528
975 528 68 1410 2028 1509 -1499 684 5002 885 -2874 1110 3403 1521 -572 645 1137 203 2285
992 2285 1585 -1526 1591 2055 -1693 -154 3371 2520 -3339 -3217 3421 3433 -1088 -2897 -869 1894 1046
1009 1046 -1807 -444 749 -736 -1737 -1954 1180 1887 -2711 -4005 400 2729 -1425 -4728 -135
1024 -135 1739 -1988 -1485 -716 -2489 -419 521 -2109 -3206 931 1224 -4680 -2586 3707 -878 -5073
$$ packed form
905B925l422k020M58K157R37k585m05L66Q39J365j843m20K312k490q68L701P56
922A763k811l289K755L699k209j317P31l63L02l94Q00J131k176j45J136K59P55
939F27j441j684K305J717n37k973j30L506o38k056J600j26o79M83J02Q46l91j299
957g68o53J081L568j442m968K304L145n74j021r21R42Mn73J642j13r19N62p68
975E28m60J342O18n19l008K183M318m117l759L984K293j882k093J217M92r34K082
992B285p00l111L117M64l748J539L525q51n859J22O638J2m521j809K028K763q48
1009A046k853J363J193j485j001k17L134P07m598j294M405K329m154l303M593
1024a35J874l727N03P69j773K070R40k630j097M137K93n904K094O293m585m195
$$ plain form
1040 -5073 -339 2592 -755 -3741 -395 1020 -1796 200 1404 -2704 -2741 1688 2715 -1815 -3172
1055 -3172 2137 2046 -3107 -63 4207 -573 -3538 477 4057 906 -847 1028 -1673 -54 5654
1070 5654 1159 -3614 855 3245 409 -860 2261 2641 -437 -520 468 2067 4389 -1372 -4106 3263
1086 3263 5223 -1328 -2743 1998 3846 -1245 -2695 2368 3131 -203 -2073 297 2690 -678 -629 2712
1102 2712 -810 -1742 2552 -840 -3229 3565 4853 -5578 -6076 6646 3853 -7092 -431 5163 -3894
1117 -3894 -4188 4205 2954 -3674 -2964 1453 -111 -1050 1273 -332 -3205 -2563 1203 3614 -2175 -4295
1133 -4295 1509 -136 -3606 1999 3070 -3872 -3927 2663 1076 -3824 2267 1800 -5561 -1186 3708 -1548
1149 -1548 -1699 1302 -1211 -1373 1575 -127 -2490 2570 1965 -5736 -1132 5936 -641 -3524 1253 1054
$$ packed form
1040e073M734K931l347k986L346J415k816J996J204m108l7M429J027m530j357
1055c172N309r1n153L044M270m780k965M015L580l151j753J875k701J619N708
1070E654m495m773M469K390k836j269L121L80l078q3R88J599K322n761k734P369
1086C263J960o551j415M741J848n091j450N063P63l334j870K370K393l368M9L341
1102B712l522r32M294l392k389O794J288j0431m98J2722k793j0945O661N594r057
1117c894k94Q393j251o628P10M417j564r39K323j605k873O42L766K411n789k120
1133d295N804j645l470N605J071o942n5O590j587m900O091m67p361M375M894n256
1149a548j51L001k513j62K948j702k363N060o05p701M604P068o577k883M777j99
$$ plain form
1165 1054 -1352 -1142 1804 2761 -468 -3121 -677 3006 1851 -724 1247 -1317 -3143 4317 4362 -4875
1181 -4875 126 5319 -3613 -4002 7692 5407 -8020 -2612 7914 164 -3331 4446 1434 -3533
1195 -3533 1010 3103 635 216 1176 -576 -1046 2037 2444 929 -574 -1159 2755 1975 -2943 1818
1211 1818 4677 -2741 -2655 3928 1607 -2516 2024 2606 -3599 -287 4157 -1797 -805 3536 -2487 -4005
1227 -4005 3947 2449 -3873 -670 2289 -2358 -2222 4275 438 -4672 -1156 981 -505 152 -359 -847
1243 -847 -1567 -1967 622 1254 -2076 -2941 51 -413 -2807 1032 1921 -5921 -3197 4953 -1535 -5849 2220
1260 2220 1758 -5686 -1793 4459 -1409 -4641 1874 735 -4370 472 2018 -2066 -1568 1022 -77
1275 -77 -1771 -440 2103 -160 -1987 -661 1009 866 -727 477 1962 -2083 -1088 4177 884 -1759
$$ packed form
1165A054k406K10K946R57l229k653K444L683j155k575J971k564j826P460M5r237
1181d875N001N193q932l89J1694k285j3427N408J0526p750l495P777l012m967
1195c533M543K093k468m19R60j752m70L083M07j515j503n85L914p80m918M761
1211A818K859p418Q6O583k321m123M540N82o205L312M444n954R92M341o023j518
1227d005P952j498o322L203K959m647J36O497l837n110L516K137j486O57n11m88
1243h47p20m00K589O32l330q65K992m64k394L839Q89p842K724Q150o488m314Q069
1260B220m62p444L893O252n868l232O515j139n105M842J546m084M98K590j099
1275g7j694J331K543k263j827J326J670j43j593J204J485m045R95N265l293k643
$$ plain form
1291 -1759 1442 918 -1674 1674 4729 -1004 -2669 2999 1975 -1488 3455 3295 -3122 -423 4155
1306 4155 1944 -527 1609 1695 -1229 828 3717 956 -283 849 734 732 581 1428 1353 -1305 258
1323 258 2019 -247 -984 1378 1688 -2087 -1601 2703 65 -2764 1858 1440 -3754 -935 2475 -770
1339 -770 -2885 407 256 -3881 -1130 3184 -1660 -3522 -274 -252 -2054 -1196 399 -1260 -3449 -471
1355 -471 943 -2051 -1566 -236 -1022 -2116 -998 929 -2052 -3702 805 892 -2677 -1195 937 -905
1371 -905 -1826 740 866 -2409 -1077 1955 -580 -1024 1606 -160 -1406 993 2472 239 -1141 1219
1387 1219 1239 -462 1333 1915 117 476 1399 1623 526 919 2373 564 256 2624 1308 -180 1682
1404 1682 2919 1199 -479 1518 2537 130 1071 2875 -34 -608 1878 2249 178 145 1555 -78
$$ packed form
1291a759L201n24k592L348L055n733j665N668j024l463M943j60o417K699M578
1306D155k211k471K136Q6k924K057K889k761j239J132j15kj51Q47p5k658J563
1323B58J761k266p37K362L10l775M86M304k638k829M622m18n194K819L410l245
1339g70k115L292j51m137K751M314m844j862L248K2j802Q58J595j659k189K978
1355d71J414k994M85J330p86j094J118J927k981j650M507Q7l569J482K132j842
1371i05r21K566J26l275J332L032k535m44K630j766j246K399J479k233j380K360
1387A219K0j701J795N82j798L59R23K24j097L93J454j809l08K368j316j488J862
1404A682J237j720j678J997J019k407R41J804k909n74K486L71k071l3J410j633
$$ plain form
1420 -78 -1047 2280 2098 -1418 -453 1060 227 -539 1041 1003 -2006 -1262 1760 -284 -2025 24 309 -1568
1438 -1568 -1714 479 -18 -2639 -724 1052 -1987 -2657 -12 -39 -1762 -888 353 -1604 -2933 601
1454 601 469 -2120 -1172 -230 -1356 -1550 172 462 -2018 -2108 434 115 -1035 -111 -18 -850 -542 291 280
1473 280 -1178 -523 782 -453 -159 793 20 -227 196 795 154 -612 919 588 180 1318 36 20
1491 20 839 981 762 596 458 750 -102 1116 2204 -309 -426 996 1168 518 322 1260 415 -852 1243
1510 1243 1277 -323 42 715 418 -22 89 1068 -231 -582 1012 504 -920 -146 668 200 -603 -156 554
1529 554 -765 -460 695 -296 -1277 -204 -252 -275 -356 -146 -567 -1344 -63 618 -410 -376 -1049 -710 33 -490
1549 -490 -277 -256 -859 -283 -174 -273 -224 -680 -367 -304 -31 361 -1216 -769 617 -386 -387 -83 -710 -864 82
$$ packed form
1420g8r69L327j82l516R65J513q33p66J580l8l009P44L022k044j741K049K85j877
1438a568j46K193m97k621J915J776l039o70K645k7j723Q74J241j957j329L534
1454F01j32k589R48R42j126j94J722K90k480r0K542l19j150R24R3q32L08Q33j1
1473B80j458O55J305j235K94R52p73k47M23N99o41p66J531l31m08J138j282j6
1491B0Q19J42k19j66j38K92q52J218J088k513j17J422J72o50j96R38q45j267K095
1510A243L4j600L65O73k97m40J11R79j299l51J594n08j424P74Q14m68q03M47P10
1529E54j319L05J155r91r81J073m8k3q1K10m21p77J281O81j028L4o73L39P43n23
1549d90K13K1o03N76J09r9M9m56L13O3K73L92j577M47J386j003jL04o27j54R46
$$ plain form
1570 82 469 -577 -1014 1007 -9 -958 678 198 -1080 -668 74 490 139 -916 -227 456 46 -323
1588 -323 -101 783 -544 -296 1238 -229 -867 837 538 -655 -148 594 35 -720 737 728 -777 -374
1606 -374 61 558 988 -409 -789 805 -42 -195 1129 473 -1217 -668 1300 174 -756 1037 42 -2148
1624 -2148 406 1516 104 -602 -378 -191 417 206 -9 296 107 -569 -197 1749 292 -1243 891
1641 891 460 -1090 809 1187 -777 -1012 1156 454 -913 451 1832 -500 -645 512 413 930 -320
1658 -320 -607 704 -123 -1075 702 1866 -298 -1531 1093 671 -859 1276 1387 -1835 -658 2082
1674 2082 583 -748 -111 235 -776 -178 1162 432 -727 -828 -794 930 726 -1106 -265 -64 -1615
1691 -1615 252 1795 -441 -1926 275 1031 -1250 -55 1402 -966 -1695 267 336 105 24 -373 -294
$$ packed form
1570H2L87j046m37K021j016r49J636m80j278M12P42M16l51j055O89O83m10l69
1588c23K22Q84j327K48J534j467o38J704k99j193N07P42n59p55J457rj505M03
1606c74M35M97M30j397l80J594q47j53J324o56j690N49J968j126r30J793r95k190
1624b148K554J110j412p06K24J87O08k11k15L05j89o76L72J946j457j535K134
1641H91m31j550J899L78j964k35K168p02j367J364J381k332j45J157r9N17j250
1658c20k87J311q27r52J777J164k164j233K624m22j530K135J11l222J177K740
1674B082j499j331O37L46j011N98J340p30j159j01L4J724k04j832Q41K01j551
1691a615J867J543k236j485K201P56k281J195J457k368p29J962O9k31q1l97P9
$$ plain form
1708 -294 -527 -60 163 438 360 -1213 -250 1065 -724 225 1526 -1104 -1356 1044 1169 -318 232 891
1726 891 -730 -656 1425 1245 181 -25 -665 256 1552 429 116 278 -246 -443 1548 1670 -549 -599
1744 -599 905 196 -89 2327 561 -1708 57 1245 547 182 663 -72 -983 230 788 409 628 -326
1762 -326 -480 485 94 -418 911 -454 -1386 -214 536 -157 -885 606 -374 -1933 219 552 -963 -432
1780 -432 -328 -1112 -649 721 210 -803 -760 -705 -1136 746 552 -1411 -750 -404 -1120 395 1004 -938 -1364
1799 -1364 -349 99 -486 177 42 -1518 -525 460 -193 529 154 -997 -90 622 -90 242 507 -506
1817 -506 -1100 730 1175 -865 584 1296 -1114 -341 1528 155 -437 474 473 -546 305 1379 77 594
1835 594 278 -479 612 1282 -378 311 454 -605 -37 1445 358 -622 276 324 -716 848 1567 -946
$$ packed form
1708b94k33M67K23K75p8j573R63J315j789R49J301k630k52K400J25j487N50O59
1726H91j621P4K081j80j064k06o40R21J296j123l13J62n24j97J991J22k219n0
1744e99J504p09k85K416j766k269J765J188o98l65M81p35r11J213N58l79K19r54
1762c26j54R65l91n12J329j365r32J172P50o93p28J491r80j559K152L33j515N31
1780d32J04p84M63J370n11j013M3N5m31J882j94j963O61L46p16J515O09j942m26
1799a364J015M48n85O63j35j560R93R85o53P22l75j151R07P12p12L32K65j013
1817e06n94J830M45k040J449P12k410P73J869j373n92R11jj019Q51J074j302N17
1835E94l16p57J091O70j660O89J43j059N68J482j087r80Q98M8j040J564P19k513
$$ plain form
1853 -946 -302 803 -58 267 1165 -238 -916 -150 650 -309 -20 461 -1411 -659 1007 -355 -902 438
1871 438 -472 -1011 121 269 -527 -605 -198 -584 -446 305 -443 -698 91 -1031 -653 625 -920 -765 248
1890 248 -588 -1139 -42 545 -1003 -616 416 -737 -1083 867 229 -939 203 -102 -78 285 545 -391
1908 -391 -600 13 461 323 818 128 -311 831 347 213 1093 57 -316 597 607 395 392 619 193 -6
1928 -6 1046 642 -8 724 360 -147 957 698 -185 610 741 351 166 877 644 -114 404 786 -146 387
1948 387 478 331 295 -378 -367 267 335 83 220 95 -230 -353 436 306 -742 229 -140 -482 128 364 -360
1969 -360 -606 -366 132 -316 -431 -160 -661 -314 -315 -361 -425 -656 -585 -19 -587 -420 -290 -447 -133 -476 -433 -214
1991 -214 -763 -383 -141 -76 -83 -220 -388 -46 -186 9 -7 -558 -418 -91 125 65 -286 275 121 -182 373 77
$$ packed form
1853i46O44J105q61L25Q98j403o78P66Q00r59K89M81j872P52J666j362n47J340
1871D38r10n39J132J48p96p8M07l86J38P51p48k55P89j122L78J278j545J55J013
1890B48q36n51J097N87j548L87J032j153l46J950o38j168J142l05K4L63K60r36
1908c91k09O13M48j38M95o90m39J142m84j34Q80j036l73R13J0k12lK27m26j99
1928fJ052m04o50P32l64n07J104k59q83P95J31l90j85P11k33p58N18L82r32N33
1948C87R1j47l6o73J1O34O8k52J37j25l25j23P89j30j048R71l69l42O10K36p24
1969c60k46K40M98m48j15K71n01L47jm6o4k31P1N66n68J67J30j57L14l43M3K19
1991b14n49L80K42O5pj37j68L42j40J95j6n51J40L27K16o0l51N61j54l03N55k96
$$ plain form
2013 77 56 198 128 615 316 -350 599 676 540 312 355 472 325 -41 606 365 42 559 567 223 39 232
2035 232 618 220 259 621 170 86 377 447 404 152 340 374 -221 247 194 -55 71 -53 -76 224 -111 -144 -260
2058 -260 -392 -15 53 -118 -2 -505 42 182 -696 -272 -201 -452 62 -512 -218 -9 -780 -320 149 -464 -310
2079 -310 -410 -340 -415 -512 -155 -273 -613 -272 -240 -33 -473 -348 -182 -314 -305 163 -428 -332 29 -123 145 -245
2101 -245 -230 92 -50 -248 254 -67 101 -215 526 241 -207 92 305 357 493 408 337 155 223 729 650 238
2123 238 53 284 362 574 -159 637 429 -211 293 604 150 -12 302 328 316 112 633 128 14 154 373
2144 373 -50 7 -136 564 19 -306 262 212 -291 -215 124 2 -714 -210 404 -457 -659 -115 -370 -622 -156
2165 -156 -26 -501 -626 -496 -38 -465 -489 -413 -311 -267 -762 -159 56 -883 -830 683 -241 -554 -139 241 -291
$$ packed form
2013G7k1J42p0M87k99o66R49P7j36k28M3J17j47l66O47k41l23N17Ql44j84J93
2035B32L86l98L9L62m51q4K91P0m3k52J88L4n95M68n3k49J26j24k3L00l35l3j16
2058b60j32L77O8j71J16n03N47J40q78M24P1k51N14n74K94K09p71M60M69o13J54
2079c10j00P0p5r7L57j18l40L41L2K07m40J25J66j32RM68n91R6L61j52K68l90
2101b45J5L22j42j98N02l21J68l16P41k85m48K99K13N2J36q5p1j82O8N06p9m12
2123B38j85K31P8K12p33P96k08o40N04L11m54j62L14K6j2k04N21n05j14J40K19
2144C73m23N7j43P00n45l25N68n0n03P6L39j22p16N04O14q61k02N44k55k52M66
2165a56J30m75j25J30M58m27k4P6J02M4m95O03K15r39N3J513r24l13M15L80n32
$$ plain form
2186 -291 -388 379 24 -409 248 -38 60 180 -32 -134 88 -348 142 588 219 -398 64 831 -152 100 1212
2207 1212 -51 -490 1006 469 -151 287 695 42 -69 623 458 284 657 -267 -218 892 151 68 1205
2226 1205 -49 -793 181 494 5 115 672 -226 -851 683 550 -272 377 -145 -822 92 147 -195 94
2245 94 -347 -460 175 333 -209 -707 253 -627 -824 1048 285 -1209 -159 13 -659 -247 767 -294 -1033
2264 -1033 106 -160 -648 298 183 -723 238 7 -718 293 231 -498 -305 423 185 -284 302 4 -898
2283 -898 343 451 -165 615 301 -744 140 788 100 184 451 -49 -510 1152 770 -751 551 524 -903
2302 -903 317 1222 -446 -647 347 259 -368 994 768 -546 127 454 -229 557 619 -834 -62 340 -192
2321 -192 344 670 -263 -522 454 198 -411 527 265 -1155 -158 696 -241 -211 584 -606 -674 410 519 -752
$$ packed form
2186b91r7P67l55m33O57k86R8J20k12j02K22m36M90M46l69o17M62P67r83K52J112
2207A212j263m39J496n37o20M38M08o53j11O92j65j74L73r24M9J110p41q3J137
2226A205j254p44R74L13m89J10N57q98o25J534j33q22O49n22o77R14N5l42K89
2245I4m41j13O35J58n42m98R60q80j97J872p63j494J050J72o72M12J014j061p39
2264a033J139k66m88R46j15r06R61k31p25J011o2p29J93P28k38m69N86k98r02
2283h98J241J08o16P80l14j045Q84O48o88Q4K67n00m61J662l82j521J302k7j427
2302i03J220R05j668k01R94q8o27J362k26j314O73L27o83P86O2j453P72M02n32
2321a92N36L26r33k59R76k56o09R38k62j420R97Q54r37L0P95j190o8J084J09j271
$$ plain form
2341 -752 -12 207 -1272 -511 730 -382 -525 66 -638 -446 638 127 -375 -376 -429 -325 262 160 -485 -168
2361 -168 24 -436 271 886 -989 -342 171 -211 -245 772 170 -872 -235 741 -312 -272 961 -277 -578
2380 -578 919 311 -271 95 214 -106 -354 660 106 59 150 -440 2 374 -173 59 462 -294 48 490
2400 490 -3 -168 174 331 -462 118 782 -335 -408 57 -498 -318 610 91 -682 -239 312 -407 -233 214
2420 214 -387 -888 22 55 -483 -1 -18 -448 -339 -184 315 -304 -178 -81 -23 -92 -145 -12 266 -286 -370 317
2442 317 -169 -569 499 -50 -436 199 448 105 -187 371 147 -458 367 289 -93 -130 197 180 143 212 482
2463 482 113 55 351 -17 366 441 36 180 222 154 494 49 125 385 29 225 428 252 -22 304 341 49
2485 49 -78 296 104 -275 90 262 15 -48 -11 273 -243 -220 410 -62 -73 370 22 -366 -183 76 -210 -409
$$ packed form
2341g52P40K19j479P61J241j112j43N91p04J92J084n11n02jn3J04N87j02o45L17
2361a68J92m60P07O15j875O47N13l82l4J017o02j042O37R76j053M0J233j238l01
2380e78J497o08n82L66J19l20k48J014n54m7R1n90M42L72n47K32M03p56L42M42
2400D90m93j65L42J57p93N80O64j117p3M65n55J80R28n19p73M43N51p19J74M47
2420B14o01n01R10L3n38M82j7m30J09J55M99o19J26R7N8o9n3J33K78n52q4O87
2442C17m86m00J068n49l86O35K49l43k92N58k24o05Q25p8l82l7L27j7l7O9K70
2463D82l69n8K96l68L83P5m05J44M2o8L40m45P6K60l56J96K03j76k74L26L7k92
2485D9j27L74j92l79L65J72k47o3L7K84n16K3O30m72j1M43l48l88J83K59k86j99
$$ plain form
2507 -409 72 279 -324 -173 72 -68 -299 -195 69 15 -447 85 -116 -584 -106 -101 -458 -410 -132 -13 -173
2528 -173 -156 267 -153 -463 427 -154 -135 -189 -105 28 -299 344 123 -513 -9 287 -129 234 336 -82 -7 133
2550 133 398 98 -281 377 326 -79 149 -28 95 20 269 280 -20 -17 442 80 -167 63 391 89 63 502
2572 502 260 -198 -36 331 -94 32 21 -79 -216 -122 371 -211 61 275 -88 -201 527 -35 111 26 249
2593 249 130 -508 49 -104 -172 -6 213 4 -39 -223 -2 -152 -166 132 -79 -382 102 -205 -442 234 -77
2614 -77 54 -314 -385 163 -56 -340 267 -177 -189 61 243 -164 -484 82 1 -337 -285 139 -167 156 142 284
2636 284 -113 -194 153 33 -614 224 194 4 139 -63 34 -47 77 683 -194 -135 163 110 -52 -108 83 -51
2658 -51 257 -9 119 -38 -63 35 -115 -23 147 62 169 158 -69 -67 -194 258 61 -119 -53 -49 -75 -133 132 213 -8
$$ packed form
2507d09M81K07o03J51K45j40k31J04K64n4m62N32k01m68M78Nl57M8K78J19j60
2528a73J7M23m20l10Q90n81J9n4Q4J33l27O43k21o36N04K96m16L63J02m18P5J40
2550A33K65l00l79O58n1m05K28j77J23p5K49J1l00LM59l62k47K30L28l02k6M39
2572E02k42m58J62L67m25J26j1j00j37R4M93n82K72K14l63j13P28n62J46q5K23
2593B49j19o38N57j53o8J66K19k09m3j84K21j50j4K98k11l03M84l07k37O76l11
2614g7J31l68p1N48k19k84O07m44j2K50J82m07l20N66q1l38N2M24l06L23j4J42
2636B84l97q1L47j20o47Q38l0j90J35k02R7q1J24O06q77N9K98n3j62n6J91j34
2658e1L08k66J28j57k5R8j50R2J70q5J07j1k27Kj27M52j97j80O6Mk6n8K65Q1k21
$$ plain form
2683 -8 63 401 -303 -140 531 -13 -379 141 82 -390 -107 409 255 -89 233 -210 -256 84 246 -155 -44 -313
2705 -313 -16 -170 -159 -102 94 51 -306 157 -99 -200 -131 157 -484 -365 361 52 -230 -54 -127 -302 -134 279
2727 279 9 -424 66 -255 -56 225 -128 -222 395 -49 -191 167 131 -152 167 180 -80 -253 3 41 -246
2748 -246 43 49 -113 -105 -40 -107 110 67 38 51 189 -67 -124 313 195 -271 289 90 -458 409 274 -205 -144 -92
2772 -92 80 -307 367 291 -333 48 -18 92 280 322 -341 31 -194 -69 -72 -126 52 -303 342 -204 -380 480
2794 480 -114 -410 208 333 -64 -203 69 -376 -284 52 151 -268 288 112 -567 203 127 -26 -228 -489 -191
2815 -191 148 91 -108 23 -49 10 -660 353 304 -124 64 -9 -69 397 349 -59 -263 84 443 -37 215 315
2837 315 -202 -69 327 61 241 389 -272 -19 191 122 495 295 74 -303 23 355 -141 299 196 -200
$$ packed form
2683hP1L38p04J63O71n44l66N20n9m72K83N16j54l44L22m43m6L40J62m01J11k69
2705c13K97j54J1N7J96m3l57M63k56j01O9K88o41J19P26l09k82J76p3j75J68M13
2727B79k70m33M90l21J99K81l53r4O17m44j42L58l6k83L19J3k60j73K56L8k87
2748b46K89Oj62QO5o7K17m3k9J3J38k56n7M37j18m66N60j99n48Q67j35m79O1N2
2772i2J72l87O74p6o24L81o6J10J88M2o63L72k25J25ln4J78l55O45n46j76Q60
2794D80n94k96O18J25l97j39K72m45R2L36R9m19N56j76o79P70p6j53k02k61K98
2815a91L39n7j99J31p2N9o70J013m9m28J88p3o0M66m8m08k04L47L59m80K52J00
2837C15n17J33L96k66J80J48o61K53K10o9L73k00k21l77L26L32m96M40j03l96
$$ plain form
2857 -200 -430 423 305 196 -48 85 -246 277 432 115 -435 205 -114 205 399 -199 -55 -333 170 70
2877 70 118 324 -279 -448 32 -174 -141 169 -243 -180 -74 -77 102 118 -231 -293 -369 -52 -102 -150 142 -357 -384 279
2901 279 -138 -276 50 -170 -288 184 261 63 -236 121 7 -383 216 182 90 -131 -104 -87 223 151 110 80 83
$$ packed form
2857b00k30Q53j18j09k44J33l31N23J55l17n50O40l19L19J94n98J44k78N03j00
2877G0M8K06o03j69M80k06L3L10m12O3J06lJ79J6l49o2p6L17n0m8K92m99k7O63
2901B79m17j38L26k20j18M72P7j98k99L57j14l90N99l4r2k21K7J7L10p2m1l0L
$$ [...]
8191g2
##END NTUPLES=NMR FID
##END=
