##TITLE=1H_Pr AmAd2
 CDCl3, 8 sc, 
 9.04.2021
##JCAMPDX= 6.0         $$ Bruker NMR JCAMP-DX V2.0
##DATA TYPE= NMR FID
##DATA CLASS= NTUPLES
##ORIGIN= UXNMR, Bruker Analytische Messtechnik GmbH
##OWNER= root
$$ XWIN-NMR		Version 3.5
$$ Fri Apr  9 11:46:13 2021 Russian Standard Time (UT+4h)  she@DPX200
##.OBSERVE FREQUENCY= 200.131506
##.OBSERVE NUCLEUS= ^1H
##.DELAY= (6, 6)
##.ACQUISITION MODE= SIMULTANEOUS
##.ACQUISITION SCHEME= undefined
##.AVERAGES= 8
##.DIGITISER RES= 18
##SPECTROMETER/DATA SYSTEM= spect
##.PULSE SEQUENCE= zg30
##.SOLVENT NAME= CDCl3
##.SHIFT REFERENCE= (INTERNAL, CDCl3, 0, 15.7039)
##AUDIT TRAIL= $$ (NUMBER, WHEN, WHO, WHERE, WHAT)
$$ ##TITLE= Audit trail, XWIN-NMR		Version 3.5
$$ ##JCAMPDX= 5.01
$$ ##ORIGIN= Bruker BioSpin GmbH
$$ ##OWNER= she
$$ F:/spectra/data/she/nmr/H-F/1/audita.txt
$$ ##AUDIT TRAIL=  $$ (NUMBER, WHEN, WHO, WHERE, WHAT)
(   1,<2021-04-09 11:44:35.29 +0400>,<she>,<DPX200>,
      <created by zg, POWCHK disabled, PULCHK disabled
       configuration hash MD5:
       00 E9 B6 7A A2 85 ED C7 34 08 36 98 17 FE 4E 26
       data hash MD5: 16K
       A6 A3 BB 88 2A 3E A7 FD 2F 88 C5 BE 70 00 DB 5C>)
$$ ##END=
$$ 
$$ hash MD5
$$ 1F 23 67 6F C9 A0 9F 85 4C AF 09 A7 67 54 FB 2B
##$RELAX= 
##$RELAX= 
##$RELAX= 
##$RELAX= 
##$RELAX= 
##$RELAX= 
$$ Bruker specific parameters
$$ --------------------------
##$DU= <F:/spectra>
##$EXPNO= 1
##$NAME= <H-F>
##$PROCNO= 1
##$TYPE= <nmr>
##$USER= <she>
##$AMP= (0..31)
100 100 100 100 100 100 100 100 100 100 100 100 100 100 100 100 100 100 
100 100 100 100 100 100 100 100 100 100 100 100 100 100 
##$AQSEQ= 0
##$AQ_mod= 1
##$AUNM= <au_zg>
##$AUTOPOS= <>
##$BF1= 200.13
##$BF2= 200.13
##$BF3= 200.13
##$BF4= 200.13
##$BF5= 200.13
##$BF6= 200.13
##$BF7= 200.13
##$BF8= 200.13
##$BYTORDA= 1
##$CFDGTYP= 0
##$CFRGTYP= 5
##$CHEMSTR= <none>
##$CNST= (0..31)
1 1 145 1 1 1 1 1 1 1 1 1 1 1 1 1 1 1 1 1 1 1 1 1 1 1 1 1 1 1 1 1 
##$CPDPRG= <>
##$CPDPRG1= <>
##$CPDPRG2= <>
##$CPDPRG3= <>
##$CPDPRG4= <mlev>
##$CPDPRG5= <mlev>
##$CPDPRG6= <mlev>
##$CPDPRG7= <mlev>
##$CPDPRG8= <mlev>
##$CPDPRGB= <>
##$CPDPRGT= <>
##$D= (0..31)
0 1.2 0 0 0 0 0 0 0 0.06 0 0.03 0 0 0 0 0.0002 0 0 0 0 0 0 0 0 0 0 0 0 
0 0 0 
##$DATE= 1617954274
##$DBL= (0..7)
120 120 120 120 120 120 120 120 
##$DBP= (0..7)
150 150 150 150 150 150 150 150 
##$DBP07= 0
##$DBPNAM0= <>
##$DBPNAM1= <>
##$DBPNAM2= <>
##$DBPNAM3= <>
##$DBPNAM4= <>
##$DBPNAM5= <>
##$DBPNAM6= <>
##$DBPNAM7= <>
##$DBPOAL= (0..7)
0.5 0.5 0.5 0.5 0.5 0.5 0.5 0.5 
##$DBPOFFS= (0..7)
0 0 0 0 0 0 0 0 
##$DE= 6
##$DECBNUC= <off>
##$DECIM= 32
##$DECNUC= <off>
##$DECSTAT= 4
##$DIGMOD= 1
##$DIGTYP= 9
##$DL= (0..7)
0 120 120 120 120 120 120 120 
##$DP= (0..7)
150 150 150 150 150 150 150 150 
##$DP07= 0
##$DPNAME0= <>
##$DPNAME1= <>
##$DPNAME2= <>
##$DPNAME3= <>
##$DPNAME4= <>
##$DPNAME5= <>
##$DPNAME6= <>
##$DPNAME7= <>
##$DPOAL= (0..7)
0.5 0.5 0.5 0.5 0.5 0.5 0.5 0.5 
##$DPOFFS= (0..7)
0 0 0 0 0 0 0 0 
##$DQDMODE= 0
##$DR= 18
##$DS= 0
##$DSLIST= <SSSSSSSSSSSSSSS>
$$ [...]
##$SUBNAM2= <"">
##$SUBNAM3= <"">
##$SUBNAM4= <"">
##$SUBNAM5= <"">
##$SUBNAM6= <"">
##$SUBNAM7= <"">
##$SUBNAM8= <"">
##$SUBNAM9= <"">
##$SW= 16.9725357007746
##$SWIBOX= (0..15)
0 0 2 0 0 0 0 0 0 0 0 0 0 0 0 0 
##$SW_h= 3396.73913043478
##$TD= 16384
##$TD0= 1
##$TE= 0
##$TE2= 300
##$TE3= 300
##$TEG= 300
##$TL= (0..7)
0 120 120 120 120 120 120 120 
##$TP= (0..7)
150 150 150 150 150 150 150 150 
##$TP07= 0
##$TPNAME0= <>
##$TPNAME1= <>
##$TPNAME2= <>
##$TPNAME3= <>
##$TPNAME4= <>
##$TPNAME5= <>
##$TPNAME6= <>
##$TPNAME7= <>
##$TPOAL= (0..7)
0.5 0.5 0.5 0.5 0.5 0.5 0.5 0.5 
##$TPOFFS= (0..7)
0 0 0 0 0 0 0 0 
##$TUNHIN= 0
##$TUNHOUT= 0
##$TUNXOUT= 0
##$USERA1= <user>
##$USERA2= <user>
##$USERA3= <user>
##$USERA4= <user>
##$USERA5= <user>
##$V9= 5
##$VALIST= <valist>
##$VCLIST= <CCCCCCCCCCCCCCC>
##$VD= 0
##$VDLIST= <DDDDDDDDDDDDDDD>
##$VPLIST= <PPPPPPPPPPPPPPP>
##$VTLIST= <TTTTTTTTTTTTTTT>
##$WBST= 1024
##$WBSW= 4
##$XGAIN= (0..3)
0 0 0 0 
##$XL= 0
##$YL= 0
##$YMAX_a= 802453
##$YMIN_a= -949064
##$ZGOPTNS= <>
##$ZL1= 120
##$ZL2= 120
##$ZL3= 120
##$ZL4= 120
##$ABSF1= 10
##$ABSF2= 0
##$ABSG= 5
##$ABSL= 3
##$ALPHA= 0
##$AQORDER= 0
##$ASSFAC= 0
##$ASSFACI= 0
##$ASSFACX= 0
##$ASSWID= 0
##$AUNMP= <proc_1d>
##$AZFE= 0.1
##$AZFW= 0.1
##$BCFW= 1
##$BC_mod= 2
##$BYTORDP= 1
##$COROFFS= 0
##$CY= 11.3945322036743
##$DATMOD= 1
##$DC= 2
##$DFILT= <>
##$DTYPP= 0
##$F1P= 15.9154993809931
##$F2P= -4.1035820241983
##$FCOR= 0.5
##$FTSIZE= 0
##$FT_mod= 4
##$GAMMA= 1
##$GB= 0.15
##$INTBC= 1
##$INTSCL= 1
##$ISEN= 128
##$LB= 0.24
##$LEV0= 0
##$LPBIN= 0
##$MAXI= 10000
##$MC2= 0
##$MEAN= 0
##$ME_mod= 0
##$MI= 1.114404
##$NCOEF= 0
##$NC_proc= 0
##$NLEV= 6
##$NOISF1= 3.799351
##$NOISF2= 2.8
##$NSP= 1
##$NTH_PI= 0
##$NZP= 0
##$OFFSET= 15.70392
##$PC= 1
##$PHC0= -11121.18
##$PHC1= 13.20092
##$PH_mod= 1
##$PKNL= yes
##$PPARMOD= 0
##$PSCAL= 0
##$PSIGN= 0
##$REVERSE= no
##$SF= 200.130013532006
##$SI= 16384
##$SIGF1= 3
##$SIGF2= 2
##$SINO= 400
##$SIOLD= 16384
##$SREGLST= <1H.CDCl3>
##$SSB= 0
##$STSI= 0
##$STSR= 0
##$SW_p= 3612.71676300578
##$SYMM= 0
##$S_DEV= 0
##$TDeff= 0
##$TDoff= 0
##$TI= <>
##$TILT= no
##$TM1= 0
##$TM2= 0
##$TOPLEV= 0
##$USERP1= <user>
##$USERP2= <user>
##$USERP3= <user>
##$USERP4= <user>
##$USERP5= <user>
##$WDW= 1
##$XDIM= 8192
##$YMAX_p= 0
##$YMIN_p= 0
$$ End of Bruker specific parameters
$$ ---------------------------------
##NTUPLES= NMR FID
##VAR_NAME=  TIME,          FID/REAL,        FID/IMAG
##SYMBOL=    X,             R,               I
##VAR_TYPE=  INDEPENDENT,   DEPENDENT,       DEPENDENT
##VAR_FORM=  AFFN,          ASDF,            ASDF
##VAR_DIM=   8192,          8192,            8192
##UNITS=     SECONDS,       ARBITRARY UNITS, ARBITRARY UNITS
##FACTOR=    0.0002944,     1,               1
##FIRST=     0,             0,               0
##LAST=      2.4114304,     0,               0
##MIN=       0,             -949064,         0
##MAX=       2.4114304,     802453,          0
$$ Real data points
##PAGE= N=1
##DATA TABLE= (X++(R..R)), XYDATA
0@%%%%%%qJ6j6J6j6K4m0N3o1P2q8J12j41J70k02K37k79L27l84M53n25O04o97P97
30D24r09J036j176J330j499J685j890K117k364K634k930L252l605L991m412M871
46B555n373N923o523P182p910Q714r607J0604j1718J2977j4415J6067j7992K0270
60A0754k3008K6373l0624L6178m3758N4724p1979J02940j74001N88998K8722j454383
72i49064J445171j24762j143529J218779p4523j092472J102224p4576q73507R06605
82C40346q0490q50651Q94585N0580q74924O87214J51458p69651O13091J32334
92B93892o86428M85306J43178n21060M03943n613l67463L81743k8223k53295K01027
103D7007l6174m8559O9388o6817O8593o7477l5134K06687k00953m9995K48238
$$ y = [0, 0, 0, 0, 0, 0, 0, -8, 8, -8, 8, -8, 16, -24, 29, -32, 40, -48, 64, -77, 93, -109, 128, -151, 176, -208, 245, -280, 324, -373, 424, -485, 551, -625, 705, -794, 891, -999, 1118, -1246, 1388, -1542, 1710, -1895, 2096, -2316, 2555, -2818, 3105, -3418, 3764, -4146, 4568, -5039, 5565, -6153, 6824, -7591, 8476, -9516, 10754, -12254, 14119, -16505, 19673, -24085, 30639, -41340, 61600, -112401, 476597, 505319, -949064, 496107, 371345, -772184, 446595, 372072, -720400, 381824, 307248, -566259, 340346, 259856, -590795, 303790, 354370, -520554, 166660, 318118, -451533, 161558, 293892, -392536, 92770, 235948, -285112, 118831, 113218, -254245, 127498, 99275, -154020, 47007, 10833, -37726, 31662, -35155, 33438, -34039, -69173, 137514, -63439, -113434, 134804]
114A34804j96305o388K10173k54643K4614K61595k63366r206K49132k43810o972
125a00372K85543k67475o9951L32742k47400m6935L03404l16529J5240L43279
135B31546l60374L1872L13791l87929J31149K74916m23926J60369K18887l59840
145a69539K13721J15957l69435K75168R4993l42325K58490M1560k99759K73027
155I1858M6867l14338K39491N0961k70146K52317L859k87632K82116J6059k94985
166a83573K95961l1619k88579L48628n8884k85314L26837o9667k29179L11149
176A35760j04940j93235K76935r8946j25294K01444j04376p3609J69656r4954
186a1559n7556J29599q1427k6996J01688p0590l3673Q6921m4714k3771N6648n2133
$$ y = [134804, -61501, -67889, 142284, -112359, -87745, 173850, -89516, -98722, 150410, -93400, -100372, 185171, -82304, -152255, 180487, -66913, -113848, 189556, -126973, -111733, 231546, -128828, -96956, 216835, -171094, -39945, 234971, -188955, -28586, 190301, -169539, 44182, 160139, -209296, 65872, 160865, -181460, 77030, 118590, -181169, 91858, 138725, -175613, 63878, 114839, -155307, 97010, 100869, -186763, 95353, 111412, -183573, 112388, 80769, -207810, 140818, 81934, -203380, 123457, 53790, -175389, 135760, 30820, -162415, 114520, 15574, -109720, 91724, -12652, -86261, 83395, -11559, -69115, 60484, -20943, -47939, 53749, -16841, -50514, 36407, -8307, -32078, 24570, -27563]
198b7563J6355L0999n4691M2146k726n1812Q2239l5855n9771J17225p9351l1993
210e4798J39980j31624j2486J63402j54483p055J70610j74939J1847J70510j80844
221e9880J7056J53824j69005K5510J50975j84633L0085J62417j88478K4805J61989
232A24665j84516J5482J72512j83001R714J60733j71892K4701J35776j61697K8096
243b9427J22506j48343L3909R9480j31857L7738P6065r9193K4297N5198p1025
254c0652K1593L4989n0967K1069J2479k2787J3282j534n614Q398j3264J0901R859
267G752l6747L5223M924n0546N2503J185o2276O4595K866p8001Q5765r353q4273
280f6383J03496k0416q7893J15699k6162r8714J35689l6546j03156J47579m6255
$$ y = [-27563, -11208, 19791, -34900, 7246, 4520, -47292, 34947, -908, -60679, 56546, -22805, -54798, 85182, -46442, -58928, 104474, -50009, -57064, 113546, -61393, -49546, 120964, -59880, -42824, 111000, -58005, -32495, 118480, -66153, -36068, 126349, -62129, -37324, 124665, -59851, -44369, 128143, -54858, -45144, 115589, -56303, -31602, 104174, -57523, -29427, 93079, -55264, -21355, 78125, -53732, -15994, 60071, -39122, -14825, 40373, -30652, -9059, 25930, -25037, -3968, 8511, -14276, -994, -2528, -8142, 256, -13008, -2107, 7752, -28995, 6228, 11152, -39394, 13109, 14294, -47982, 16613, 19479, -58522, 27243, 17890, -66383, 37113, 16697, -71196, 44503, 18341, -80373, 55316, 18770, -84386, 63193, 16938]
291A6938j01265J52099m7489j07604J61831n5202j05653J67555o3702j02227J67172
302H2453o2035j06360J71768o5516j07383J74606o7604j04830J68553o1004j09356
313h6708J68606n7258j12800J65927n3718j08624J53290m1537j11777J45136l0905
324B9632j11666J34424k2814j06242J15912n144j06784J00380J0081j06943Q7306
335A8142K0855j00036O6033L8643r8656M9845N2035r7385L6433O1562q7985J3987
347b6527P7346q3215n856R2075p7482k1902R8039o6733m0522J10521o3003n5498
359f2757J21498o2031o1362J23416n4549p4791J29172m6057q3550J27652m0730
370A5911q4545J22396k9149r5295J22300k0320j04229J26859j7992j11931J25654
$$ y = [16938, -84327, 67772, 20283, -87321, 74510, 19308, -86345, 81210, 17508, -84719, 82453, 20418, -85942, 85826, 20310, -87073, 87533, 19929, -84901, 83652, 22648, -86708, 81898, 24640, -88160, 77767, 24049, -84575, 68715, 27178, -84599, 60537, 29632, -82034, 52390, 29576, -76666, 39246, 34102, -72682, 27698, 37779, -69164, 18142, 38997, -61039, 4994, 43637, -55019, -5174, 46861, -50524, -14091, 47471, -40514, -26527, 50819, -32396, -38252, 53823, -23659, -45561, 52478, -14255, -54777, 55744, -7259, -62757, 58741, -3290, -64652, 58764, 4215, -70576, 58596, 12539, -71011, 56641, 15911, -68634, 53762, 24613, -70682, 51618, 31298, -72931, 53928, 35936, -75995, 49659]
381D9659m124j21263J21186O37j20038J20174k706j11809J08020K90j02321R9595
393C7300R05j01605R4338J1175r7860P1053K7800r4199N8459M0429r9427N1178
405d54M5708r0740M4480M2439r1701M8881M6034r2785M3679L8521p3358L5589
417c707L4234o3863J9345M1148m7751N595L4407l7117m159N0696l8871k4562O2213
430B7608l4825k0985N8281m2326j9347O3263l8438j6065M8203m2175K404M3961
442B9559l7848j2031L6059j0315j7590K5117o604k4929K9633J1717m0786K4580
454F562R958l7767M8116r712n0645N6617k975m1734M6310j5738l2739M8125j1055
467A3323k2341J6110o595L82J2190n710k0973J2263K1435k5579k381K5594l6480
$$ y = [49659, 45535, -75728, 45458, 46095, -73943, 46231, 43525, -68284, 39736, 40026, -62295, 37300, 38205, -63400, 30938, 42113, -55747, 15306, 43106, -51093, 7366, 47795, -51632, -454, 45254, -45486, -1006, 41433, -50268, -1387, 44647, -48138, -4459, 34062, -39296, -3707, 30527, -33336, -13991, 27157, -20594, -14999, 19408, -17709, -21868, 28828, -10043, -34605, 27608, -7217, -28202, 30079, -12247, -31594, 31669, -6769, -22834, 25369, -16806, -14402, 29559, -8289, -20320, 15739, 5424, -12166, 12951, 6347, -18582, 11051, 22768, -18018, 6562, 16520, -21247, 26869, 17157, -33488, 23129, 20154, -21580, 24730, 8992, -23747, 24378, 13323, -9018, 7092, 497, 879, 13069, 7359, -13614, -1351, 20084, -5495, -7876, 17718, -18762]
480a8762J1737M0732n4493O456L0881l2725K3078L314m0432L2420J0061k7311
492a5044J8116r132p924J5930K533m925k1533J7880J6511k4180J1684l009k0651
505b3744M0531j1633k9739L5483k2230J435L3899l7263j664K1914r462J1029r605
518a049j4109K1399m462O183n116j9143K7985q116k678J6080l4519J3757L2351
531B8563l2814N654M371j7524L4333j3287j8306J8095j3338J4332N907k2367Q313
544A932l705P489J8405l8845P157K5426k5700K0583r500k2401L0679r542l465
557a487J2092l0679J4939K4570k6895L174l952K903J6366j9653P534m211j2281
570a7580L2231j2235k2105K1935j3382J1022J5576m0278J9952J2426k0375K2923
$$ y = [-18762, -7025, 33707, -20786, -14330, 16551, -16174, 6904, 10218, -30214, 2206, 12267, -15044, 3072, -6060, -13984, 1946, 4479, -446, -21979, -4099, 12412, -11768, -84, -3093, -23744, 16787, 5154, -24585, 10898, -11332, -9897, 24002, -13261, -14925, 6989, -2473, 8556, -1049, -15158, 6241, 1779, 7962, 2846, -16297, 11688, 3572, 894, 16974, -17545, -3788, 28563, -4251, 1403, 5774, -11750, 22583, 9296, -9010, 9085, -4253, 10079, 15986, -6381, 1932, -1773, 5716, 24121, -14724, -7567, 17859, -7841, 12742, 3242, -19159, 11520, 1978, -1487, 10605, -20074, -5135, 19435, -7460, -4286, -8238, -5335, 11031, -8622, -1088, -5299, -17580, 14651, 2416, -19689, 2246, -11136, -114, 15462, -24816, -4864, 7562, -12813, 10110]
582A0110j3505j6921K6189k758m949M86j2561J8169q64m866N830k0918K0535J0052
596A4029k3913J4881o428r361L1217j8199j4179K3568j6650J1015R791k5510R516
609b23P820j112J930j2031N430N948p422J3945j5157r197K7151j5197o54Q808
623A0039k1739J6312J1017k3343Q810J764r157J6259q815o760L950j091J0075
636G321r848m494P650o938Q967J312j9580J6017J561j3526K0079j5377q357K3636
650H423j1296n275R297r240L759Q096q044m91j449P105k26p193R052r310K133
665d659J4364j5764K70J2907j4278Q805P988k1136J3340O275j2596P830K87o351
679b718M794N134n284l931N908K978q258P663n82j1903J6857m579j1129J4827
$$ y = [10110, -3395, -20316, 5873, 3115, -1834, -1348, -13909, 4260, 3396, -1470, 4360, -16558, 3977, 14029, -9884, 4997, -1431, -10792, 20425, 2226, -11953, 11615, -5035, 5980, 15771, -9739, -223, 7597, 6485, 8415, -3616, 1814, 7762, 340, 14285, -872, -10069, 17082, 1885, 1231, 10039, -11700, 4612, 15629, -7714, 1096, 2860, -6297, 9962, 1147, -5613, -1663, -2754, 7321, -2527, -7021, 629, -6309, 2658, 3970, -15610, 407, 1968, -11558, 8521, -6856, -15213, 8423, -2873, -8148, 1149, -8091, -4332, 3764, -4280, -4771, -6220, 885, 659, -6534, 2518, -6792, -4659, 9705, -6059, -5789, 7118, -7160, 1645, 9633, -11503, 1837, 8112, -4484, 3346, 3633, -2718, 2076, 7210, 1926, -2005, 3903, 6881, -1377, 6286, 5704, -6199, 10658, 6079, -5050, 9777]
693I777o783p261J5954q674r133J5213o857m087P291m042m044N177K329r391M589
708E8L846q839M436N879j3247N473R178j5966P624N493j3299Q236M196j1401N005
723c328N461j0110N752L066p572K463O185o566j850R874q292j518J0670p858l552
738g175J1377o503m276J1907q611j396R781o854k239R049m917m714J0863n668
752F24m159R450l278o314R559j446r193J2073k952q198J0867j851q735R780L23
767F550j1398J1412o07r755R310j2r232P949K304j1770R512J122j0715Q022K700
782E392j0801O063N334j3142P939L485j1117O161L708r226L922N742j0773N170
796b143M426q689L696L826o506J169N949p420K245M261n720J546M066m379o06
$$ y = [9777, 2994, -4267, 11687, 3013, -6120, 9093, 2236, -1851, 5440, 1398, -2646, 2531, 4860, -4531, 58, 3904, -4935, -499, 5380, -7867, -2394, 6784, -9182, -1558, 3935, -9364, -1128, 3068, -8333, -3328, 2133, -7977, -2225, 841, -6731, -4268, 1917, -4649, -6499, 3375, -4917, -6435, 4235, -3623, -7175, 4202, -2301, -6577, 5330, -3281, -4677, 5104, -1750, -3989, 5060, 143, -4571, 6292, 624, -3535, 5915, 2637, -3677, 5882, 4436, -4757, 7316, 4364, -3834, 7033, 5182, -3553, 6227, 6550, -4848, 6564, 5957, -3798, 5512, 5500, -3732, 4217, 6521, -5249, 4263, 5385, -5330, 2692, 5392, -5409, 654, 5988, -7154, 785, 4270, -6847, -686, 3022, -6204, -2282, 3460, -7313, -2143, 2283, -6406, -2710, 1116, -5390, -4221, 1728, -5692, -3447, 814, -4906, -3360, 706, -3673, -4279]
811d279N991n295K57M768l912JL444k018j669M830k859m94L135j615r11J982J824
828C180m590L069J970m840L145K991n707K329M994q439M841L105q047N491K408
843E900o987K779M876p363K837L468n601K12M906l462l611P611o360j992R428
858F641p856l526J0409o697l952J0507q881r70P750o078R3J291j093j26J558n72
874a502k451M27M945n454n84P642j0760M770Q013j2573L188P407q010L315L740
889B113q239M875L093l159j322K753K63m542R168k999j0909J4950j349j2384J5871
904H183o868j1330K3818j1976r985J9193j2207k190J5803j3437m685J4845o337
917B827l409N718l648m443Q854K426j5906J0371N559j6023J5106L06k2043K1276
$$ y = [-4279, 1712, -3583, -3326, 1442, -2470, -2469, 975, -1043, -2712, 2118, -741, -1235, 1900, 285, -626, 1356, 3180, -1410, 1659, 3629, -1211, 1934, 4925, -782, 1547, 6541, -1898, 2943, 6048, -1999, 3492, 5900, -1087, 1692, 6568, -795, 2042, 5510, -91, 121, 5027, 1565, -2046, 5565, -795, -2787, 6641, -1215, -4741, 5668, -1029, -4981, 5526, -3355, -4325, 3425, -2653, -2560, -1269, -2362, -2488, -930, -1502, -3953, -3526, 1419, -4035, -4619, 3023, -7737, -2967, 5046, -7527, -4339, 3068, -4942, -1627, 2113, -6126, -1251, 1842, -1317, -2639, 114, 377, -4165, 5003, 2004, -8905, 6045, 4696, -7688, 8183, 1315, -10015, 13803, 1827, -8158, 11035, -1172, -3362, 12441, -996, -5681, 9164, 2827, -582, 5136, 1488, -2955, 5899, 8325, -7581, 2790, 8349, -7674, 7432, 7738, -14305, 6971]
931F971L435k2292J9523o194j2614K2465r474j1754J3382l539m480Q851n427o847
945g994N445Q969r822n981J4942j2393J622J6971k3248J724K0928j9922N323J2363
959H927k4937J3867J3854k1011M943O520o842L807N928q113o345J3740K219j5365
973h808J2772j337j6214K8771r686k3188K9376q869j2597K6473j9423j0432K9161
986A5999j3798o852J3206j2250K015J2477o037j1614Q162P557j0858N754M149
999G910j9672J6021J2217k8845J5898L986k1738K8011o137k5273K5179k758j3150
1012h351J8506j3483p231J7860n025n112p99K216j40Q55O141j3910l38J8878j4156
1027d089k292J3331k1089J2776J4141k5750R932N790j2269J5468l888j3778J1996
$$ y = [6971, 10406, -11886, 7637, 1443, -11171, 11294, 1820, -9934, 3448, -91, -4571, 4280, -1147, -7994, -2549, 6420, -3402, -9383, 5559, -6834, -5212, 11759, -11489, -9765, 11163, -8759, -3436, 8927, -16010, -2143, 11711, -9300, -4357, 2163, -4679, -872, 5056, -3057, -9402, 4338, 6557, -8808, 3964, 2627, -13587, 15184, 5498, -17690, 11686, 2817, -9780, 16693, -2730, -13162, 15999, 2201, -4651, 8555, -3695, -1680, 10797, 4760, -6854, 1308, 8865, -1993, 3761, 7910, -11762, 4259, 16476, -12369, 3529, 7515, -14223, 13788, 7651, -17622, 7557, 4799, -8351, 10155, -3328, -10559, 7301, 2276, -2836, -3635, -1419, -1559, -704, 5437, -8473, -8811, 10067, -4089, -6381, 6950, -14139, -1363, 12778, -12972, -3040, 2750, -9519, 5949, 2061, -11717, 279]
1040B79J030j273K30n635N320k300O257R2j5057J3477K818j0597J3059r571q603
1055a0474K3911j2221p140J3913j3557O243J0629j4152M24N954j663K384j873
1068B378k237j376L780P411j4159L238Q556j3492J3340k71j9699J8565J516j5134
1082g584J6015r513q650K0495r810o427Q495n728J333N987o236l620L764M176
1096B697l671k969N588q173N066Q565j6254N850P209j1306R239O41j4031J2938
1110A389J403r289Q855o018o11O989l369j234q63J181L647l433Q81P56n145R613
1126D752k103q265R411m007j514P974p179j945P513l292m59J990l215J894N11
1141B066K127m166j111O664n364O86M907q763L033Q025j1068M024M124r454P703
$$ y = [279, 1309, 36, 266, -5369, -49, -2349, 3908, 4000, -11057, 2420, 5238, -5359, 7700, -1871, -10474, 13437, 1216, -5924, 7989, -5568, 675, 11304, -2848, -2424, 3530, 1867, 4251, 2378, 141, -1235, 2545, 9956, -4203, -965, 7591, -5901, 7439, 7168, -12531, 6034, 7550, -7584, 8431, -1082, -9732, 10763, 953, -5474, 3021, -2707, -1374, 4613, -1623, -5243, -1479, 2697, -974, -3943, 1645, -6528, -1462, 7103, -9151, -3301, 3908, -7398, 1841, 2482, -11549, 1389, 2792, -6497, 2358, -3660, -4271, 2718, -651, -1885, -2748, -1567, 2080, -1353, -472, 284, -4861, 4752, 2649, -5616, 3795, -212, -1726, 6248, -931, -2876, 4637, 1345, 886, 2876, -339, 1555, 2066, 4193, 27, -1084, 5580, 216, 902, 5809, -2954, 79, 8104, -2964, 1060, 5184, -4270, 3433]
1156C433O01p574M642J548l961K940n84l432K395J076o54l306L244n21k914N021
1172A954l838k037N157k196k726M468l442o12M342l460O3Q49L73o51m84J947k158
1189b451P4L576k934j835O077n022o7O264o760J088N330m999k77N781n292j04
1205a551N997n031q65M988k507k969O664l298m101P982l749l956P343k974n017
1220c044Q689l841m790Q489m157l599P045k991m528P040k730m723P049k603l788
1235b482N295r30n453N870o67n697O151j029m826M566R9n424N379M38o126N551
1251G15p4n103L833J730n811L747K219o080M027J529m769K532L057n459K411L697
1267B201o154K822L403n198J235M287n018P13N306n822J040M714m860j60N106
$$ y = [3433, 4034, -3540, 1102, 2650, -1311, 1629, 1045, -2387, 8, 1084, 430, -2876, 368, -153, -3067, 1954, -1884, -3921, 1236, -960, -3686, 782, -2660, -3272, 1070, -2390, -2327, -1478, -1105, -1756, -2240, -293, -2451, -2377, 1199, -1735, -3570, 2507, -2515, -2582, 3682, -3078, -1990, 3340, -1659, -1936, 3845, -1447, -1551, 4446, -585, -1450, 3538, 1031, -1938, 4726, 1428, -2673, 5309, 1560, -2396, 4947, 1973, -3044, 5645, 1804, -2986, 5503, 1346, -2253, 4792, 1801, -2727, 4313, 1583, -3140, 3909, 1306, -2482, 2813, 1883, -3570, 2300, 1633, -4064, 2087, 1058, -3768, 798, 897, -4527, 852, 1290, -4836, 715, 641, -4462, -629, 1101, -4710, -963, 1256, -4824, -797, 732, -4037, -1505, 1552, -3907, -1496, 2201, -3953, -1131, 2272, -2926, -1691, 2596, -2422, -1709, 3597, -2225, -1185, 3529, -1331, -1491, 3615]
1282C615m118p73N595m729l71M833l438j950N621l201k755O637m371k018N675
1297D252k771l052O061l016l499O557l457k671M926j860l169M720j491m255N261
1312B536j226l996M119j65m737M790M64n924N840j258m176M768r25l926M369l46
1328B07l976L860r58j981K448n5k387J116K093k875R47J827l257J266L293m311
1344b743J247L201n170L948R62m505L245J067l030K540k01k315L011j97m26p37
1360a03M76J475k059K688j403k645N084j730k918M794l515q97N907n646R7L576
1376C181l119J895J63k787J536Q05m07k37j993K184j212N33K548o137K773L060
1392B786m908L007m78m864O817j504m457M720m063J429L794n200J052Q36n35K394
$$ y = [3615, -503, -1276, 4319, -410, -781, 4052, 614, -1336, 4285, 1084, -1671, 4966, 595, -1423, 4252, 1481, -1571, 4490, 1474, -2025, 4532, 1075, -1596, 3330, 1470, -1699, 3021, 1530, -2725, 2536, 1310, -2686, 1433, 1268, -3469, 1321, 1785, -4139, 1701, 443, -3733, 1035, 110, -3816, 553, 207, -3769, 91, -867, -2848, -400, -455, -2842, -1726, 367, -2508, -1561, 266, -2991, -1725, 1568, -2743, -1496, 1705, -3465, 483, 1445, -3060, 185, 1252, -1778, 762, 561, -1754, 1257, 1060, 634, -103, 373, 1848, -211, 2477, 1074, -1571, 3513, 1783, -1135, 3659, 144, -753, 5154, -492, -395, 3181, 62, 1957, 2120, -667, 869, 1674, 1267, 1030, -963, 1221, 9, 542, 3090, -3047, -274, 2786, -2122, 885, 407, -4457, 2360, 856, -3601, 1119, -2944, -1515, 2279, -2921, -1869, -1033, -1568, 826]
1408H26k403q89J921j702L564k265l641N922k939Q00K495o600L853L283m370K801
1424F56j528k595O992l216j413J899l703N437l40l867K854k236J483M447o433
1439a563J305K436l161N692l826l718N799k175J167Q67n506M059J983k998K843
1454C204n309J677N358n596K155j606k855P418l018m081M204m309L858L151q398
1469d147L883L45j697N184o214p35M538k570K721j378n155O162o49j685K617o686
1485e466M799L203n569L380k680j327P276m698j567L096m393O171m37o099M780
1500D69j813J640L465p195J961L345l246N161m375l594Q042l756J178J090o176
1515c804N815J362l723K750l761J103N663n798R69j04j884O668m382k497L892
$$ y = [826, -1577, -2466, -545, -2247, 1317, -948, -4589, 1333, -1606, -806, 1689, -4911, -1058, 2225, -2145, 656, -872, -3467, 3525, 309, -1104, 795, -2908, 2529, 2189, -1678, 1176, -1060, 423, 4870, -1563, -258, 2178, -983, 4709, 883, -2835, 2964, 789, 1956, 2823, -2683, 1376, 3359, 361, 3204, -2105, -428, 4930, -666, 1489, -117, -2972, 4446, 1428, -2653, 1551, -2758, 1100, 4251, -4147, -264, 81, -1616, 3568, -2646, -3381, 1157, -1413, 1308, -70, -5225, 937, 288, -1397, 1220, -5466, -667, 2536, -3033, 347, -2333, -3660, 3616, -1082, -2649, 447, -3946, 2225, 1788, -4311, 469, -1344, 296, 3761, -3434, -1473, 1872, -1374, 3787, -588, -4182, 3860, 104, 1282, 2372, -3804, 2011, 3373, -350, 2400, -1361, -258, 5405, -393, 576, 472, -1412, 5256, 874, -1623, 2269]
1530B269l454L937J101p386M572M18k457N291o416k12N470l833K291j356l856
1545c621N323n91k035J744m213L563K287n065L016k831K79N333n140o23K521k475
1561b528L650m28n024M180r81M05K288n211K484J532j784L076l487r98N012l215
1577a029O35J619m882N404j16l163K585k151P53L387l252k94J661j552L174k071
1593G08j396K201j788K830j000k755K800m66o81K265l476K79L730l687J816k64
1609A116k541L516r54j462J133j300O33J418k052N13n16j65J971k742P20Q42j299
1626a169K001j036j996K296p89n76K004l043J349J195j482R21q57m0J239r83K44
1643g22K86j461K188o35q51J494j666J108J186k215J092N69j142J237O3j610K062
$$ y = [2269, -1185, 2752, 3853, -3533, 1039, 1457, -1000, 4291, -2125, -2337, 3133, -700, 1591, 235, -3621, 1702, 1111, -924, 820, -3393, 170, 2457, -2608, 408, -2423, -2144, 3189, -1951, -2574, -53, -2528, 1122, 694, -4330, -150, -1131, -726, 1562, -3649, -1165, 367, -1417, 1659, -1828, -2826, 2186, -1029, -394, 1225, -3657, 1747, 1631, -1532, 1053, -1098, -345, 3042, -210, -504, 1157, -395, 2779, 708, -688, 1513, -275, 2555, 1555, -1200, 1600, 1134, 453, 2718, -758, -479, 3251, -436, 1380, 1116, -1425, 2091, 1137, -325, 808, -492, 141, 1559, -493, 20, -496, -661, 1310, -1432, -712, 130, -1169, 832, -204, -2200, 96, -693, -1269, 735, -2308, -959, 236, -1246, -325, -1182, -1222, 17, -966, -722, -436, -1897, 291, -344, -1195, 299, -1367, -259, 927, -1288, -196, 373, -769, 468, 531, -1079, 983]
1660I83p49J83K91o82O53J62K49o11k54O06K23o91Q31m99n35J707j511M0J391
1679A787j682P05N95j264K18J085j348N37r9n19K96j87K63n31K09L5n43N69j65
1698c9m44K94J44q49P47o32J00N02q47L29K04j57m75J015q16j06N86l30J76k7
1718f25J77p17O16jk44K39L09l17L24M46q97O39K99n16N23M1l02M2O83q73M79
1739C25K16j34P3J84j27l82J008m53j52N53m86L7J57J47n95R45p76l34O75n60
1759C21m2l1M07m40L90k05l48OJ51j29j93M73o19J29p3n10M34j59K9K49k69k91
1781g20O24l91K0J11n20O79q88M30J78n22M68m9n08N67O0o91J139n16Q5L79n65
1802f30K34M3L73k97O2L10K36n58N42J46p30J158r78K5J095r78M51L28j028Q71
$$ y = [983, 234, 417, 708, 26, 679, 841, 1090, 479, 225, 831, 1054, 363, 1194, 695, 160, 1867, 356, 396, 1787, 105, 810, 1405, 141, 359, 1444, 96, 633, 534, 15, 311, 124, 387, -144, 65, 100, -443, 126, -39, -483, -189, -45, -894, -147, -779, -679, -177, -1024, -695, -491, -648, -1123, -108, -924, -1030, -444, -774, -598, -625, -448, -1165, -549, -550, -794, -555, -246, -563, -239, 207, -690, -51, 248, -268, 255, 296, -6, 36, 719, -154, 325, 541, 407, 480, 664, 537, 155, 1163, 710, 558, 1111, 625, 662, 819, 966, 371, 1316, 540, 206, 881, 321, 279, 248, 655, 215, 605, 400, 52, 58, 209, 80, -113, 360, -259, -130, -203, -713, -279, -438, -409, -160, -429, -720, -96, -487, -467, -356, -876, -197, -1085, -655, -477, -999, -531, -580, -1088, -521, -461, -1152, -13, -529, -444, -65, -630, -396, -353, 20, -277, -215, 95, 331, -227, 315, 461, -269, 889, -89, -64, 1031, 53, 504, 832, -196, 675]
1822F75N47j190J052o16l68R77n80P3k45K43N55m80m26N82j048J145J66j945J624
1841G41n89l91J330j393j62J225j149P97m12j488J787j93m49Pj098J350n8o91
1859h36R53j589M75J796j991K92Q69k061K578o33k058K298r21M17J064j680K02
1876h25J327j007Q69r43n68J952j226J061n30j293K681q88q99J674k354J082K032
1893B145k817J128Q9j143K707j603j027J537p01R54j5j880J045L00o6J365l149
1910a131J146J256j586J800j835j122L021j019j236J711k719J827J484k736J463
1925C24j158J66K005j905l33N49o44K122j242j771K442j686J205P00l502K322
1941d06J018j870K110j912j024L471j846p2O28j902K757n19j193R58j679J640
$$ y = [675, 1222, 32, 1084, 468, 100, 1077, 497, 570, 325, 568, 1123, 643, 217, 799, -249, 896, 1062, -883, 741, 152, -239, 1091, -302, -464, 761, -388, 409, -3, -1491, 296, 103, -346, -339, -1437, -87, -145, -836, 117, -1472, -997, 799, -1192, -900, -31, -2092, 486, -147, -2205, 93, -828, -411, 653, -1027, -825, 502, -505, 364, -579, -1147, 805, -421, 640, 110, -1183, 1498, 610, -289, 1385, -969, 113, 2145, -672, 456, 545, -598, 2109, 506, -521, 1016, 315, 1269, 1254, -626, 419, 719, 653, 2018, -1131, 15, 1271, -315, 1485, -350, -1472, 1549, 530, -706, 1005, -1714, 113, 1597, -1139, 324, -834, -668, 1337, -568, -901, -352, -996, 1126, -116, -1887, 555, -1131, 74, 774, -2728, -406, 612, -1258, 852, -1060, -2084, 1387, -459, -531, 97, -1805, 952, 433, -760, 198, -1481, 159]
1957A59J713k998J088J6m13K835k695o64K285j879J954j97l020K789J74j129K065
1974B083l213Q28K271k028J451j376p04K755j561l38M33k038K814J97k726J597
1990D45r11L47K263l101K55J443j504J875r94j979K325o52J80P74k944K012N02
2007C36j010J158k225O77K094j820L13J46j759L046p06j935J968j508J051J247
2023A073k550P39J008o90J471j816n43J871j261J741p46j884K559n67j22N31j911
2040a097J397J317j826Q08o19p19K762j897l18P66r35J623j53j635J516o57k43
2057I0J563k256N14R18p71J100j033o59J500o94r1L25j572J177L37j094J283j432
2075g95M34Q78r63J68n3n54J163k32j262J163n55N02M96j601P11J35l40J072j149
$$ y = [159, 1872, -1126, -38, -22, -435, 2400, -295, -959, 1326, -553, 1401, 1204, -1816, 973, 1147, 18, 2083, -1130, -302, 1969, -59, 1392, 16, -688, 2067, 506, 168, 601, -1437, 1377, 1574, -1152, 445, -466, -119, 2144, -957, -702, 741, -763, 1112, 118, -1861, 464, -188, -8, 766, -2178, -166, 336, -674, 484, -1741, -1064, 1030, -790, -477, -331, -2090, 956, 250, -1685, 283, -1225, -174, 1073, -1477, -738, 270, -420, 1051, -765, -1308, 563, -698, 1043, 297, -1587, 972, 405, 283, 814, -1097, 300, 1617, -209, 599, -20, -739, 2023, 126, -192, 574, -361, 1262, 1109, -526, 990, 333, 90, 1653, -603, -89, 829, 58, 1158, 125, -534, 966, 272, 181, 506, -1066, 111, 448, -646, 637, -795, -361, 517, -446, -278, -331, -885, 278, 46, -1216, -53, -608, -106, 390, -1211, -500, -365, -705, 367, -782]
2094g82k63J062n36K43J33q08J064k92j55K16n63Q10J3o25M00K24o28J172p18
2113c3n7N22m87P70m14m65N91m6J41J94o44L88J46m96N82l53m48J008m37lj36
2134C23p3o1K53l66K36%j60M30o95L84%n48M69j89j07K37j56J29L0m41J86M4j45
2157b20M00o43q1M26j92j41K07k62J95K53l08N6k83L60k5j72J06J25J1N5m22J64
2179c91K96l28L27P7l62M53M2O2L1j70J79k9j83J26K92o4l0j08J71l11K67L0n5
2202C22J97l67M7J29M1j73N4J04k17K01j72p9JQ9N1k36J81m11L57j41L17m05L65
2225B55j40m17M68l10k08N5n2R3J25p4k08L71l94K48l02J33p6J52k5j29J94k36
2247d77K07j68K56K6j11J86m7M2j60J48K58m40Q6K49p9J65K33j23p9J12o1k63
$$ y = [-782, -1045, 17, -519, -276, -143, -951, 113, -179, -334, -118, -681, 129, 142, -483, -83, 141, -487, 685, -33, -90, 432, -55, 715, 301, -164, 427, 381, 522, 716, 72, 460, 606, 110, 692, 339, -109, 899, 462, 459, 323, 250, 189, 442, 76, 312, 312, 152, 582, -113, 271, 271, -277, 192, 3, -104, 133, -23, 106, 136, -305, -119, -75, -220, 180, -463, -544, -118, -310, -451, -244, -506, -311, -58, -366, -310, -593, -233, -258, -430, -324, -199, -188, -133, -555, -391, -95, -423, -96, -19, -381, 72, 114, 176, 207, 37, 216, 187, 4, 130, 422, 358, 328, 220, 391, 80, 347, 377, 322, 519, 152, 199, 328, 369, 196, 250, 354, 137, 338, 166, 87, 88, 177, 228, -8, 173, -238, 119, -22, 295, -110, 255, 115, -302, 166, -144, -352, -297, -349, -256, -131, -205, -413, -42, -436, -188, -490, -357, -433, -281, -306, -435, -241, -477, -270, -438, -182, -156, -267, -81, -128, -86, -246, -98, 160, -280, -194, 55, -24, 141, 374, 251, 172, 284, 223, -40]
2269d0j2K24K43j65q4R1Q7J03r1J02Q9m09K89j26r2J98q2k66L33j80l48L04p8
2292I0L1j0l2Q3m04L25N0k04j79L75m99O49m08q0K25m24J86N55q07M37o0l31L50
2315h2j87o9L07n38M02P6m68R45o23P5n0o3K62K37q38N08K48o23J076j041J65
2336b81L86m35P02j09q62R43j12l77N18o72O25J23l91K01m23j28Q69m23K44k17
2356A81l22O26K36j116O13k31K30P16j522M40K79k44N55o26n97J418q13M01Q4
2375C08j017P04L2j56M08p35K53P17q51L20k54m73J205n25m63O30p22N99J28r94
2395h86P69N1m86J086j290L45P03p66R54r77m64J324j82m70N48j169J213N79r86
2414a04K49k25r2J169r88m3L70n52J353p96n08N77l07N54M45j790J060K20q08
$$ y = [-40, -52, 172, 415, 250, 166, 257, 344, 447, 356, 458, 547, 138, 427, 301, 209, 407, 325, 59, 392, 212, -136, 168, 90, 121, 111, 79, 162, -242, 83, 133, -71, -250, 125, -374, 275, -133, -213, 12, -412, -226, 329, -478, -41, -101, -432, -82, -269, -338, -31, -569, -167, -91, -559, 386, -237, -162, -212, -275, -13, 224, -614, -106, 142, -481, 595, -446, -281, 105, -330, 372, 263, -599, 344, 232, -145, 373, -299, 326, 449, 58, 259, -164, -292, 577, 154, 398, 181, -141, 485, 721, -395, 218, -13, 217, 933, -589, -149, 130, -114, 441, -185, -782, 636, -177, 224, 308, -709, -5, 27, -129, 279, -456, -203, 514, -337, -17, -271, -744, 461, -64, -527, 103, -619, -20, 108, -886, -117, -66, -552, 534, -756, -411, 292, -474, 480, -497, -961, 363, 181, -289, 259, -910, 303, 882, -104, 145, -80, -172, 997, 9, -34, 336, -216, 1137, 341, -167, 410, 103, 657, 1102, -688, 372, 592, -216]
2433b16J178j113k38J167o98K69k85o19J086j84n92O45q64L17J047j149K2j53
2451c80q6J149n65p56Q07n07P10Jj308J061l35K3M71j146K95R15r21P84m30o41
2471h59J322p66j32L75o28Q48K88r66O31l72J47R33j352K98K96l35P54l63n81
2490d62Q25l12J8M76r53N07N86o10M30p13L09P99r56K15nm80R27j62l50M18r20
2511d13N77N76j274L94J64k04R71j110J07N36n34K81J12p83P54k44J97M10j075
2530e58M94J74l8j61k34j13R06o29j71Q5l16Q45p5p84O73m67L96K70r00L08K71
2551b4j13K37l55j64O03j71K15k12m42M90Q8k99L67m33J76N27o83J94K66l5L27
2572E59l71j64kL81k71K85n49M37j45r7N79o92P4J76l30N31l62m40P54j41j25
$$ y = [-216, 962, -151, -389, 778, 80, 349, 64, -555, 531, 347, -245, 400, -464, -147, 900, -249, -227, -380, -466, 683, 118, -638, 169, -338, 372, 373, -935, 126, -209, -186, 285, -861, -566, 349, -572, 212, -218, -859, 463, -303, -435, -60, -688, 160, 448, -518, 113, -259, -112, 821, -531, -233, 63, -272, 482, 119, -462, 363, 51, 69, 545, -408, 99, 685, 75, 505, -208, 101, 900, -56, 159, 154, -326, 601, 439, 89, 507, -413, 164, 740, -534, -140, 24, -180, 791, -319, -212, 324, -210, 71, 183, -600, 154, -90, 107, 517, -558, -64, 110, 72, -89, -323, -436, 470, -159, -330, -245, -561, 284, 209, -575, 98, -369, 27, 297, -603, -295, -24, -137, 100, -255, -419, 184, 13, 228, 16, -426, 64, 152, -147, 220, -213, -37, 490, -193, 1, 267, 232, 559, 188, 24, 22, 403, 132, 417, -132, 305, 160, 63, 642, -50, 24, 200, -130, 401, 39, -401, 353, 212, 87]
2593H7K07l04J10j65o2J83k50K02L06l93m2M9p1K42q7j96K49j53j06K67m82J82
2615b27K11n4n2j14l9L83m31J11kK23J10m63J85Q2k15m7K68k15Q8K73k76M99m34
2638a36J72q4m3j21K12q8L40m3k26L62j05m1j08J5J03j47R8L4N0J1J07l13j71
2661a22K10k59N24k60J31j42J08l2j65j61J35J92l90K46o5K2O4q1j81k0Q5N1P6
2684c4j36O2k13K89j68QP7n5K05k41M07l19k5J13r9nj5o4N0K43j86M4o1J30q4
2709g7O3J67j16R5q5k52L09j25K93j43j10P1k4L0J73j09J97Ql38J56K81l60K6
2732A30l0J7L2J66j64m6j7j94J25M1K93k96J22k5L3L5k23m9J55j85J64j78j71
2755b65K15L4n9J63j21j21J64J05n1l00L65j18j67k4K70k84N0K84m21J89n4j26
$$ y = [87, 294, -10, 100, -65, -127, 56, -194, 8, 314, -79, -121, -72, -143, 99, 12, -184, 65, -88, -194, 73, -409, -227, -16, -70, -122, -236, -275, 108, -323, -212, -214, 9, 119, -344, -159, -77, -292, -339, -71, -286, -198, 75, -201, 298, -136, 36, -48, -91, -212, 0, -88, 252, 209, -17, 345, 240, 199, 91, 106, 209, 62, 160, 194, 244, 255, 362, 49, -122, 88, -171, 353, 93, 224, 82, 190, 158, -7, -168, -33, 159, -231, 15, -50, -28, 36, -45, -226, -246, -161, -110, -34, -170, -108, -321, -32, -200, -192, -115, -170, 35, -206, 201, -118, -143, -30, -129, -134, -149, -213, -163, 80, -106, -62, -123, 7, -77, -14, 153, 37, 132, 47, -205, 104, -21, 272, 129, 19, 90, 66, 96, 269, 160, 357, 365, 27, 183, 464, 104, 130, 100, 117, 149, 315, 151, 105, 88, -106, 19, 60, 353, 57, 179, 154, 187, 222, -1, -50, 105, -80, 84, -94, -265, -50, -16, -75, 88, -33, -154, 10, 115, 64, -236, 129, 11, -156, -180, 90, -194, -144, 140, -281, -92, -146, -272]
2777b72L15j36p8p1K07J2m6k29K18%J49M2l33L24p3L3K99l91J04N9k40K56J19
2800B68k14R5K02n03N12m39Q6N1N1K47k44l32O25k73m8J35m87L66n0j99L41j65
2822B5L4K8k92K83n6k19L58m32j86N48j41J0J40n26M80j36l79M53k22j28Q58n69
2844f9l8p1o2K15J0l53L30k22J12M06p37M73R9k20L70o62K46L22l15M27L7o51
2866c53P12l12n4K66o34N48L48o07N67o25j32O94m01q3K48k81M01K90p98L18j45
2887c3L0L04m25N7M6J74J57l75k78N52j13q4M22p35M28K25n60N40n63r1P66o98
2909b54P9Nj74O88l97l04M20k97L65O5r29O29N0k10M92p04J2O01m73L42q2m69
2931e45Q42j93j70O0m01L53N18n30P7L8K3L25l47j83L80l00M99Qo65L76O3j90
$$ y = [-272, 43, -93, -171, -242, -35, -23, -69, -298, -80, -80, 69, 111, -222, 102, 29, 62, 361, -30, 74, 133, -107, 149, 268, 54, 149, 351, -152, 360, -79, 7, 58, 109, 356, 112, -220, 405, 132, 84, 219, -268, 98, 48, -151, 190, 25, 59, 87, -205, 78, 22, -197, 161, -271, -457, 91, -50, -40, 100, -426, 54, -82, -461, -8, -230, -358, 500, -69, -107, -178, -240, -25, -15, -368, -38, -260, -148, 258, -479, -6, 93, -127, 243, -419, -173, 149, -166, 261, 298, -353, 359, 47, -7, 259, -375, 173, 521, -86, 481, -144, -276, 418, 17, -66, 182, -99, 302, 592, -206, 112, -33, -3, 301, -124, -67, -21, 153, 310, -65, -343, 209, 96, 12, 434, -301, 127, 352, -208, 332, -231, -322, 444, -254, -175, -170, -344, 344, -53, -357, 63, -234, 131, 196, -733, -104, -54, -264, 228, -476, -464, 137, -336, 6, -76, -545, 297, 104, -66, -6, -407, -54, 464, -66, 11, 49, 72, 397, 50, -133, 247, -53, 446, 454, -211, 165, 228, 38]
2953C8M63o03J33M15l42K85l83j42N96l83lnm55O61k2k11K9k77m2M90n86L14j01
2976a31K0N34l84k87K10k63K70P4n40N99o1j77M18n15J49L92m93qPl88Q62m22
2998a34K6m2l34M56M9m36K06J8p0O42o30J98J25k90K36n9k99M46nk34J76l18J75
3021i8L77j80K51k78J32P2j23m0K27k69J82J30o67L45l6L64l44J3j01ML7J91L7
3044B26n09N37m55K82n5m07L62J10l93R2k95K71L55p1J29l41J30J60k65p7J86
3065b8l1j96Pj08K44J9J49q2j55J31j4j18J2M1o5J06m8J45L5m3j81K60j31K16
3089A65k69J7P9Q5J31j32j7J3J4j21L28k43L91m33k6J73J89k24j32J08M2j89K51
3112B00j52L0o0J21j30L7r9J07Q5l1j18j2lK09Nl57J78o6N7l2J09j42j7o3R0K10
$$ y = [38, 501, -102, 31, 446, 104, 389, 6, -136, 460, 77, 74, 69, -386, 275, 253, 42, 71, -206, -248, 242, -344, -30, -131, -111, 423, 39, -248, -38, -301, -31, 43, -497, 102, 41, -136, 282, -233, -84, 308, -185, -193, -186, -574, 288, -134, -108, -150, -484, -28, 21, -415, -209, -191, -261, 381, -249, -51, 74, -216, 20, -39, -338, 108, 103, -131, 45, -273, -98, 279, 99, 350, 72, 204, 276, 153, 113, 340, 71, 253, 383, -284, 61, 25, 389, 45, 58, -43, -39, -2, 189, 226, -283, 254, -201, 81, 26, -381, -19, 91, -302, -210, -505, -234, 121, 50, 179, -162, -32, 128, -137, -214, -28, -59, -255, -248, -356, -112, -93, 56, -26, -181, -50, -64, -182, -170, -129, -194, -88, -136, 9, 44, 1, -180, 80, -51, 165, -104, -87, -8, 77, 208, 76, 59, 72, 86, -35, 293, 50, 441, 8, -18, 155, 344, 120, -12, 96, 138, -51, 200, 48, 78, 18, 139, 9, 46, -53, 54, 139, 108, -10, -22, -25, 184, 189, -168, 10, -56, 1, -31, 78, -64, -81, -144, -54, 156]
3138A56l10J58k44J91m9K0n6K25j65k8J20j10pL1J98k92L02k11J17k07O2J41q5
3161d3J3p4N7J36J1m5O0J59k31J74j30j05kk6nJ42n1J51J45k99o0OK45k48n3J82
3187A09K3p1o4P7K40j60k79L08l65L28K13j97l53L72l43L17k9l40L63j22j74N2
3209i5p3K6P0R4j42k02L16j69k74N11m9j37J59k37K38jk0K1J0j17K73k02M1k68
3233b27J13J70J76m34L74k46j12M49l40k1J62l20K70J07l06K82M6n1J87l20p5
3254a16L08j68K69j35k2m4j60L42j76Q8r0j09J84O1j48J76j52l20K86j62P7O1
3276E0j51J13M19o39K92j38j74L24j66j10R2l7L31k01m28M32n4k1J15k62O6J14
3298c3j30J56j20j8P0j41M19k37p6Q2K08l08K92m87K52K32k70R6L42k25L85l69
$$ y = [156, -154, 4, -240, -49, -98, -78, -134, 91, -74, -102, 18, -92, -99, -68, 130, -162, 140, -71, 46, -161, -99, 42, -43, -30, -104, -47, 89, 100, 55, 115, 274, 43, 217, 87, -18, -20, -46, -51, 91, 40, 191, 336, 37, -23, -17, 228, -20, -73, 109, 132, 61, -3, 74, 314, 154, -125, 183, -182, 146, 359, 162, -191, 181, -162, 155, 126, -214, 149, 27, -147, -95, -168, -142, -72, 22, -120, -322, -6, -175, -449, 62, 13, -124, 35, -202, 36, 35, 15, 36, 46, -71, 202, 0, 41, -227, -114, 56, 232, -202, 172, -74, -186, 263, -77, -98, 64, -256, 14, 121, -185, 97, 143, 92, 279, -41, -116, 192, 24, 293, 158, 136, 92, -68, 274, 98, 186, 96, -13, 171, 232, 84, 260, 108, -212, 74, -88, -11, 50, -101, 12, 431, -208, 84, -54, -228, 96, -70, -180, -88, -125, 206, 5, -423, 9, -45, -66, 49, -213, -147, -33, -163, -7, -127, -145, -75, -216, 203, -34, -110, -28, 180, -128, 164, -323, -71, 161, -109, -13, 329, 104, 489, 120]
3320A20k75K69j59J16o8p6J96J21M9j0k99J17P4j76M50k48m39N56l63R8K20n67
3342b94N3M89n20L38J07m7J92n27J6K78j94J73L7j1j9k39K00J46j47k95M46l35
3364a53J04K23l67N17m78K63J38l34J7J28l19K3K47j08K38l22J49j64m5M09O6
3385B32n69N22j23q8M16o66L15P9l37J86R3l71M34l1j66K06j97K01N0k92J75j94
3407a25J43L60o18J73m7J80N68m05m20O20l26L48l45l67M04L1j1j46j19R7L99
3428C94l19K20n1n26N17l13k34J22N6P9K50n72K11K6J74M5l92M7K10o2n0L03n53
3451d18L09PJ61j04k90K16J64r9r9j3K8M72n73J94K57k54J57M2l17J40P4O8o0
3474F2l20J20J42J13J33k53j16M67l30Q1r2l91O17j89j85K12l38N09n1p4J54k88
$$ y = [120, -155, 114, -45, 71, 3, -73, 123, 244, 293, 283, -16, 101, 175, -1, 449, 201, -238, 318, -45, 53, 273, -294, -241, 248, -272, 66, 173, 126, 318, -209, -193, 85, -109, 64, 101, 90, 71, -168, 32, 178, 31, -264, 182, -153, -49, 174, -193, 324, -154, 109, 247, -87, -70, 58, -261, -238, 9, -99, 139, -183, -34, -198, -243, 166, 232, -337, 185, 62, -26, 390, -276, 39, 118, -219, -33, 60, -311, 123, 92, -74, 132, -65, 136, 186, -106, 69, -125, 18, 378, -240, -67, -114, 66, 634, 229, -191, 429, 103, 451, 106, -261, 143, 174, 163, 17, -102, -5, 394, 75, 295, 244, -282, 235, -78, -312, -190, -134, -55, 195, -377, -166, -140, 34, 79, -313, -266, -56, -118, -168, 135, -418, -109, -102, 59, -45, -335, -119, 45, -54, -153, -166, -138, 334, -239, -45, 212, -42, 115, 157, -160, -20, 54, 122, 62, -258, -138, 4, 117, 250, -3, -119, 348, 18, 99, 7, -384, 233, 44, -141, 71, -267, 242, 191, 117, 271, -17]
3496a7Q8K50k31j49rj3NJ17k66L97k04k56R5K21j20R9P2J01p1m68N43k44lM2l41
3521c62L20J80l29L1PJ03K63m24J71Q0k55L52j46K5J14r5r6O7l16R3L09k36L61
3544B17m68J19m9j0N49j90l41L41p6j53J65r5J74p6j61J40J14p9R5m8j63J54j09
3567E0O6J56k32r9J77Q7l7j12j21K69j65k53K67k8o4K11k09K72k62oJ25l42J60
3590i0j00QOjP4k00R4K5O9P8l8l4j12R6K15m01J28K26r5j25j01M0P2L29k75Q0
3616c2j83L08l14K77o2O6K6N8J27m34K99q4N2M8l27L81l30R9Qm5J68j18J5j14
3640a11J54k7K39k29j1P6m5j90L53j01p9J23j55J31j57p5q8K00K03l61K45j01
3662fP9K7j59K77k84J38j11K8j41J60jJ68l03J51N6k85N8P8q1p7J80N0o2K9j1
$$ y = [-17, 71, 321, 90, -59, -68, -81, -76, 41, -225, 172, -32, -288, -193, 28, -92, 7, 79, 180, 109, -359, 184, -60, -63, -21, -362, -42, 138, -191, -160, -153, -50, 213, -211, -40, 40, -215, 137, -9, 16, 130, 35, -61, 6, -310, -217, 92, -144, 217, -251, -132, -181, -191, 358, 168, -173, 168, 92, -61, 104, 9, 183, 107, -54, 86, 200, 121, 216, 168, 5, 159, 50, 116, 272, 40, -59, 118, 205, 168, 56, -65, 204, 39, -214, 53, 25, -39, 172, -37, 235, -27, -33, 92, -250, -90, -190, -182, -176, -177, -103, -303, -209, -184, -115, -37, -75, -109, -221, -125, 90, -311, -183, 43, -52, -177, -278, -238, -166, 163, -112, -32, -215, 93, -221, 56, -6, 60, 86, 144, 271, -163, 136, 52, 104, 152, -175, 206, -124, -25, -17, -62, 106, -12, 3, -111, 43, 16, 255, 26, 15, 91, 46, -144, 209, 108, 29, 152, -3, 128, -29, -104, -192, 8, 211, -150, 95, -6, 73, 100, -59, 218, -66, 72, -39, -11, -152, 8, 7, 175, -128, 23, 79, -206, -148, -70, -151, -228, -48, 2, -60, -31, -42]
3687d2k40L32k0N4p6j03p7J39k4K9N8%j39K13m67K99K54j51%J13k02l7M4K00j19
3712C8q6K84j23j98J65M6M1R0l73K13p5N4k6j88P6j23J13pJ16j93K05j21J65o0
3736C3o7J69l2k21j01K54nJ1j34j63K65J5Nn4Ll4N5k93K97r2N8J26k70J3K76j59
3762d5N5j11J98k28oJ34j6j16qJ48j99M11j57j37P1J21j46n0j54J35P4n7K28n8
3786H7j24L79l33J5J72j12J9Rk01J75l6k51L92k87N7J67j48J99j81M3M4j34L04
3809B55j32j79K88K8j19l2j19L7K66l83N2L6k2P4j56J98j64j92J53K65n09N09
3831A54j17l21J48k13J61K87o6Q3O8m49K27r3PL60m98L00J1N8J9J02l76J69O7
3854H8PJ04j68J1J41k64K45j26J20o3j40L6K48rQk23j85J8J43N9M0k39K43J31
$$ y = [-42, -282, 50, 30, 84, 8, -95, -172, -33, -57, -28, 30, 30, -109, 104, -363, -64, 190, 39, 39, 152, -50, -87, -43, 157, 38, -48, 236, 113, -85, 80, 126, 167, 257, -116, 97, 22, 76, 50, -138, -62, -185, -72, -79, 37, -156, 49, -72, 93, 33, -34, 135, 103, -118, -219, 35, 30, 41, -93, -256, 9, 24, 29, -25, -22, -56, -1, -294, 3, -89, -31, 95, -175, -162, 114, -45, 10, -101, 97, -131, -137, -3, -19, -135, -143, 5, -194, 217, 60, -77, -6, 115, -31, -81, -235, -100, -26, -83, 145, 87, -37, 342, 9, 24, 196, 84, 103, 112, -89, 86, 50, -201, 191, -96, -39, 128, -20, 179, -2, 41, 85, -49, 255, 123, -56, 232, 260, 141, 109, -10, 27, 293, -90, -38, -2, -24, 50, -106, 92, -72, -264, -111, 154, -355, 154, 37, -284, -136, -349, -188, 99, 33, 116, 184, -265, -38, -131, -124, 236, -262, 38, 49, 107, 126, 228, -148, 21, 88, 95, 199, 31, 42, 183, -81, 164, 38, 158, 95, -45, -9, 239, 230, 238, 15, -170, -152, -9, 50, 90, -149, 94, 225]
3878B25j09j37l35M98M7m68M30l05q5L20J52l28R4j59M59k40l00K91o0j61K72
3899A01j63R6M6k65L07k44j03M35k19j57K66m08N50l00m3L51l18j81N77k31q7
3920A0L4k9m8Q4m5O3l54L68j02j89L02N4l1r4M3k11J57j63M03J36l87P6K44l21
3944@J81l0k03J94o5l7j34j53L77j62jL50m75L27K04n22J37K33l42nM6K05j32
3967gj64L77j33j21L2j49K92r4k69J13J38k12L0K9L9L41k53l2o2k59N63k70K14
3990A43J51m12L38l03p0J68N3j47P4l0k16K52j06R3M4J11k61n7K29K76l79m5L43
4013B49l26L5M6r8M47m58J63J86k50KM09m00oP2j12K79j75kK47k93K3K8Q8J02
4037B56m00J0O7P1j54J12J73j32J39k98J22j3J2J41k98P7J8J3n8J68L6J71k95
$$ y = [225, 116, -21, -356, 142, 189, -279, 151, -154, -239, 81, 233, -95, -1, -160, 299, 59, -241, 50, -10, -171, 101, -62, 34, 80, -185, 122, -122, -225, 210, -9, -166, 100, -308, 242, -58, -101, 250, -68, -249, 328, 97, 10, 44, 15, -33, 51, 6, 69, -285, 83, -19, -208, 94, 148, 117, 23, 66, -145, 12, -151, 252, 388, 1, 77, 321, 0, 181, 151, -52, 142, 77, 40, -94, -247, 130, -32, -33, 317, -158, 169, 373, -149, -12, 221, -121, -126, -80, 125, -7, -171, 206, 73, -48, -16, -165, 127, 33, -236, -123, 15, -197, -167, -138, -99, 242, -11, -43, -105, -364, 199, -71, 143, 294, -118, 220, -83, -153, 15, 68, -79, -5, -35, -251, 1, -105, -12, 32, 143, -118, -175, 54, 330, -49, -94, 249, -77, -42, 4, -94, 353, -105, 58, 244, -6, -4, 405, 5, -1, 71, -41, 238, 63, 61, 308, 15, 38, 66, 154, 256, -144, -134, -67, 4, -150, -38, 135, 3, 142, -156, -34, -47, -35, 106, -192, -115, -97, -84, -142, 26, 62, 233, -62]
4060f2k04L1Q6Q5m7R6R5j00lR1j04J7l10L15J4j31K06L0nJ1l51J78K1J51J41l56
4086a05N6L20n93L07Rl5R6L9L1K7j24O8j18j14J88j09j34L78j16p6K9k42L93q6
4110H9j2j05N2k21K7J96R9l46K0J76L23k10l7k31k5J52l8k25J48J35L7k2j88q4
4134b90J62Q0j89L0J54n2K54l00O6l6K6J47l4J13j58J2j81N3J45j8J58r7o1k47
4158b63L62l44J82j04m5N52k98p2J37p7J60j29j38J00k0J50J36k86m7L44k29L87
4180D58k61l96M91k26j1P9M1J36m24P2J56k41p4L05j77L1j88J36P6K52l40j17
4202b22l6J67K02k68J00k53O6M42l10j69M23k35O5j81P9K85k51j51M51k8m61M78
4224A93k84k1J77j26j4j4L9J95k43NL7O3l6J77q9J27m7j71K40j64m9M3l19M08
$$ y = [-62, -266, -235, -149, -64, -111, -15, 80, -20, -23, 68, -36, -19, -329, -14, 0, -131, 75, 105, 100, 111, -240, -62, -41, 110, 251, -105, -49, 271, -322, -15, -6, -41, 55, 94, 125, 152, 28, 96, -22, -136, 52, -57, -191, 187, 71, -5, 24, -218, 175, 89, 77, -28, 24, -197, -170, 26, 125, -221, -201, -25, 298, 88, 51, -180, -205, -53, -91, -316, -168, -33, 4, -18, -206, -290, -128, -48, -237, -207, -53, -105, 149, -151, -85, -121, -95, 52, 18, 131, -27, -15, -196, -143, 2, -16, 142, 45, -16, -263, 99, -245, -63, -167, -212, 340, 42, -30, 107, 30, 190, 61, -77, 23, 3, 153, 289, 3, -44, 300, 71, 458, 197, -199, 292, 66, 55, 134, 175, 311, -113, -41, 115, -126, -200, 105, -72, -41, -229, -93, -17, 235, -105, -222, -258, -91, 111, -157, -57, -310, -244, 198, -112, -281, 142, -93, -28, -209, -130, 155, -96, -247, 204, 176, -285, 193, -91, -112, 65, -61, -75, -89, -50, 145, -98, -93, -56, 7, -29, 148, 59, 186, 139, -32, 208, 44, -5, 38, -281, 127]
4248A27N8q9K15k65J79J4l14K83k6m13L58O4o7J21l94K0K68l62M21k45J30nJ16
4271A94k50K01k12J36L9k48L01k77l8P7k25K22J88k52K26j32q6J85m55L29P8j55
4293a54J46J84j52K6m5k24N06j28m57O65n81J62M8q1L35l43J48N3l26L48j52J45
4315A23K32j04m29L39j04L00n01k4K87j94L5J03j22K4J66r1J88l28J0J36j42L06
4337B10R4j35J14p4k67l4K02j31o0r0K42P4l91K20J7m8J40q6MK47l02J98ok06
4361f8O0P0k39J18j94J09j26L2M97k85l25J70K68j53J86o30M52K77l47J81M1k77
4383a83M48k54j00J63qj13Q8l5K23j56K8K20n00K90m16M79k78K36j45K2K19J8
4405B46k79k84M44m7n8J26j25k06L02k24Q4N9k25K51j1k19M17l40k05K11q4K26
$$ y = [127, 185, 96, 311, 46, 225, 239, -75, 208, 182, -231, 127, 191, 124, 245, -149, -129, 139, -223, 198, -47, 83, 78, 194, -56, 145, -67, 69, 108, -140, 161, -116, -154, -77, -302, -80, 108, -144, 82, -50, -136, 49, -406, -77, 1, -154, -8, 176, 24, 50, 5, -219, 287, 159, -298, 367, -214, -52, -4, -85, 250, -93, 55, 108, -218, 130, -22, 123, 355, 251, -178, 161, 57, 357, -144, -168, 119, -75, -40, 63, -59, -35, 131, 40, 228, -100, -90, 46, -96, 210, 304, 169, 283, 209, -58, -92, 110, -21, -81, -171, 71, 145, -246, -26, -9, -57, 83, -3, 1, 248, -54, 144, 138, -68, -8, 62, -177, -59, -253, -144, -270, -238, 259, -26, -351, -181, 87, -66, 120, -510, -58, 219, -128, 53, 94, -183, 265, 11, -89, 74, 66, -47, 41, 6, 229, 73, 101, 321, -179, 111, -305, 174, -104, 132, -13, 9, 228, 246, -33, -317, 127, 80, 22, 148, 23, -183, 119, -105, -21, 38, -187, 64, 53, -166, 251, -89, -294, -83, -167, 59]
4427E9j1J69k2j70m7j53J67l6K25l31k4P5j53K08j16J70J7j63L33l31N7k04K60
4450b1j10j40J96K80l57N3J42k93M56j93k2J78n2j46J15m26N06Q3j09M5O0p0M4
4473B19n4n0j22R4j2N6j31mJ63j22o3Q3J79j17j26J17O1k37O7J21j46M4N2j93
4497a21K94k38pJ72j99J99j52J79J01l96O2J01k4m4%J09R0l41O0N6k09J51K50
4520I3m57L55L2J31k29m7k1P7K0k65M19k58L54l54L00k62k5K18R4l70P4J38K8
4543D5L8Q5J22k81j68K23j1M4N4l11J65K02k84q8J16M5J78j74K44k49r4K99rj39
4567E2J20j37j00K28j3l4r6Nj51K88l73K03rj01P1k45K18j2p3K30l5O1n9K18n0
4592B06j56j38J7Kk8K34o2l51J55K91o6j46k3KK5j49K03j85lP8L48k4k82J86j76
$$ y = [59, 48, 217, 195, 25, -22, -175, -8, -44, 181, -150, -174, -99, -252, -44, -160, 10, 27, -136, 197, -134, -77, -281, -21, -131, -271, -75, 205, -152, -99, 43, -250, 206, 13, -9, 169, 117, -29, 86, -340, 166, 249, 140, 185, 245, 175, 219, 165, 115, -7, 87, 75, 131, 0, -4, 159, 37, -26, 57, 236, 119, -7, 110, 171, -66, 1, 122, -24, 20, 72, -121, 173, -65, -72, 100, -99, 100, -52, 127, 228, -168, -106, -5, -29, -73, -73, 36, 126, -215, -155, -99, -308, -157, 93, -364, -9, 23, 154, -75, -122, -143, -66, -46, -311, 108, -150, 204, -150, 150, -112, -137, 81, 175, -195, -121, 17, 45, 83, 168, 290, 9, -159, 64, 53, 97, 151, -160, 5, 207, -77, -165, -49, -4, 174, 0, 244, -5, -99, 200, 191, 52, 172, 35, -65, 163, 150, 116, 20, 25, -126, 162, -211, -8, -17, -118, -47, -292, -74, -86, -159, 71, 36, 97, 38, 256, 206, 50, -88, -71, -69, -97, 137, 75, -276, -121, 170, 104, -42, -65, -63, -38, -187, 16, -169, -172, -94, 254, 230, -52, 134, -42]
4617d2J43M8k39K87k00l6r2L55p3J01jj68j3K9K50k30j05n7J10k3J09O3m9j68
4641a%J6L0l13P6L74r8k31J87j50J49k40K66J16j92j43k6K7J91J30k32K40l56
4664a80Q9L90p73L29J86j49J77j71m1J35N2R9l2l65M16o2j57k1j22L99k63R7j24
4687i1J19J67k8k38M6N6k19R4K83n50N34K3n0j38p8J23k2M6K48j28n2k98J42P6
4711F5J5j15J07K2rj53J27p5K4k9J42o2j96L34j87J92j41k10M69m1l38nO0j60
4735a64L83l29j39J91k17J43R0j75L05j95J92j60q7K35j33r6L05j04j35n0N0k5
4757a15L03j89Nk31R5J0j72L92N4Mj42j2j09L58l46j8J70k27J96m5j53L14O6o1
4781A47K76o83l3N48k44K42j63m7L03m61K84j92j5L50k13j81M3N4L2j7j07P1K04
$$ y = [-42, 101, 149, -90, 197, -3, -39, -131, 224, 151, 252, 251, 83, 70, 99, 349, 119, 14, -43, 67, 44, 153, 216, 167, -1, -1, 15, 45, -268, -192, 182, 84, -147, 40, -110, 39, -201, 65, 181, -11, -154, -180, -153, 38, 168, -64, 176, -180, -91, 299, -474, -145, 41, -108, 69, -102, -143, -8, 44, 143, 111, -254, 162, 100, -57, -78, -200, 199, -64, 33, -91, 28, 195, 167, -71, -25, 31, -188, -94, 189, -361, 173, 196, 146, 8, -70, 53, 31, 77, 325, 197, 145, -153, -11, 65, 80, -35, 72, 94, 85, -68, 59, -16, 8, -21, 121, 59, -137, 197, 10, 202, 61, -149, 320, 279, -59, -64, -4, -164, 219, -110, -249, -58, -275, -132, -42, -217, 88, -107, 85, -75, -162, 73, -60, -156, 149, 45, -90, -140, -90, -115, 188, -1, 4, -227, -132, -122, -294, 98, 152, 156, 14, 2, -107, 251, -95, -113, 57, -170, 26, -19, -172, 142, 208, 147, 423, -260, -293, 255, 11, 253, 90, 43, 346, -115, 169, -23, -38, 312, 99, -82, -39, 15, 47, 30, -77, -6, 198]
4804A98m28M22rl16L44m71K40J83k13p5K52j82J29j08j74N73n05k8r9K87L30k19
4826A31k58k5Q5lJ67k42l8K46j84J30P3M1L8l13L72J06o28L25k25J60N1k84N33
4849B58k65K23o0j43K5k2J83m60L27J74k38J43j01Q7k74K78k2k10j22L46k6J0
4871A11J18l71N19m51R1K7p0k32M09j70K11m87K78K62l82K13p8l33K78P4j98K61
4893H0l12Q8J38j32QrR9J6K1k00N51j85j88j07j2K80j54M2p7k61K00J39p0j78
4917b23L20l91M20j06j83O6k6k7J49R7j32Ll26L50j17o2N28o53L80j06pJ66K53
4940C73m76J84l42M40J97m42J60j5r4K03k02J63k54J3K12m23L09n2M1j53K50l36
4962b44J45j58K06K23q2l33K34j25J33j50K75R4j94j02L9j83o0L83j40K9j5j13
$$ y = [198, -230, 192, 183, -133, 211, -260, -20, 163, -50, -125, 127, -55, 74, -34, -208, 365, -140, -168, -267, 20, 350, 131, -127, -152, -67, -70, 97, -145, -183, 63, -121, 9, 82, 123, 161, -152, 220, 326, -302, 23, -202, -42, 9, -275, 258, -7, 216, 156, 13, 38, 16, 199, -261, 66, 240, 2, 145, 44, 131, -143, 135, 113, -97, -219, 127, 101, 111, 229, -142, 377, -74, 17, 44, -26, -258, 151, -19, 192, -295, -17, 245, -137, 76, -2, -335, -57, 17, -181, 80, -232, -144, -6, -138, -130, -139, -40, -24, -3, -203, 348, 163, -25, -132, -144, 136, -18, 24, -53, -314, -114, 25, -45, -223, 97, -294, 126, 20, -163, -97, -123, -150, -1, 96, -36, -33, -359, -9, -126, -188, 340, -313, 67, -39, -46, 120, 373, -103, 81, -261, 179, 376, -66, 94, 79, -15, 188, -14, 149, -105, -92, 120, -303, 6, -46, -5, -158, 92, -244, -99, -257, -51, 172, 90, -243, -9, -134, -1, -151, 124, 218, 24, -78, -39, -222, -282, 101, -39, -10, -25, -138]
4984a38J96j13j22L04j03k46J34j24J77k4j3K03l99J42o6M4K30k8j43L45j76l37
5006b57N39p8l13L48r8K17j94J15l32J58j33n6J51K47m12J44J94l11J32J76j95
5027D2j04K90k51l9k1M0p1J98n5j53M1J86O2k93mP9K15k46M5L6J59k24J73l5J07
5052A77l67K82j76k1o6P3q0n0J37J75k46N7J77R0j05L3Pp8k35J40J05p2J55k40
5076a28r8O9J76o3K06j01J64k45J19j8p3o0J06j50J04l7J92l28L80M3j95J94m8
5099B09pk8N9j43p0R1j5j57P0j69O7J38k9L8l07K86j64K31j44J07Q0l19K11k20
5123a85J87l6R1o1j00K61n35K46r2J61Q7j7j29P2r8J09K27j70J36k01j49K17k2
5146aJ50k02j8J82o2R2N4j78Q7j18n2J00n6K11l63J26J17l4K6Q5j60L4o2NO9k9
$$ y = [-138, 58, -55, -177, 127, 24, -222, -88, -212, -35, -59, -72, 131, -268, -126, -192, -148, 82, 54, -89, 256, 80, -257, 282, 204, -109, 239, 141, 358, 164, 279, -53, 105, -28, -84, 67, 314, -98, 46, 240, -71, 61, 237, 42, -62, 228, -23, -62, -83, -43, -114, 84, 29, -124, -83, 103, 165, -128, -132, -53, 162, -84, -39, -3, 156, -68, 105, 70, 177, -190, 92, -84, -105, -171, -98, -178, -228, -91, 84, -162, -105, 72, 162, 57, 90, 97, 19, -216, -76, 29, -43, 112, -128, -226, -157, 19, -44, 162, 61, 225, -20, 99, 81, 8, -52, 54, -96, 8, -29, 163, -165, 215, 258, 63, 257, 209, 202, 174, 233, 90, 20, 111, 96, -61, 9, -160, -93, 45, 16, 54, -253, 33, -131, 100, -44, 63, 143, -176, 35, -185, 2, -34, 57, -4, -104, 157, -378, -132, -224, -63, 24, 7, -122, -50, -148, -39, 188, 18, 154, -47, -196, 21, -1, 149, -53, -71, 111, 49, 141, 195, 17, 104, -14, -66, 34, -22, 189, -174, -48, 69, 35, 61, 146, -14, 20, -42, -37, 32, 3]
5172Cq5P7j91L21j92q7J00K58Rk22q4N0q1K30k42J46j10M9N4j83J71j48J39j12
5196a30J24Q9j27l2J08O3k40R6K01j34P6j60j59J80n6J55n0j60J70n7O5J05j45
5219a8k38K67J8N0k20J00R0J45l50M2j27M08J8m25L54p2j06K33J23k04K90k63
5241A15j84J90l74N41k43k2j81J89j44J58o8P0j71j28K92n7K1j56J56J53N3j61
5263D9J8N8J43j71j60q5K83k02K75j54n7O4r1K70m5k74J96L0k1J79l71j54N72
5286C52n56L46l02Q4R4k7j40J33J33k57J69n5r9O1J71k9k03K0k7K32K53j41j72
5309D0p8j0r1L40l54O1L89k44p6K0P2K63k7j83l40K89J70l00o7J40P8l0K82n56
5333b12J28K82j87j06J44l63L66k43M50k54l3J82j34r0K23l64J30K10k37K89k05
$$ y = [3, -82, -5, -196, 125, -67, -154, -54, 204, 213, -9, -93, -43, -124, 106, -136, 10, -100, -51, 3, -180, -9, -157, -18, -130, -6, 83, -44, -76, 32, 95, -145, -49, 152, 18, 94, -66, -225, -45, -101, 54, 4, -156, 14, -43, 22, 127, -18, -256, 11, 29, 79, -141, -41, 49, 194, -156, -114, -241, 167, 185, -240, 114, 42, -64, 169, 292, 88, 378, 115, -69, 121, -253, 288, 45, 23, -158, 31, -113, 45, -23, 47, -124, -252, 40, -17, 4, -152, 4, 157, 210, 49, 67, 125, 268, 97, -63, -148, 135, -67, 208, 54, -3, 61, -30, 240, 195, -79, 117, 147, 126, 305, -66, -220, 352, -204, 142, -160, -76, 18, -9, -149, -16, 117, -140, 29, -26, -125, -64, 107, 78, -125, -105, -132, 100, 353, 212, 40, -38, -48, -139, 201, -153, -92, 297, 53, -23, -3, 69, 332, 305, 122, -218, 71, 241, -59, -126, 14, 92, 62, 344, -212, -84, 198, 11, -95, 49, -314, 52, -191, 259, 5, -28, 154, 20, -70, 153, -211, -81, 129, -108, 181, -24]
5354b4k99M37j0k81L63k00J02j89P9J97j86M1J3O1j18R7j57P5N8m4K01k16Q0J8
5378I8q2K3N0Pl0j05j4L7M5J11J08k53R4l9L0L0p0J3N6l56L53j13K19k8j81Q2
5404H5j26L30j78Pm45L12J95p0m1M2jn5l6k40R0n2K40j88j21K15k1p5q2R6J13
5429fJ29k15r9m9K67j86N4J17j38J14r8J83j01L16l86J12r2K01j80j79M1J32R3
5452C0j56J57q7J1p5k2k6l3l2K5K54Q4j68j93O12j60j34m6k53J24r0K76o6J52
5476A84j26j31k8J09K95j58j08J27j12j07K00k18J10P3k09K06j75m2K57j05M0
5497H2Jk29J12j49K28L0k72K16O4k41M2M1j65L36j13k14K61j54J9Q8j44K50j44
5520e5j10J01p0%K75j8Q9k17q7J84k63K46j17R7q3j09j06M82j86j14K8k0q4K87
$$ y = [-24, -323, 114, 104, -177, 186, -14, 88, -101, -22, 175, -11, 30, 43, 104, -14, 83, -74, 1, 59, 15, 216, 0, 80, 98, 16, 39, 89, 96, 66, -39, -53, -16, 29, 140, 248, -5, 89, 50, 80, 110, 40, 53, 109, -247, 106, -7, 212, 184, 3, 85, -41, 289, 111, 118, -327, -15, 180, 110, 69, 111, 110, 55, 19, -221, -131, -183, 57, -131, -252, -37, -58, -133, -215, -119, -6, 123, -92, -191, -240, 27, -159, -105, 12, -126, -12, -110, 73, -28, 288, -98, 14, -78, 123, -57, -236, -195, -63, 30, -126, 31, -56, -45, -120, -142, -168, -201, -233, -208, 46, 130, -38, -231, 381, 221, 87, 41, -212, -88, -178, 98, 32, 184, 58, -73, -101, 8, 303, 145, 37, 164, 52, -55, 145, -73, 37, 110, -99, 107, -68, -110, 147, 42, 82, 83, -146, -34, -183, 45, 75, -197, 19, 83, -158, -116, -75, -240, 96, -17, -231, 30, -124, -105, -17, -161, 89, -55, -165, -64, -134, -134, 141, 123, 212, -5, -92, 92, -171, 75, -42, 55, -28, -137, -243, 239, 53, -61, -33, -53, -137, 150]
5544A50l63K38k9j46R2j6k76M61J7m7np2O5k4L1o9n4P3m6p8K27j95J90k29K80
5569A75l39o7J20J24J59J40l53J83j98L25J6k02J45k5l19O7N1J83j95j15J5r1
5591b01M24l52p5J80j56L47j45jj35p9L69p6j00j92K09r6L03j53j04L4J72j61
5613A2m4L91m37r4L32lq6j48L21l86L22j6l57L41k27J51k78j0J42J29Q4k33L0
5636f4L25j38j55m9K9K0K44mm84L11R1J99m79O9p3q8M76j34N1m01K76L0q9J52
5660A15j56J4J85k90J76j77j4J35l8K87k44o3L7n4j9n2J75k9J89l74J77j31J91
5683D0J24j14J5J48j79J87k35L0m1j9L9o4O4L8J53jk25M4k6J51l35J93J76r9K0
5708H4M1m1o6j7J3m9j51P1M66l29J11L7p5N4m21K68R3K49l01j71L2J73p7o9p0
$$ y = [150, -213, 25, -4, -150, -58, -74, -350, 111, 128, 81, 76, 4, 69, 45, 76, 7, -47, 26, -20, -98, 129, -66, 124, -105, 175, -164, -231, -111, 13, 172, 312, -41, 142, -56, 269, 285, 83, 228, 203, -116, -49, 2, 185, -10, -125, -110, -201, 223, -129, -204, -24, -180, 167, 22, 21, -114, -193, 176, 100, 0, -192, 17, -79, 224, 71, -33, 1, 173, 12, -32, 359, -78, -172, 160, 157, 71, -77, 244, -142, 180, 164, -193, 148, -79, 72, -206, -216, -74, 55, 139, -94, -64, 261, 123, -32, -81, -52, -32, 212, 208, -276, 35, 126, 325, -154, -85, -158, -246, 230, 96, 147, -254, 22, 52, -37, 115, -41, -27, 158, -132, 44, -133, -147, -12, -50, 237, -7, -70, -33, -87, -106, -158, 17, -12, 177, -197, -20, -151, 40, 164, 50, 65, 213, 34, 221, -14, 16, -25, -44, -5, -69, -5, 33, 186, 185, -40, 4, -22, 129, -206, -13, 163, 64, 84, 125, 84, 18, 1, 14, -35, -186, -115, 351, 22, 133, 170, 95, 149, -272, -4, 89, 338, 37, -134, -102, 71, -6, -75, -145]
5733a45L6j1k8K62K0l9l47L13k5Rk77M0L31j42L9K99l94K26j33j78K81k65K01
5756G3L16o18K86R9l5M4j70j36K13j64P9J78j32j59K43J32K4j04j50N1M7p7J30
5779A70j29n1l3K9J89q7k1J65O2n14J22k20L86p2J18J67m61QP9O7J33J82l88k
5803a01r1R0K95m31K22j81k7J07J24Oj03o7J76J21l53K66k16K01K78m70L8K23
5825A07k34j34L10k0j01J99k12J90j54J61j48M4N7k66K64J0P4k72j03K18J62J69
5847C21k81Q8r3j48K22m9j10P4KK8O2p4J53j77j00%K19P5j29k13J55l31J65J51
5871A0l63P13k33l16L92l03R8N7k86J48m7K16L6j26k86L50l52J16K04j48J97m33
5893c56K27J26M5j32K30j64J87j37m09L18k8j38L80J6k17J45q1L3Pq3K88k40j7
$$ y = [-145, -109, -120, -148, 114, 134, 95, -252, 61, 36, 45, -232, -192, 139, -3, 36, 335, -59, 167, 34, -144, 137, -128, 73, 389, -229, 57, 156, 121, 165, -5, -141, 72, -92, -13, 165, 33, -126, 117, 249, 273, 169, 19, 70, 117, 40, 170, 41, -10, -43, -14, 175, 88, 67, 232, 294, -220, -98, -318, 68, -4, 114, 281, -180, -172, -93, -26, 107, 289, -99, -101, -192, -102, 193, -238, -16, -197, -224, -117, 7, 13, -90, -157, 19, 140, -213, 53, -163, 38, 316, -154, -116, 107, -127, -261, 49, 29, -72, 127, -85, 105, -49, 112, -36, 8, 65, -201, 63, 73, 147, -125, -228, -10, 152, 321, 40, 128, 35, -113, 109, 60, -50, 24, 26, 54, 116, 42, 195, 18, -82, -82, 137, 212, 83, -130, 25, -306, -141, 10, -353, 360, 127, -189, 203, -100, -2, 55, -231, -83, -130, 86, 122, -4, -290, 60, -292, -176, 28, -120, 77, -356, -129, -3, 42, -90, 140, -24, 163, 26, -383, -65, -93, -231, 149, 165, -52, 93, 12, 45, 52, -31, 257, 17, 0]
5916@J91L9l08K93j38o6j4j76N84m31K52n6k26J86o2J93j78j12J34p1q8r1K81
5939A36k20J85j48K59q9k81M17l69N3lL3L05l36N6nn3o3l5L70l33J51j45J05J1
5963An5n4K29k3k66r2J78L87k59j93J49l0K09M6j42J5n8j28J28P9k34L7J96p0
5987E0J5p7J0r2J98j39n0J43k40K60O9L1m0j10K22j15j9r2p6Nr2J87l1j02k5l8
6013a48J53Ok71J23J73L01l64J09j76K55k14r3K55j31J06l1j12J4l27L28J09j08
6035d3J07K8l6j70K50m2q9j03O6l23K94J23k2n7J10Q6k64j47O0J41j34L0K18j17
6059c4K57k78R9j06K4LK46o5k21J19J34l07l2J50K00P7k18N2k64k9J30O8K30j09
6083A26P6j93J46k10J37J45j58j68J53Kj7k20M18m65J40K88p5j91K95m28L21j55
$$ y = [0, 191, 230, -78, 215, 77, 11, -3, -179, 405, -26, 226, 170, -56, 130, 68, 261, 83, -29, 105, 34, -54, -145, 136, -84, 101, -47, 212, 123, -158, 259, -110, -57, -60, -27, 278, -58, -2, -7, -60, -123, -158, 212, -121, 30, -115, -10, 1, -54, -108, 121, 98, -168, -260, -82, 305, 46, -147, 2, -28, 181, 227, 85, 100, 42, -86, 42, 121, -113, -76, 120, 50, 65, -12, -2, -94, 104, -35, -85, 58, -182, 78, 147, 178, 138, 28, 250, 135, 116, 24, -52, -47, -139, 48, 17, -85, -110, -148, 5, 11, -260, -137, 36, 337, -27, 82, -94, 161, -53, -146, 109, -22, 84, 53, -59, -45, -372, -44, 65, -43, 64, 92, 56, -114, 136, 94, 5, -98, -32, -355, -61, 62, 40, -17, 93, 179, -85, -232, -172, -31, -165, -135, 83, -34, 223, -55, 44, -62, -38, -35, 211, 146, -75, 44, 178, -129, -161, -11, 189, 266, 48, 100, -164, -193, -63, 5, 235, 126, 202, 9, 155, -55, 82, 227, 69, -99, 54, 56, 39, -181, 237, -228, -88, 200, 125, -66, 229, -199, 122, -33]
6105c3j03J84mK45l37M8l8m0N9M2O2j44K35m64K10J40j11n8K88n50K07J13o4J79
6129F6l04J91j53L40kn2N2k3o4o0k59m9M01p3o7J74k17K15n3M1j08J25k06q2K56
6154H9P7N6N0k22P9j79J56j08J41l0J45j40j1l65J70L32j14j80J2L28j43j19L18
6177C42l10R0j00k68L54j81oK34k38L13m31J85j20Q7K01J1j68J3N8n2J15k31j86
6200b88M19m96L00J25l93J75K35N0l88M9r6P65m49J08m67M51J73m80J13l00L69
6221b5m03Q27n83K70K35r91P78L16N6M88j282R69m24j020J085q3K56m11j81J28
6241EO16n80j42m4K70R0l47L61o39M44q4j15r7J97j31P6L31l1j49M01l96K26o25
6264c63O01m84j07L87J01n64L90L31k03L45o25J1L74N7l64K51j00L08r4j70N4
$$ y = [-33, -136, 48, 44, 289, -48, 0, -38, -78, -19, 23, 85, -59, 176, -288, -78, 62, -49, -107, 181, -369, -162, -49, -113, 66, -238, -47, -200, 140, 138, 86, 138, 115, 51, -9, -268, -317, 84, 11, -56, 118, -99, 116, 63, 104, -4, 121, -85, -167, 89, 166, 222, 272, 50, 129, -50, 106, -2, 139, 109, 254, 114, 103, -262, -92, 240, 126, -54, -42, 286, 143, 24, 342, 32, 122, 22, -246, 108, -73, -79, 155, -83, 230, -201, -16, -136, -49, 152, 163, -5, 8, 66, 14, 129, -102, -288, 131, -365, -65, 60, -333, -158, 77, 127, -261, -212, -308, 457, 8, 116, -351, 100, 273, -207, -94, -394, -25, -428, 399, -184, 86, 321, -670, 108, 424, 480, 968, -314, 655, 231, -789, 296, 213, 469, 58, -123, 5, 621, 41, -101, -145, 125, 215, -132, 229, -410, 34, -50, -165, -262, -65, -196, -120, 211, 180, 31, 432, 36, 262, -363, 238, -246, -353, 34, 135, -429, -39, 292, 89, 434, -191, -180, 194, 251, -113, 138, 38, 346, 252, 82, 136]
6285A36m36O64k61J26k93KM5m30K58k4J94l74P72N1o64K14j66rK66j98L1L01m47
6308b42M89p0J26Q9m48K5j53K37R6k1k46n7L55j13q3j5K6K38l50K28j13o4J24
6331E8M4j06L6j55J01K15n51N74l77o3K66J29j85j9R0N7k55k00N57l06P5j64m5
6354b24J70J80j89q9k07L77L6j88J78j59m4J47J23k08L36j58r9K79j78J14k02
6375eJ71K44j69l95J02j16P3J51k12K74k02Q7Q2k39J49J35j81j9K57r9j04K60
6397B44j21L9L0j33n8m4J97j23o0q5P6J86j60n5p4J36j54o3P0J36q7j20J04K44
6421A25o21M71r5n6j2j34J47J96J12l50J42M5O2k56J32L92k99K49r2r9o4l7M0
6444bj61K8N5k67K80L0K87m35K79j58N1kO6l7j29K40l02M23l39M31m99L95k85
$$ y = [136, -300, 364, 103, 229, -64, -62, -17, -447, -189, -213, -19, -393, 379, 430, -234, -20, -186, -195, 71, -127, -96, 205, -242, 247, 177, 303, 392, -56, -31, -184, 53, 149, 128, -118, -175, 180, 67, -16, -31, -5, 233, -117, 111, -2, -66, 58, 102, -4, 32, -123, -22, 193, -358, 216, -161, -224, 42, 171, -14, -33, 57, 114, -141, -341, 216, -90, -15, -179, -224, -54, 126, -63, -152, -359, 18, 54, -134, 44, -115, -159, -12, 111, -97, 239, 81, -18, 261, 83, 197, -5, 166, 410, 241, -154, -52, -168, -95, 56, -156, 118, -84, 3, 85, -154, -5, 130, -51, -70, 187, 88, -16, 244, 123, 162, 192, 59, 1, -43, 154, 31, -29, -114, -38, 148, -12, -67, -141, -5, -159, -222, -152, -16, -103, -223, -119, 125, -496, -25, -120, -176, -188, -322, -175, 21, 133, -217, -75, -30, 32, -224, -92, 300, 1, 250, 158, 59, -5, -42, -2, -163, -135, -80, -347, -67, -37, 250, -185, 94, -64, -13, -15, 51, 14, -115, 125, -177, 246, -93, 338, -161, 234, -51]
6467e1K11j70Q6j54J63j81J82j51K9k1L5k2j94N00k14P7k39L0J1J33j08j89K12
6490b5j98MJ46o8J49j47K23k53n8J11J21j41p6L54l68J66j1J40q5K0l18L37kj46
6514a25J78K1O8J0l43M2K13l0O4j13j27K00N5k44M2J15j26O1J54j63L3O7N2m2
6538F2O7p8Q6j00j10R3q0J96l5p8j82%J3J32r3N4q4L30l29J41R2p9m23K99J12
6563FJ03j36J6j30K09jl1m06L12j22K97L1j74JK1m5J09ll8j9P0j23r8L0J71%j00
6590e0j0J09j35J43k49L0K36k57NK76j83o4K25k27J93k31K34j63J92j94K14j33
6612c9K41n9j98J24O5k6k74K57j07n3K57j27m9J33l93J29J56n3o5J82l21J77l7
6635h0Q8j76R8l3J10p0j70L74l05R1j19K21k15j62M2LJ08J25K7j18L39j26M2O9
$$ y = [-51, 160, -10, 76, -78, 85, -96, 86, -65, -36, -57, -22, -44, -238, 262, 48, 125, -114, -84, -73, 60, -48, -237, -25, -223, -219, -73, -141, 8, -139, 84, -169, -227, -116, 5, -136, -212, 142, -226, -60, -71, 69, -16, 4, -314, 23, 21, -125, 53, 74, 142, 152, -191, -149, 64, 34, 98, -15, -142, 58, 113, -131, -89, 26, -100, -39, 115, -48, -15, 52, 104, 62, 129, 51, 137, 37, -73, 20, -60, 136, 101, 23, -159, -159, -146, -14, -107, -53, -137, 193, -136, 5, 97, 18, -405, -106, 6, 109, -27, -11, -141, 68, 67, 36, -370, -58, -180, 117, 148, -26, -25, -4, -49, 60, 57, 19, 0, 70, -53, -151, -121, 50, 50, -50, -60, 49, -86, 57, -192, -162, 74, -183, -178, 98, -85, -149, 76, -151, 42, -189, 45, -118, 74, -120, 94, -39, 202, 143, -55, 69, 134, 108, -166, 91, -16, -69, 188, 61, 12, 145, -248, -119, 37, -16, -81, 101, -220, -43, -80, 8, -168, -70, -103, 7, -63, -233, 141, -164, -73, -192, 29, -186, -348, -306, -303, -195, -70, -43, -161, 178, 52, 94, 163]
6659A63k37j46L30k96K61j08K26j02K02l29K2KR3Mj60o9J37K6Q6j63J20o0J94
6682A96p2j43j8K4o5J91j88k70M72m7N4l34K55J27j76j0N1j52J12J64k23O4r8
6705h6m2O5J25Mr2p8r0K58l00L08q6j97J71o0M5j00K77P2j93r5M0R8j04J22l4
6730B8j27J3L77l51J58k93j12M61nj40j09j71J51J82m7Q6k50oJ13J3m66J88K70
6753c7j07o1J24K5K41j73q50R16j99K24J18j98k6P56q74L74j75q31J312j261P40
6774C8l18l08P43r8n37L16O76o72L97J05k87J68l90J47l47j6P34J73j011J58N13
6795A84k23M37L45l44j234L96J78p35J290k25l10o05J012l53J08m31O69L32j34
6814C57m49j92J18O54j395P67O61l06p4l30l1M8q2K26N7l6p01L03P3J67O87m83
$$ y = [163, -74, -220, 110, -186, 75, -33, 193, 91, 293, -36, -14, -12, 81, 85, -75, -144, -7, 19, 105, -58, 62, 2, 196, 124, -19, -37, -13, -78, 113, -75, -345, 127, 80, 134, -200, 55, 182, 6, -4, 47, -105, 7, 171, -52, 12, -86, -128, -63, 62, 66, -26, -104, -194, 64, -236, 72, -14, -211, -40, -100, -55, -155, 122, 194, 1, -94, -54, 44, -60, 62, 28, -99, -86, 291, -60, 98, -195, -307, 154, 149, 9, -100, -271, -120, 62, 15, 101, -149, -155, -42, -29, -495, -307, -37, -144, -205, -81, -56, 185, 12, -838, 78, -121, 103, 221, 23, -3, 753, -121, 253, 78, -753, 559, -702, 38, -280, -588, 155, 57, -480, -164, 512, -160, 237, 342, 55, 223, -167, -20, -367, -383, 351, 524, -487, -329, 184, -39, 398, 743, 399, -835, -439, -261, -996, 294, 69, -241, -846, 166, -187, -79, -510, 159, 491, 357, -92, -284, -166, 488, -907, -140, 521, 215, 141, -189, -220, -172, -254, -28, 29, -7, -708, -405, -332, -165, 522, 39]
6836C9o44J80O32m45J58J041l35n86K07j034Q31N06o53L48l23l3N92o68N65q04
6856d26L48R5m78J97km3Q22p44K01j14J12j60M37q70Q04q0O0n19O93m80j56k12
6878e15J92K70j90L21l92M50l59k52Q74m48r83N25M21K78O78j221l45Q09j18K61
6898B56n66M21j63M90o58j10O0P27n94L95k18K71p75Q31R6m40l87j0M47m32O54
6919B95o53l79J066l73P54j363O10L58N9l10l11J81l8L33l73N26n48L02k89M00
6939B47j330O81N40K02o63K99N22j198J89N33J74k65l91L87L83o96J99P68m67
6958A14p9k83K71m3o4j93k12K23j79J058m52n45K35L99l75N21j10j87m85M04o41
6979f23K51J067j073Q25n82k35N45o34R38m99M94l04m13J14l88M90R2N16p00p64
$$ y = [39, -605, -425, 207, -238, -80, 961, 626, 40, 247, -787, 44, 550, -103, 245, -78, -111, 481, -187, 378, -426, -78, 17, -461, -264, -266, -309, 513, -231, -30, -144, -32, -192, 245, -625, 179, 99, 159, -360, 333, -147, -303, -515, -323, -53, -243, 78, -314, 136, -223, -475, 399, -49, -1032, -507, -86, 192, 870, -351, -696, 113, -5, 256, -310, 111, -52, 438, -220, -330, -270, 457, -137, 258, 40, 311, -464, 367, 463, 23, -364, -374, 73, -359, 295, -358, -737, 329, -44, 710, -653, -43, 315, 374, 64, -247, -66, -104, 229, -144, 382, -166, 136, -153, 247, -1083, -402, 138, 340, -323, -24, 498, -700, -511, 22, 196, -69, -460, -73, 310, -386, -187, 581, 114, 35, -248, 23, -20, -84, -277, -489, -266, -445, 613, 161, -384, -149, 250, -125, 396, 286, 99, -386, 18, -623, -372, 695, -378, 447, -135, -370, 175, -459, 479, -20, 474, 170, -243, -129, -517, -27, 65, 581, -119, -883]
6999h83Q67l12P67j88p42p45J232k31K92l67j88L76p78J288n92J55K9R5M41j14
7019D02O7k70K71o93L23L54l08r01Q24j99o03j96R19n84Q97m44l00Q7P49k49p1
7040G5p58O23M18m31o81K87J17N03K0m87l15M36P13k80l25L31n33M14k62M57l35
7061a3k35M64m83P76p23M59p85O90m98N90m34O17q74P67ql23J20r0l0pM16o13
7083b17l58M66j07M05l73M40n18J94J43k93J76l86P47o23N43j44l40K26p7m24
7103e20J62j58Q08n50l57K19Q34l93r9m46L42M86o17N09n92L37J15j03J11o7j3
7124HP6M78n98k75j34L96p3o5J66M7L0Rk02J5n0K1J35L79l90K95l43o0J03J31
7148I9j9l8r0J34m1l74N26p5J28m06K90m4l7J9J4k33K27r9J10l7k12pK18k68K33
$$ y = [-883, -16, -328, 439, 251, -491, -1236, -4, -235, 57, -310, -498, -122, -900, 388, -204, -49, -20, 75, 516, 402, 469, 199, 470, -223, 100, 454, 146, -755, 69, -130, -733, -929, -10, -594, 303, -141, -441, -354, 395, 146, 75, -683, -60, 358, -73, -754, -467, -350, 153, 173, -314, -629, -193, 520, 240, -85, 246, -287, 127, -135, 322, -13, -248, 216, -267, 509, -214, 245, -540, 150, -348, 242, -192, 425, -449, 318, 310, -13, 107, 17, -13, -20, 396, -217, -575, -109, -216, 189, -184, 256, -262, -68, 75, -218, -42, -428, 319, -304, 239, 95, -245, -19, -96, -520, -358, -516, 292, -258, -615, -396, 438, 45, -54, -500, -158, 328, -289, 220, -372, -35, 80, -23, 88, 21, 8, 84, 562, -36, -311, -445, -49, -122, -187, -21, 26, 56, 65, -137, -122, -172, -151, -16, 363, -27, 268, -75, -135, -32, 99, 80, 42, -48, 86, 45, -329, 197, 122, 250, -156, 134, 90, 53, 72, 86, -147, 80, -19, 91, 54, -158, -165, 53, -215, 18]
7173A8J40m01Q5J92q2o0l9J21k9P4J68m99K89j20j15J40N8k96M33l7j95J40P5
7196F0j10j04L13j79J4K2K21q8j03p9n1K02Qq3K57j22j77J04r4pJ09r4K43k35
7220B7j95K09n2q4J13P0j81J54K3j85J89K06Qm40J37J3k04M49j19l31L17j3k16
7243a05K76j63N6M0j10L2J15K8r8j51L0Jn2J93p3P1k09O3J44k9j84L7m2J03k19
7268b46J62LO1q3P6j17m0L51k3l19J06J20l10J87M2j21M67m16K48q1j34k3K6J26
7292F2QJ62j45P1N1k07PL35l14M1j01j56M42j91om55P17k25l6K0k13J32j54K56
7316A01k0j05m54O52j07N0k93j65O74m25K94j53k73K39n41O15j4k63j4k43O13
7337A68M7j51K03m80K97o7r1K9L3L1K16L3P4j46m69L98k7P3L39o10L77l88M20
$$ y = [18, 158, -243, -158, 34, -48, -108, -147, -26, -55, 19, 187, -312, -23, -143, -258, -118, -60, -356, 77, 40, -155, -15, 60, -50, -154, 159, -20, -6, 16, 237, 149, 46, -33, -84, 118, 126, 43, 300, 178, 1, 105, 11, 4, 113, 19, 262, 27, -168, 41, -11, -95, 18, 88, -93, 61, 84, -101, 88, 294, 302, -138, -1, 12, -192, 257, 138, -193, 124, 111, -105, 171, 8, 64, 104, -6, 26, 141, 169, 71, -80, -50, -49, -101, 92, 19, 90, -119, -56, 88, 59, -125, -88, -130, -27, -246, -84, -81, -20, -103, -27, -144, -184, 167, 144, -175, -69, 51, -259, -72, -30, -151, 316, -100, 148, 67, -67, -90, -64, 62, 70, 232, 87, 158, 209, 2, 9, 344, 30, 71, -30, -186, 256, 65, 59, -396, 321, 96, 60, 80, -133, -1, -155, 101, 81, -24, -478, 174, 67, 117, -176, -341, 333, -92, 202, 49, -224, 15, -526, 89, 75, -188, -202, -445, 168, 215, 64, 267, -213, 84, 17, -74, -45, -12, 19, 235, 268, 342, 196, -273, 125, 98, 171, 510, -100, 277, -111, 309]
7360C09p01J131q65m47N57Q3m08O95n3o61P16q2j49n32k66N36j86N62K55j69m41
7381a16J82l05L23M58q25O71j21n60N14O4k26J69l40j003J243J5j1l94R27n88
7401G7M24l82N04j67l47j57N38j026M40M66m86L65m94j57j49N29K28j83p2k07
7421b56o56Q09N16p42K09L0L65o07L59O0k18Q01n70J38o11o1P38J81o64J2N13
7442C46J0j26n3j5r7k41Q5O2J46m9j86J94L5j21j40O4k00K93N5L36m58n3K4K00
7466A11j22K11k0k53j0J26J20R5r5l06o5J29L6j6M2j78K96k23J95j64K14o4j08
7489d9Q5j60K96j16P8j20L4j54k3L47l3j89j81J60p0J25j35P1r8r5J50K63k48
7512f2j80L56k87l8K22J48j51o3P5K6J32l09J51P1J34k85J27p3K48n63M05j90
$$ y = [309, -392, 739, -126, -573, -16, 67, -341, 354, 301, -360, 356, 274, 125, -407, -673, -137, -323, 239, 494, 325, -116, 66, -239, 84, 542, -283, 388, 267, -293, 221, 285, 59, 228, -112, -1115, 128, 143, 132, -262, 665, 77, 501, 119, 623, 456, 109, -48, 490, -536, -96, 370, -116, 249, -245, -402, -551, -22, 206, 23, -49, -256, -912, -103, 413, -329, -120, -90, 275, -332, 27, 87, -131, 670, 100, 238, -373, -434, 304, 485, -179, -167, 346, 356, 230, 177, 162, 65, -176, -91, -29, 117, 68, -118, 76, 111, -10, -150, -86, -286, 7, 62, 398, -60, -113, -89, 111, -11, 200, 180, -73, -83, 43, 163, 258, 163, -143, -208, -79, -43, -59, -17, -195, 101, -122, 73, -91, 123, 59, -49, 36, -124, 172, 56, 134, 14, 48, -106, -129, 218, 185, -4, -185, -25, -95, 30, -105, -34, -132, -227, -77, 186, -62, -242, 114, -173, -211, 11, 159, 8, -55, 20, 46, 178, -131, 20, 91, 225, -60, 67, -6, 242, -321, 84, -106]
7534a06P3K45k13L5k9J46K6m9k42k2L40J21n55K16KJ4q3K13p5O9M3l69J32J88
7558A20p8K7k47J88J8j44J87P7k53K24K5J6k40j08J64K66l88J88j1J48L8l33J46
7581C0K24k76L25m64L0J08j71J69J16k14J15N8J24j62j65K48j5j70N2J08j00J20
7603I0l1k11J77l3N7k1J82r5k12L3j2J01k60n9M81j45j70K55m5p3n1L2o8K2Q9
7628C3j37K32m6j60M8j5K8l6k4K33j47O0k04N2j14J96j19m2J71j6J49l07J45N8
7652C8K41l05K03j77q9J55r1L5n3O8j71N12l31mo6J55n6L2k08J7J19P9j16J06
7676I3L64m09J57m19Q5k20K37J14k18J94Q2p8J62l62K47j85J39R1j01P4k80K73
7698D0q0j37K75l04K19o2K0j16K55j76n7L36k29q5J7L17q0k20K5k0M3j57j0J08
$$ y = [-106, -33, 212, -1, 34, 5, 151, 177, 128, -114, -136, 204, 325, -230, -14, -12, 2, -81, 132, 57, 126, 169, -200, -68, 120, 42, 69, -178, 10, 28, -116, 71, 148, -105, 119, 144, 160, -80, -188, -24, 242, -146, 42, 31, 179, 217, -116, 30, 254, -22, 303, -161, -131, -23, -194, -25, 91, -123, -8, 50, 174, 12, -153, 95, 80, -90, -38, 70, -30, 90, 59, -152, 25, -8, 49, 28, 210, 115, -97, -64, -76, 25, -235, -294, 187, 42, -128, 127, 82, 9, -42, -10, -78, -56, 33, -104, 128, 82, -78, -30, -45, -17, -53, -77, 156, 9, 69, -135, -83, -197, -1, -120, -162, 9, -7, 142, -165, -20, 38, 279, -26, 177, 0, -89, 66, -25, 10, -43, 25, -146, 366, 35, 31, -35, 120, 64, 96, -112, -95, 24, 103, -13, 93, 457, 48, 205, -214, -129, -349, -112, 2, -216, -22, 60, -18, 144, -218, 29, -156, -17, 74, -27, 47, -233, 40, -40, -177, 98, -206, 13, -49, -29, -145, 110, -66, -123, 213, -16, -101, -84, 233, 153, -67, -42, -62, -19, -176, -186, -78]
7722g8J46j49MK22o6k5k86K20J30j73K02j92J13J82k11k1M9k06mL11j52j12J84
7745H8p4n3J46l6n9r9O5N6J6L1k79K04J90j31j57J78J3j13j02M00l04k58M51j08
7769F5k12P3r7J2L06k98J84rpj09J68k5k77K62j53K02k25J03J27k57J37K20k22
7792c2k10L49k96L88j55J16p4j5q5j27J37n2P2j31L59k28J03j61o6L12j40j84
7814a20J46k55K9L09k32K08k36q1J41RR7J7Q2k4k53K12n9K2oR8j28L00k81p9P8
7839fj39j5O4L00k85J00J0K5N9k87J99J12O9j79l3R9k44J95j19q1L52j83j38M7
7863g8J64l03L67l2l63K21J61j19J04l08L00j56P5J87n12L18q5P0k5K0k8J48l37
7886b11l0L06j56J72o5J9K4J55k76j33K07q2m2Q0J6J41j62J98j32j54J8J63N2
$$ y = [-78, 68, -81, -77, 145, 79, 54, -232, -12, 118, -55, 147, -45, 68, 250, 39, 18, 67, -139, -143, 168, 16, -96, 88, 14, -39, 107, 71, 12, -87, -22, 34, 50, 81, -198, 6, 196, 65, -92, 86, 99, -14, -116, 284, -20, -278, 173, 65, -147, -74, -171, -159, 147, -151, 33, 24, 17, -92, 76, 51, -226, 36, -117, 85, -140, -37, 90, -167, -30, 190, -32, -242, 107, -189, 199, 44, 160, 86, 71, -14, -141, -4, -56, 16, -115, 244, 16, 119, -42, -108, 204, 64, -120, 26, -229, -200, 109, -123, 85, -151, -232, -91, -82, 15, 32, 114, 90, -163, 49, -10, 12, 6, 104, -24, 276, -5, -84, -6, -145, -160, -96, 204, -81, 19, 29, 54, 113, -174, 25, 137, 206, 27, -6, 93, -151, 44, -75, -156, 196, 13, -125, -78, 86, -217, 150, 118, -245, -24, 137, 18, 122, -186, 114, -42, 33, 220, -292, 26, -59, 11, -14, 6, -22, 126, -211, -241, 65, -91, 81, 16, 35, 59, 214, -62, -195, 12, -70, -112, -32, -16, 125, -37, 161, 29, -125, -107, 56, 108]
7909A08K02l59o4J51k36Q1k7J39M8k4k2m9k4o7J67k82M37j99j15N3K2J32q2K1
7933A1j10j02J96k02K26k24L80k27J71k3J69k10k26J53J04QM4j87l8J29m8J90
7955A84mk59r9R4M1J19Q1j77j46J21J75j71m1J71j57J99q0j89K7J51K4m3o6J57
7979A12J28k82j8J29j3j6J15k75q9J60n0J13j18L0O2J26j67j71K49P3K8j88J21
8002E9k25K12m3J7r4K17j86P6k97L29j3j06j05j21N3K12P0n7j01J10k6j00J17
8025bJ39l79K15j69J18M1r6J5J93J3J01k71J58k90oJ70L1j43p1L52l1j1L4k20
8049a09K86j28J94j95J23l63M91r7j05O7k54J42j0j07K51j56m6J50j40j22K02
8070G4k54K75k22Q9J67k19k3M1J68j88k13J98M21k53j84N9r6L22j87j9J14j81
$$ y = [108, 310, -49, -113, 38, -198, -117, -144, -5, 43, 19, -3, -52, -76, -143, 24, -258, 179, -20, -135, -82, -60, 72, -10, 11, -99, -201, -5, -207, 19, -205, 175, -52, 119, 96, 265, 55, -171, -18, 86, 94, 138, -49, -87, 42, -6, 184, 180, -79, -178, -84, -43, 76, 157, -20, -166, -45, 130, -41, -82, 89, -68, 131, 51, -138, -111, 40, 64, 21, -45, 112, 240, -42, -60, 69, 56, 40, 155, -120, -209, -49, -99, 14, -104, -74, -12, 114, -53, -224, 25, 98, 126, -62, 59, -166, 46, 3, 20, -74, 143, -43, 33, -264, 65, 52, -54, -159, -280, -227, -15, 55, -2, -103, 7, -19, -119, -2, 137, -242, -27, -196, -78, -37, -133, -118, 75, 88, 189, -82, 76, -214, -220, -50, -19, -162, -233, 119, 88, 77, 111, -109, 177, 49, 243, 48, 171, -192, 299, 202, 97, 164, -90, 52, 42, -65, 186, 30, -16, 134, -6, -128, 74, -180, 95, -127, -38, 129, -90, -113, -72, 96, -92, -305, -107, 314, 61, -123, -64, -160, 162, -25, -44, 70, -111]
8092a11PK43m1k04L59l52J78Qj52K46J6j75M5k40K9N4m1J17k3l0K83J35k72r7
8116a8L1J07k25J73j36o3J87j69O5L97l8l44J08j60J64k13J35K7J38m15L49M7
8138A47j38k6Q6N4k93J64J17J27n00J58l3J4k23M50P7j13k24J36J0p4L3k23J91
8161h3J66Jj45K73n26J07L52m42O12l61l49L67J40r1l7l7j24L03j57J57k19J9
8183g4k17M39j35j1m1K89k19j7
$$ y = [-111, -104, 139, 98, -106, 253, -99, 79, 87, -65, 181, 197, 22, 67, -173, -144, -90, -131, -14, -37, -67, 216, 351, 79, -18, 13, 120, -105, 68, -68, -131, 56, -113, -48, 349, 311, -33, 75, -85, 79, -134, 1, 28, 166, -249, 100, 147, 9, -17, 69, 123, -170, -6, 111, 238, -262, -104, -137, -123, -346, 104, 181, 68, -156, -20, -10, -84, -51, -274, -83, 83, 84, -61, 212, -314, -207, 145, -297, 315, -46, -395, -28, 112, 21, -16, -53, -177, 126, -31, 126, -93, -74, -291, 148, 13, 2, -39, 250, 31, 14]
8191A4
$$ Imaginary data points
##PAGE= N=2
##DATA TABLE= (X++(I..I)), XYDATA
0@%%%%%%%Lj1J6j6K2l0M0n6P2q8J08j32J64k04K47k93L45m07M79n62O55p56Q69
30D65j000J146j306J483j680J899k141K404k693L012l360L740m157M612n108N650
46B966o241O889p597Q370r218J0153j1185J2328j3599J5019j6619J8434k0516
59a0816K2931k5766K9152l3280L8446m5120N4115o6970Q7028j23894K97099r66914
71g43989P02064Q44378j572661Q66578N36136j291292O70294N84550j167400O13648
81D2306M09668r79760N44774N12264j012883L83453N58796q26124K74369N10991
91D17854p58488K31918M55719n88599J73981K95287m69541K58345J70763l68003
101a80764J63237R6396j48430R3854l7847J341K4943q8313J63845p9193j64418
$$ y = [0, 0, 0, 0, 0, 0, 0, 0, 3, -8, 8, -8, 14, -16, 24, -32, 40, -48, 60, -72, 92, -112, 135, -158, 187, -220, 259, -303, 352, -404, 465, -535, 611, -695, 788, -892, 1007, -1134, 1270, -1423, 1589, -1771, 1969, -2188, 2424, -2684, 2966, -3275, 3614, -3983, 4387, -4831, 5322, -5863, 6465, -7134, 7885, -8734, 9700, -10816, 12115, -13651, 15501, -17779, 20667, -24453, 29662, -37308, 49720, -74174, 222925, -743989, -41925, 802453, -770208, 96370, 632506, -658786, 11508, 596058, -571342, 42306, 451974, -527786, 16988, 529252, -483631, -100178, 458618, -367506, -93137, 417854, -340634, -108716, 347003, -241596, -67615, 227672, -241869, 16476, 187239, -180764, -17527, 78869, -69561, 24293, -13554, -12213, 12730, -75583, 88262, 9069, -155349]
112a55349K68596q7900j49618K40736j41598j12856K99151j63590j53447K93567
122A37692j34443j44408K97091j39152k06154L42933r6632k26768L28110j53969
132D300j76257L88581k14027j88774M02386k48331j13468L98699l32781o2388
142a42060L78705l15994K162K84725l49757R4126K72623l67604J03514K18083
152A78523l26776J36068J95865l37085J11252K08934k99464J18336J60445l13994
162a67896J57043J78820l35807J58985J60716l47376K21815J35643l71575K29874
172B0242J21022l25570K28511O8503k96104K33011M3118k31953J86000J65j55712
183a08767J63211j8348j28596J34549k0747q6992J08452l0197p2632Q9840q052
$$ y = [-155349, 113247, 25347, -124271, 116465, -25133, -137989, 161162, -2428, -155875, 137692, 3249, -141159, 155932, 16780, -189374, 153559, 56927, -169841, 158269, 4300, -171957, 216624, 2597, -186177, 216209, -32122, -145590, 253109, -79672, -142060, 236645, -79349, -77187, 207538, -142219, -48093, 224530, -143074, -39560, 178523, -148253, -12185, 183680, -153405, -42153, 166781, -132683, -14347, 146098, -167896, -10853, 167967, -167840, -8855, 151861, -195515, 26300, 161943, -209632, 20242, 141264, -184306, 44205, 112708, -183396, 49615, 92733, -139220, 46780, 46945, -108767, 54444, 36096, -92500, 42049, 21302, -65690, 42762, 12565, -60067, 29773, 21721]
194B1721o3509O4072k0904k4471N5653m7437P777L6014n9113M7781J8114q9452
206e3754R0256l823r6776J33406n4562r4362J73503p9348j02496J90446r5877
217F613r5495K03353j14844q6854J93352j09417p4353J84612j20076p3703K01138
228A14326j26953p9252J99530j20076q4327K03265j14121r5378K00684j10194
238a2496p6639J79074j12020n9572J63967j04609m9744J45159j01489l0039J19201
249F0793q4018k2953Q6831n7757j5508O1675m6228k864L5929k8922O054R834j1583
262h717Q163l326k240J7402k7014J0646K9124n1429K6997L1822o5293L3973M1297
275D1405q2830M5290M4964j01428O5910L8900j10960P7236L9208j24652R1362
$$ y = [21721, -41788, 22284, 1380, -23091, 32562, -14875, -7098, 28916, -30197, 17584, 35698, -53754, 36502, 32679, -64097, 69309, 14747, -79615, 93888, 14540, -87956, 102490, 6613, -88882, 114471, -373, -87227, 106125, -3292, -77645, 106967, -13109, -86812, 114326, -12627, -91879, 107651, -12425, -96752, 106513, -7608, -102986, 97698, -12496, -89135, 89939, -22081, -81653, 82314, -22295, -72039, 73120, -28369, -58408, 60793, -23225, -46178, 40653, -17104, -32612, 29063, -17165, -20029, 15900, -13022, -6968, 2866, -8717, -554, -3880, -6120, 11282, -15732, -5086, 24038, -27391, -394, 31428, -33865, 108, 41405, -41425, 3865, 48829, -52599, 13311, 52211, -58749, 18487, 57695, -66957, 24405]
286B4405M0135j40706J07495L3774j44377J14372L1856j50165J19390L2664j57350
297h8507J30021K3685j56351J32893K2814j57535J32517K4989j63285J39504K1302
308F2047j61372J36252K3345j59276J30349L0447j63151J29480L1651j57389J20204
319B2587L5301j50346J06427M5982j47457R6399M8093j36077Q1149N3929j24274
330f8287N9938O6368j17941M6077P0336j05444K7546P5827r0588O448Q5445q3538
342b7813p208Q8268o9288k4971R0738n2167m7678R9299l9764o3813R8631k4125
354B0109p8004R8929r494r6415J05986k902j04631J06083L934j11931J03314J7798
366E2776j22233J00113K3726j21013R3479L0551j22835Q4313M4300j30620Q3445
$$ y = [24405, 64540, -76166, 31329, 65103, -79274, 35098, 66954, -83211, 36179, 68843, -88507, 41514, 65199, -91152, 41741, 64555, -92980, 39537, 64526, -98759, 40745, 62047, -99325, 36927, 60272, -99004, 31345, 61792, -101359, 28121, 59772, -97617, 22587, 57888, -92458, 13969, 59951, -87506, 8893, 56986, -79091, 2058, 55987, -68287, -8349, 58019, -59922, -13845, 56491, -48953, -21407, 54420, -36168, -29720, 55725, -27813, -35021, 53247, -16041, -41012, 49726, -2441, -50119, 49180, 9416, -54397, 44234, 20109, -57895, 41034, 31540, -64875, 41111, 38209, -66422, 39661, 43595, -68336, 34978, 52776, -69457, 30656, 54382, -66631, 26848, 57399, -65436, 18877, 63177, -67443, 16002]
377A6002M9568j36622Q1297O1035j40977P0245P0746j40781P0180O6396j34989
388f7900O5538O1977j21069N7353N8543j16172N4845O1840j08832L5776O8093
399D9992r1730J6680P6619q9766O351Q2420q1502N69P6343p7955K938Q0988q3051
412c1104Q68P5200o9398K352N9276n6223o077N8266l8781j7161M4640k3294k0369
425b1805M6959j5968m4203N7929m903m8768N5154j2395m4688O1075j0850m6483
437b8946N3154j7335k6400N1137k5517k8286M0350p67k7947J8703N681k6525J8689
450E991K0380l8454M931L1703l9085K0890J9503n9420L8430K6522n7844K9614
462C161J4671m7820L9093R127m0294J9309L919p530J0143m304j6163P733K3000
$$ y = [16002, 65570, -71052, 10245, 71280, -69697, 548, 71294, -69487, 693, 67089, -67900, -2362, 59615, -61454, -4101, 54442, -61730, -6885, 54955, -53877, -18101, 49992, -41738, -25058, 51561, -38205, -31854, 50566, -30936, -30367, 45976, -31979, -29041, 51947, -31104, -30236, 44964, -24434, -22082, 37194, -19029, -25106, 33160, -5621, -22782, 21858, -1436, -21805, 25154, 9186, -35017, 22912, 18009, -30759, 24395, 12000, -32688, 28387, 17537, -28946, 24208, 6873, -19527, 31610, 6093, -22193, 18157, 17390, -10557, 8146, 13827, -12698, 5991, 26371, -12083, -7152, 24551, -14534, 6356, 25859, -33561, 4869, 31391, -26453, 3161, 17832, -29988, 9105, 18232, -22062, -2753, 1166, -6364, 3779, -525, -16688, -8955, 14045]
475A4045j9353j4725K8666j6949j2019M6590l8167j9843N2173k7710j969K3163
487A3902l9092J7932K9387l6401Q691R121j6048J8061J164q367j1399R051K3812
500A9814k4363k178J4801k1082K4132Q706m3084L0041M010k2654L6662k5010j8407
513a8612L5381q691m004K082j7475K0185M414j0841M711j8749K0176P472k1573
526e524J7789j8812l495L9042k8138j4614K4202j8897J8594L722l3665K2497j501
539A200k890J3752k4097L435J0975n342J5535k5219r745L9841k2956j402J2042
552E129k8864K5732O669k1943J6290j6617l72L3752k6335r201J4438n164J6019
565I533j4167n555J2412j4877K1937J725l2347K1941M404r352K1327l0685K201
$$ y = [14045, -5308, -20033, 8633, -8316, -20335, 26255, -11912, -31755, 20418, -7292, -9261, 13902, -25190, -7258, 22129, -14272, -5581, 3540, -12508, 5553, 6717, -1650, -13049, -3998, 19814, -4549, -6727, 8074, -13008, 11124, 19830, -23254, 6787, 10797, -11857, 24805, -205, -18612, 16769, 8078, 4074, 6156, -11319, 8866, 13280, 2439, 7150, -11599, 8577, 16049, -5524, 12265, -6547, -10042, 29000, 862, -13752, 10450, -8447, 10147, 13869, -19796, 2701, 1200, -1690, 12062, -12035, -8600, 2375, -2967, 12568, -12651, -22396, 17445, -5511, -6913, 5129, -23735, 1997, 8666, -13277, 3013, -13604, -13976, 19776, -6559, -15760, -1322, -6486, 9533, -4634, -10189, 2223, -12654, 9283, 11008, -21339, 602, 5006, -4346, 16981, -13704, -11503]
578a1503L2564k7089R769L878k4136K5114O239j8368O022p360J0119Q915j6639
591b475Q131j0613O436K0456k7682M402J0893j6971K2994m373k8134K6762l789
604F037q278J8196k4547K326J7916r120r1p089J60J2133r272L727j762j6557K5557
619I336m431j7414J7087j5062M468J9205k3917qJ4568j2750J0289j45j4420J0212
633b982p6M586l621r653J1428k141J94O606j6830P687J4046j9094J2509k20j7703
648a5264K4283l208j5171J2331l006k394J0374p766l266M238K433L284r804O378
662C442l98n869J5077j0609q011J7300q931l365J4641j7991K904J6284j6256L075
676A293N786q494L242N674n648m521N143L506p069R90O293j3042R684M888j7805
$$ y = [-11503, 21061, -6028, 3741, 7619, -16517, 8597, 14836, -3532, 2490, -4870, 5249, 14164, -2475, 5656, -4957, 1479, 21935, -5747, -1345, 9548, -7423, 15571, 11198, -16936, 9826, 6037, -2241, 15955, -8592, -6266, 11650, 2530, 2439, -4650, -4490, 7643, -1629, 2098, 336, -16221, 9336, 4905, -12509, 4578, -10484, -6016, 13189, -10728, -10736, 3832, -8918, 1371, 1226, -13194, -2982, -3058, 1528, -2093, -11746, -318, -2459, -2265, 4341, -12489, -4802, 9244, -9850, 2659, 2439, -15264, 9019, 5811, -9360, 2971, -35, -2429, 7945, 179, -3087, 1151, 3584, 6868, -2936, 3442, 3044, -2825, 12252, 1643, -6368, 10932, 2001, -1364, 13277, -4714, -1810, 14474, -1782, 1293, 7079, -1415, 1827, 7501, 1853, -2668, 2475, 5981, -1088, -98, 6195, -6847, 2837, 7725, -10080]
691a0080J2093J786j3068J3048j107j4831J4258j5j0578Q729j782n038M129L804
705A348p637Q29P081p364L24Q162q964j775J3777j1972j135J2919j2723K800R640
720E310j0521R6J0134q875Q61P488p615R54O764l823n116R552l092o613J1042
735F546l540p069R956q44r458J1430k529q322J1677l968n850Q222r47q280R016
750F040n43q987R309k81q400O187L298j1064P502L623j2351Q518K501j0599N863
765F16N304j2291O128N846j2821O354M902j0205L476O783j1274L673P527j2153
779h135M718O429r859J775Q776j0795J254J0026j1249K387P507p833l03Q879q396
794d819o7Q960q357J106O308n215j265O997m611j942P360n293p02N199k585k509
$$ y = [-10080, 2013, 3799, -9269, 3779, 2672, -12159, 2099, 2084, -8494, 235, -1547, -6585, -2456, 1348, -6289, -5460, 1621, -5743, -5419, 2743, -6221, -7996, 5781, -6191, -7326, 5593, -7130, -4330, 5310, -5211, -5115, 5019, -3856, -2995, 4493, -3122, -2168, 4596, 773, -4343, 5209, 2117, -4496, 6546, 3006, -4063, 5893, 5049, -4409, 7021, 4492, -3830, 7847, 3879, -1971, 6251, 5304, -2976, 6040, 5497, -3490, 5819, 5538, -2862, 3325, 6623, -4441, 3061, 6684, -5667, 2851, 5352, -5247, 616, 5920, -6371, -243, 5603, -7218, -864, 4038, -6167, -2691, 4092, -7182, -3509, 4018, -8135, -3417, 3012, -6847, -5072, 3704, -7091, -5837, 4189, -7060, -4673, 2834, -4999, -5302, 3577, -4819, -4886, 4074, -4283, -3177, 3131, -2084, -3349, 3648, -963, -2905, 4455, -838, -1540, 3659, 1074, -1435]
810a435N644k208l638O660l074j788L633p49l110L676k65l207L976j606j337J332
826B504J921l861L30M424n191P27L523m224j141O644o569m83O662q288K052N377
842D407o957l44O466n726j488O027m810j567M571j022n331N561k93o669R309l583
858a449p147J0330j761q256R968l039o624J0703m543l008M060j073j00J175m09
873a173j232N71L683j641m604Q543n284k254J1680j0603j897J1166o431j982P346
888E888p309R88O968n168j094J921J862m314M306J842j2065J0371N869j5984R504
903C585M753j7602J8135K5k0837J9626k590j2737J6727p295j1361J6191k423r512
917e315P225j619m421N415M547j3681L177J2951j5835N148J0455k2140J1058J5719
$$ y = [-1435, 4209, 2001, -1637, 5023, 1949, 161, 3794, 3045, -65, 3611, 3346, 139, 4115, 2509, 1172, 2504, 4425, 564, 894, 5318, 127, 854, 4377, 153, -988, 5656, -913, -1396, 5266, -3022, -970, 4407, -2550, -2894, 3572, -2154, -3642, 2385, -2425, -3992, 579, -443, -5774, -213, -506, -7175, 2134, -1449, -8596, 1734, -27, -8283, 1685, -1354, -7978, 2725, -1818, -4826, -766, -1839, -1939, -764, -1173, -2405, -1834, 1849, 208, -4396, 4147, -1137, -3391, 8289, -2314, -4211, 6955, 524, -1458, 5888, -1421, -433, 6535, 1367, 273, 2194, 4056, -258, 4048, 5890, -6175, 4196, 10065, -5919, 3585, 8338, -9264, 8871, 8896, -11941, 7685, 5095, -7642, 9085, 1790, -9571, 6620, 4197, -5315, 1910, 291, -4130, 1285, 5832, -7849, -4672, 8279, -7556, -2408, 8047, -14093, -3035, 12684]
931A2684k6034J0060R819k0499J8262O50j9186J4113L272r659P513r96q289O197
945b093P626o500r403J3882k148r423J8454j3816r429K6060j2673r334J9871j7761
959f687Q09K2753k1058k528J4238p084m3O296o225o310J1085N562j5623M300R822
974I307j7517J6345N876l1796K3413P926k5022K1376m085k1958K8617l049k0677
987a1244J7103n625n245J3313n224j1774O257J0985j0552j735Q970j4096M689
1000d178J9957k6542J476K0981k4552J4866R251l1383J9041J2108k2905J3989
1012B109j204j5079J9737j441j1005K695K689K007k005L717o935m828J8639o582
1026B514j2949J7098j1000j895K2636k3679j051J8792j4884P211N002j7214J0137
$$ y = [12684, -13350, -3290, 6529, -13970, 4292, 4942, -14244, -131, 3141, -6518, 995, -1, -8290, -2093, 5533, -967, -10370, 3512, 1364, -8059, 10395, -3421, -12850, 13210, 537, -8797, 11074, -6687, -5878, 16875, -4183, -6711, 7527, 443, 400, 6696, 471, -5839, 5246, 10808, -4815, -515, 9307, -8210, 8135, 14011, -17785, 5628, 13554, -11468, 9908, 5823, -16135, 12482, 9433, -11244, 5859, 234, -5011, 8302, 3078, -8696, -2439, 8546, -2006, -3741, 5229, -8867, -4178, 15779, -10763, -9287, 11694, -12858, 2008, 11259, -20124, -1083, 11025, -11880, 2109, 905, -14174, 5563, 4122, -6883, -4188, -1499, 508, -1497, 2220, -4715, -9543, 9096, 2514, -10435, 6663, -4337, -6232, 16404, -7275, -8326, 10466, -4418, 2793, 7795, -9419, 718]
1039G18P541q063K005m619M324J949j143L655j3320P434J1309j5028O023J985
1053D770j4461K0058j792j9141J7129n677m643J5004j2850m765J1052k580j050
1066A054n24l175K061R54N527r456l949J4320j0641K420Q544j9800J0480J2858
1080A0673k0606R353L815j6232J8937k017j5544J2152j144l448O639m798m304
1093f524N342L605k739n072N509j886j644J0781j2424j922J4445j0564J758P532
1107F197j3975P198R309j3475N830J339n997Q895k652m000J762O48L252k562k134
1122c65L360m459M668L506j1784P819K154p043P541l702n617Q262r53m629L332
1137B090k724J096J466l09j567l234O491k576l848O022m982j892R423p789k854
$$ y = [718, 8259, 196, 2201, -2418, 1906, 3855, 2712, 6367, -6953, 481, 11790, -3238, 2785, 4770, -9691, 10367, 8575, -10566, 6563, 886, -3757, 11247, -1603, -6368, 4684, 2104, 1054, 530, -2645, -584, 370, 5897, -3559, -7508, 6812, -3829, -1409, 7135, -12665, -2185, 10673, -9933, -580, 3235, -12997, 5940, 3923, -11621, 531, -613, -4061, 2578, -2220, -6524, -1182, 2423, -316, -5388, 121, -1765, -3409, 7372, -5052, -6974, 7471, -3093, -1335, 6197, -7778, -580, 8729, -4746, 1084, 2423, -3574, 5321, 2669, -1331, 431, 1079, 4331, 1769, -365, 2995, -1464, 3204, 6710, -5074, 2745, 4899, -2144, 5397, 1695, -3922, 4340, 3387, -1242, 2090, -634, 462, 1928, 1619, 52, -3182, 3309, 733, -3115, 2907, -2075, -3967, 5456, -2333, -5187]
1152e187R309q573K320N779r023K762M340m659Q23K144l809K297J396j225k008
1167c314J386K212l884L612m60l976N074L59m659M305m34l295N117k025j900K561
1183F79l37M06j098J368l49j169L148r86l572N235j014m107O847m041k851P149
1199E308l796k946O047k642l579O435l388l141N199j018m579M926K36o457O656
1214C261l41o774O311L18p055O313Q44p931P260J6p190O690k16o593N652J450
1230B015p651N944J005o390M725J388n934L806K767o823M035K170n763L676K942
1245A912o274K747L814o599L537L065n828K599L442n288J488M653n768J349M262
1260C111m806O74M437m069o27N527m838j47N220m562q83N179l491k219O526m390
$$ y = [-5187, 4122, -4451, -2131, 3648, -5375, -2613, 1727, -2932, -2109, 35, -3774, -1477, -81, -1306, -3314, -1928, 284, -3600, 12, -448, -4424, 650, 1009, -3650, 655, 221, -3074, 2043, 18, -1882, 679, 342, 748, -350, 1018, 669, -500, 2648, 1662, -1910, 3325, 2311, -1796, 5051, 1010, -1841, 5308, 1512, -1434, 4613, 1971, -1608, 4827, 1439, -1702, 3497, 2479, -2100, 2826, 3062, -3395, 3261, 2920, -3854, 2457, 2775, -4280, 2033, 2877, -5054, 2206, 2222, -4968, 1722, 1506, -5087, 565, 2015, -5636, 308, 1313, -5077, -352, 1036, -4898, -1092, 1675, -5148, -1113, 1057, -4706, -1030, 1912, -4362, -1615, 2199, -4400, -863, 2202, -3626, -1027, 2415, -2873, -1385, 3268, -2500, -1151, 3111, -1695, -1021, 3416, -653, -1280, 4247, -591, -738, 4482, -80, -963, 4216, 725, -1494, 5032, 642]
1276F42j881N955l535k413N424k730l370O039k680l543N689j823l900M866m56
1291B284n616N821q24m894N613q60m933M697J23n485N343m46m894M615j97l890
1307c543L121J252m912L454J970n430K919K385m843K085L522o579L357K989n921
1322d174L586J918m998K830K774n051K925J243l268K694M42k125M37K759k430
1337d38j85K823k347q42M278k984j595N136m301N86L931n356J923L174l789R28
1353I42J397k775K066P50j971N54n18J887k218J010O23l459L572P49m698L131
1369A042J86l952N814l120l500N949l154k66K005l101O55K096j396l40j177J258
1385a001J169k035K823l896q3N640n250M10L039n047M093K309o790M162R3k302
$$ y = [642, -1239, 4716, 1181, -1232, 4192, 1462, -1908, 4131, 1451, -2092, 3597, 1774, -2126, 2740, 2284, -3332, 2489, 1665, -3229, 2384, 1524, -3409, 1288, 1411, -4074, 1269, 823, -4071, 544, 347, -3543, -422, 830, -4082, -628, 1342, -4088, -1169, 1216, -3627, -1542, 1980, -4599, -1242, 1747, -4174, -588, 1330, -3668, -838, 1936, -3115, -190, 1053, -2215, 479, 921, -1204, -767, 1992, -438, -623, 2200, -147, -989, 3289, 305, -1290, 3846, -455, 131, 4062, -1294, 629, 3803, 14, 942, 2339, -436, 1630, 2380, 409, 963, 445, 2332, 114, 1124, 1747, -1712, 1860, 2609, -2089, 1042, 1228, -2724, 3090, -30, -3530, 2419, -735, -1001, 1004, -2097, -1442, 654, -742, -1082, -2259, -1001, 168, -1867, 956, -2940, -3023, 2617, -2633, -2223, 816, -4231, -138, 2171, -4619, -457, -364, -2666]
1401b666N303m351j106L645j600J554j175k000L376q49P71Q41n337N451O87l407
1417h63M011m691L17O523n383J0K477m267N464l09n333M322k665K146K238n657
1433a660K495M98j232M167m683k124O231l923J968K51o228O335kk883K185m134
1449b739K005M295n099J259r42k017O965m765j726K957m006N446j75o833M904
1464d71o99p81N170p472P47N332m383L983k631l864O897j546j283J575n239M640
1480b5K968n595L489l310Q86O673o438N47J422l200O611j960n473N132j679J530
1496A578K613p406L878J671j976L956n572p42O401l886J342j9o032Q020r30m197
1512a301L973m983L025M173n959R62J65j641N856m150k706M089l841M790o53o148
$$ y = [-2666, 2637, -1714, -2820, 825, -775, 779, -396, -2396, 980, 131, 902, 1743, -3594, 1857, 2544, -863, 3148, -1543, -1226, 5297, -86, -76, 2401, -1866, 3598, 3289, -2044, 2278, -387, 1759, 3997, -1660, 835, 1333, 101, 4268, -415, -2539, 3692, -231, 1737, 1988, -4240, 2095, 2093, -790, 1395, -2739, -734, 3561, -1538, -279, -1221, -3238, 3727, -1038, -2764, 193, -3813, 1633, 1458, -5375, -471, -1170, -1951, 3219, -4253, -3506, 1826, -2557, 1426, -1205, -5069, 1828, 282, -1001, 574, -4665, -25, 2943, -2652, 837, -2473, -1587, 5086, -1352, -805, 617, -2583, 4028, 2068, -3405, 1727, 48, 1578, 4191, -3215, 663, 2334, 358, 4314, -1258, -2000, 4401, 515, 1857, 1838, -4194, 3826, 2896, -1301, 2672, -2311, 714, 4887, -1072, -110, 55, -1586, 4270, 120, -2586, 1503, -2338, 2452, 1799, -4349]
1528d349M959j116k1L268p151K087M952n001L607k490l735P494k913j497K186
1543B80m261M243J526m626K260j850P21M994n989R08J826k426N465l217l521M899
1559A232k055J047K356n844L228K237k835L009l736M20L943k946J447j005k115
1574a617M816j344k825L588l966K346L096n521K207O18j845L509k294j867K843
1589A744j266R30j33l021K887m76j58Q55l580K575J309k875K170j560j753M466
1605B114k509j121K238l442K908O43k863J478k79m42J617j581n60J392j028K006
1621E71j702r65K432j577J077J07k223J949Q41k150K099j465m48K777j884L98
1637a63L53q19J355k37o78J044j105R22R43k054J701n27o99J931j654p6J602j269
$$ y = [-4349, 610, -506, -527, 2741, -4410, -2323, 2629, -2372, 1235, -1255, -4990, 2504, -409, -1906, 280, -3981, 262, 1788, -2838, -578, -2428, -1707, 3287, -2702, -1794, 32, -2394, 3071, -146, -3667, 1232, -823, 224, 2580, -3264, -36, 2201, -634, 2375, -1361, -941, 3002, 56, 1503, 498, -1617, 3199, 1855, -970, 2618, -1348, 998, 4094, -1427, 780, 1398, -447, 3062, 768, -1099, 1744, 478, 1408, 1275, -1746, 1141, 665, 507, 1362, -2218, 357, 1666, -1209, 961, -599, -2352, 2114, -395, -1516, 722, -2720, 188, 831, -2032, -554, -833, -1275, 342, -1239, -1799, -407, -1435, 571, -1131, -2096, 336, -1241, -164, -57, -2280, -331, 510, -1640, 459, -1006, -1454, 1323, -561, -163, 190, -629, 726, 489, -189, 855, -250, 672, 1615, -439, 1262, 735, 36, 1967, 313, 237, 1839, 570]
1655E70L68O56j617R41L45r23R13p94J69K80k87J48p18K89K99o95J12N64j480
1674h60J799q69r69J597j131K06N83r50l41R24n60k93P87r30M73J05m63L6J03
1693g53R9k77M17j94k33J44M83p02O12j26n13Q40k66l07P45l4k76M61k38j13P89
1714E58p15L49k91M49q5J33J29m2R7l8p2j5O62n63j33O86p97M33N3k66J96L15
1736A043m98k82N11m83J31K27K73o47J23j29o19R05l65l98J53K57n79N62k2r02
1756g39P76n75K14j58J30l86K47kl12K98j03j70j24N20k64l89O22l84O2K30k57
1777g64N5J98p7N6L46k21L85n14O35j80j92O09n25L85J94j85q2N61o35N60J98
1798H07q60P68l80J01M11l85K87J28j52R5l41k9L81j096J189k77p91J226q65j12
$$ y = [570, 938, 1594, -23, 918, 1263, 340, 1253, 459, 628, 908, 621, 769, 51, 340, 639, -56, 56, 620, -860, 939, 70, -899, 698, -433, -227, 356, -594, -935, -11, -571, -864, -77, -1007, -534, -429, -892, -856, -753, -654, -931, -514, -708, -941, -797, -314, -1016, -404, -530, -1043, -203, -469, -776, -31, -65, -341, 120, -118, -231, 558, -157, 192, -99, 350, 265, 398, 527, 485, 582, 544, 472, 457, 1119, 556, 423, 1109, 312, 745, 798, 532, 728, 1043, 545, 263, 774, 291, 422, 649, 922, 275, 398, 269, -350, 555, 190, -208, -55, 202, -377, 185, 163, -739, 37, -538, -324, -482, -352, -738, -491, -493, -805, -507, -610, -780, -904, -384, -648, -1037, -415, -799, -737, -507, -764, -709, -511, -588, -532, -186, -407, -22, -536, 99, -81, -273, 336, -189, 196, 390, 205, 123, 684, 49, 609, 807, -53, 715, 335, 436, 847, 462, 749, 877, 725, 820, 479, 450, 831, -265, 924, 647, -144, 1082, 217, 105]
1818A05Q18r47J1R42j127K24J71o09R32p25j58J86k02N52l52n40L86j21j16R06
1838C36j979J224N21j565J473o72r08J505l46o00J057j687J063J058j691Q72m76
1855h15L24J043j669J022l53l64J819q83r76J828j519J086J027k906J910J49j109
1872c86J460j112m05J826q42p8j9r85K078r61j23M44j776K153L71k270J550p55
1890A70r07L524l008n79K340k267K150n52k479J851K75m70Q38k077P35J276j478
1907f58J625k175j33K782k093O39j76j997K998j6k835J963j078j41L008l177J78
1924a286J275j287K278j311j472J934p17R21K08k839K510p1q05J841k919Q82K684
1941A826k279Q06nj916L456o86j942J872k066J705J475l059J146m6L4J701k160
$$ y = [105, 923, -24, -13, 929, -198, 26, 197, -412, 520, -205, -363, -177, -379, 173, -179, -719, -333, -454, -570, 336, -1643, -419, 102, -1463, 10, -662, -1570, -65, -411, -1011, 46, -1641, -578, 480, -1211, -339, -815, -491, 552, -1117, -95, -448, -812, 1007, 124, -852, 976, -543, 543, 1570, -1336, 574, 723, -386, 1074, -38, -443, 1383, 541, 463, 444, -541, 1537, 576, 453, 897, -879, 1274, 1645, -625, 925, 170, -737, 2787, -221, -800, 1540, -727, 1423, 871, -1608, 243, 518, 48, 886, -1191, -456, 820, -658, 967, -1208, -1341, 1441, -652, -13, -189, -2186, 812, 796, -2039, -76, -1154, -1295, 1713, -1464, -1286, -11, -1298, 980, -331, -1803, 131, -586, 335, 543, -2296, 214, 143, -662, 1179, -1740, -858, 1826, -453, 353, 348, -1568, 1888, 1202, -740, 1132, -934, 771, 2246, -813, 333, 287, 321, 2022, -138]
1958a38m24J893j628K036j100k385L466j286J49Q93l267J945J776k404J250j229
1974d53p40L309k135l65N64j744K617l72k095J431p25O53J674l629J391R16j374
1991a077K378k295j350K879j160M71J67k542K579N83j733J528j813O76K375k641
2007i75R42n72n39K657j447j185J825j850J905P37l175J996k58l97K069k281j84
2024g32J852p56O08l16j692K510q50n62Q23j911J812N16j581J255j200J73J875
2041A824j869l24R64j196K122r10j440J397r00O11P23k037O05Q17j057J580j558
2058f48m35J871j307O03k74j344J817k44q88O91o83K71J213j757P30j06n49J546
2076E07r39l44Q72q32Q54R5j401J307j48l90R64j461M69J014q33N84k03m82Q23
$$ y = [-138, -562, 1331, -297, 1739, 639, -1746, 1720, 434, 583, 1476, -1791, 154, 1930, -474, 776, -453, -1193, 2116, -19, -384, 180, -1564, 1053, 681, -1414, 17, -708, -55, 1619, -2010, -619, 297, -1077, 1301, -994, -2344, 535, -625, -154, 13, -2529, 50, 633, -1100, 428, -1385, -709, 1666, -975, -33, -605, -1144, 1513, 66, -1119, 706, -1144, 761, 1498, -1677, 319, 61, -336, 1733, -548, -732, 1120, 364, 972, 656, -1036, 1474, 624, 62, 885, -1026, 786, 1302, -279, 976, -224, -51, 1824, -45, -369, 595, -601, 1521, 611, -829, 568, -332, 279, 1002, -1035, -430, 387, -670, 910, -648, -1083, 788, -519, 84, -190, -1534, 283, 39, -849, -158, -841, -570, 643, -1114, -384, -490, -1039, 507, -432, -776, 96, -736, 118, 213, -1188, 119, -29, -419, 545, -916, -447, 567, -266, 318, 115, -367, 456]
2095D56o6m87N26o50O22K87o18P09q43N11N16j179M01O45o66M39k2p25J003o33
2115B26J55K98q05L70J90k61J02j80K4L85n95J45K53n06M76j70p78Q07m34J69
2135a29K27n46L1L12k99L99m91m8J64j09J14l7j07K99k40kK63j56J22K24n48J66
2157c91K31l04O40l53l3k0K73j99K59k88J93J99M8rk32M0n3K22o9m8L13K28l50
2180B97R7J6k42L34j7k17K67j82n9Q0j46k77M04j59K54q9k43m8R9K38l45K38l14
2203a4j4m9n4p5K24j4j56K11k70r3k85L22J58l19R5j34K16l1Q2j32O8O4k45J59
2227b86q1j6K60R3l58p1M91k19R9j30K32J26k13M2N4Q4j94L6j6O0J89j19o1J13
2251A15L66l10K92k11k41L77L8l55M06j73r1L33k38k06K83l82M24l00K01j69O2
$$ y = [456, 390, -97, 429, -221, 401, 688, 70, 779, -64, 447, 963, -216, 185, 830, 164, 603, 581, -144, 859, 226, 381, 679, -126, 244, 434, 173, 275, 95, 119, 504, -91, 54, 307, -199, 277, 107, -671, 136, -298, -129, 98, -448, -417, -105, -404, -5, -496, -544, -380, -489, -375, -412, -519, -220, -460, -462, -199, -355, -233, -9, -557, -391, -160, -464, 176, -177, -210, -230, 43, -156, 103, -185, 8, 207, 255, 246, 14, 54, 1, 223, 154, 106, 419, 647, 297, 394, 410, 168, 502, 485, 268, 535, 353, 294, 374, 228, -49, 355, 196, 450, 361, 118, 70, 169, 407, 62, 300, -14, -28, -77, -131, -206, 18, 4, -152, 59, -211, -304, -589, -267, -109, -428, -333, -467, -251, -282, -200, -332, -264, -200, -445, -286, -367, -383, -123, -30, -388, -459, 32, -187, -88, -218, 14, 140, -73, -31, 23, 107, -87, -51, -67, -7, 182, 63, 2, 115, 481, 171, 463, 252, 11, 388, 426, 71, 477, 304, 213, 546, 308, 102, 385, 3, 427, 127, 328, 159, 221]
2272B21J76l94l5J07O2k82L37l17K58n9j65J67j66l36O98l41j47L06l80n4L49
2293El71M00k69l72N53l62j03K96M8k5K37q01O52L1k69K83j16J40K28m91J74j96
2315c28P4M81j67k10L49n58P69k96m28N75m53K04O66p78j53O78n96Q50l11q19
2335d51R85l00L6J04p13M87M17n95L99l85J66N01n93K74n3o48P47P3p72O24m69
2356a66O6N25r31M14K8j92O81q93Q5O79n99M19k01p77R09r2k99L75q98O66M85
2377B84j136O25l22P4P19k69m99M39k90N59J15j228J210m07J72N01j163M84M15
2396B83m89P74o14n57J365o44Q5J59r31J080L7p07N62m65J42J051j171j18O40
2415D82p82J433p58r59J085m16M52K89j304M37L00k90Q42j162j42J115r09N59
$$ y = [221, 397, 3, -32, 75, 137, -145, 192, -125, 133, 74, -91, 76, -90, -426, 272, -69, -216, 90, -290, -344, 5, -366, 34, -235, -607, -54, -416, -519, -223, -175, -200, 37, -764, -112, -81, -350, -67, -183, -43, 185, -306, -132, -328, -254, 227, 60, -150, 199, -359, 410, 114, -314, 261, -192, 12, 678, -100, -253, 425, -171, 679, 368, -451, 534, 234, 270, 374, -339, 148, 565, -30, 369, -16, 150, 651, 58, 332, 279, -369, 378, 451, -321, 303, -166, -100, 425, -506, -92, -64, -256, 425, -468, -383, 296, -303, 116, -85, -862, 47, -45, -344, 31, -867, -201, 284, -852, -227, -549, -475, 244, -25, -524, -85, -375, 184, 299, -929, 281, -126, 46, 547, -616, -132, 283, -206, 568, -46, -603, 762, 118, 203, 362, -569, 511, 548, -159, 403, -62, 80, 1131, -40, -158, 482, -300, 1133, 375, -584, 501, 85, 537, 826, -478, -41, 259, -31, 811, -351, -493, 622, -287, 272]
2433B72p08l48J386l79o52N43r37Q43N12j308O49k69o8R53q41k84O59m22N50k63
2453a12j116J376l99K59K73j016O35N43m97M75p41k11J139p86P6J62n91J289j11
2472F47r79O66p61Q64M85j142jN25l59J083j012m41J055p21N79m8j144J165R1
2491E52j66J30q74L68Q97j071K78nn01J013m20k43J56m13L77L71r44O08j25k39
2511b51J011j204n2N39n57Q76m51o86J206o15j84M21o55N62J79o40O22p00K10
$$ y = [272, -436, -784, 602, 223, -429, 114, -823, 20, 532, -776, -127, -396, -464, 489, -352, -636, 23, -399, 151, -112, -1228, 148, -251, 8, 281, -735, -100, 443, -54, 421, -320, -531, 608, -178, -102, 60, -531, 758, 647, -332, 334, -427, 437, 922, -220, -221, 304, -55, 1028, 16, -425, 630, -91, 488, 440, -704, 461, 552, 386, 516, -358, 10, 907, -164, 114, 109, -392, 621, 201, -42, 114, -299, 78, 449, -495, 113, -12, -251, 760, -444, -496, 43, -514, 362, -89, -775, 431, -184, -368, 53, -602, -40, 139, -501, 121, -579, -369]
$$ [...]
8191B3
##END NTUPLES=NMR FID
##END=
