##TITLE=1H_Pr Am4B
 200.13MHz, CDCl3,
 8 sc
 
 29.1.2025
##JCAMPDX= 6.0         $$ Bruker NMR JCAMP-DX V2.0
##DATA TYPE= NMR FID
##DATA CLASS= NTUPLES
##ORIGIN= UXNMR, Bruker Analytische Messtechnik GmbH
##OWNER= pz
$$ XWIN-NMR		Version 3.5
$$ Wed Jan 29 14:38:16 2025 Russian Standard Time (UT+4h)  she@DPX200
##.OBSERVE FREQUENCY= 200.1313
##.OBSERVE NUCLEUS= ^1H
##.DELAY= (6, 6)
##.ACQUISITION MODE= SIMULTANEOUS
##.ACQUISITION SCHEME= undefined
##.AVERAGES= 8
##.DIGITISER RES= 18
##SPECTROMETER/DATA SYSTEM= spect
##.PULSE SEQUENCE= zg30
##.SOLVENT NAME= DMSO
##.SHIFT REFERENCE= (INTERNAL, DMSO, 0, 14.3821)
##AUDIT TRAIL= $$ (NUMBER, WHEN, WHO, WHERE, WHAT)
$$ ##TITLE= Audit trail, XWIN-NMR		Version 3.5
$$ ##JCAMPDX= 5.01
$$ ##ORIGIN= Bruker BioSpin GmbH
$$ ##OWNER= she
$$ F:/spectra/data/she/nmr/H-C/1/audita.txt
$$ ##AUDIT TRAIL=  $$ (NUMBER, WHEN, WHO, WHERE, WHAT)
(   1,<2025-01-29 14:36:48.75 +0400>,<she>,<DPX200>,
      <created by zg, POWCHK disabled, PULCHK disabled
       configuration hash MD5:
       00 E9 B6 7A A2 85 ED C7 34 08 36 98 17 FE 4E 26
       data hash MD5: 16K
       5B 13 46 D1 E2 0A 8A DD EF A6 45 40 B6 5D A7 F5>)
$$ ##END=
$$ 
$$ hash MD5
$$ 0E E1 49 12 78 42 38 4E 62 3F 8C E1 59 21 DC FA
##$RELAX= 
##$RELAX= 
##$RELAX= 
##$RELAX= 
##$RELAX= 
##$RELAX= 
$$ Bruker specific parameters
$$ --------------------------
##$DU= <F:/spectra>
##$EXPNO= 1
##$NAME= <H-C>
##$PROCNO= 1
##$TYPE= <nmr>
##$USER= <she>
##$AMP= (0..31)
100 100 100 100 100 100 100 100 100 100 100 100 100 100 100 100 100 100 
100 100 100 100 100 100 100 100 100 100 100 100 100 100 
##$AQSEQ= 0
##$AQ_mod= 1
##$AUNM= <au_zg>
##$AUTOPOS= <>
##$BF1= 200.13
##$BF2= 200.13
##$BF3= 200.13
##$BF4= 200.13
##$BF5= 200.13
##$BF6= 200.13
##$BF7= 200.13
##$BF8= 200.13
##$BYTORDA= 1
##$CFDGTYP= 0
##$CFRGTYP= 5
##$CHEMSTR= <none>
##$CNST= (0..31)
1 1 145 1 1 1 1 1 1 1 1 1 1 1 1 1 1 1 1 1 1 1 1 1 1 1 1 1 1 1 1 1 
##$CPDPRG= <>
##$CPDPRG1= <>
##$CPDPRG2= <>
##$CPDPRG3= <>
##$CPDPRG4= <mlev>
##$CPDPRG5= <mlev>
##$CPDPRG6= <mlev>
##$CPDPRG7= <mlev>
##$CPDPRG8= <mlev>
##$CPDPRGB= <>
##$CPDPRGT= <>
##$D= (0..31)
0 0.7 0 0 0 0 0 0 0 0 0 0.03 0 0 0 0 0 0 0 0 0 0 0 0 0 0 0 0 0 0 0 0 
##$DATE= 1738147008
##$DBL= (0..7)
120 120 120 120 120 120 120 120 
##$DBP= (0..7)
150 150 150 150 150 150 150 150 
##$DBP07= 0
##$DBPNAM0= <>
##$DBPNAM1= <>
##$DBPNAM2= <>
##$DBPNAM3= <>
##$DBPNAM4= <>
##$DBPNAM5= <>
##$DBPNAM6= <>
##$DBPNAM7= <>
##$DBPOAL= (0..7)
0.5 0.5 0.5 0.5 0.5 0.5 0.5 0.5 
##$DBPOFFS= (0..7)
0 0 0 0 0 0 0 0 
##$DE= 6
##$DECBNUC= <off>
##$DECIM= 32
##$DECNUC= <off>
##$DECSTAT= 4
##$DIGMOD= 1
##$DIGTYP= 9
##$DL= (0..7)
0 120 120 120 120 120 120 120 
##$DP= (0..7)
150 150 150 150 150 150 150 150 
##$DP07= 0
##$DPNAME0= <>
##$DPNAME1= <>
##$DPNAME2= <>
##$DPNAME3= <>
##$DPNAME4= <>
##$DPNAME5= <>
##$DPNAME6= <>
##$DPNAME7= <>
##$DPOAL= (0..7)
0.5 0.5 0.5 0.5 0.5 0.5 0.5 0.5 
##$DPOFFS= (0..7)
0 0 0 0 0 0 0 0 
##$DQDMODE= 0
##$DR= 18
##$DS= 0
##$DSLIST= <SSSSSSSSSSSSSSS>
$$ [...]
##$SUBNAM0= <"">
##$SUBNAM1= <"">
##$SUBNAM2= <"">
##$SUBNAM3= <"">
##$SUBNAM4= <"">
##$SUBNAM5= <"">
##$SUBNAM6= <"">
##$SUBNAM7= <"">
##$SUBNAM8= <"">
##$SUBNAM9= <"">
##$SW= 18.0517328524113
##$SWIBOX= (0..15)
0 0 2 0 0 0 0 0 0 0 0 0 0 0 0 0 
##$SW_h= 3612.71676300578
##$TD= 16384
##$TD0= 1
##$TE= 0
##$TE2= 300
##$TE3= 300
##$TEG= 300
##$TL= (0..7)
0 120 120 120 120 120 120 120 
##$TP= (0..7)
150 150 150 150 150 150 150 150 
##$TP07= 0
##$TPNAME0= <>
##$TPNAME1= <>
##$TPNAME2= <>
##$TPNAME3= <>
##$TPNAME4= <>
##$TPNAME5= <>
##$TPNAME6= <>
##$TPNAME7= <>
##$TPOAL= (0..7)
0.5 0.5 0.5 0.5 0.5 0.5 0.5 0.5 
##$TPOFFS= (0..7)
0 0 0 0 0 0 0 0 
##$TUNHIN= 0
##$TUNHOUT= 0
##$TUNXOUT= 0
##$USERA1= <user>
##$USERA2= <user>
##$USERA3= <user>
##$USERA4= <user>
##$USERA5= <user>
##$V9= 5
##$VALIST= <valist>
##$VCLIST= <CCCCCCCCCCCCCCC>
##$VD= 0
##$VDLIST= <DDDDDDDDDDDDDDD>
##$VPLIST= <PPPPPPPPPPPPPPP>
##$VTLIST= <TTTTTTTTTTTTTTT>
##$WBST= 1024
##$WBSW= 4
##$XGAIN= (0..3)
0 0 0 0 
##$XL= 0
##$YL= 0
##$YMAX_a= 1059856
##$YMIN_a= -1096970
##$ZGOPTNS= <>
##$ZL1= 120
##$ZL2= 120
##$ZL3= 120
##$ZL4= 120
##$ABSF1= 10
##$ABSF2= 0
##$ABSG= 5
##$ABSL= 3
##$ALPHA= 0
##$AQORDER= 0
##$ASSFAC= 0
##$ASSFACI= 0
##$ASSFACX= 0
##$ASSWID= 0
##$AUNMP= <proc_1d>
##$AZFE= 0.1
##$AZFW= 0.1
##$BCFW= 1
##$BC_mod= 2
##$BYTORDP= 1
##$COROFFS= 0
##$CY= -3
##$DATMOD= 1
##$DC= 2
##$DFILT= <>
##$DTYPP= 0
##$F1P= 0
##$F2P= 0
##$FCOR= 0.5
##$FTSIZE= 0
##$FT_mod= 4
##$GAMMA= 1
##$GB= 0.15
##$INTBC= 1
##$INTSCL= 1
##$ISEN= 128
##$LB= 0.25
##$LEV0= 0
##$LPBIN= 0
##$MAXI= 10000
##$MC2= 0
##$MEAN= 0
##$ME_mod= 0
##$MI= 1.114404
##$NCOEF= 0
##$NC_proc= 0
##$NLEV= 6
##$NOISF1= 3.799351
##$NOISF2= 2.8
##$NSP= 1
##$NTH_PI= 0
##$NZP= 0
##$OFFSET= 14.38212
##$PC= 1
##$PHC0= 253.6676
##$PHC1= 9.59223
##$PH_mod= 1
##$PKNL= yes
##$PPARMOD= 0
##$PSCAL= 0
##$PSIGN= 0
##$REVERSE= no
##$SF= 200.129724274929
##$SI= 16384
##$SIGF1= 3
##$SIGF2= 2
##$SINO= 400
##$SIOLD= 16384
##$SREGLST= <1H.CDCl3>
##$SSB= 0
##$STSI= 0
##$STSR= 0
##$SW_p= 3205.1282051282
##$SYMM= 0
##$S_DEV= 0
##$TDeff= 0
##$TDoff= 0
##$TI= <>
##$TILT= no
##$TM1= 0
##$TM2= 0
##$TOPLEV= 0
##$USERP1= <user>
##$USERP2= <user>
##$USERP3= <user>
##$USERP4= <user>
##$USERP5= <user>
##$WDW= 1
##$XDIM= 8192
##$YMAX_p= 0
##$YMIN_p= 0
$$ End of Bruker specific parameters
$$ ---------------------------------
##NTUPLES= NMR FID
##VAR_NAME=  TIME,          FID/REAL,        FID/IMAG
##SYMBOL=    X,             R,               I
##VAR_TYPE=  INDEPENDENT,   DEPENDENT,       DEPENDENT
##VAR_FORM=  AFFN,          ASDF,            ASDF
##VAR_DIM=   8192,          8192,            8192
##UNITS=     SECONDS,       ARBITRARY UNITS, ARBITRARY UNITS
##FACTOR=    0.0002768,     1,               1
##FIRST=     0,             0,               0
##LAST=      2.2672688,     0,               0
##MIN=       0,             -1096970,        0
##MAX=       2.2672688,     1059856,         0
$$ Real data points
##PAGE= N=1
##DATA TABLE= (X++(R..R)), XYDATA
$$ [...]
2312C058l864j566L190J560k652j347J470J598r52k201N45K483j49k665n00K898
2328I06J234l058j595L473J773l557k123L744J952l363j991L376J632l113j523
2343b233K357J477j623j485R40J368L25k199q45K932J156k908k075L860K070m245
2359a128j912M541J546m606r84M112K23l207N7J929P31j491p42P7J627J153k954
2376a028j185L324J556m200j222M691Q91m670o34M456l38l266K4K745J7j725n74
2393a138Q65J370l87j639n76L006J87l089m12L472N26l785n47L790L49l635l87
2410b030L219N64l004n30K407N42j725j021J220K017j224j985O51K726m39k863
2426a475j30L380K88l587m00L773M0m018l96M328k6l431l04L429K57k409r00K224
$$ plain form
2312 3058 -806 -2372 818 2378 -274 -1621 -151 1447 495 -1706 -1161 1322 1173 -1492 -1992 906
2328 906 2140 -918 -2513 960 2733 -824 -2947 797 2749 -614 -2605 771 2403 -710 -2233
2343 -2233 124 1601 -22 -1507 -567 801 1126 -1073 -1918 1014 2170 -738 -2813 1047 3117 -1128
2359 -1128 -3040 1501 3047 -1559 -2543 1569 1792 -1415 -1358 571 1302 -189 -931 -854 773 1926 -1028
2376 -1028 -2213 1111 2667 -1533 -2755 1936 2827 -1843 -2477 1979 1641 -1625 -1601 1144 1161 -564 -1138
2393 -1138 -273 1097 710 -929 -1505 1501 1688 -1401 -1813 1659 2185 -1600 -2147 1643 1992 -1643 -2030
2410 -2030 1189 1753 -1251 -1781 626 1168 -557 -1578 -358 1659 435 -1550 -899 1827 1388 -1475
2426 -1475 -1605 1775 2063 -1524 -1924 1849 1889 -2129 -2525 1803 1777 -1654 -1958 1471 1728 -681 -1581 643
2444F43R97j457j115L54J838K52k895n99L598N77m027n85M251M37m700K55M168
2461A992n60l182N35K360j96j617k72J021J212o24j973K15K710j48l333J83L701
2478B024l94m140P66L950q01l869J347K972q84k353M66J825K46j496q04P11J975
2495A541p49k451Q16K686q77l335R91L615j155l222J062K876q96k705Q14K662
2511A673k88k321k26J987K31j332j211J625J202q03k423J251K396p58k685K44
2527a438L442o33l444Q82K996n59k987N57K619l28k233j66K518n8j679o53J156
2544hJ473j315j836Q23K701q21l146O65L743j037l801J537L609j538k939J155
2560g35K661j254j838L40J857j00j130p80O82J796j070k369J037L130j728k679
$$ plain form
2444 643 1640 183 -932 -578 1260 1512 -1383 -1982 1616 2193 -1834 -2419 1832 2269 -2431 -2176 1992
2461 1992 1432 -1750 -1215 1145 949 -668 -940 81 1293 669 -1304 -1089 1621 1473 -1860 -1677 2024
2478 2024 1630 -2510 -1744 2206 1405 -2464 -1117 1855 971 -1382 -916 909 1155 -341 -1145 -434 1541
2495 1541 792 -1659 -843 1843 966 -2369 -1378 2237 1082 -2140 -1078 1798 902 -1803 -989 1673
2511 1673 1385 -936 -1162 825 1056 -276 -1487 138 1340 537 -1886 -635 1761 1003 -1682 -1438
2527 -1438 2004 1371 -2073 -1191 1805 1246 -1741 -1184 1435 1107 -1126 -1292 1226 1168 -511 -1164 -8
2544 -8 1465 150 -1686 -863 1838 1017 -2129 -1464 2279 1242 -2559 -1022 2587 1049 -1890 -735
2560 -735 1926 672 -1166 -826 1031 931 -199 -979 -297 1499 429 -1940 -903 2227 499 -2180
2576b180J791K884k001k951K078K768j986j894R02K080p14j911K49J470L84j325
2592c56j108J716J598k015j853J998K597k133k686J898K725j886k199J326K157
2607A779j372j888P86J727k15k048K77J603M85j843r50J772J776j878j833J542
2623b80K082j671k339J799K548j507k645J665K208j395k300J317J901r34j643
2638a194K69J889Qj464r86J715J488j395j924J440K822k566k408K255K558k237
2654B70k540K189J753j604j744J307J599j070j236K67J356N12j199j226J493J940
2670B067k326j742K165K330k667k015K385J988k682j604K245J454j524j467J220
2685a73J031j14j750J4J757N42j474j364K103J355k466j411K391J727k733j553
$$ plain form
2576 -2180 -389 2495 494 -2457 -379 2389 403 -1491 -589 1491 777 -1134 -885 585 969 -356
2592 -356 -1464 252 1850 -165 -2018 -20 2577 444 -2242 -344 2381 495 -1704 -378 1779
2607 1779 407 -1481 -695 1032 817 -1231 -954 649 1134 -709 -1659 113 1889 11 -1822 -280
2623 -280 1802 131 -2208 -409 2139 632 -2013 -348 1860 465 -1835 -518 1383 449 -1194
2638 -1194 -925 964 972 -492 -1478 237 1725 330 -1594 -154 2668 102 -2306 -51 2507 270
2654 270 -2270 -81 1672 68 -1676 -369 1230 160 -1076 -809 547 1059 -140 -1366 127 2067
2670 2067 -259 -2001 164 2494 -173 -2188 197 2185 -497 -2101 144 1598 74 -1393 -173
2685 -173 858 744 -1006 -992 765 1307 -167 -1531 572 1927 -539 -1950 441 2168 -565 -2118
2701b118K642J193k190j048J770J030j457r04P14J315l14j458J31J630M40j930
2717e54r69K316Q74k223j568K754J247k440j402K187J329j908j479K044J152j031
2733C29j661J304R44l97j522L3K071L81k125p86K200N96j891j617K672J290k624
2750h03j188K425J426k437j220K230R80j537j270J174J361m69j630k15K110P36
2766A673k322r92K166J025k407r56K559J011k629r51K636O21k310n39K010M72
2782A067j314o79M21J526j95j820o4K235J17k365o78K810M84k924n68L028O00
2799A681l102m8K423M41k185j33J354N03n60j270N99J694o88k027L05K321k99
2816A009k626L94K575K06k978L66K099K56k222n13K307L83j694j002J865R27j258
$$ plain form
2701 -2118 524 1717 -473 -1521 249 1279 -178 -1082 -368 947 633 -825 -694 936 1376 -554
2717 -554 -1523 793 1667 -556 -2124 630 1877 -563 -1965 222 1551 -357 -1836 208 1360 329
2733 329 -1332 -28 916 519 -1003 -970 1101 1482 -643 -1429 771 1367 -524 -2141 531 1821 -803
2750 -803 -1991 434 1860 -577 -1797 433 1413 -124 -1394 -220 1141 672 -958 -1173 937 1673
2766 1673 -649 -1641 525 1550 -857 -1813 746 1757 -872 -1823 813 1434 -876 -1415 595 1067
2782 1067 -247 -926 -505 1021 826 -994 -1058 1177 1294 -1071 -1749 1061 1545 -1379 -1947 1081 1681
2799 1681 -1421 -1469 954 1395 -790 -923 431 934 374 -896 -297 1397 709 -1318 -1013 1308 1009
2816 1009 -1617 -1223 1352 1558 -1420 -1054 1045 1301 -921 -1434 873 1256 -438 -1440 425 1352 94
2833I4j303Q69J637p80j788M56J796j35k126m6K316L79k262n82K873j0k494k02
2851a308K320N91k413l89J871J87j157p27R70Q17k58j480J28J880l45j919l72
2868a604L181j28k814r5K710Qk309j07K282m27j399j52J285M52r94j093Q49J656
2886A301o91k061L21K650m33k672M91K870o32k591M64K561l06k447O19J432p9
2903G97j261o23J349P59j013j360J045J851r96k005N97K383p52k461R31K520n93
2920A168k642M86K409n06j744j96J885q9j333o92J499J001j511j025J320J315
2936A345j184j623J044J913p78k194O40K035j61k127J08K118l18k006K20K157
2952A189m78j620L8R74Q43j089o93N91J309m47j825N77K004l33k607R97K079p88
$$ plain form
2833 94 -1209 -340 1297 517 -1271 -815 981 846 -1280 -1326 990 1369 -893 -1475 1398 1388 -1106 -1308
2851 -1308 1012 1603 -810 -1199 672 859 -298 -1025 -55 762 504 -976 -848 1032 687 -1232 -1604
2868 -1604 1577 1449 -1365 -1460 1250 1258 -1051 -1158 1124 697 -702 -854 431 883 -111 -1204 -355 1301
2886 1301 610 -1451 -1130 1520 1087 -1585 -1094 1776 1144 -1447 -983 1578 1272 -1175 -556 876 797
2903 797 -464 -1087 262 1021 8 -1352 -307 1544 548 -1457 -860 1523 771 -1690 -759 1761 1168
2920 1168 -1474 -988 1421 915 -829 -1025 860 771 -562 -1254 245 1246 -265 -1290 30 1345
2936 1345 161 -1462 -418 1495 717 -1477 -837 1198 1037 -1090 -982 1136 818 -1188 -968 1189
2952 1189 711 -909 -871 103 946 -143 -836 -245 1064 617 -1208 -631 1373 1040 -1567 -570 1509 721
2970G21k359R52J872n05j726K36J472l3j097l06R18J168j129j555J020J810q65
2987E94k259J233J969j212k308J523K229j374k028J206J474l85j496K99J378K53
3003A096j353r67J461R72j307j147J254J602j377j779J132J554q82j716P97K091
3019A431q52j657M02J966p64j546K64J615K71j532m24J342N43j287j173J040J811
3036A450j377j142O75J853j164j499P29J664o75k004P21K173j009j434N32J194
3052F87R8j314o6P40R65r41j521R16J734j151j913J520J537r94j927J340J837
3069A547j672j124Q47J500p88r10Q9J052L9q16o20Q54J120j128j299J349J201
3086A241j476j401J422J567j301j339J210J369j112j275R46J081q64p43Q0J194
$$ plain form
2970 721 -1638 -686 1186 681 -1045 -809 663 630 -467 -773 145 1313 184 -1371 -351 1459 594
2987 594 -1665 -432 1537 325 -1983 -460 1769 395 -1633 -427 1047 662 -834 -535 843 1096
3003 1096 -257 -1224 237 1209 -98 -1245 9 1611 234 -1545 -413 1141 259 -1457 -660 1431
3019 1431 579 -1078 -676 1290 526 -1020 -756 859 1130 -402 -826 516 1059 -228 -1401 -361 1450
3036 1450 73 -1069 -394 1459 295 -1204 -475 1189 514 -1490 -769 1404 395 -1039 -507 687
3052 687 785 -529 -595 145 1110 169 -1352 -436 1298 147 -1766 -246 1291 297 -1630 -290 1547
3069 1547 -125 -1249 -402 1098 310 -600 -511 541 580 -236 -856 -2 1118 -10 -1309 40 1241
3086 1241 -235 -1636 -214 1353 52 -1287 -77 1292 180 -1095 -149 932 68 -675 -595 599
3102E99M95j689n13J347J034j474r59J153J474j525j318J577J098j426j100J258
3118C1J032o16j395O94J186n95j217J61J218J78j139l18J287M69j542n62J374
3135B46R32j181j144J358J303j273j672J655R31q71j318P24J157o18r44J26J048
3152D59J12r42o66J452Q06j387j098J378J259j600j072J464J032j479o97R85J006
3169A012r70j082J077N14k39j068L39P82L08r64p45J352J145k100p30J644J134
3186A409j736n70J249R13j486o27J011P04q37o10K59Q02O5j164q9J208L88j287
3204c98m52J438N26j514o08J524O51j377j064J537P49j202n85Q42N29o24o88M93
3222b23R86j37j245K69R91K55j280j75R63N67j379r02J711O16j356j015J503R18
$$ plain form
3102 599 1094 -595 -1108 239 1273 -201 -1160 -7 1467 -58 -1376 201 1299 -127 -1227 31
3118 31 1063 447 -948 -254 932 337 -880 -719 499 677 -462 -780 507 976 -566 -1128 246
3135 246 1178 -3 -1147 211 1514 241 -1431 224 1155 284 -1034 -310 847 229 -715 -589 459
3152 459 571 -371 -1037 415 1221 -166 -1264 114 1373 -227 -1299 165 1197 -282 -979 6 1012
3169 1012 42 -1040 37 551 312 -756 -417 365 673 -291 -1036 316 1461 -639 -1369 275 1409
3186 1409 -327 -897 352 1265 -221 -848 163 867 30 -580 -321 481 546 -618 -707 501 889 -398
3204 -398 -850 588 1114 -400 -1008 516 1167 -210 -1274 263 1012 -190 -775 67 596 -28 -716 -223
3222 -223 763 626 -619 -350 641 896 -384 -559 404 971 -408 -1310 401 1017 -339 -1354 149 1067
3240A067j357p90J297P43q72p09N41J009o71p85L69P34K89j370k54J363L38j376
3258d34q78J845L81j457j55Q63P86j116m80P23N10r24l93M92J051j58j027k0R99
3277F08L37j679J11J093L56j389k21J304M42j445r8J062L29j184j84M86O18o37
3295i1o42M85P37J92j096P0J030L5j159l44J343J06j348j33J345J46j069j88R88
3314D07M14j185k16O91N16n01n36Q4R37o66m83n5J120J19j422K07J264j00r79
3333c84l84J282M23j443j01J013M68j112k90N50P48r81o64Q33O00k74j034K44
3351e06R34O6j181o7J472K6j035n70J275M49j313m16J452J75j012l83Q24O36j104
3370b78n56O27R52o09r52J82J693l46j471q1J490j83j054q6J192J07j385L31Q97
$$ plain form
3240 1067 -290 -1080 217 960 88 -621 -80 929 258 -527 -158 576 865 -505 -759 604 942 -434
3258 -434 -1312 533 914 -543 -698 165 951 -165 -645 78 588 -336 -729 -237 814 656 -371 -391 608
3277 608 945 -734 -623 470 826 -563 -784 520 962 -483 -581 481 810 -374 -558 -72 546 -91
3295 -91 -733 -248 489 681 -415 -345 685 720 -439 -783 560 666 -682 -815 530 676 -393 -581 407
3314 407 821 -364 -580 111 627 126 -410 -326 611 -55 -538 -593 527 646 -776 -569 695 595 -384
3333 -384 -768 514 937 -506 -607 406 874 -238 -528 22 770 -211 -875 -42 558 284 -750 -506
3351 -506 428 494 -687 -754 718 744 -291 -861 414 863 -450 -866 586 761 -251 -634 190 826 -278
3370 -278 -834 -207 745 136 -816 -634 1059 713 -758 -839 651 468 -586 -672 520 627 -758 -427 470
3389D70J93r32j70M40O54o17o46M70J038p12q23L81P95R0j385L74J054k07j005
3408e38M2J181J16j127l46Q82N68r10m78N00N41k61q47N12Q62k80j168L70J165
3427G84j73j113K03J180l26q91j90J149p4r38n9R00Q2r11j72R49K95q03n63N82
3447h9P76k80j352N14J283o03j044N50Q51k86j025J6J159j41j112K75R18P8q74
3466c86k37O10L64k04r02N25J052p40r09O36J138p63r77M73J061k91j420O53R84
3485F67l33p75K34O33Ro22l55P13K54m41p44O92P46n33q27M83P29l32r08M56R42
3506F88l17j006P1J162jj093K31K54N29p54m47P53O85p11p43P41O63n27j012Q22
3526a2N62j39r86L19R00l98p82J20J003o5o70j93N06L39p17m56N36P58m80p59
$$ plain form
3389 470 663 -269 -439 1 655 38 -608 -138 900 188 -635 -254 541 631 -754 -380 674 467 -538
3408 -538 -496 685 801 -326 -672 210 778 -132 -610 -110 431 170 -677 -165 697 417 -751 -381 784
3427 784 611 -502 -299 881 555 -336 -526 623 549 -389 -448 452 534 -377 -549 400 695 -108 -671 -89
3447 -89 687 407 -945 -431 852 249 -795 -245 606 320 -705 -689 470 329 -783 -508 410 488 -386
3466 -386 -623 -13 351 147 -755 -230 822 82 -827 -191 947 184 -793 -320 741 450 -970 -317 667
3485 667 334 -441 -207 426 435 -187 -542 171 425 -16 -760 -68 678 145 -682 -199 530 198 -710 -254 688
3506 688 371 -635 -564 598 597 -496 -265 -11 518 -236 -683 70 755 44 -699 42 705 178 -834 -12
3526 -12 550 411 -575 -256 644 246 -536 -416 587 522 -148 -341 165 504 -213 -669 -133 625 145 -614
3546f14Q61M89n38j001O10R71n05q67K16J071m59r44M32P98l20p08L3O31K74m54
3566b4m56M68M71o08o75Q36P56q29q07N01J181n80j102P57Q13n83o92L76N20l0
3586B93m47j26M43L83m46m62O95M39r48o30J040K73m91q16O05O47l80p07N89O28
3606E82n11n62N4P90j32o33j84R06P8n74n07Q76L50l11q75O69O35p67j84K13Q32
3627G45m78q92M50P92l70q51N08M54j6r33J43O38R5m05l59N72L27n55n48N30R04
3648G51o01j072Q31R22o22j131Q29O01l94n21M4Q19k77m66K19L22L72p64m80Q43
3668B25J09l21o43N45J012p86p66Q07L35n39o52M65O50k54p24L41M92l3q11J36
3688d12O02J05l46n85J014K55o39k73L89M95q25o36P32M78l02n59L28O78k05o31
$$ plain form
3546 -614 247 736 198 -803 -193 778 273 -594 -378 693 234 -710 -278 520 200 -508 -475 156 430 -24
3566 -24 -480 -12 459 -149 -824 12 768 -61 -868 -367 814 234 -868 -111 702 119 -573 -197 323 293
3586 293 -154 -280 163 546 100 -362 333 772 -176 -806 234 507 16 -800 -195 452 72 -635 -46 582
3606 582 71 -491 -437 353 221 -412 -596 310 388 -186 -693 183 533 222 -653 16 651 -116 -300 -87 745
3627 745 267 -625 -175 617 247 -604 -96 358 342 -591 -448 190 285 -120 -479 93 420 -135 -683 -153 751
3648 751 150 -922 -91 831 209 -922 -93 508 114 -407 -363 456 179 -287 -68 254 626 -138 -618 225
3668 225 334 13 -630 -85 927 141 -625 182 517 -22 -674 -209 441 187 -537 -196 296 263 -548 -412
3688 -412 190 295 -51 -636 378 633 -6 -279 110 605 -220 -856 -124 354 52 -507 -179 499 294 -337
3708c37P9L30J00l97m66P07L11n83n37J012K77p13l22Q84L08m54j031N59O70o77
3728b80r6L26M68j78q12L63O26j8p00j22M25N85p10l14N31M91o99o53R18K06l43
3749A4n18L37P76n23j009O43O91q4n45l1P08m02m55R0P88r4m09q41J111L87p61
3770a27j32K10Q59q73p49J011M46o38k49N9K40K78n24J12O62k39o12j35Q38J39
3790E76p09n31P69N10o25p49J005K6l32n84O15N73n39j61n1N57l62l42m4Q20p2
3811C50q17m9O85L22o83l77O41R2l38k58N29N07p77l45N79L18j09p05L48N53k84
3832A82m99J40N69R0o76j86P01J93q40K5J9R99q43o14R50K99m91l45M28M27m51
3853G7l61K53J86P2o07J65M03R8m04k26O48n1m47j40M26N17p75l81N33Q04q95
$$ plain form
3708 -337 -258 72 172 -225 -691 16 327 -256 -793 219 496 -217 -539 345 653 199 -832 -273 397 -280
3728 -280 -376 -50 418 240 -572 -209 417 399 -301 -423 2 587 -123 -437 94 585 -114 -767 151 357 14
3749 14 -504 -167 609 86 -923 -280 411 327 -218 -249 459 57 -398 -308 480 386 -23 -864 247 634 -127
3770 -127 -259 -49 810 -63 -812 199 645 7 -242 -183 57 335 -189 -77 585 346 -266 -401 437 576
3790 576 -133 -664 105 615 -10 -759 246 272 -60 -644 -29 544 5 -156 -207 350 -12 -354 -398 422 350
3811 350 -467 -516 169 491 -192 -569 72 164 -174 -432 97 604 -173 -518 61 379 270 -435 -87 466 182
3832 182 -317 -177 392 482 -194 -380 321 514 -326 -301 -282 717 -126 -740 210 509 18 -327 101 528 77
3853 77 -284 -31 155 227 -380 -215 188 286 -118 -344 304 253 -194 -334 92 609 -166 -547 -14 790 -105
3874a05k95M87L61k40n11o2M77K47m28J16K60Km87j66Q42J0p37k21K98N35k98
3895H5m94L62L35m15n5J87K85k81l65p0P94l07j06k75N94j27l05P5K92n1n28J47
3917b23K92M32n95l39M78M28m81m03M79J59j49o69K82N60j02k69K8J78L48m35
3937aj97N61M2n61j02J02N49m01m32O32M76o85m20K35O22l85l95K26M70l18k97
3958b79J8L50Q7l86j47N92L3p03j1M61N48p34o9K96J99k97l94L98L60l37j99J84
3980c0N95m21k56l69N96J81o28J45L79K10o54j98P76j53k83j20K40O5O6n20M11
4001C2J61K18o75K2P69m77k10j94N03K48o60j48N22L23l91n35O61J69l33j42J21
4022a6J66l84j46K37O05m44l76K79L65mk02j19J57J01m15j22P00k25m92M0K84
$$ plain form
3874 -105 -400 87 448 208 -303 -365 112 359 -69 47 307 309 -178 -344 498 508 -229 -450 -152 383 85
3895 85 -409 -47 288 -127 -182 5 290 9 -356 -426 368 61 -45 -320 274 147 -158 -83 209 158 -370 -223
3917 -223 69 501 -94 -433 45 473 -8 -411 68 227 78 -591 -309 251 149 -120 -92 86 434 -1
3937 -1 -198 363 405 -156 -258 -156 393 -8 -440 192 668 -17 -437 -202 420 35 -360 -134 336 18 -279
3958 -279 -261 89 176 -210 -357 235 268 -435 -446 15 563 -171 -240 56 255 -42 -436 -38 322 -15 -214 -30
3980 -30 565 144 -112 -481 115 296 -332 -187 192 402 -252 -450 326 173 -110 -230 10 75 141 -379 32
4001 32 193 411 -264 -242 527 50 -160 -354 149 397 -263 -411 111 434 43 -492 169 338 5 -137 -16
4022 -16 150 -234 -380 -143 462 18 -358 -79 286 282 80 -39 118 219 -196 -318 382 157 -335 -295 -11
4043a1N33o55m6L13K58l34m34O49Q8l26o19O09K74K10p50O3L20J21n81l0M56N4
4065A62k59k76N10K01n52p0M08rk11m64P83j29j9l31K37M44m6m54k14M11J07n09
4087b80l3M56j5l63K91J32j05j88p5J09L31k5m72K11K22k64l35J61O71k33n58
4108c62J38K28L25o04J74K49K3P4o04N81j89M2k17L63N1j86m31J88N49m55l50
4129d13M60M10j57m60j7M81j17p04K33M80k38R1m14O65J8k38m49N68n1j98m04
4150d54L26J92K54n89K13K00k38l09O3R23j46o50J35M86o7n27K82J61k26j6l02
4171b89K86K75l64m14M60L08j36k21L8L58J4q11K27P37j87o91K47O08o9k51n53
4192d28M77K98l72j35K20K18k12k61K86RK27l92M7J27J15m38J41K85n8m25O3O58
$$ plain form
4043 -11 522 -133 -179 134 392 58 -376 273 361 35 -584 25 299 509 -241 -178 142 263 -318 -348 108 162
4065 162 -97 -373 137 338 -214 -284 124 115 -96 -560 223 94 75 -256 -19 425 379 -75 -289 122 229 -280
4087 -280 -313 143 128 -235 56 188 83 -105 -180 -71 260 235 -237 -26 196 -68 -403 -242 429 196 -362
4108 -362 -224 4 329 -275 -101 148 171 245 -359 222 33 75 -142 221 272 86 -345 -157 392 -63 -413
4129 -413 47 457 300 -160 -177 304 187 -517 -284 196 -42 49 -365 300 318 80 -369 199 148 -50 -454
4150 -454 -128 64 318 -271 -58 142 -96 -405 -342 581 435 -215 -80 406 339 -188 94 255 29 13 -289
4171 -289 -3 272 -92 -506 -46 262 126 -95 -57 301 315 -496 -269 468 281 -410 -163 445 376 125 -428
4192 -428 49 347 -25 -160 60 278 66 -195 91 100 327 -65 -18 109 224 -214 -73 212 154 -271 -208 450
4214D50k73k18N4n5L20l96k90L77M92o71j49L86K84l60l31L30M10j96k97L2M21
4235C20Pn27j0L02J20k43k72J92N32k62n21N96J10n01o5L25L57l79q8j89M51n9
4257A96n31m8P95j91m81L10j23O1j85j21L37K33k11m65N22j08J77k96K49mK5m59
4279c18L73N76n72o18K92O72k08n93K50J55J66m09PM85J83p59K04nK78o7n11L73
4301d6L94j43m14J10M56l67l86L10L63r4l82J13K25o0j44p0k2J03k1m8K54L43
4323D74n73k96L10L40k89k33K52J91R9m74Q4K99J17m94K0M71jn14j7O18j83l23
4345a22l60O40L25n92l29K93M02K7o94L70N39m94l00l9M93K04o03N3L49K92o43
4366a89J08J81J61j12k55o1M64k24n16K43N44l29l79K33J46K18n45J71L34j86
$$ plain form
4214 450 177 -41 13 -42 278 -118 -408 -31 461 -210 -359 27 311 -49 -380 -50 360 164 -133 -101 320
4235 320 327 -200 -210 92 212 -31 -303 -111 421 159 -362 234 344 -157 -222 103 460 81 -7 -196 255 196
4257 196 -335 -383 412 221 -260 50 -73 -12 -197 -318 19 252 41 -424 98 -10 167 -129 120 116 141 -318
4279 -318 55 631 59 -559 -267 405 197 -396 -146 9 175 -234 -227 258 441 -318 -114 -119 159 92 -419 -46
4301 -46 348 205 -209 -99 357 -10 -396 -86 277 183 -199 -86 139 79 -65 -135 -157 -54 -75 -123 131 474
4323 474 -99 -395 -85 255 -34 -267 -15 176 275 -199 -115 184 301 -193 -173 298 297 -217 -234 384 201 -122
4345 -122 -482 158 483 -109 -438 -145 257 284 -410 -40 499 5 -295 -334 159 363 -240 -187 162 454 -189
4366 -189 -81 100 261 149 -106 -167 297 73 -443 -200 344 15 -364 -131 15 233 -312 -141 193 7
4386Gl71K90M45k86n0o5L46r4k32k40J99L06m25J35r6M69k00o95O06O3j10k54
4408b52J53L59o3n59L12M26Q1p27k4L28J2Lk76M48j19j62j56J54M10j83n50J62
4430b23P03m07l79O8M89mm63j24O34j17k84r1L55K59m47k47L47L86n04k50L14
4451A5K52j57l44K33p4r7k06J13L36K73m91k7L59p6j35k96L38N7j76n00P69l3
4473A33l24J91j0L04l49k19J33N10J17p77K82L03j92k62k06N45J34n17J65L57
4493C18k16p6Lo7J07k36j35O17Q4l96j86l8J53q3rk29P03k56o6l23J04M25k68
4516g0J36l5L09q52J25N48Np4k70L00J42k67k94L48J53l00l98M88K51p1q66L65
4538c27M41j5J4m65M94J6l88nJ61K49j48n39M90L09k53j98J39J43j2l50J0N30
$$ plain form
4386 7 -364 -74 371 85 35 -30 316 222 -10 -250 -51 255 -170 -35 -131 338 138 -557 49 112 2 -252
4408 -252 -99 260 197 -362 -50 376 457 -270 -294 34 46 49 -227 221 102 -60 -216 -62 348 165 -385 -223
4430 -223 480 73 -306 -238 251 247 -216 -340 294 177 -107 -198 157 416 -31 -278 69 455 -49 -299 15
4451 15 267 110 -234 -1 -75 -172 -378 -265 71 344 -147 -174 185 109 -26 -322 16 73 -103 -603 166 133
4473 133 -191 0 -10 294 -55 -274 -141 369 486 -291 -9 294 102 -160 -366 179 313 -204 -39 318
4493 318 102 26 29 -38 69 -167 -302 315 399 3 -183 -221 -68 -151 -160 -389 314 58 -8 -331 -227 198 -70
4516 -70 66 31 340 -512 -387 161 166 92 -178 122 264 -3 -297 51 204 -96 -494 -6 245 174 -692 -327
4538 -327 114 99 113 -352 142 158 -230 -235 -74 175 27 -512 -22 287 34 -164 -25 118 106 -244 -234 296
4560B96j4m97J57J52jl49J18M21J18m84k57J71J64K2m45N48J93m15j93L78m4R
4582D8l15K92L56k55j25l66L29J1j81J7M29L4l29j14K37J23l01j39j64N93k61
4603h1o3m0L01q0l83J67J53J35q3L6N1P5k15j34K24J02m13J52K45L47o63M1j50
4626b76K94J86k00l2r8J54J28m56M25J9l28K98N3j18k99M31j48J50n45L42J03
4647H3L85n42l95M36L16l76J6O2J16m9l02R7K29j69qQ9J43Q7m30j10L51Q5k64
4670a50O0oJ95k51O1K27Q2k98j69K85j14P0J54j90L92j72n13K41j67n0J7L22Q7
4693A13L4J16m34K50j21k57K14J69k37K06m4k92M92Jl53k73K38K97k20J01J68
4714A68j37m44M06J91j34k8m07M01K82k38j75K01j28l9l9K58K29l85j01L33k09
$$ plain form
4560 296 282 -215 -58 94 93 -256 -138 283 401 -83 -340 -169 -5 17 -428 120 313 -102 -295 83 39 48
4582 48 -267 25 381 126 1 -365 -36 -25 -206 -189 240 274 -55 -169 68 191 -110 -249 -413 180 -81
4603 -81 -144 -184 117 37 -346 -179 -26 109 26 62 113 188 -27 -161 63 165 -248 -96 149 496 -167 -126 -276
4626 -276 18 204 4 -28 -126 28 156 -300 125 144 -184 114 167 49 -250 181 33 183 -362 -20 83
4647 83 468 -74 -469 -33 283 -93 -77 -15 101 52 -250 -153 76 -93 -101 -12 131 218 -212 -322 29 114 -150
4670 -150 -90 -96 99 -152 -91 136 218 -80 -249 36 -78 -8 146 -44 348 176 -337 -96 -263 -313 -296 26 113
4693 113 147 263 -171 79 -42 -299 -85 84 -153 53 9 -283 209 210 -143 -416 -178 119 -101 0 168
4714 168 31 -413 -7 184 50 22 -385 16 298 60 -115 86 -42 -81 -120 138 367 -18 -119 214 5
4735EJ69l44MM33J07o16J15K44l05M6LK09N4k09j6K91j86k25J30K1K27j51J9J8
4759D3j17M1j33J82O3M2k31k41K77L17k57l26K84O4j90j37N83k90P4k06M00l31
4781h9K00k57L3K38J09n00K30K1J65l05L05k77J74l62L46J53k64J69j52K46l49
4802a66L17j71j01K84j88j5N8k0J13J8j64k03M65m38R5o7K32n3k79K51n1k60J59
4825a84K41J23l85M48l42nJ76k35J33j09K87j92J8J70k41r3J57n1n3J57k41N8
4847a63K97l38N1J91Pj14q7M34j57j9l84J94O0K2P9k43M93j20l57k0L60p6k49
4870a39j73J36J61M3j28J77J79n56L58k01M74k6n01L65n4j41q1p5L65j22m5j55
4892a39P3q6r9P3K27K29l04k12L71J62j54j72pQ7K23k88j38M46j89j04k73M40
$$ plain form
4735 5 174 -170 -166 267 374 -242 -127 117 -188 -142 -139 70 124 -85 -101 190 4 -221 -91 -70 157 6 25 43
4759 43 -74 -33 -166 16 79 121 -110 -351 -74 243 -14 -340 -56 8 -182 -319 264 -26 48 -158 242 -89
4781 -89 111 -146 -113 125 234 -266 -36 -15 150 -155 150 -127 47 -315 31 184 -80 89 -63 183 -166
4802 -166 151 -20 -121 163 -25 -40 18 -2 111 129 -35 -238 227 -211 -116 -183 49 -4 -283 -32 -83 -343 -184
4825 -184 57 180 -205 243 -99 -104 72 -163 -30 -139 148 -44 -26 144 -97 -190 -33 -84 -137 20 -221 -163
4847 -163 134 -204 -153 38 45 -69 -156 278 121 102 -282 -88 -28 -6 73 -170 323 203 -154 -174 186 110 -139
4870 -139 -312 -176 -15 28 -100 77 256 -300 58 -143 331 305 -196 169 115 -26 -107 -182 183 61 16 -139
4892 -139 -66 -152 -251 -178 49 278 -26 -238 133 295 141 -31 -38 49 272 -16 -154 292 103 -1 -274 166
4914A66m6k36J17qK61n54J14K63M6p4j22j9n1J74l1l00M96m11n3L05N3K3j03j99
4938a89rK88j21Q3J2K8l35L02j70J88K17k26j25K08l1k30J50L9K22j98k0j65j38
4961b20M06n02J00L15p4j3k76M00J26l76p4P2J35j50K5J52J41j97j04K62Q2l73
4983a43K12K7L7k99K5K92j57R4l8J51k02K9L2j03j2r8j56K26K7J0j12K15m2m9
5007c4m6L51o3j62L12m58N6M60j85m15L20m12M07l05Q6J54q3K11k14l3K19m88
5029c22J77K50J36k69R1p1J20j86J31K86k51q3q4Nn6j03n7K65Q6J23o9L6J52k34
5053G3O9l01J66n8j60J85O2m1L7J7r7O9j76Q1j5m7K20j6L5j5j08O8j23J4K36k29
5079e4j80K28K43j46q7oPJ7O1k51M06j07l53L5L03M1j64L21j21j09k8j89o4J76
$$ plain form
4914 166 120 -116 1 -7 254 -300 -186 77 123 49 -73 -92 -143 31 0 -300 196 -215 -268 37 90 113 10 -189
4938 -189 -198 90 -31 52 64 92 -243 59 -111 77 294 68 -57 151 120 -110 40 79 301 103 83 -82 -220
4961 -220 186 -316 -216 99 25 12 -264 136 262 -114 -188 -116 19 -131 -106 46 187 -10 -114 148 230 -143
4983 -143 69 96 133 -166 -141 151 -6 88 50 201 -1 28 60 -43 -55 -153 -309 -83 -56 -46 -158 57 15 -34
5007 -34 -80 271 208 46 358 -100 -44 416 231 -184 136 -276 131 -174 -88 66 -17 194 -20 -53 166 -322
5029 -322 -145 105 241 -28 63 -8 112 -74 57 343 92 9 -75 -70 -126 -229 -286 -21 65 188 119 155 307 73
5053 73 142 -159 7 -51 -211 -26 36 -5 32 49 -48 21 -155 -74 -89 -136 84 68 103 88 -20 48 -75 -61 175 -54
5079 -54 -234 -6 237 91 4 -2 5 22 83 -168 238 131 -222 -187 116 157 -7 314 193 84 56 -133 -197 -21
5103b1R5j46J81L6k52n2O3J73N1m1j37L43k01j10K36j75k24L27K5l7k8q1k11L09
5127A23J38l13r7L12J46m62j47M34k08J91k57J75J8Mk02K47j47P0n6j46J05K4
5149d8n4M1P4Q9K4k21J18J0J82k15j66K54R8m35K66K73k39M3k23K70J9m05M41
5172A96j47K35n45J87Q4J18j90j11N5L79k82j43l3L01L4m14K13K63j90J48k54
5193i6R1J94k22j14J12K13k37K81j88J71k74%R0OJ48k42K07j5m20J91r9L27j17
5216Gk02J16J42j07K2J2N8O3k53K59j44J06j12M2J81J76k27m17N74%l70j39L17
5239A04p9J24m96J40M93n4l56K03j58J71jJ62j66J55l18rq5K81M2l42K01J13R1
5262B16k85j0J23J20n11L91%Q8k73RM25M4j95k48J58k03K92m98M44J02j78k46
$$ plain form
5103 -21 74 -72 109 145 -107 -159 -96 77 128 87 -50 293 92 -18 218 43 -181 146 171 134 106 25 -186 123
5127 123 261 -52 -149 163 309 -153 -300 134 -74 117 -140 35 53 57 -145 102 -45 25 -31 -177 -72 -48
5149 -48 -102 -61 13 102 126 -95 23 33 215 0 -166 88 186 -249 17 290 51 94 -129 141 160 -245 196
5172 196 49 284 -261 -74 10 128 -62 -173 -118 261 -21 -164 -197 104 138 -276 -63 200 10 158 -96
5193 -96 -5 189 -33 -147 -35 178 -59 222 34 205 -69 -69 21 27 175 -67 140 125 -295 -104 -203 124 7
5216 7 -195 -79 63 -44 -22 -10 48 111 -142 117 -27 79 -33 9 190 366 139 -278 296 296 -74 -213 104
5239 104 25 149 -347 -207 286 232 -124 79 -79 92 91 253 87 242 -76 -85 -170 111 153 -189 12 125 216
5262 216 -69 -79 44 164 -347 44 44 132 -141 -132 293 337 142 -106 52 -151 141 -357 87 189 11 -235
5284b35J74R5k01J34j02O12n20R7j30K02j21J36k59o6R0K45l01L79o7l25O6K0
5306g7M24l92j1j24M03l47j19K00L30p2j87j61L64k78r4J50K78j40k97jL05J01
5328B55k10k18L12J12k21k87J34L10q6k45L45m0j98m3k3L4J41k82J46M76l10n4
5350D8j19J04r7P9l80L66J34j26m0K4L84m46j11R3L78j73k79J75J50k89n7l8K29
5373IK12l81J23Q7J82l55n9J91J54n2l65M7L11k5j52J29R8k63j33L78J45n9m66
5396b44J15J73K04m66J80k1K31m96J53J10M59m14p0K33K04m09l08M46M4J8j91
5417d9k46M32j17j86j62L22N3j58J84K77l47O7r9j4L83m31k3J20J91k88k58L13
5439c6l8K48l10l1N86J21q03K25R3K53n11k11M17L77l34j26K85O6k43m52N44j2
$$ plain form
5284 -235 -61 34 -167 -33 -135 477 -43 54 -76 126 5 141 -118 -184 -94 151 -150 229 162 -163 -97 -77
5306 -77 347 -45 -56 -180 223 -124 -243 -43 287 215 28 -133 231 -47 -141 9 287 147 -150 -151 154 255
5328 255 45 -173 139 251 30 -257 -123 187 101 -144 201 161 -37 -80 -103 -69 72 -210 -64 412 102 48
5350 48 -71 33 -64 15 -365 1 135 9 -31 -7 377 -69 -180 -87 291 118 -161 14 164 -125 -182 -220 9
5373 9 221 -160 -37 50 232 -123 -182 9 163 111 -254 -207 104 79 -73 56 154 -109 -242 136 281 222 -244
5396 -244 -129 44 248 -218 -38 -59 172 -324 -171 -61 398 -16 -86 147 351 -58 -366 80 124 142 -49
5417 -49 -295 137 20 -166 -328 -6 47 -111 73 350 3 70 -29 -43 340 -91 -114 6 197 -91 -349 -36
5439 -36 -74 174 -136 -167 419 540 -263 -38 55 308 -203 -414 3 380 46 -80 205 271 28 -424 120 108
5461A08N4k83J20R0j52l8M4P4J85k10l70N56K40m09j24L29O9l29J33L24O6p57
5483b80J58j07L18J28k98O2J32k3l78J73k2J69l01Q6L56j89k95J54K95j36j78
5504a76o7J94K05m20Q1K70J48n31k9L71rK8k56K00j23J74j99K1K82K03o18K78
5526B7j4L77n03k19N35k75k03K1O02k11n5k99n1O15l96r3NM90j64k53P2L15j94
5549A29k05P4K25k39j89j20M04o8j55J4N6L95k59l08K81M9j7j97J64L92m04j06
5571h4j2K40m5k60J73j7L67m73L85j21J52l82l5K35J70k49k01J83L14k49j89J33
5593C5K61k59m18M27p1J73k32k52O10J02m40j65L20J49j32k70K34J48j03n33L41
5614g5K32l28N3P0L1K28n61J59P52n22q9j44O03j69m62k01O01K09k17l73K22J32
$$ plain form
5461 108 162 -121 -1 89 -63 -101 -57 17 202 -8 -378 178 418 9 -115 214 283 -46 87 411 477 -280
5483 -280 -122 -229 89 217 -81 -19 113 90 -288 -115 -137 32 -269 -183 173 -16 -311 -157 138 2 -176
5504 -176 -243 -49 156 -264 -183 87 235 -296 -325 46 37 65 -191 9 -114 60 -139 -118 164 367 -251 27
5526 27 13 390 -113 -332 203 -72 -275 -254 348 137 82 -217 -268 347 -49 -142 -137 353 189 -64 8 323 129
5549 129 -76 -2 223 -16 -205 -325 79 11 -144 -130 -74 321 62 -246 35 84 67 -130 34 426 22 -84
5571 -84 -96 144 99 -161 12 -5 362 -111 274 153 305 -77 -112 123 293 44 -157 26 340 91 -98 35
5593 35 296 37 -381 46 -25 148 -84 -336 274 376 -64 -229 91 240 108 -162 72 220 117 -416 -75
5614 -75 157 -171 -118 -48 -17 211 -350 -191 561 39 -50 -194 409 240 -222 -423 178 387 170 -203 19 151
5636A51o4j83K53J68j68l18J70M43o45K24n7K98l71j11L3M45K2k79m03O66K11
5657D85o36j31N43o3l49lK25J33m05n2Q7O53j73m59J30K39k28l50K85K07J43k02
5679G9j73J36L50p14J53O8M38l71k37K63M43o48j79N32Q7k90n51N36L92k68n0
5700dM0N14m39m05J64K19j10k38J12K10J63m15j77M75L86n21l06K38K77q6l26
5721b29J12M89k84n75K67N70k65l18o8M33J12m02p1L32K5n20l0L85N30p47K27
5742b7k59O36p9n11qO67qr48L06O57o82K04j94N14Jm35J21K54K05p15qN18%j77
5766C2n08M37K26Qo26M76N38p41k21K41L97l12j36L4L84r5k14J11%K53k40m34
5788c90N46K24n45l0K41J76m40k82P60r9qk14o9M94k20n22K61L69q5l92K08m2
$$ plain form
5636 151 87 -96 157 325 157 -161 9 452 -193 31 -26 272 -99 -210 -177 268 290 11 -392 274 485
5657 485 -151 -282 261 198 -151 -154 71 204 -201 -253 -166 487 314 -145 -15 224 -4 -354 -69 138 281 79
5679 79 -94 42 392 -322 -169 -101 337 -34 -271 -8 435 -213 -392 140 227 -63 -614 -78 314 46 -4
5700 -4 36 550 111 -294 -130 89 -21 -259 -147 63 226 -189 -366 109 495 -26 -332 -94 183 97 -229
5721 -229 -117 372 88 -487 -220 350 85 -233 -301 132 244 -158 -229 103 128 -392 -422 -37 493 -254 -27
5742 -27 -286 350 271 -240 -248 419 411 -537 -231 426 -256 -52 -246 268 269 -166 -45 209 414 -301 -309 209 209 32
5766 32 -476 -39 187 195 -431 45 583 -158 -379 -138 259 -53 -189 -155 229 134 -80 31 31 284 44 -390
5788 -390 156 380 -165 -195 46 222 -218 -500 260 161 153 -61 -130 364 144 -378 -117 252 167 -225 -17 -59
5810e9L22k99l57M56J57m59k19O37J85o17JL56N28o88j65J39L48j17m48K70j16
5831a45J33k57m1M90J9m04n4L70J98n86J01L00J78j27m88L68K81m55l85M06M11
5852C13k79k12j44N89Kp10K37J15J45m48N7L66L80n70j90M93J68j59m32K62J44
5873A27L1o04O12O0K13p27rO47O0n07j51J30J11k64N0N23o4m58k33O25k00j66
5895a94k15Q1O66l02m02M32J53j37m19L57L17j24m59J34K87L6m47j8M18L55n03
5916A6m28L13O36o60l53N29k0N9m16L82J41k33k07J43M84k29k89k31K20O01q51
5937c93J7O57k18k51j23N58l9k33r9N4L63k56n1O1K73l18m60N23J16j63l15N9
5959b38M86k9m47M0M77k90J56m96L14J82l14j44K66M07l38m66K49P39n34j22M3
$$ plain form
5810 -59 263 -36 -393 63 220 -239 -458 179 364 -253 -252 104 632 -56 -221 -82 266 149 -299 -29 -145
5831 -145 -12 -269 -310 180 199 -205 -259 111 309 -277 -176 124 302 175 -313 55 336 -119 -504 -98 313
5852 313 34 -178 -322 267 269 -441 -204 -89 56 -392 -335 31 411 -159 -349 144 312 153 -279 -17 127
5873 127 158 -446 166 226 439 -288 -297 350 410 -97 -248 -118 -7 -271 -221 302 238 -220 -453 172 -28 -194
5895 -194 -409 -328 338 36 -366 66 219 82 -337 20 337 213 -246 -112 175 211 -236 -254 164 519 16
5916 16 -412 -99 537 -123 -476 53 33 92 -324 58 199 -34 -241 -98 386 157 -132 -363 -143 458 -393
5937 -393 -376 281 63 -188 -311 247 208 -25 -124 -70 293 37 -14 47 320 2 -458 65 181 18 -297 -238
5959 -238 248 219 -228 -188 289 -1 155 -341 -27 155 -159 -303 -37 370 32 -434 -185 554 20 -102 -59
5980e9L97j86k70j07O47j83o26K97K58J20l95l7N99No37L4L5L09k05j62qM60k39
6003D7k42J36L53q5k75m03M86J68m58M2K10K15k26j46K1L91k82l57L93J44j50
6024a8l39K37K42j44m63O88q5Q7n11J47K40k75jK71k1J00m51k26O82L39n10m73
6046d84P62K7m62j55O5M81n78j45N62Pj19p7L91mJ88o00j14K82L40m97J60N8R8
6069A86k53J39K71l27n2l71M66o4j71p6J49M55l07o91O11K38q9n48K77M01j38
6090A06l09R4L46p6k09q3K91J95l37k74M95k40j81j17J68M80m16k54L85K60k76
6111D8m35K62K96Om85k00Q74mn09j16L09K37j96j6J04K01n11k59O69j65r1j56
6133a37O3J15R9l07J36rK86n14K29J62J67n70J56J90J67j98m98N75M7l96K32n6
$$ plain form
5980 -59 338 152 -118 -225 422 239 -387 -90 168 288 -107 -144 455 460 -177 -143 -108 201 -4 -166 -174 286 47
6003 47 -195 -59 294 209 -66 -469 17 185 -273 -231 -21 194 -32 -178 -157 234 -48 -405 -12 132 -18
6024 -18 -357 -120 122 -22 -485 203 118 205 -306 -159 81 -194 -195 76 55 155 -296 -522 160 499 -11 -484
6046 -484 278 305 -157 -312 -247 234 -344 -489 73 80 -39 -116 275 271 459 -141 -255 27 367 -130 30 88 186
6069 186 -67 72 343 16 -36 -407 59 -5 -176 -252 -103 352 45 -646 -35 203 114 -434 -157 244 106
6090 106 -203 -109 237 161 -48 -131 160 355 18 -256 239 -1 -182 -299 -131 349 -67 -321 64 324 48
6111 48 -387 -125 171 177 -308 -508 366 362 -147 -263 46 283 87 71 175 376 -135 -394 275 110 19 -137
6133 -137 -74 41 140 -167 -31 -40 246 -268 -39 123 290 -280 -124 66 233 35 -463 112 159 -237 -5 -61
6155f1J05P9n47O82J06j78l04N0J40m2m98L00L48j12j29r1jK85l94K55j7M1j12
6178i5P0K9M72l63l74L54J61n18N8lN15jn29K9L29nl61L8L02J00k00k02P00l67
6202A39j44r5n9N07n17L5Q3L61n25Q1J53J18m5j41k4K89J06o10L6L13J12k55j81
6225b63L13lj38j39K75N42n23l57L69K14m25R6p9L31j29j90j32M77k55j48M2J61
6247C9p2l5k84L06N38m94k65K19M36m63j54K48J45j51k66J55K68K0k77RL10k44
6269a2k41n2N62J54m11k04M95k8m12j33M20K52m15k09J76K74j23n46M05jk7k11
6291b87K17J96L0k63r6N70l8n68m9M11J70l82k67M78K1j47k94L94L52l28l30L11
6313A01J49k01r9j7K40k38L4j31O80j99n39j53P82j98l79j72M02L63n62j35K35
$$ plain form
6155 -61 44 123 -424 258 364 186 -118 -68 72 30 -468 -168 180 68 -61 -152 -153 132 -262 -7 -24 17 -95
6178 -95 -25 4 476 113 -261 93 254 -264 -206 -209 306 305 -224 -195 134 129 -232 -194 108 208 8 -194 506 139
6202 139 -5 -100 -159 348 -169 -134 -51 310 -215 -134 19 137 92 -49 -73 216 322 -288 -252 61 173 -82 -263
6225 -263 50 47 -91 -230 45 587 64 -293 76 290 -135 -39 -118 213 84 -106 -238 239 -16 -164 -122 39
6247 39 -33 -68 -352 -46 492 -2 -267 -48 388 -75 -229 19 164 13 -253 -98 170 190 -87 -78 232 -12
6269 -12 -253 -305 257 411 0 -204 291 263 -149 -282 138 390 -25 -234 -58 216 93 -453 -48 -49 -76 -287
6291 -287 -70 126 156 -107 -203 367 329 -239 -288 123 293 -89 -356 122 143 -4 -298 96 448 120 -210 101
6313 101 250 49 -50 -67 173 -65 -31 -162 518 319 -220 -373 409 211 -168 -340 62 425 -137 -272 -37
6334c7K27j84l92K12P32n13p2j18K21K05m01M1K28j5l69q2L94J89m75m3N59l6
6356B71l11k6R3J77K6n95P13l63J29k82J79L53j20k93j89L62K3l06j31N10M5n56
6378b91J18J32L77l75j20M57J81k52m66K45K23J12n70K08K71l83j42l0O24j9p51
6399d51K45M68o6l29k17M73M04p64o2L63P1k99qK04J84l9j00l83M13j02l14L52
6421D3K3J06k41N5M34j63k47k87K21J89n5k43J97J50l01j87L55P1n8o35M88K55
6443A70K30n47K3L17q9l04K87M42n82j8k61O21j17m28j58O59J56n44j3J90K32
6464B66k54l11L35j5K18l79Q9J90rn09J74L41j2k07q0l3K09k14p2L82j16L04n96
6487b99K87J04k2k53K17K4m6k35J71J96J17m26N8J15P4j37j61M09R4p21K20K27
$$ plain form
6334 -37 190 6 -386 -174 558 45 -27 -145 76 281 -120 -79 149 134 -235 -317 77 266 -209 -252 307 271
6356 271 -40 -66 27 204 230 -365 348 -15 114 -168 11 364 244 -49 -238 124 147 -159 -290 220 265 -291
6378 -291 -173 -41 336 -39 -159 298 479 227 -239 6 229 341 -229 -21 250 -133 -275 -305 319 300 -451
6399 -451 -206 262 196 -133 -350 123 527 -237 -299 64 135 -164 -172 32 216 177 77 -306 107 5 -309 43
6421 43 66 172 -69 -14 420 257 10 -277 -56 133 78 -165 32 182 -119 -306 49 120 62 -573 -85 170
6443 170 400 -147 -124 193 104 -200 87 529 -53 -71 -332 289 172 -256 -414 245 401 -143 -156 34 266
6464 266 12 -299 36 21 239 -140 -51 139 130 -379 -205 136 124 -83 -163 -196 13 -201 -273 109 -7 297 -299
6487 -299 -12 92 70 -183 34 58 12 -223 -52 144 261 -165 -107 8 82 -55 -216 193 287 -434 -214 13
6509A3K51o8l38K96J45j28k87J94J62j91j04k00O05k31k96K10J2K35k53k9J27
6530A25P0l28m7K79j0j12j94R7M93m32p8J19Q5k1k08J83K44r9l16J90j02j45M4
6553a63L6P2L93m99k14N33j7m11J63J8L02p0k80L14Q9Pl49k8J41Q9n52M4N15m1
6577I2q7M3K3j7j63J45j35L57n68k26O06J44m04L8K37J48K42q15L96K04m3m77
6599b60p2M63k2l47J53J31K30j23m12K00K24m69l8L20j9n2k18L72J44o8k06J75
6621A06r8O7n10L99K39p0j5k65J74J44l56o7L47j00k28j44J06K80N8k13Q3J19
6643E6L21m01J74J38k06l98Q3J36J8M8R1L5j07k25j03J82K11L8j05K06J02j79
6665A15k75R5K33M9m91L27L69n37k01J04N18l96L0M9J56J14k01n5J16J37m33J13
$$ plain form
6509 13 264 196 -142 154 299 171 -116 78 240 49 -55 -255 350 119 -177 33 45 280 27 -2 125
6530 125 195 -133 -180 99 89 -23 -217 -120 373 -59 -137 -18 67 46 -162 21 265 166 -150 40 -62 -207 -163
6553 -163 -127 -55 338 -161 -375 158 141 -270 -107 -89 213 143 -137 177 266 273 -76 -104 37 126 -426 -382 133 92
6577 92 5 48 71 54 -109 36 -99 258 -310 -536 70 214 -190 -152 85 233 475 -340 56 260 217 -260
6599 -260 -332 131 109 -238 -85 46 276 153 -259 -59 165 -304 -342 -22 -41 -93 -311 61 205 137 -69 106
6621 106 8 75 -435 -36 203 133 118 -147 27 171 -185 -252 95 -5 -233 -377 -271 9 67 -146 -63 56
6643 56 377 -24 150 288 82 -316 -233 -97 -79 -31 60 95 -12 -237 -340 -158 53 91 -14 192 294 115
6665 115 -160 -65 168 217 -274 53 422 -115 -316 -212 306 -90 -60 -11 145 259 58 3 119 256 -177 -64
6687f4l3N27m32n1LM13k28j56O5K13k04l60L38J54q5q7j68J32L55p42O38k75K75
6710B28m22j80K92J40p5J2K92K0n86J60Q5J38j07m52N61RJ73l75j18N07k51j85
6732a34kK44L0j57k39J31J90j99n5K20J58j78k77J90K85ln79L56L18n57j3Q9M31
6755B49j93k43J7K92J70j88l65L58j24j9j3N6K0j62j44L85M4J4m33M3K45k56J51
6778i6p2L21K2m19L1M97j30k98J40Q7n9l01L47lL2R7j82P0J55k89m2O8M1j59k38
6803c80J57M23k09o9RN25m33M1j25k03L58j06MK69o6ql81o3N19j1j95Jo1J76l6
6828A36j28o6N6k60k0N34k38j21k34N11N7j99j69K59j92M24m99K74L17o44M5M03
6850B46k28J19j93K0J01P3k69K87J0j23j68j72N38k11j44%J34J39l04j02l6L90
$$ plain form
6687 -64 -97 430 -2 -53 -50 363 135 -21 44 257 53 -307 31 185 100 13 -155 -23 332 -410 228 -47 228
6710 228 -194 -374 -82 58 -17 -5 287 307 -279 -119 -34 104 -3 -455 106 115 288 -87 -205 302 51 -134
6732 -134 -136 108 138 -19 -258 -127 63 -136 -191 29 187 9 -268 -78 207 204 -375 -19 299 -258 -271 -182 249
6755 249 56 -187 -170 122 292 104 -261 97 -27 -46 -59 -3 17 -145 -289 96 140 154 -279 -236 9 -247 -96
6778 -96 -168 153 175 -244 -213 284 154 -144 -4 83 24 -277 70 67 99 196 14 84 239 -50 -92 -24 17 -142 -380
6803 -380 -223 200 -9 -78 -69 456 23 64 -61 -264 94 -12 -8 261 195 187 -194 -257 262 251 56 57 -4 172 136
6828 136 8 -58 -2 -262 -282 252 14 -107 -341 170 227 28 -141 118 -74 350 -149 125 442 -202 -157 246
6850 246 18 137 -56 -36 65 138 -131 156 166 43 -125 -297 241 30 -114 -114 20 159 -145 -247 -283 107
6872A07j77O9mM21l58l72J82j26L58n2k69M58k28r2J67N7j21j82M0O3L39k90p1
6895h1K46m0j97M0l25M64l23K63o5K38n08K85k33O10n58k11L31J42Q8k51m2O2
6917f5K85R7n56L24pQ5r4p2n1MM2l78Q14l84Jl6n9J51k49k33N76k32j16o0L72
6942A59k9l07mO00l71k1k27P7M20l20j1K3K0j06j15P3L08o9l38L85l30L00k25
6965a08j37N05j31m0L6j14L72k94l34L19J58m13j14J6K81M4j48r4K49Q8l13L24
6987A52l53L09l09R9K68O6l51k95O21J96m31j70L36j00j17m6P1K33k44l13L25
7008e3J0L48l76j69M12o6m0k00J87o9J82k39Q7R9l33p9L6K70K93m67j7M41j81
7031G6l18O3L88J09m80L2M49j95qm74L96L8j60K42j22j31k3k00L45p0J54m19L62
$$ plain form
6872 107 -70 -1 -5 416 58 -314 -132 -258 100 48 -221 237 9 -83 84 141 20 -162 -122 -59 280 -10 -81
6895 -81 165 125 -72 -32 -357 107 -216 47 -18 220 -288 -3 -236 374 -184 -395 -64 78 166 -85 -127 -65
6917 -65 220 317 -239 85 78 163 69 -3 -54 -50 -8 -386 428 44 45 9 -50 101 -148 -381 195 -37 -153 -213 159
6942 159 130 -177 -181 419 48 27 -200 -123 297 -23 -34 -11 9 -97 -212 -139 169 100 -238 147 -183 117 -108
6965 -108 -245 260 129 89 125 11 383 89 -245 74 232 -181 -295 -279 2 46 -102 -196 53 141 -172 152
6987 152 -201 108 -201 -102 166 232 -119 -414 207 403 -28 -198 138 38 -79 -125 -54 179 -65 -378 -53
7008 -53 -43 305 -71 -240 172 106 66 -134 53 -16 166 -73 14 113 -220 -299 -263 7 300 -167 -184 257 76
7031 76 -242 -179 209 318 -162 -130 319 124 116 -358 38 76 -84 158 36 -95 -118 -318 27 -43 111 -308 54
7054E4R0l63m1L64q2N2l26J15J08L88n30N5N31k16j3j13Q5O1k26k49J83K65j02
7077I0j12K70J4j4l93OL83k78L6K7j9K15k86j1N6K83k78j19O47n77K8j66N3N95
7101D50j90l38J70J5K9j41j5J60o3j40K21K6k77j29K89J42p8p8r9Q0J56k06l16
7124c32J27N16j31k00P0J59l50L6K60k49L44l10J87J6l3j43k8J65j21j50L79j48
7146F4J05l05K15J6K10k23RLq5j34K89j49m6r6J54j70J67K15p2k14J59lk75K58
7170I2r5M1k31m5K21m7J46j79k1M8J86j77j08M24l75L44p8J10m6k01l31O31j44
7193A65k20k00M84k61p9K83k21q8L21m59K7K62L82p65L28kK11n26K67J93k48l84
7215e30M34L97n95L82l20L22q9K1k63L33J57l02N0J56j1l02J26K3J69J32n86L44
$$ plain form
7054 54 144 -219 -260 104 22 74 -252 -137 -29 359 -171 -116 415 199 186 73 158 219 -7 -256 -73 192 90
7077 90 -22 248 262 248 -145 -139 244 -34 2 29 10 225 -61 -72 -16 267 -11 -130 517 -60 -32 -198 -145 450
7101 450 260 -78 92 107 136 -5 -20 140 77 -63 158 184 -93 -222 67 209 131 53 -46 34 190 -16 -332
7124 -332 -205 311 180 -20 50 209 -141 -105 155 -94 250 -60 127 143 110 -33 -61 104 -17 -167 212 64
7146 64 169 -136 79 95 305 82 91 94 9 -125 164 15 -31 -127 27 -143 24 239 167 -47 112 109 -166 92
7170 92 -3 38 -193 -238 -17 -64 82 -97 -118 -70 116 -61 -169 255 -120 224 146 256 210 9 -322 309 165
7193 165 -55 -255 229 -32 -111 172 -49 -137 184 -275 -248 14 396 -369 -41 -43 168 -358 -91 102 -146 -530
7215 -530 -96 301 -294 88 -232 90 1 22 -241 92 249 -53 -3 153 142 -160 -34 -11 158 290 -296 48
7237D8q0K42k74J8J29j4l13J97J09P6j51k24J59N6j16J2J72K4q8RK86k04n0r5
7261g2J87K70l59k17J06J78k15K50l66L28J08l76J2N9K71q8l23N48j81L5j60j3
7283a8J67k33K6KK85r7j60n8M0p3J0j4K25N7l52jJ80J34l66K59j25J14q0j26J67
7308c7L36m03j6J77L52n58j8r7K72m4r3K83j25j60J55k4P4qj48J64o6M5l11J59
7332i1L19o9k08k44K93K86p5k71P3J61l7l68K80N4k2J54o08M44L4l46R2J0J02
7355c7n4M6J48O4l93J38j9K94J02n09J37N8P1l45L42J69k08k0n1J67K68l65K0
7378B3k08J07R6j43K42K12k80O8P2k96K38m00K35J99k11K38q2m4j47k07K19%K9
7401d0k6j36L25K11l47k24J27j24L18k85K02K84k31j13Q0O2q8l28M31j45j8l56
$$ plain form
7237 48 -32 210 -64 -46 83 69 -244 -47 62 138 -13 -237 -78 -22 -138 -126 46 70 -18 -9 277 73 23 -72
7261 -72 115 385 26 -191 -85 93 -122 128 -238 90 198 -178 -166 -107 164 76 -247 301 120 155 -5 -18
7283 -18 149 -84 -58 -56 229 132 -28 -86 -46 -119 -109 -123 102 159 -193 -194 -14 120 -246 13 -112 2 -78 -204 -37
7308 -37 299 -104 -120 57 409 -149 -167 -264 8 -36 -129 154 29 -131 24 0 74 66 -82 82 16 61 -250 -91
7332 -91 228 159 -49 -293 0 286 211 -60 13 174 137 -231 49 103 81 235 -373 71 105 -241 -149 -139 -37
7355 -37 -91 -45 103 167 -226 -88 -107 187 289 -220 -83 -25 46 -299 43 212 4 -16 -67 100 368 3 23
7378 23 -185 -78 18 -125 117 329 49 117 189 -107 131 -269 -34 165 -46 192 110 66 -81 -288 -69 -69 -40
7401 -40 -66 -202 123 334 -13 -237 -110 -234 84 -201 1 285 54 -59 21 83 -5 -333 98 -47 -65 -421
7423d21L92J27K4k11J62K4K56n69Q2n1L1L01l76Q4L25k49j53L40k31J69k62J66
7445d0L46k56j1j16Q1K04k97J06p8Q2oj35M28k13k5r2J24m3R0n6L6p0l13O6Q7
7470a01L02m8p51N90J11J59n44J97j2R7j3j34K73j98o8j66M10j28J79j91L61q7
7492B38j41m0p2M5p6j5L5M9J69j90j26J21J84l48R5L52k05O4k03j70M33l81K68
7515H6j46J58L0m12K13M55l33m90K49K70j04j34L31l17k6J93j73J34J30k28o2
7536a76Q8J3j52j46N90n2k14Lk3J59l3j73J22J03J22k29j62N00j65J31m10J41
7558C7J19O0m88J65Q6m6j21K90j84q5K12j20J18o7q4r4Q2L25k65K26J28n6n02
7581b64l1K35K44r9m01N69j52k76K32J71l14L7q2J47J33k1j48J4N2j08m5l9K63
$$ plain form
7423 -421 -29 98 122 -89 73 97 353 -216 -134 -185 -154 147 -229 -145 180 -69 -222 118 -113 56 -206 -40
7445 -40 306 50 39 -77 4 208 -89 17 -61 21 15 -120 308 95 70 -22 102 59 149 93 129 59 -254 -188 -101
7470 -101 201 153 -598 -8 103 262 -282 -85 -97 0 -13 -147 126 -72 -140 -306 104 -24 155 -36 325 238
7492 238 97 57 -15 30 -46 -61 -26 23 192 2 -124 -3 181 -167 -72 280 75 139 -64 -234 199 -182 86
7515 86 -60 98 128 -284 -71 384 51 -439 -190 80 -24 -158 173 -144 -170 23 -150 -16 114 -114 -176
7536 -176 -88 -75 -227 -373 217 165 -49 -46 -69 90 57 -116 6 109 231 2 -160 340 175 306 -104 37
7558 37 156 216 -272 -107 -21 -67 -188 102 -82 -167 45 -75 43 -24 -108 -202 -120 205 -60 166 294 238 -264
7581 -264 -295 -60 184 85 -316 253 101 -175 57 228 -86 -49 -131 16 149 128 -20 -6 46 -62 -107 -146 117
7604A17j26j55L5J72N1Ok17J61L9j75j41O08l68J76k5j16K73j73m55M14j10K32
7626B23k10p6K58k89J70k29K68J85l45r4L78L9j59j95J67R6q0P2po2L1o33L67
7649a25K17j42r6J68K52k69j34j07M53n9k85n5M61p0o83O49q8p2J28k04J26L6
7671A01Kk16L9J10P2m02L07J20j57j07K50J72j31j58k50L06N1l1l00L98JL3m80
7694b70L18J0R3k57P0j22J79k18r1N76j78k76N7Q9K59k18j30K85l36M46l77K74
7716A83q2j53l9K85p6j45N6l9L14k56j51K7K13n2M2j40J62k40J49m1k76K08p7
7739a28K75j79r1Q9j54kJ44L9l7q5L35j57k29K3K60j58L4p0J23p2l6J85k5K35
7763C19l07k24L54J0m13K04j75L56j10n1P0k4p5j7M0J34j41j99K39K39j58j32
$$ plain form
7604 117 -9 -164 -129 43 94 100 -117 44 83 -92 -233 375 7 183 158 42 315 142 -313 101 -9 223
7626 223 13 -63 195 -94 76 -153 115 300 -45 -139 239 278 119 -76 91 187 107 179 172 110 141 -492 -125
7649 -125 92 -50 -146 22 274 5 -129 -236 217 158 -127 -182 279 209 -474 175 87 15 143 -61 65 101
7671 101 103 -113 -74 36 108 -294 13 133 -24 -131 119 291 160 2 -248 58 109 78 -222 176 177 210 -270
7694 -270 48 58 151 -106 -36 -158 21 -197 -288 288 110 -166 -109 -20 239 21 -109 176 -160 286 -91 183
7716 183 101 -52 -91 194 118 -27 29 -10 304 48 -103 -76 137 85 127 -13 149 -91 58 17 -259 -51 -128
7739 -128 147 -32 -123 -34 -188 -190 -46 -7 -44 -129 206 49 -180 -157 103 -55 -21 -91 32 -40 -76 109 84 319
7763 319 12 -212 142 152 -261 -57 -232 124 14 -37 33 9 -66 -83 -43 91 -50 -249 -10 229 71 -61
7785f1J07J10j84m6j64P0L73l56O2K5n1L14l57L07Q8l60k7J57j50L49k05o2K49
7808A88k00l4o7J43K06k83k01L97J27m38K7R3K01l31K83Lj95n7k48L22J35j21
7830e0j23p3K49R7j14M3J54j49j35O5L75l78k50k35Q83l50j19L8J23k5J19l34
7852a89K12K07l35J72j68J20J43ol6j74RJ44j61L56l98K6L58l35K02j33p2J07
7874D9J82m66J45m2M10k78r8K25j72K96l80J11J69n6l80K04L55k67q1L0J17j9
7896E4k00K4k9K05rj62K34lJ19p9k1k4j15r5m5K42k72j5J65K07K23m44R8o8J43
7921A33q2k5k17M79j70Q2j57K02j40J93l81J03R1k91O6J76j43k54K10L65r5o4
7943H1q3Q8m5m0l26K54J67n20L92J8K07k03j13O2L90k92l72L06M6J12l20J31J00
$$ plain form
7785 -61 46 156 -28 -74 -238 -168 205 -151 -89 -64 -115 199 -158 149 237 -123 -150 7 -143 206 1 -61 188
7808 188 -12 -46 -113 30 236 -47 -248 149 276 -162 -135 -42 159 -172 111 114 -81 -138 -386 -64 71 -50
7830 -50 -173 -246 3 100 -14 29 183 34 -101 -36 339 -39 -289 -524 359 9 -110 -72 51 26 145 -189
7852 -189 23 230 -105 67 -101 19 162 156 120 -54 -45 99 -62 294 -104 -78 280 -55 147 14 -58 49
7874 49 231 -235 -90 -132 278 0 -98 127 -45 251 -129 -18 151 95 -285 -81 274 7 -74 -44 73 54
7896 54 -146 -122 -151 54 45 -117 117 114 233 154 133 109 -6 -101 -146 96 -176 -191 -26 181 404 -40 58 -10 133
7921 133 51 26 -191 288 118 200 43 245 105 298 -83 20 111 -180 -114 62 -81 -335 -125 240 145 81
7943 81 -2 86 41 1 -325 -71 96 -424 -32 -14 193 -10 -123 -61 329 37 -335 -29 17 129 -191 -60 40
7966D0L29l75J73j17k9n7j35L39k22P7J17k28K92l46K83J50k78K42l31J38J82
7987B44k67j19K29J03O3m44q0K74n1j03l3J58L1N9j06J33J79k77k48K02L76k52
8009G1j50N3N0J40l07%mL43k50o0J37J09j53J63j38r4J31j27L05k10n8p6K2J19
8033A6j21J4L6oJ69l57J00K44P5k83K28j13J6j64j12N63k72P7j85m6J21j9k73
8056b92L91q5o9L6J2O0j44J6J1P6J34l64N75l00R9l13J43R9J0q3l22M75o1j82
8080g8Q9j00K37m8k76J18M01k84j6M4K16j70l07QJ65P8l15q9L87k40p4J93n1N
8104a07J10J26j21L60l91j58K75p4K1M1j20k8j60L15K13k33j70J74k69J94jPk08
8127b04L56O3j91m1o9L00j79k39L21p8k63j4O4L18k44K5q4L93j47M6l01J45o3
$$ plain form
7966 40 369 -6 167 50 21 -36 -171 168 -54 23 140 -88 204 -142 141 291 13 255 -76 62 244
7987 244 -23 -142 87 190 253 -191 -271 3 -48 -151 -184 -26 5 64 -42 91 270 -7 -255 -53 323 71
8009 71 -79 -26 24 164 -143 -143 -147 196 -54 -114 23 132 -21 142 4 -90 41 -86 219 9 -49 -125 -103 16
8033 16 -105 -91 -55 -61 108 -249 -149 95 170 -113 115 2 18 -146 -258 305 33 110 -75 -121 0 -19 -292
8056 -292 99 14 -55 -19 -7 53 -91 -75 -64 12 146 -218 357 57 156 -157 -14 85 95 12 -310 165 104 -78
8080 -78 11 -89 148 100 -176 -58 343 59 43 87 303 133 -174 -166 -1 77 -238 -327 60 -180 -254 -61 -112 -107
8104 -107 3 129 8 368 -23 -181 94 20 41 82 -38 -66 -226 89 302 69 -101 73 -196 -2 -3 4 -204
8127 -204 152 215 24 -17 -86 214 35 -204 117 39 -224 -238 -174 144 -100 -75 -159 234 87 133 -168 -23 -86
8150h6k2j79J10K95j50o0k6N03m15k13L07J33k53j60K47Q4j05l5k44M95k36K4
8172A4p0k8L03k23j9N7k65J34k19M27L12m21j85K37J34j7l71K29j12
$$ plain form
8150 -86 -108 -287 -177 118 -32 -92 -118 385 -30 -243 64 197 -56 -216 31 115 10 -25 -269 226 -10 14
8172 14 -56 -84 219 -4 -23 34 -231 -97 -316 111 423 2 -183 54 188 171 -200 29 -83
8191h3
$$ Imaginary data points
##PAGE= N=2
##DATA TABLE= (X++(I..I)), XYDATA
0@%%%%%%Qj6J6j6K4l2M0n6P2q8J12j39J64k01K48k96L52m16M88n71O67p74Q89
29D75j022J175j343J526j729J956k206K479k779L111l476L873m306M781n300N867
45C082o485P158p895Q705r592J0564j1638J2827j4147J5621j7277J9151k1296
58a1222K3773k6671L0123l4313L9522m6204N5131o7731Q6981j20305J93655o24457
70e01718L82037J179537j177280n54985P84637L11114o58840J90985L64139m58439
80a38813l07624O38738J58939n21632o4597L83844p9054j13630J45477j12588
90a0940k57218L04718K73084l76041k34771M20182J14932l82553R553L21515j46288
101C6173k31651K16147J43421k09596O562J62030j62507j12954K77796J9855l49230
$$ plain form
0 0 0 0 0 0 0 0 8 -8 8 -8 16 -16 24 -32 40 -48 64 -75 89 -112 136 -160 192 -224 264 -307 360 -414 475
29 475 -547 628 -715 811 -918 1038 -1168 1311 -1468 1643 -1833 2040 -2266 2515 -2785 3082
45 3082 -3403 3755 -4140 4565 -5027 5537 -6101 6726 -7421 8200 -9077 10074 -11222
58 -11222 12551 -14120 16003 -18310 21212 -24992 30139 -37592 49389 -70916 122739 -501718
70 -501718 -119681 1059856 -117424 -672409 112228 423342 -235498 -44513 319626 -138813
80 -138813 -446437 192301 351240 -170392 -234989 148855 69801 -43829 101648 -10940
90 -10940 -268158 36560 309644 -66397 -301168 119014 233946 -148607 -139054 182461 36173
101 36173 -195478 20669 164090 -45506 -38944 123086 -39421 -152375 125421 145276 -203954
112b03954P5473L57833j81319l01090L14708K46091m24254j90883M69630J10714
122B72949m64122j7742M04088p5916k98535J73790J93630k34282r4323K42263
132A01800l015k07942O7387J12049j06163K3177J21301j66511j20120K84371J11685
143B18019l34927p7942L14888J1132k36632P9616J19379j76481j990K36877j01020
154E0919k33190J92234J69140k69870o3745L20727p0153l42867K03050L24428
164B80673l09793k61579L78490J72020l95356o5699L67471l6004k98291J23846
174d4222K08401j71589j15871J53679J1481r3148P9571M266j43425R9756J83609
185A72508j83549j78413K42389J20960k86481m1071L01522m1191k76009J19131
$$ plain form
112 -203954 -128481 229352 48033 -253057 61651 307742 -116512 -307395 162235 272949
122 272949 -191173 -208915 195173 119257 -179278 -5488 188142 -46140 -140463 101800
132 101800 98785 -109157 -41770 70279 -35884 -12707 108594 -57917 -178037 106334 218019
143 218019 -116908 -194850 120038 131170 -105462 -25846 93533 -82948 -84938 151939 50919
154 50919 -182271 9963 179103 -90767 -154512 166215 96062 -246805 -43755 280673
164 280673 -29120 -290699 87791 259811 -135545 -201244 166227 130223 -168068 -44222
174 -44222 164179 -7410 -123281 30398 41879 -51269 28302 32568 -110857 -11101 172508
185 172508 -11041 -189454 52935 173895 -112586 -153657 147865 106674 -169335 -50204
195e0204K29487j65773j62964J76424P4361j65653Q523J23344p9674n4954J37603
206G0520j7039j67164Q2033J64836j38340j33671J85447Q9139k13946k8057K28887
217A22645l0420k26009O7884J92126r3687j39231J03581P8012r3283r124O7277
228C9771n6363l1003J00509k2432j20895Q1129J19292j29826q5357J74442L6196
239A05463k06239J5326K08614p1607j83617J15953J30285j42197n6056J49585
249F5510k3406j37789R1979J01522j41499m1087J70596l0308j68973J05887J43323
260A35755j69289j01792K08072N1075k19784Q07K03127m5923j62662P3507J01480
271G4373q2897l6006O6656k2849k7911P0421k0913r8668P7232J07320j31717r3491
$$ plain form
195 -50204 179283 13510 -149454 26970 101331 -64322 -55799 67545 -12129 -67083 70520
206 70520 53481 -113683 -31650 133186 -5154 -138825 46622 135761 -78185 -106242 122645
217 122645 92225 -133784 -65900 126226 32539 -106692 -3111 74901 -18382 -27506 39771
228 39771 -16592 -47595 52914 30482 -90413 -9284 110008 -19818 -105175 69267 105463
239 105463 -100776 -85450 123164 51557 -132060 -16107 114178 -28019 -84075 65510
249 65510 42104 -95685 -3706 97816 -43683 -84770 85826 55518 -113455 -7568 135755
260 135755 -33534 -135326 72746 123821 -95963 -95156 107971 62048 -100614 -27107 74373
271 74373 -8524 -44530 22126 -723 -28634 41787 20874 -77794 -562 106758 -24959 -118450
283a18450J75126N8995k01073j1895K08333l9404j99862Q2564J74135j13399j35970
294a20900J26240Q7116j17230l2496Q9625j7187m6465N5408j318p6671N3034Q2536
306H1692r9423p0946J36025M2983j60051r659J63781k5875j50174N4009J22897
317H5259p2921q5920P9533M3643p2936j657N3473k9815k0179N0379j9024n5574
329d5739N8372M6880r5986k9062J26854K56j45707L3289J48094o6598j35437R1169
341a3615J09592j05244p2862J10364L2273r9183J1514P5025m9082m0204P4040
352C2618j637q3647M3236P6890q0351n7791J06725K6113j22125R505J19841m2965
364B6412j00352O8882O9287p8039k9975P2303r577n1955M3989J8995o7917K4624
$$ plain form
283 -118450 56676 115671 -85402 -97297 111036 71632 -128230 -45666 128469 15070 -120900
294 -120900 5340 92456 -24774 -57270 32355 15168 -31297 24111 22793 -53878 -844 81692
306 81692 -17731 -88677 47348 90331 -69720 -79379 84402 58527 -91647 -37638 85259
317 85259 12338 -73582 5951 49594 -23342 -24999 28474 -1341 -21520 28859 9835 -45739
329 -45739 12633 59513 -36473 -65535 61319 61575 -84132 -50843 97251 30653 -104784 -13615
341 -13615 95977 -9267 -82129 28235 60508 -38675 -27161 47864 -1218 -41422 32618
352 32618 30981 -52666 -9430 67460 -12891 -70682 36043 62156 -59969 -50464 69377 26412
364 26412 -73940 -5058 64229 -13810 -43785 28518 18941 -33014 10975 29970 -37947 -13323
376a3323P5801p1422o7870J11398M5305j42621j5861J59827j7216j60479M9942
387d6519J46146p4337j16610Q8202P9096q7233m0110P3968O303m9088J9107J6683
399A5608l4558J9118L4743n6102k4873Q5833M232j04315K0369J11209m4368j06427
411g9531O6127R1533q0574o7052Q6507L9524p8656j1827N8891j1902l1921K7798
423H917j929l6869L7367L5373p0006k4102R5234M777j10582K0837J14887m6264
435B7640j06660O9304R1161q4760o8000R1016L9327q5856j1655O9044j1873m5126
447b6438K6079J4012l1199J7556K5622m8227j0380P4320j1495q7469L6883Q8272
459F7536o0268p4886P8783N2360q9734k1902Q9824r525p8841L5778N2218n4446
$$ plain form
376 -13323 62478 -8944 -76814 34584 79889 -62732 -78593 81234 64018 -96461 -46519
387 -46519 99627 25290 -91320 -3118 75978 -11255 -51365 22603 28906 -20182 -1075 15608
399 15608 -18950 168 34911 -21191 -46064 39769 44001 -60314 -39945 71264 26896 -79531
411 -79531 -13404 78129 -2445 -69497 17010 56534 -22122 -33949 24942 13040 -18881 8917
423 8917 6988 -29881 7486 42859 -27147 -51249 43985 48762 -61820 -40983 73904 27640
435 27640 -79020 -9716 81445 -3315 -71315 19701 59028 -26828 -38483 30561 18688 -26438
447 -26438 -359 13653 -17546 10 25632 -22595 -32975 41345 29850 -57619 -20736 67536
459 67536 7268 -67618 11165 63525 -26209 -48111 41713 32188 -46653 -10875 41343 -13103
471a3103j5680N9995k5384n4566O5580M0638r7132j8161J15724j0271j16011M2256
483b6115J01710p0211p6824Q9613M6821r5948j9872Q5680l603o2204J9690K6183
495A4920k6358J2732K2866m8163q271P4214j2244q6691L7131Q7662o1006p7831
507g1039Q2334O0723r3793l9642R2287J5641q0776M848N9852k1647l4627L2004
519F165Q900l4258J7035K5516l8892q206N7740j3273o8379L6394P3209n7839p0943
532f6831P5253N9748q8765m3050R2533K3325q6474l907P0588j3707m7416K6246
544b457J8977l1443J2850K9546m0590j6373O0654m829o9752L1521O6289n9413
556e020n2597Q2885L0900j00352m848J02223k0369q9221M2246O2373n5735k8129
$$ plain form
471 -13103 -28783 31212 5828 -48738 16842 57480 -39652 -57813 57911 47640 -68371 -26115
483 -26115 75595 5384 -71440 18173 64994 -30954 -50826 34854 31251 -30953 -11263 14920
495 14920 -11438 1294 24160 -24003 -32274 41940 29696 -56995 -19864 67798 6792 -71039
507 -71039 11295 72018 -21775 -61417 30870 46511 -34265 -29417 30435 8788 -25839 6165
519 6165 15065 -19193 -2158 23358 -15534 -23740 34000 20727 -47652 -11258 61951 4112 -66831
532 -66831 8422 68170 -20595 -63645 28888 52213 -34261 -38168 32420 18713 -28703 -2457
544 -2457 16520 -14923 -2073 27473 -13117 -29490 31164 26335 -43417 -11896 54393 -5020
556 -5020 -57617 25268 56168 -44184 -49032 53191 32822 -56399 -14153 48220 -7515 -35644
568c5644N9644p163n1366M0240L3628o4403o128P7384k5955p8348N3586O6958
580F2433p4653m6991Q3936K2305q2136K618O7873k3639m3687L7022J4570l9129
592a9478J5014L2708l7884j5872N2998q290n9698L4581N6947n8826m6204P6047
604B2043K9576q4962j2406Q2842m285p2090J8230N4632k6685l0779L0346N879
616A2341k7345J7997J8561l5915m789M6769j3163n2976L2546N2116n0720m6978
628e1556O5396L4885p3425j9445P3588L845o6447J0928N5053k1261l6942K6716
640A335J5515k4843O721J3505k5990L938M0211k6272m8156M8505M6996o9123l7552
653e5210Q3025K0035q7764L510Q3787k6077o9910M3527N0052n2830k4411N1648
$$ plain form
568 -35644 24000 16837 -34529 5711 39339 -25064 -31192 46192 20237 -58111 -4525 62433
580 62433 -12220 -59211 24725 47030 -35106 -32488 35385 11746 -31941 5081 19651 -19478
592 -19478 -4464 28244 -9640 -25512 27486 19196 -40502 -5921 51026 -7800 -54004 22043
604 22043 51619 -33343 -45749 37093 32808 -39282 -21052 33580 6895 -23884 6462 12341
616 12341 -15004 2993 21554 -14361 -19150 27619 14456 -38520 -5974 46142 -4578 -51556
628 -51556 13840 48725 -24700 -44145 29443 33288 -33159 -22231 32822 11561 -25381 1335
640 1335 16850 -7993 -1272 12233 -13757 -9819 30392 4120 -44036 4469 51465 -17658 -55210
653 -55210 27815 47850 -39914 -36404 47383 21306 -48604 -5077 44975 -7855 -32266 19382
665A9382k018m0843K6473K0328m4139L727N1324l0101m7926N1862L5204o6555
677b3282j6721P3495m434o9172K4919N5749l7352l5646M1845J2226l6708R491
689e590K4067k7776o213L7782j4846m0685L5845L5226n4006k4848O5609J3033
701C7598o9649M89O6579j1614n7071K1755M3607k8728k7404L0660J1884k7287
713i181L59J8632j1918o595K0195r855k4039K5643K5404l9832k1672N0779J4425
726C2345n5622l531N5433p369n0899J8316M1342k6035k7742K7083J0848k1853
738g684N409R945k0032N601L0068k3169l3657M1617K9575n6719j7600O7158K038
751C2550p0172J4786O5826k9076n4322L7878L7839m1432j8742L6140L52k5591
$$ plain form
665 19382 17364 -23479 2994 23322 -20817 -17090 34234 4133 -43793 8069 43273 -23282
677 -23282 -40003 33492 29058 -40114 -15195 40554 3202 -32444 9401 21627 -15081 -5590
689 -5590 18477 -9299 -15512 22270 7424 -33261 2584 37810 -16196 -41044 24565 37598
701 37598 -32051 -31562 35017 23403 -33668 -11913 31694 2966 -24438 6222 18106 -9181
713 -9181 -8822 9810 -2108 -8703 11492 1637 -22402 3241 28645 -11187 -32859 17920 32345
726 32345 -23277 -26808 28625 21256 -29643 -11327 30015 3980 -23762 3321 14169 -7684
738 -7684 -2275 7670 -12362 -6761 23307 138 -33519 8098 37673 -19046 -36646 30512 32550
751 32550 -37622 -22836 42990 13914 -40408 -2530 35309 -6123 -24865 11275 11627 -13964
763a3964J4151Q724k1363J0344K2396k8752j7141M5074P592n5718N271N9627j8042
776A8199n5404K9386M3507l6396k8541L8052J1105l4718M488K5610j7071j1776
788a3559K4705n216k5318K2075K0781l5913j1609M6266J012n1436J1005N1055
800C3848k1890m6282K9708L6233l3103k4844L0866J2870k4480k749J5153n895
812e65k763J1517j0062j2378K2799J0410l2577m722L9152k651m2624J0871M1826
825B8233j9647l7445K5803K8847k9197j8666K8035Q292k2909J832J4364r470k402
838d330J4260j0864j4608K5527J0081l7348k327M5713q314m9136J8000M7294k7359
851F589m0890L3653K9189l4400j6182K9919M281k0431N620Q387j0945N548J2263
$$ plain form
763 -13964 187 8911 -12452 -2108 20288 -8464 -25605 19469 27061 -28657 -23386 36241 18199
776 18199 -37205 -7819 35688 -708 -29249 8803 19908 -14810 -10322 15288 -1783 -13559
788 -13559 11146 5930 -19388 2687 23468 -12445 -24054 22212 23224 -28212 -17207 33848
800 33848 11958 -34324 -4616 31617 -1486 -26330 4536 17406 -7074 -9823 5330 -565
812 -565 -3328 8189 -1873 -14251 8548 18958 -13619 -18341 20811 18160 -24464 -13593 28233
825 28233 8586 -28859 -3056 25791 -3406 -22072 5963 14255 -8654 -6822 7542 -1928 -4330
838 -4330 9930 -934 -15542 9985 20066 -17282 -19609 26104 17790 -31346 -13346 33948 6589
851 6589 -34301 -648 28541 -5859 -22041 7878 12159 -8272 -2652 5735 -5210 338 12601
864A2601j9420p586L1093j590l8840J2395M1034k4041l8391L2420L1591l7865
876f599k1914L8457J1617l3960j633K5785o268j3036R791O99j0098J2024O571
889A1436k2014j244K9789p077l4472J5703L4284k3273l1345K8609K5354l1200
901e450j7766L0886R891k6545j765J9171l187r823O015p72n473J1182Q80j9512
915a2268M831K5873j3096k9032K0426K9001k8146k4582L2492J8577l3352j0453
927a9729L0515L977k4710K403J6573p281n969Q875n028p353J4954K112k2885M050
941i496K7636j1710k9377J8993K8695k5794k3829K9915J7627l0526r683K7559
953A0010L518k2264K089J3982n216l932M365p321o39J6692o136k4071J4355K7505
$$ plain form
864 12601 -6819 -14405 16688 15098 -23742 -11347 29687 5646 -32745 -325 31266 -6599
876 -6599 -28513 9944 21561 -12399 -14032 11753 5485 -7551 2240 2939 -7159 4865 11436
889 11436 -10578 -11822 17967 10890 -23582 -7879 26405 3132 -28213 396 25750 -5450
901 -5450 -23216 7670 17561 -8984 -10749 8422 5235 -4588 1427 655 -4818 6364 7244 -12268
915 -12268 -7437 18436 5340 -23692 -3266 25735 -2411 -26993 5499 24076 -9276 -19729
927 -19729 10786 14763 -9947 -7544 9029 1748 -4221 4654 -374 -7727 7227 9339 -13546 -9496
941 -9496 18140 6430 -22947 -3954 24741 -1053 -24882 5033 22660 -7866 -17549 10010
953 10010 13528 -8736 -6647 7335 2119 -1813 2552 -4769 -5408 11284 5148 -18923 -4568 22937
967B2937k2156k7744L0112K4051l5500j6497L7644P976l5561J291K9279q157k0802
980a3127J2073R985j2494R27Q865j1789j943J9130p026k2910J6718K3084k4765
993c272j9463L0344J4059l2313p466L1657J382k7398L853J9234n948j1089N654
1006g66J573k916O021j608j3029Q104J7492j4486j9146K1792J7403k6121j4186
1019a9873K9890R127l0969l645K9411j542k6353N806K0612q387j3407Q210M882
1032C762n628K528J206q870M623J4487j0981j7178J7960J6910k3228j4161K6781
1045H211R837k7772m425K5491q46k1534M751J4453p254n784O054k553k791J0349
1059F187k653j5496J0054J8837j7620j8691K5656J5699l1919j0328L4826L089
$$ plain form
967 22937 781 -26963 3149 27200 -8300 -24797 12847 20823 -14738 -13447 15832 7675 -13127
980 -13127 -1054 8931 -3563 -2636 6229 -5560 -7503 11627 4601 -18309 -1591 21493 -3272
993 -3272 -22735 7609 21668 -10645 -18111 13546 14928 -12470 -8617 10617 4669 -6420 -766
1006 -766 807 -2109 3912 2304 -10725 -2621 14871 385 -18761 3031 20434 -5687 -19873
1019 -19873 10017 19144 -11825 -15470 13941 12399 -13954 -8148 12464 4077 -9330 -1120 3762
1032 3762 -1866 662 1868 -7002 -2379 12108 1127 -16051 1909 18819 -4409 -18570 8211
1045 8211 18048 -9724 -14149 11342 10496 -11038 -6287 8166 912 -4872 1182 -1371 -4162 6187
1059 6187 3534 -11962 -1908 16929 -691 -19382 6274 21973 -9946 -20274 14552 17641
1071A7641l4024K375L0534p539k4475J0399J5373j0263n332P010l619o79J0653
1084H054o725j4095J4972J4705k2289j1726K7249O848k9728j196K8957n362k5100
1097a5436R000J8508r939j1511R461L670n278L073j008p347Q693R547j5341r061
1111a2969K0682P594k5874m005K7139O14k7577K722K5552m936k2210O274J7210
1124A0216n547j2402M321P511j567k771j496j412O039M291j1319m906J5691M926
1138A1575k0290l428K3130M29k5193K696K5016o374k1902R441J6700j0372r823
1151h395R253L029n650M269n97q954P811J1692j6503j1473K3570Q668k9497l658
1165a6435L2127k985l0737Q258K7154j2539k0199J4464J2411j2582m870Q223j446
$$ plain form
1071 17641 -16383 -14008 16526 8987 -15488 -5089 10284 21 -5311 1699 -1920 -2599 8054
1084 8054 1329 -12766 2206 16911 -5378 -17104 10145 16993 -12735 -13931 15026 9664 -15436
1097 -15436 -6436 12072 2133 -9378 83 3753 -1525 1548 540 -6807 1886 11433 -3908 -12969
1111 -12969 7713 15307 -10567 -14572 12567 13181 -14396 -11674 13878 8942 -13268 -6994 10216
1124 10216 4669 -7733 -3412 4099 2532 -239 -1735 -3147 2892 7183 -4136 -9042 6649 11575
1138 11575 -8715 -12143 10987 11416 -13777 -11081 13935 7561 -14341 -4900 11800 1428 -8395
1151 -8395 858 3887 -1763 2506 1909 -7045 766 12458 -4045 -15518 8052 16720 -12777 -16435
1165 -16435 15692 12707 -18030 -9772 17382 4843 -15356 -892 11519 -1063 -5933 2290 844
1178H44j231N599o848p290J4450O061k1181k914K5587k829k6620P535K5487j1734
1192D916k1499J3601J7069j3333j1065J1155N477o961j31O55k821N849L413j1791
1206e466k795J6488P89k0476J772K2388m697k2848P799K1679r473j8758R911J5528
1220A1841q943j2120Q203Q060n291m686P72J970L932r66q909N79J3641j288j8095
1235a1300L157K1445n581k3044R210K2087j1613j9231J3476J5083j3671j0325
1247a0307J2503M502r057L54L301m161L253N885j0871m694J7193J824k1778K564
1261i489K4563p467k4239J2142K2305j5950j7300J6629J1439j4753n892J0177
1273B165Q81l847K204l944l216J1327J533j7504K497K1529p128k2540J1735K1647
$$ plain form
1178 844 -387 5212 -1636 -8926 5524 11585 -9596 -12510 13077 10248 -16372 -8837 16650 4916
1192 4916 -16583 -2982 14087 754 -10311 844 6321 -640 -771 -116 -2937 2912 6325 -5466
1206 -5466 -8261 8227 9016 -11460 -9688 12700 8003 -14845 -7046 14633 5160 -13598 -3687 11841
1220 11841 2898 -9222 -1019 7041 1750 -2936 -2164 -194 3738 2772 -6137 -5558 8083 6795 -11300
1235 -11300 -8143 13302 7721 -15323 -6113 15974 4361 -14870 -1394 13689 18 -10307
1247 -10307 2196 6698 -2359 -2005 1296 -2865 388 6273 -4598 -9292 7901 9725 -12053 -9489
1261 -9489 15074 7607 -16632 -4490 17815 1865 -15435 1194 12633 -2120 -8012 2165
1273 2165 3046 -801 1403 -2541 -5757 5570 7103 -10401 -7904 13625 6497 -16043 -4308 17339
1287A7339j5283j8261J7438J3682j7559q299J4563L888j0900q49N323l53K71K60
1301A260n686J195J0254l535j3712O588J6032r194j6292J0869J6074j1833j4644
1314a2624J2124J2378j1754r749R371P334p096n135L691L536M21k717m465K247
1328b438R128l250j2664N424J5759q023j7731J1631J6981j3703j5735J5359J2880
1341A3618j6063r223J4862M803j1642j510O578k14p93J317n454K48J0830k929
1355D428j4827O630J7253j0537j7359J4073J4918j6259j1656J6348P326j4247
1367c909l698J1188J12n773J233j22m57N821j520j0002M587J3714q890j5083J2672
1382a27J4380j5597j3030J7226J0305j7547o947J5528M089j2318k160Q175J610
$$ plain form
1287 17339 2056 -16205 1233 14915 -2644 -10943 3620 7508 -3392 -4241 1082 729 1000 1260
1301 1260 -4426 -3231 7023 3488 -10224 -3636 12396 3202 -13090 -2221 13853 2020 -12624
1314 -12624 -500 11878 124 -9625 -254 7080 -16 -5151 -1460 2076 2497 -220 -4685 -2438
1328 -2438 6690 3440 -9224 -3800 11959 3936 -13795 -2164 14817 1114 -14621 738 13618
1341 13618 -2445 -11668 3194 7997 -3645 -5155 1423 1209 416 1733 -3721 -3473 7357 4428
1355 4428 -10399 -3769 13484 2947 -14412 -339 14579 -1680 -13336 3012 10338 -3909
1367 -3909 -7607 3581 3693 -2080 -847 -969 -1426 4395 2875 -7127 -2540 11174 2284 -12799 -127
1382 -127 14253 -1344 -14374 2852 13157 -4390 -11337 4191 8280 -4038 -6198 1977 3587
1395C587l827p96j233K352N133m397q212P080J0152r839j0799J1820J0279j3279
1409a979r247J3885P205j3699n031J2049L727r609k367O421J949k596j845j072
1423b209K978M801n326p701P396R781r935j1112J2547J0394j4211r670J5325P848
1437A0906j5438n241J3918L364j1115j527P944J56k941n84j203J934M970m692
1451D51q153P654R997j1456r767J4467Q081j6027o423J6782L900j5846n66J2506
1465E600q27q515J951L913j473R20j001m900L851P688p430r632J1313R259j3878
1480c161q089J5650N989j6150l494J5077J453j2590K0R855p55o218J94K479J350
1495A610P65m069l158O878M393r342n665J1999N427j4192m121J4876K886j4420
$$ plain form
1395 3587 -240 -1036 -2269 83 5216 819 -7393 -313 9839 0 -10799 1021 11300 -1979
1409 -1979 -11226 2659 9864 -3835 -8866 3183 6910 -2699 -5066 1355 3304 708 -1137 -2209
1423 -2209 769 5570 244 -7457 -61 9720 -215 -11327 1220 11614 -2597 -12267 3058 10906
1437 10906 -4532 -9773 4145 7509 -3606 -5133 2811 2967 26 -558 -1761 173 5143 451
1451 451 -7702 -48 9949 -1507 -11274 3193 11274 -4753 -11176 5606 9506 -6340 -6906 5600
1465 5600 4773 -3742 -1791 2122 649 1569 568 -4332 -481 7207 -223 -9855 1458 10717 -3161
1480 -3161 -11250 4400 10389 -5761 -9255 5822 7275 -5315 -5295 4560 3805 -2413 -2219 260 1610
1495 1610 2375 -1694 -4852 2026 6419 -2923 -8588 3411 8838 -5354 -9475 5401 8287 -6133
1509f133r33J3178Q5j1015P35P695p64m517j39J555J461J524m012l935O331N464
1525F580r111n536J1416N131j3235l968J4448K363j3932n65J2546k29j0739N94
1539d237Q013o45m991m91J314L126O39n165k574P959L437j0428l733J2628L333
1554H185j3845k208J4609L70j3838J285J2041k695r207K658O549k631l135R63
1568h99J24J331K355m730l727Q091M145j0714l355J2951J852j3991P0J3993j776
1583E720j2613K954J0292l802p004K518L963p86r67j927j014M407K750q071k331
1598e911J0994J485j2372j11J3130j695j3161L546J1682m326r743L858P570l331
1612A615n202J798K830N66j549k755L90N598J18p080m48R146k82j0043O75J0698
$$ plain form
1509 -6133 -7066 6112 6197 -4818 -4083 3612 2848 -1669 -1808 -253 1208 2732 -1280 -5215 1116 6580
1525 6580 -2531 -8067 3349 8480 -4755 -8723 5725 8088 -5844 -6409 6137 5908 -4831 -4237
1539 -4237 3776 3131 -1860 -2351 -1037 2089 2728 -2437 -5011 2948 6385 -4043 -7776 4852 8185
1554 8185 -5660 -7868 6741 7111 -6727 -5442 6599 3904 -5303 -2645 3904 1273 -1862 -899
1568 -899 -775 556 2911 -1819 -5546 2545 6690 -4024 -7379 5572 7424 -6567 -6497 7496 5720
1583 5720 -6893 -3939 6353 2551 -4453 -1935 2028 1242 275 -1652 -2666 1741 4491 -3580 -5911
1598 -5911 5083 6568 -5804 -5915 7215 5520 -7641 -4095 7587 3261 -6482 -2624 4946 1615
1612 1615 -3587 -1789 1041 1607 58 -2697 -2307 3291 3409 -3671 -4119 5027 4745 -5298 -4623 6075
1628F075j686j0740K257J0002k666q982K853P152j826n681J228L382P74j814k448
1643b120J33N025N30p015p47R577j28j1523J393J2052k634j2141L795J0971m894
1658B274r305N157O867m686l795K757J832j77K96k854r67O191M95q601J72J0690
1674F346j639j2184L434J1770n431j0271O158Q390o171n625N016L306l203r96
1688a100M68k08K389N56n272K28Q033j370j0206L285J0318m807j0178N668R613
1703G417o664p741O497N741n312l886L681K704j364j634j220J685L246j740n534
1718d124J945P343k895q209L997P929m448p940M511P603m786o577M498N741l637
1733I51m675K932L489j473k516k46J982J902j403m591J784O447k086q251K954
$$ plain form
1628 6075 4389 -6351 -4094 5908 3242 -5740 -2887 4265 2439 -3242 -2014 1368 2142 328 -2120
1643 -2120 -1987 3038 3568 -3447 -4194 5383 5255 -6268 -4875 7177 4543 -7598 -3803 7168 2274
1658 2274 -7031 -1874 4993 307 -3488 -731 1101 924 1220 -1634 -2601 3590 4085 -4516 -4344 6346
1674 6346 4707 -7477 -4043 7727 2296 -7975 -1817 6573 402 -5223 -207 3099 -104 -1100
1688 -1100 -632 -840 1549 2105 -3167 -2939 5094 3724 -6482 -3197 7121 2314 -7864 -2196 7417
1703 7417 753 -6988 -491 5250 -62 -3948 -267 2437 1073 -561 -1781 -96 3150 1410 -4124
1718 -4124 -2179 5164 2269 -5940 -1943 5986 1538 -6402 -1891 5712 926 -5651 -1153 4588 951
1733 951 -3724 -792 2697 1224 -1292 -1538 444 2346 943 -3648 -1864 4583 2497 -5754 -2800
1748b800R376m204r835N409R373o364p509O319N775n731l937M920J626k344m34
1763c60m72l49L317j35o131J200Q735l807r323N530R723p496q377Q430O896q468
1779a087m546P425K309n330r06K522k8O88k85l465J305N327k418p272M270P665
1795F174n495p895P200O537p254n423P195M538o614l023M826K699l375k259J536
1810f33J822R99k925k616L306M273m369m963M649O001n646n592N961N606o388
1825e15n092O363M489n842l404M203K853l061k269J844J308O21j806k133J898
1840e43L955k766n406M029O516n174o543O160O447p024n644P280L918o552k804
1855d151M957K048l463j207J406O46J536j505l849K813N570l998o858O152O252
$$ plain form
1748 -2800 6576 2372 -7463 -2054 7319 955 -6554 -235 5540 -191 -4128 792 2418 74 -360
1763 -360 -832 -1181 2136 2001 -4130 -2930 5805 1998 -7325 -1795 7928 432 -7945 485 7381 -1087
1779 -1087 -5633 1792 4101 -1229 -2135 387 359 1047 762 -2703 -1398 3929 1511 -5761 -1491 6174
1795 6174 679 -7216 -16 6521 -733 -6156 1039 5577 -1037 -4060 766 3465 90 -2169 -633
1810 -633 1189 2188 -737 -3353 -47 4226 -143 -5106 -457 5544 -102 -5694 267 5873 -515
1825 -515 -5607 756 5245 -597 -4001 202 3055 -6 -2275 -431 877 1498 -308 -2441 -543
1840 -543 3412 646 -4760 -731 5785 611 -5932 228 6675 -349 -5993 1287 5205 -1347 -4151
1855 -4151 806 2854 -609 -1816 -410 236 1772 267 -3582 -769 4801 803 -6055 97 6349
1870F349o920n808Q220M776q672l350Q164J325o371l31M046J2j889m24o04J537
1886F0K715k927l959M825M536o166m698P451L931p931l050P530K310p048j442
1901c863N464J133l795j205K036J494j71k665n15L389J293l677k340N022K614
1916D214n552l063O063L174o750k911O688K545o399k175N718J756m660j465L572
1931G55J288j647j796O2K165J554l000k491M010L191m851m265O552L589p131l000
1947e015P160J902o397j216N781J14m120L39J883N14l24q59j830K540L152l886
1963b62l959N799L263o910k858P500K058p874q48P128j01n522RM511k97k291n52
1980a206J061J324M04k442j775M121J887n236k183O390J551o674j318P161L81
$$ plain form
1870 6349 -571 -6379 1841 6617 -2055 -5405 2759 4084 -2287 -2618 1428 1440 -449 -873 -1477 60
1886 60 2775 -152 -4111 714 5250 -916 -5614 1837 5768 -2163 -5213 2317 4627 -2421 -3863
1901 -3863 1601 2734 -1061 -2266 -230 1264 1093 -1572 -2087 1302 2595 -1082 -3422 1600 4214
1916 4214 -1338 -4401 1662 4836 -1914 -4825 1863 4408 -1991 -4166 1552 3308 -1352 -2817 755
1931 755 2043 396 -1400 -1338 827 2381 -619 -3110 900 4091 -760 -5025 1527 5116 -2015 -5015
1947 -5015 2145 4047 -2350 -3566 2215 2329 -1791 -1452 431 945 621 -238 -2068 472 3624 -262
1963 -262 -4221 1578 4841 -2069 -4927 2573 4631 -3243 -4091 3037 2936 -2586 -2577 1934 1637 -654 -1206
1980 -1206 -145 1179 1583 -859 -2634 1487 3374 -1862 -4045 2345 3896 -2778 -4096 3065 3446
1995C446o635k25N915J30n060N79L430M20k345r51R65J833j21l131j95L794J075
2012B924n407j007N960Q92o275n50O136N58o296p7N593k28l994J6L149N43k675
2029g38m01R63J614l30k578n58L523J365n303q23N400J234o470k40O256J39o164
2046c111O73N361q56m046O18K953l94j349o43J42J748M74l222r05M153J486n829
2063b747o14O412j47o507O16O462j169n441J638M494j583l306R52J834j55m91
2079B48j239k00K567N18m161k97N250j07n851R09N803r65n708J096N569j605l960
2096b133J033L175o02k877J22J746O02n57k553J047L238q78l781O94M960j333
2112A903m838P85N603j704n090J835M643j587m159J202L356p83k677L33J858O84
$$ plain form
1995 3446 -3189 -3414 2501 2631 -2429 -1850 1580 2000 -345 -1296 -331 1502 1381 -1750 -1945 1849 2924
2012 2924 -2483 -3490 2470 3362 -2913 -3463 2673 3231 -3065 -3142 2451 2223 -1771 -1755 1394 1937 -738
2029 -738 -1139 -176 1438 1108 -1470 -2028 1495 2860 -2443 -3266 2134 3368 -3102 -3342 2914 3053 -3111
2046 -3111 -2438 2923 2067 -1979 -1361 1592 1198 -151 -794 -652 1096 1570 -1652 -2557 1596 3082 -2747
2063 -2747 -3361 3051 2904 -3603 -2987 3475 2306 -3135 -1497 2997 1414 -1892 -940 894 739 248
2079 248 -991 -1191 1376 1894 -2267 -2564 2686 2579 -3272 -2363 3440 2475 -3233 -2137 3432 1827 -2133
2096 -2133 -1100 2075 1473 -1404 -1282 464 1066 509 -2044 -997 2241 1363 -2418 -1724 3236 1903
2112 1903 -2935 -2150 3453 1749 -3341 -1506 3137 1550 -2609 -1407 1949 1166 -1511 -1178 680 1364
2128A364j161k016P90K965m91m133J063M850j431n148J789M983k037m520J853
2143a280M486k102l829J887K890j549j724K79J163L82k74j657L68K866n23l679
2159b296Q26M682j379n285J851N236k354m629K480M153k620l305J801K508j242
2174D27j446M9J037J006k51k577R35L488j115m244J504M938k572m831K885M551
2190C784l245l986K927L259k705k035J358J473k15j257p94J579J703j256k902
2205b312K063L357k400m265L185M252l629l790L372L135l101k758K486K700j878
2220D17k452J153K258l39j808o12K065J492k530j940K664K764k829l218K624L597
2236C306l386l173K843L569l002l631L174K982k617k619K252K134r25j636l13
$$ plain form
2128 1364 203 -1813 -1023 1942 1451 -2682 -1619 3231 1800 -3348 -1559 3424 1387 -3133 -1280
2143 -1280 3206 1104 -2725 -838 2052 503 -1221 -942 221 603 329 -1328 -960 1906 1383 -2296
2159 -2296 -1470 3212 1833 -3452 -1601 3635 1281 -3348 -868 3285 665 -2640 -839 1669 427
2174 427 -1019 -970 67 1073 822 -1755 -820 2668 1553 -2691 -1187 3751 1179 -3652 -767 3784
2190 3784 539 -3447 -520 2739 34 -2001 -643 830 615 -642 -1436 143 1846 590 -2312
2205 -2312 -249 3108 708 -3557 -372 3880 251 -3539 -167 2968 -133 -2891 -405 2295 417
2220 417 -2035 -882 1376 1037 -771 -1383 682 2174 -356 -2296 368 3132 303 -2915 -291 3306
2236 3306 -80 -3253 -410 3159 157 -3474 -300 2682 65 -2554 -302 1832 907 -729 -1042
2251a042J632R29j070k481J942K986k740l248K642L842l716l279L602L218l512
2266b95k704L305K044k563j313J816Q50l07j217q11J332K092k134k779K686K869
2282B871k989l350L949K804l984k667M196J705l340j542K927J287j859j026N90
2297d28J293N51j805j589K395K064l316k269L896K068l773k211M221J980m404
2312a327j584L682J820k963j378K095J614j447k114R35J820K16k486q79L015J355
2328B374l413j659L441J746l572j634L724K125l952j974L723J640l164j883L082
2343F04J484k238j493J624J466p19j840l98K139J049k417j842L397K037l785k177
2359c109M615J743m710j372M300R61l671m00K578K97j651m92K81J271P09k325
$$ plain form
2251 -1042 590 1519 449 -2032 -90 2896 156 -3092 -450 3392 -324 -3603 -1 3217 -295
2266 -295 -2999 306 2350 -213 -1526 290 1140 833 -384 -1195 137 2229 95 -2684 2 2871
2282 2871 -118 -3468 481 3285 -699 -3366 830 2535 -805 -2347 580 1867 8 -1018 -428
2297 -428 865 1416 -389 -1978 417 2481 -835 -3104 792 2860 -913 -3124 1097 3077 -1327
2312 -1327 -2911 771 2591 -372 -1750 345 1959 512 -1602 -667 1153 1369 -1117 -1996 1019 2374
2328 2374 -1039 -2698 743 2489 -1083 -2717 1007 3132 -820 -2794 929 2569 -595 -2478 604
2343 604 2088 -150 -1643 -19 1447 728 -1112 -1510 629 1678 -739 -2581 816 2853 -932 -3109
2359 -3109 1506 3249 -1461 -2833 1467 2428 -1243 -1643 935 1232 -419 -911 -630 641 1350 -975
2375i75r27K619J663l640j732M306J689m822o89M431L97m199K81L287n91k034
2391i36j25J437M57m98j232l11K218O13l248p7L282L08l695l09M103K17m056n7
2409a909L595L41l556k85K581Q44k114j347J982J095j110j741R29K071m01k334
2425a359k63L068J64l259m80L691P80m117m86M062O44l871p40L391N81k985n66
2442a745K251Q27j426j095M78J822j29k588J98K913M68l723j95L697P01m706K48
2459b004L961l18l540N50L127l78k499J68J405M75n98j487K48K202K29l192P3
2476a578L832o49l786L71M307r64l939J181L028r07k655N74K201j34j391l09R08
2493I0J008o91j975N94K908q32k786O38L212j121k876P29K929n96l187J062K201
$$ plain form
2375 -975 -1902 717 2380 -1260 -2992 1314 3003 -1819 -2508 1923 2320 -1879 -1598 1689 1098 -936
2391 -936 -1061 376 833 335 -897 -1208 1010 1623 -1625 -1702 1580 1888 -1807 -2116 1987 2204 -1852 -1909
2409 -1909 1686 2027 -1529 -1814 767 1611 -503 -1850 132 1227 117 -1624 -695 1376 975 -1359
2425 -1359 -1622 1446 1610 -1649 -2129 1562 2342 -1775 -2261 1801 2445 -1426 -2166 1225 1806 -1179 -1745
2442 -1745 506 1333 -93 -1188 -710 1112 983 -1605 -1407 1506 1974 -1749 -1944 1753 2454 -2252 -2004
2459 -2004 1957 1639 -1901 -1351 1776 1398 -1101 -933 472 947 349 -1138 -890 1312 1541 -1651 -1578
2476 -1578 2254 1605 -2181 -1810 2497 1533 -2406 -1225 1803 896 -1759 -1185 1016 882 -509 -818 90
2493 90 1098 407 -1568 -974 1934 1102 -1684 -1046 2166 1045 -1831 -1102 1827 1231 -1956 -894 1307
2510A307l20k611O76J762K08j607m95J423J336j415j719J086J835m67k819O46
2526a174K879n75l118Q65L186o70l598Q82L158o72k452J19K439M0k112k97J522
2543D22Q50q09j896N90K681r00k980Q64L597j390l840J640L689j346l602J627
2559h03K532j161j902N66K270m75j554l27R46J413r90k253J424K510j854k641
2575b299J563L051j872l169K148K906j818k586J711K077j295j530N81J510p2j540
2591f34o68J327J415j520j687J694K106j693k639K060K364j824k421J874J995
2606A749j442j876J028K131q14j665N2J594L47j583j088J585J543j555j898J571
2622c21K238j771k249J976K452k075k305J726K241j354k468J596J787o35j978
$$ plain form
2510 1307 987 -1624 -948 814 1022 -585 -1080 343 1679 264 -1455 -369 1466 999 -1820 -1174
2526 -1174 1705 1130 -1988 -1123 2063 1393 -2205 -1323 1835 1163 -1289 -1170 1269 1309 -803 -1100 422
2543 422 1272 463 -1433 -843 1838 938 -2042 -1178 2419 1029 -2811 -1171 2518 1172 -2430 -803
2559 -803 1729 568 -1334 -768 1502 1027 -527 -854 92 1505 515 -1738 -314 2196 342 -2299
2575 -2299 -736 2315 443 -2726 -578 2328 510 -2076 -365 1712 417 -1113 -532 978 906 -634
2591 -634 -1302 25 1440 -80 -1767 -73 2033 340 -2299 -239 2125 301 -2120 -246 1749
2606 1749 307 -1569 -541 1590 776 -889 -837 757 1104 -479 -1567 18 1561 6 -1892 -321
2622 -321 1917 146 -2103 -127 2325 250 -2055 -329 1912 558 -1910 -314 1473 838 -1140
2637a140M19J578q6j417n55J405J295j490j870J615K240j687k696K181K626k216
2653B02k213K012J882j707j859J598J418j193j286N32J364J11j390j043J627J359
2669A414j549k017K233K390k631j916K190K245k820j642K687J326j966j629J266
2684d19J737q61j794P42J404K97j830r76K200J346k153j667K833J236k406j820
2700b131K797J342k332j671K146J693k084j007J119J191o55j333q2J804j58j568
2716i29k72J792J002k046j296K363J371k383j302K237J353j969j860K142J108
2731A311j277j405J249J272q77j177M47J458J35j956j96J639J005k029j074K172
2747F97J104k372j643K566J521k580r04K177O94j437j021J301J188q84j424K28
$$ plain form
2637 -1140 -721 857 771 -646 -1201 204 1499 9 -1861 -246 1994 307 -2389 -208 2418 202
2653 202 -2011 1 1883 176 -1683 -85 1333 140 -1146 -614 750 861 -529 -1572 55 1414
2669 1414 -135 -2152 81 2471 -160 -2076 114 2359 -461 -2103 584 1910 -56 -1685 -419
2684 -419 1318 457 -1337 -595 809 1106 -724 -1700 500 1846 -307 -1974 859 2095 -311 -2131
2700 -2131 666 2008 -324 -1995 151 1844 -240 -1247 -128 1063 408 -925 -1007 797 639 -929
2716 -929 -1201 591 1593 -453 -1749 614 1985 -398 -1700 537 1890 -79 -1939 203 1311
2731 1311 34 -1371 -122 1150 273 -904 -457 1001 1136 -820 -1016 623 1628 -401 -1475 697
2747 697 1801 -571 -2214 352 1873 -707 -1611 566 1260 -177 -1198 103 1291 407 -1017 -789
2763g89J749Q0j721q35K240R58k295q77K314J024k774j085K797Q61k608l82J838
2780D95M98j426n96J141J189j077j251L86J620L75k001q19K693L17k519r01L122
2797A246L21k805l98K531M34k609k60K095P29j313j264J127J073m11j917P49J907
2814A235k19k287J31K435K7k365m52K718J07k427l83K247O94k226p94K144P52
2831A337j489j214J413J253p68j343L1J618J66k095K67J910J46k260n58K544M35
2848A393k327m94K580L64k206m35J872N16j584p28J080Q57p70r17J10J800J76
2865A287k858L05K540q0k597q0K706K19k830M91K368m65j735j82J521K54q34q25
2883g95P65N80l5j868M40K227r3k762M38K745n97k697N08K818n60k206J88K248
$$ plain form
2763 -789 960 1040 -681 -1516 724 1682 -613 -1490 824 1848 -926 -2011 786 1647 -961 -1343 495
2780 495 993 -433 -1029 112 1301 224 -1027 -641 979 1354 -647 -1466 1227 1544 -975 -1876 1246
2797 1246 1567 -1238 -1636 895 1329 -1280 -1540 555 1284 -29 -1293 -166 907 496 -1421 -672 1235
2814 1235 1016 -1271 -1140 1295 1322 -1043 -1495 1223 1330 -1097 -1480 767 1461 -765 -1559 585 1337
2831 1337 -152 -1366 47 1300 532 -811 -780 838 1004 -1091 -824 1086 1232 -1028 -1586 958 1393
2848 1393 -934 -1428 1152 1516 -690 -1125 747 1263 -321 -1049 31 888 118 -799 -689 1111 1287
2865 1287 -1571 -1266 1274 1194 -1403 -1483 1223 1442 -1388 -897 1471 1006 -729 -911 610 864 30 -795
2883 -795 -30 550 515 -1353 -913 1314 1221 -1541 -1103 1642 1045 -1652 -1144 1674 1114 -1092 -904 1344
2901A344m11j705p9J245N88j026j257J100J430r50j884J015J970p00k403J072
2917f51K261q27k150Q81J840m42k041K86J743oj585k92J222O69j224o67R05J129
2935A051r80j507R12J996q22k110P38K377p29k190L76K135q7k413M06J830K08
2952A191k057K61J099P3o10j130P35J523n38j742N29J989m15k201N46K353j096
2969E10j832L94K216o92j762O28J397k68j155r2J009K21o87j135Q43J817r24j982
2987a494J144K049j006k616J462K005j057j889Q75J824j112j135K69J228K88j440
3003f05l02J438L92j414q35J083J696j142k142J685J772j483j530J067J878r59
3019E99k009R63J544l71k024N17J832k20j624j02J682J71j043j195J627J109j488
$$ plain form
2901 1344 933 -772 -851 394 982 -44 -1301 -201 1229 279 -1605 -590 1380 680 -1723 -651
2917 -651 1610 783 -1367 -486 1354 912 -1129 -843 900 894 -691 -983 239 908 -316 -983 -78 1051
2935 1051 71 -1436 -524 1472 650 -1460 -722 1655 926 -1264 -888 1247 1160 -1253 -847 983 1191
2952 1191 -866 -605 494 567 -43 -1173 -438 1085 547 -1195 -666 1323 908 -1293 -747 1606 510
2969 510 -1322 -928 1288 596 -1166 -538 859 591 -564 -656 353 574 -113 -1248 -405 1412 488 -1494
2987 -1494 -350 1699 693 -1923 -461 1544 487 -1402 -527 1297 185 -950 -681 547 835 -605
3003 -605 -907 531 923 -491 -1326 -243 1453 311 -1831 -146 1626 143 -1387 -320 1558 599
3019 599 -1410 -447 1097 726 -1298 -781 1051 831 -793 -895 787 958 -85 -1280 347 1456 -32
3036c2j271J274J157o05k009R87J922j205j475Q47J561r69j480O54J403k29r08
3053c78j63R75L21r34j149J339J125r83j643J137J940j280j950J286J657r95j879
3070a574J165J750j229j178N33R70K54r31n00P50J092j259j136J178J333j096
3086A22j742J611J249j172j847J463J386j126j038Q34J445q14j311N20J102K11
3102H93j274o66J448R63j534j137J296J380j678j027J510J035j109j446J310J266
3118A230r03j340R41J058n62j080J51J445k73j077m58J289K67j046p19J256Q46
3135A025r19j501J394R90j109j235J061J430j118j043P84J321j025p11M36Q40
3151F20j69j046j72J169M97r73j141J322J155j520j040J497J055j631q38J373
$$ plain form
3036 -32 -1303 -29 1128 523 -1486 -499 1423 218 -1257 -410 1151 182 -1298 -644 759 530 -378
3053 -378 -541 434 755 -179 -1328 11 1136 153 -1490 -353 1587 307 -1643 -357 1300 305 -1574
3070 -1574 -409 1341 112 -1066 -533 437 691 -240 -740 10 1102 -157 -1293 -115 1218 122
3086 122 -1620 -9 1240 68 -1779 -316 1070 -56 -1094 -260 1185 371 -940 -420 682 893
3102 893 -381 -1047 401 1364 -170 -1307 -11 1369 -309 -1336 174 1209 100 -1346 -36 1230
3118 1230 327 -1013 -72 986 424 -656 -505 940 667 -410 -868 421 688 -358 -1077 179 1025
3135 1025 106 -1395 -1 989 -120 -1355 -294 1136 18 -1025 -241 1080 55 -656 -220 620
3151 620 451 -595 -767 402 899 -74 -1215 107 1262 -258 -1298 199 1254 -377 -1215 158
3167A58J167j321j168J293O78m26p40p7J096j34j024n12J271P49j196j093J896
3184F17N83j567q85J139J208j290j120J402Q38r36o86O92O06l81q61J29R90j5
3202D63q79p12J637L86j368o50J509P35j487m74J189O41j098o47Q73Q59j026p22
3220g71L21J196m27r77J01J095O9j260k47J273L77j291l98J199P39j386n86J364
3238C91Q53j452o64J026Q74j224o61Q64Q30n50r92O1J137K62j277n5J436P3j255
3257c23o50J421O48j397p36J531N66j536m83J207M46o60o96M39R10m44q37k0J330
3276G16n1j347j14J424L97j936n4J572L02j285m52J207M30j032p48J256J08m54
3294f1o63O39N45l84o57J41R82Lj208n1J542j61j335kR98M13j156k27R69L60j214
$$ plain form
3167 158 1325 4 -1164 129 807 381 -359 -436 660 526 -498 -1010 261 1010 -186 -1279 617
3184 617 1200 -367 -1252 -113 1095 -195 -1315 87 925 -11 -697 -5 601 220 -641 -512 478 463
3202 463 -416 -1128 509 895 -473 -1123 386 1121 -366 -840 349 990 -108 -755 118 977 -49 -771
3220 -771 -450 746 319 -658 -557 538 607 -653 -900 373 750 -541 -939 260 999 -387 -973 391
3238 391 1244 -208 -872 154 1028 -196 -857 7 837 287 -705 -644 493 755 -522 -577 859 932 -323
3257 -323 -973 448 1096 -301 -1037 494 1060 -476 -959 248 694 34 -662 -223 687 243 -594 -614 716
3276 716 665 -682 -796 628 1025 -911 -965 607 909 -376 -828 379 809 -223 -971 285 393 -61
3294 -61 -724 -85 460 76 -581 -440 542 545 -663 -714 828 667 -668 -670 328 741 -415 -642 327 687 -527
3315e27j13P52P41j157o04Q06Q11m34o27J07J135j41j624L16J071Q3j187L3R53
3334C94N6j000k09J278K58j250n9M06J071j220m33N87J095o14q89J07R30j46j137
3353g75Q1J306J37j168l11J499n9j183l45J390Lq57m19Q05O63q88o46N48J027
3372H08o22o07K8J297o20r04N6J216j41j419L38J460k70j096r9J208J40j191k25
3391f43P74L13k99q11K30J351q06p17M19P76j36j502P87Q18k28q70R9J366m20
3410E01j093J06O79K99p78l32O61N78p31n69M14J083p98p62O87R35m59j199N43
3429b35Q97l31j077J84J312m6j215n8R72J77r24m87J131L18q73l86N45N34o80
3448b42l98N72Q44n33j106M41J346o66r95J62J320k18j048k45J048p3m47j63M40
$$ plain form
3315 -527 -640 112 853 -304 -908 -102 709 275 -352 -245 890 749 -875 -559 512 595 -592 -559 394
3334 394 450 -550 -759 519 777 -473 -532 -126 945 -275 -708 -121 974 360 -529 -422 508 362 -775
3353 -775 -694 612 749 -419 -730 769 710 -473 -818 572 575 -282 -701 104 767 -121 -767 -219 808
3372 808 186 -421 -393 904 284 -620 -564 652 511 -908 -570 890 620 -476 -575 633 773 -418 -643
3391 -643 131 444 145 -666 -436 915 109 -608 -189 587 451 -1051 -264 554 326 -544 -445 921 501
3410 501 -592 -486 193 492 -286 -618 43 621 -110 -679 -265 818 20 -742 -55 880 421 -778 -235
3429 -235 662 331 -746 -562 750 704 -511 -569 403 580 -344 -831 300 618 -255 -641 -96 438 -242
3448 -242 -640 -68 776 243 -863 -422 924 258 -737 -575 745 527 -521 -766 282 209 -238 -401 39
3467C9N23o14o96O69N60j50j352O30J305p65r59N41J224l94j183L11R67m10p11
3486d65j51R60J18q24k51O11M21l91o22P23O37n04j186M34J323l17j164M82J159
3505I93p31r18K43R66j87p74l77J158J96q54m33J070J84n67p88P80N80l65p05
3524e29K83J163r64n83O47N98n20o86R2R95j46q99O6P59N98j250j25O04M02l86
3544A19o41O45N02k65r07L74R83o44p56N31R63o88r20L99Q16l02q26K41Q47k47
3564B24n49k17N78O38o58p60R28N99m57r66N76R62r06o82L96J041q90m41K81N13
3584B10K5p44J80P08K33o37m68M95P32p43n36N77R02q49j178J060P42p99p06O72
3604a24P21n42o88M70P02k2q01k72R29K45q83q9O19P8n52m40M76Q47p60o49N95
$$ plain form
3467 39 562 -52 -748 -79 481 331 -1021 -391 914 149 -810 -269 955 561 -622 -311 656 246 -465
3486 -465 -616 344 462 -362 -613 -2 419 28 -594 129 766 262 -924 -490 833 516 -648 -166 993
3505 993 262 -656 -413 553 366 -408 -785 373 569 -285 -718 352 536 -31 -819 -39 541 176 -529
3524 -529 -246 917 -47 -630 17 615 95 -591 -499 496 350 -549 -483 276 874 -376 -501 103 505 119
3544 119 -522 123 625 360 -547 -173 810 166 -590 -59 904 216 -704 -305 511 209 -617 -376 471 224
3564 224 -325 -542 36 674 16 -744 184 783 326 -640 -64 898 -8 -690 -294 747 -143 -584 -303 210
3584 210 235 -509 -329 379 612 -25 -493 2 734 -9 -545 32 934 85 -1093 -33 709 -90 -796 -124
3604 -124 597 55 -633 -163 539 517 -284 -556 373 618 -265 -354 265 343 -209 -649 -173 674 -86 -735 -140
3625a40P57n35j041Q85P82m12p30J94R62l15o69k9P39J8n08m47N83M03o82o11
3645g96M10J083q58o51O42J015n47j181Q49J010j020r24Q55P43m23n92jO29Q0
3664C23p37j1M49O12o22n51O42O51p52q39R36M79l56r55N30O35n5o22J96M36k4
3685C65o25L3N23N72j136l17Q85M38j169N0N94L94q63n13P99R03j043k86K22O80
3705E06o97j67K38K50Kk36k31Q04K60r59k60P24L18p27m01P41M12q53o04P37P19
3726E76m35o78L88M95k20p31O17K83j29n82P6N12K83o21k99O96K99q24l31N85
3746d0P61p23n42O97L05k30q69N79O20l43n49J53M34k62j00k89L25L16l38j05
3766b00M58J73n50n51O93M82o68n40O02L98k34o82M08P85n00o76K36P63J39o94
$$ plain form
3625 -140 617 82 -959 -74 708 296 -434 -240 722 407 -262 -291 448 466 -42 -489 94 497 -185 -796
3645 -796 -386 697 -161 -812 -170 845 298 -883 -34 976 -44 -968 -113 630 207 -385 -386 243 323
3664 323 -414 -425 24 636 14 -537 105 756 4 -835 101 580 224 -731 -201 434 379 -243 -47 389 365
3685 365 -260 -227 296 868 -268 -585 300 738 -431 -381 213 607 -256 -769 30 933 -110 -396 -174 506
3705 506 -191 -358 -120 130 132 -104 -335 469 729 -230 -490 234 552 -175 -576 165 577 -276 -880 -143 576
3726 576 141 -537 -149 346 126 -605 12 295 166 -416 -340 172 455 -166 -465 231 530 -294 -625 -40
3746 -40 721 -2 -544 153 458 228 -641 -62 558 215 -334 -181 253 -9 -109 -398 -73 243 -95 -200
3766 -200 258 431 -119 -670 23 505 -163 -703 -101 297 63 -619 -211 574 74 -602 -366 397 536 -158
3786a58m31Q89K86r90PO26J61o21j97O34K52p95M6K25N14p24j69M17M39j62p84
3807e35L88L40J54p94rO55K77o39o1L84M17p13n00O06M82m25p01O20N86n33n21
3828e22M44M38q6o07J8P12q5o82Q7P17k44m01m46Q39K02o07j72M16N07n59o13
3849f44O96L19k58n09J33O44l94k16J52M95l8p50k7N95L89q93J39J38N31n13n26
3870e37L71O22p52r2M04K41m92j16K53O07m92l10K38N39k5n19j77M17K17m43k68
3891c14M23K84p00j13N84K06n36m24M45M09j74j06j37O84k57m39n8L26M0l63k61
3912d81P12k3m05nJ17L68o84K51P25j39m54l71J93N65l28j4k18N81l45l20J19
3933a56N45r2o43n6L77Q6k70k59O70K84n52m88N41N86p45l45N57L08m13j69K56
$$ plain form
3786 -158 -589 300 586 -404 -397 229 390 -231 -428 206 458 -337 -291 -66 448 -276 -445 -28 411 249 -535
3807 -535 -147 193 347 -447 -456 199 476 -163 -224 160 577 -136 -636 -30 452 27 -674 -54 532 -1 -522
3828 -522 -78 360 274 -333 -315 397 312 -370 -283 434 190 -211 -657 182 384 -223 -395 21 528 -31 -644
3849 -644 52 371 113 -396 -263 381 -13 -229 -77 418 380 -370 -397 198 587 -306 -167 -29 502 -11 -537
3870 -537 -166 456 -296 -388 16 257 -235 -351 -98 509 17 -293 -55 484 459 -60 -237 180 397 -46 -314
3891 -314 109 393 -307 -420 164 370 -166 -590 -145 264 90 -16 -153 531 274 -165 -223 103 143 -220 -481
3912 -481 231 208 -197 -202 -85 283 -401 -150 575 436 -18 -389 -196 369 41 27 -191 390 45 -275 -156
3933 -156 389 297 -346 -402 -25 61 -209 -468 202 486 -66 -554 -13 573 -172 -517 40 348 -65 -234 22
3954B2K50j36o62L78K57n2k33k37O78J81n19l92Q35k04l82k52O47L14l88n21N66
3975A50K08n59j70J02M13J79n06j09N31j45l39l61N26N54m42j25K5M99o11l28
3995e08P19M5k15j81K12K00j65l86l4M68k03l82M18K6Q5k42J44K38qm35k28O59
4017B27J67m28p9J93K83l66l13L93M41o35k08J49M29k0m98O4O40j80l22j16P56
4038E77j71m24k60N77j32l82P1J19L38m32m2K18K04k00k58J30N39k42m60K13M34
4059D17j54l09m58O48J29l88j54K02M19m19l92M29L89l21n71N75K49m46j3K57
4079H9K37m98J92j00K45J30o48j37P52J21o55N7M05J94o85QN42j0l05r6J67K17
4101B22j40j47N2J20P2o13K27O56j01o28J87M74j22q13J99M74J29j63m65M45J85
$$ plain form
3954 22 272 136 -526 -148 109 57 -176 -413 265 446 -73 -465 370 166 -216 -468 179 493 105 -416 150
3975 150 358 -201 -371 -269 144 323 -183 -292 239 94 -245 -606 -80 474 32 -93 -68 431 -180 -508
3995 -508 211 256 41 -140 72 272 107 -279 -313 155 -48 -430 -12 14 99 -143 1 239 231 -204 -432 227
4017 227 394 -34 -113 80 363 -3 -316 77 518 -117 -325 -176 253 233 -265 -201 439 259 -63 -179 577
4038 577 406 -18 -278 299 167 -215 -144 -25 313 -119 -161 57 261 61 -197 -67 472 230 -230 -17 417
4059 417 263 -46 -504 144 273 -115 -269 -67 352 -67 -459 -30 359 38 -533 42 291 -155 -168 89
4079 89 326 -172 20 -80 165 295 -353 -490 262 383 -272 -215 190 384 -301 -293 249 239 -66 -162 5 222
4101 222 82 -65 -13 107 179 -434 -207 449 348 -280 -93 381 259 -554 -355 119 248 85 -380 65 250
4122B50k64l84K79L39j05l07J79L59l12j72L3N48m4n18k92L63M25m69j01O8K44
4143A19l52j91L99L0k40j15J96N30o68O1J00N68j88k72k96M34K80o80J13M03K02
4164D33n11k80M76J09l94l5K06L60l82j97J98M99l39k25J45R4N6n20K98K26J58
4185C75k78l08N05J34p73J94J60K33j39l32M98K09j49o54L15M93n9q45K11M80
4205B70j21l34j33N72j26k17j75O84km91k48P56p7m93M6P3K59l99k07N83l8J10
4227B92o41K14N04Nq78K97M95m08l7j08K81J97l13r2L22K41p26J59M09K65l46
4248A32m02K15L61l85m42M55M56k28m38o7N98k7n16K6N36j9m10P2L14J20m09J0
4270d8L6L48l32p4N1N09m29m95K96N19m15k96J25O89l56n07J10N63N9o19J12K70
$$ plain form
4122 250 -14 -398 -119 220 115 -192 -13 346 34 -138 -105 443 399 -119 -411 -48 377 -92 -193 -125 119
4143 119 -233 -424 -25 5 -235 -350 -154 376 -292 -231 -131 437 249 -23 -319 115 395 -285 -172 231 433
4164 433 -78 -358 118 227 -167 -202 4 364 -18 -215 -17 482 143 -82 63 157 213 -307 -9 217 375
4185 375 97 -211 294 428 -345 -151 9 242 103 -229 269 478 329 -325 -10 483 424 -421 -210 270
4205 270 149 -185 -318 254 128 -89 -264 420 418 -73 -321 435 358 -135 -89 -16 243 -156 -363 220 182 292
4227 292 -349 -135 369 374 -504 -207 288 -120 -157 -265 16 213 -100 -192 130 371 -355 -196 213 478 132
4248 132 -270 -55 306 -79 -521 -66 390 162 -276 -343 255 228 -288 -262 274 255 -155 -83 231 351 -58 -48
4270 -48 -12 336 4 -70 -19 490 61 -434 -138 381 -34 -330 -205 484 128 -379 -269 294 353 -266 -154 116
4292A16o4r9j64J65L57j18n56J38P59n43j00M0K10r1l84K75L68k04k98k59O50
4313A98l93k89M17K20J18m76j19N25j45j92n05N61L96l55p7Q2K83k40k04J96K65
4334B66j64l86k09O94L4p4m21M73J63m32k32L71K73k20n95N10M40o13j69L95j32
4355b8nm20K70L76p2l0m02M78R9p14K78O09j66j86l70M28J74j38n2l27J81J47
4377A30m67J06M60p5m39J84K56Rl50J68k8L31k58N1k32M93k04k85N47k20j48j77
4399a48k9L09j06o02N28L09k59l40J03O81l75l81j17N19Pm69J20J89K57k87j27
4420b18K42L27n96mK61L78l38j90J0K33j28l60M22L55k63l28O9J79L04o38MN06
4442B27K32o78j10K65L44l09j60M6N26j97k55L4K81j33l88N23K5k20l05K05L16
$$ plain form
4292 116 52 -47 -211 -46 311 193 -363 -225 534 -9 -109 -69 141 50 -334 -59 309 105 -193 -452 198
4313 198 -195 -484 -67 153 271 -205 -324 201 56 -136 -641 -80 316 -39 -116 -34 249 9 -195 1 266
4334 266 102 -284 -493 201 235 161 -260 213 376 -56 -288 83 356 136 -459 51 491 -122 -291 104 -28
4355 -28 -33 -453 -183 193 121 91 -311 167 266 -448 -170 439 273 87 -283 145 319 181 129 -198 -17 130
4377 130 -337 -231 229 154 -285 -101 155 164 -186 -18 -46 285 27 78 -154 339 135 -150 397 177 29 -148
4399 -148 -177 132 26 -576 -48 261 2 -338 -235 446 71 -310 -427 92 99 -370 -250 -61 196 -91 -218
4420 -218 24 351 -245 -249 12 390 52 -138 -128 105 -23 -383 39 394 131 -197 -128 51 355 -283 -279 227
4442 227 459 -219 -329 -64 280 -29 -189 -143 383 186 -69 -35 246 113 -275 248 273 53 -252 -47 269
4463B69n2k58J0n6K76l74l50O53J01l78k86N12K03l09j74r3P70j17m67R3J93J50
4485C16n89J41L13j94j96p9K54L06m46J27J44O9j50k95P9M15n3l99j07N36j42
4506E0k91j32P07l37j09J8N2L31n93K22J76n8M7k49J21K81k55k04J51L36n22J54
4528a04j52K66K24l71Nj7K79q0l52N31j24j72j44K93p4m56K53O23k08l73PJ88
4550D2L58l37m43L72k0l1l9o4L43k18q1N6L81M4o12P2N5L10j19n07L43J18j57
4573a34n9J11k3J73j63j27N32l68j07M16r3J3k71LL87P2o17Q4J92k7j40o3L77
4596A68nn11K1K57J99j99l6L13kj06j87n8K86o1k88Q9J56Q2j90m3K19Qk17k5N7
4621g3K25p9l69L63K00j03l04R9N0Q4m91K40J67R4j39j71N97l03k10j06L44R3
$$ plain form
4463 269 217 -41 -31 -87 189 -185 -535 118 219 -159 -445 67 270 -39 -213 -306 464 347 -120 -27 166 316
4485 316 -273 -132 181 -13 -209 -288 -34 272 -174 -47 97 166 16 -279 -200 215 162 -237 -344 192 50
4506 50 -241 -373 334 -3 -112 -94 -42 289 -304 -82 94 36 83 -166 -45 236 -19 -223 -72 264 -258 -104
4528 -104 -256 10 234 -137 -132 -149 130 50 -302 229 105 -67 -211 82 8 -448 -195 428 220 -153 -146 42
4550 42 400 63 -380 -8 -28 -59 -98 -162 181 -37 -118 -62 319 363 -249 -177 -122 188 69 -438 -95 23 -134
4573 -134 -193 -82 -105 68 -95 -222 310 -58 -165 251 158 171 -100 -97 290 362 -255 -171 21 -6 -146 -209 168
4596 168 163 -348 -327 -70 129 -70 -106 207 205 99 -88 -146 140 79 -209 -120 36 118 -72 -115 104 112 -105 -130 -73
4621 -73 152 73 -296 67 267 164 -140 -41 9 93 -398 -158 9 103 -36 -207 390 87 -123 -229 115 208
$$ [...]
8191E0
##END NTUPLES=NMR FID
##END=
