##TITLE=1H_Pr Am3
 CDCl3, 8 sc, 
 3.08.2021
##JCAMPDX= 6.0         $$ Bruker NMR JCAMP-DX V2.0
##DATA TYPE= NMR FID
##DATA CLASS= NTUPLES
##ORIGIN= UXNMR, Bruker Analytische Messtechnik GmbH
##OWNER= root
$$ XWIN-NMR		Version 3.5
$$ Tue Aug  3 12:25:18 2021 Russian Standard Time (UT+4h)  she@DPX200
##.OBSERVE FREQUENCY= 200.131506
##.OBSERVE NUCLEUS= ^1H
##.DELAY= (6, 6)
##.ACQUISITION MODE= SIMULTANEOUS
##.ACQUISITION SCHEME= undefined
##.AVERAGES= 8
##.DIGITISER RES= 18
##SPECTROMETER/DATA SYSTEM= spect
##.PULSE SEQUENCE= zg30
##.SOLVENT NAME= CDCl3
##.SHIFT REFERENCE= (INTERNAL, CDCl3, 0, 15.7039)
##AUDIT TRAIL= $$ (NUMBER, WHEN, WHO, WHERE, WHAT)
$$ ##TITLE= Audit trail, XWIN-NMR		Version 3.5
$$ ##JCAMPDX= 5.01
$$ ##ORIGIN= Bruker BioSpin GmbH
$$ ##OWNER= she
$$ F:/spectra/data/she/nmr/H-F/1/audita.txt
$$ ##AUDIT TRAIL=  $$ (NUMBER, WHEN, WHO, WHERE, WHAT)
(   1,<2021-08-03 12:24:04.48 +0400>,<she>,<DPX200>,
      <created by zg, POWCHK disabled, PULCHK disabled
       configuration hash MD5:
       00 E9 B6 7A A2 85 ED C7 34 08 36 98 17 FE 4E 26
       data hash MD5: 16K
       6F CD 26 26 EB F5 B5 49 30 CB B9 E5 47 99 C3 52>)
$$ ##END=
$$ 
$$ hash MD5
$$ C6 82 A7 1D 74 69 3B DB 1A 64 C2 B2 58 65 EF E4
##$RELAX= 
##$RELAX= 
##$RELAX= 
##$RELAX= 
##$RELAX= 
##$RELAX= 
$$ Bruker specific parameters
$$ --------------------------
##$DU= <F:/spectra>
##$EXPNO= 1
##$NAME= <H-F>
##$PROCNO= 1
##$TYPE= <nmr>
##$USER= <she>
##$AMP= (0..31)
100 100 100 100 100 100 100 100 100 100 100 100 100 100 100 100 100 100 
100 100 100 100 100 100 100 100 100 100 100 100 100 100 
##$AQSEQ= 0
##$AQ_mod= 1
##$AUNM= <au_zg>
##$AUTOPOS= <>
##$BF1= 200.13
##$BF2= 200.13
##$BF3= 200.13
##$BF4= 200.13
##$BF5= 200.13
##$BF6= 200.13
##$BF7= 200.13
##$BF8= 200.13
##$BYTORDA= 1
##$CFDGTYP= 0
##$CFRGTYP= 5
##$CHEMSTR= <none>
##$CNST= (0..31)
1 1 145 1 1 1 1 1 1 1 1 1 1 1 1 1 1 1 1 1 1 1 1 1 1 1 1 1 1 1 1 1 
##$CPDPRG= <>
##$CPDPRG1= <>
##$CPDPRG2= <>
##$CPDPRG3= <>
##$CPDPRG4= <mlev>
##$CPDPRG5= <mlev>
##$CPDPRG6= <mlev>
##$CPDPRG7= <mlev>
##$CPDPRG8= <mlev>
##$CPDPRGB= <>
##$CPDPRGT= <>
##$D= (0..31)
0 1.2 0 0 0 0 0 0 0 0.06 0 0.03 0 0 0 0 0.0002 0 0 0 0 0 0 0 0 0 0 0 0 
0 0 0 
##$DATE= 1627979043
##$DBL= (0..7)
120 120 120 120 120 120 120 120 
##$DBP= (0..7)
150 150 150 150 150 150 150 150 
##$DBP07= 0
##$DBPNAM0= <>
##$DBPNAM1= <>
##$DBPNAM2= <>
##$DBPNAM3= <>
##$DBPNAM4= <>
##$DBPNAM5= <>
##$DBPNAM6= <>
##$DBPNAM7= <>
##$DBPOAL= (0..7)
0.5 0.5 0.5 0.5 0.5 0.5 0.5 0.5 
##$DBPOFFS= (0..7)
0 0 0 0 0 0 0 0 
##$DE= 6
##$DECBNUC= <off>
##$DECIM= 32
##$DECNUC= <off>
##$DECSTAT= 4
##$DIGMOD= 1
##$DIGTYP= 9
##$DL= (0..7)
0 120 120 120 120 120 120 120 
##$DP= (0..7)
150 150 150 150 150 150 150 150 
##$DP07= 0
##$DPNAME0= <>
##$DPNAME1= <>
##$DPNAME2= <>
##$DPNAME3= <>
##$DPNAME4= <>
##$DPNAME5= <>
##$DPNAME6= <>
##$DPNAME7= <>
##$DPOAL= (0..7)
0.5 0.5 0.5 0.5 0.5 0.5 0.5 0.5 
##$DPOFFS= (0..7)
0 0 0 0 0 0 0 0 
##$DQDMODE= 0
##$DR= 18
##$DS= 0
##$DSLIST= <SSSSSSSSSSSSSSS>
$$ [...]
##$SUBNAM2= <"">
##$SUBNAM3= <"">
##$SUBNAM4= <"">
##$SUBNAM5= <"">
##$SUBNAM6= <"">
##$SUBNAM7= <"">
##$SUBNAM8= <"">
##$SUBNAM9= <"">
##$SW= 20.0188882624521
##$SWIBOX= (0..15)
0 0 2 0 0 0 0 0 0 0 0 0 0 0 0 0 
##$SW_h= 4006.41025641026
##$TD= 16384
##$TD0= 1
##$TE= 0
##$TE2= 300
##$TE3= 300
##$TEG= 300
##$TL= (0..7)
0 120 120 120 120 120 120 120 
##$TP= (0..7)
150 150 150 150 150 150 150 150 
##$TP07= 0
##$TPNAME0= <>
##$TPNAME1= <>
##$TPNAME2= <>
##$TPNAME3= <>
##$TPNAME4= <>
##$TPNAME5= <>
##$TPNAME6= <>
##$TPNAME7= <>
##$TPOAL= (0..7)
0.5 0.5 0.5 0.5 0.5 0.5 0.5 0.5 
##$TPOFFS= (0..7)
0 0 0 0 0 0 0 0 
##$TUNHIN= 0
##$TUNHOUT= 0
##$TUNXOUT= 0
##$USERA1= <user>
##$USERA2= <user>
##$USERA3= <user>
##$USERA4= <user>
##$USERA5= <user>
##$V9= 5
##$VALIST= <valist>
##$VCLIST= <CCCCCCCCCCCCCCC>
##$VD= 0
##$VDLIST= <DDDDDDDDDDDDDDD>
##$VPLIST= <PPPPPPPPPPPPPPP>
##$VTLIST= <TTTTTTTTTTTTTTT>
##$WBST= 1024
##$WBSW= 4
##$XGAIN= (0..3)
0 0 0 0 
##$XL= 0
##$YL= 0
##$YMAX_a= 56637
##$YMIN_a= -90152
##$ZGOPTNS= <>
##$ZL1= 120
##$ZL2= 120
##$ZL3= 120
##$ZL4= 120
##$ABSF1= 10
##$ABSF2= 0
##$ABSG= 5
##$ABSL= 3
##$ALPHA= 0
##$AQORDER= 0
##$ASSFAC= 0
##$ASSFACI= 0
##$ASSFACX= 0
##$ASSWID= 0
##$AUNMP= <proc_1d>
##$AZFE= 0.1
##$AZFW= 0.1
##$BCFW= 1
##$BC_mod= 2
##$BYTORDP= 1
##$COROFFS= 0
##$CY= 11.3945322036743
##$DATMOD= 1
##$DC= 2
##$DFILT= <>
##$DTYPP= 0
##$F1P= 2.36226072786647
##$F2P= -0.459571619588291
##$FCOR= 0.5
##$FTSIZE= 0
##$FT_mod= 4
##$GAMMA= 1
##$GB= 0.15
##$INTBC= 1
##$INTSCL= 1
##$ISEN= 128
##$LB= 0.24
##$LEV0= 0
##$LPBIN= 0
##$MAXI= 10000
##$MC2= 0
##$MEAN= 0
##$ME_mod= 0
##$MI= 1.114404
##$NCOEF= 0
##$NC_proc= 0
##$NLEV= 6
##$NOISF1= 3.799351
##$NOISF2= 2.8
##$NSP= 1
##$NTH_PI= 0
##$NZP= 0
##$OFFSET= 15.70392
##$PC= 1
##$PHC0= -13360.14
##$PHC1= 18.80099
##$PH_mod= 1
##$PKNL= yes
##$PPARMOD= 0
##$PSCAL= 0
##$PSIGN= 0
##$REVERSE= no
##$SF= 200.130013532006
##$SI= 16384
##$SIGF1= 3
##$SIGF2= 2
##$SINO= 400
##$SIOLD= 16384
##$SREGLST= <1H.CDCl3>
##$SSB= 0
##$STSI= 0
##$STSR= 0
##$SW_p= 3612.71676300578
##$SYMM= 0
##$S_DEV= 0
##$TDeff= 0
##$TDoff= 0
##$TI= <>
##$TILT= no
##$TM1= 0
##$TM2= 0
##$TOPLEV= 0
##$USERP1= <user>
##$USERP2= <user>
##$USERP3= <user>
##$USERP4= <user>
##$USERP5= <user>
##$WDW= 1
##$XDIM= 8192
##$YMAX_p= 0
##$YMIN_p= 0
$$ End of Bruker specific parameters
$$ ---------------------------------
##NTUPLES= NMR FID
##VAR_NAME=  TIME,          FID/REAL,        FID/IMAG
##SYMBOL=    X,             R,               I
##VAR_TYPE=  INDEPENDENT,   DEPENDENT,       DEPENDENT
##VAR_FORM=  AFFN,          ASDF,            ASDF
##VAR_DIM=   8192,          8192,            8192
##UNITS=     SECONDS,       ARBITRARY UNITS, ARBITRARY UNITS
##FACTOR=    0.0002496,     1,               1
##FIRST=     0,             0,               0
##LAST=      2.0444736,     0,               0
##MIN=       0,             -90152,          0
##MAX=       2.0444736,     56637,           0
$$ Real data points
##PAGE= N=1
##DATA TABLE= (X++(R..R)), XYDATA
$$ [...]
$$ plain form
1412 305 464 215 249 438 367 126 460 326 98 152 256 261 102 336 186 95 143 -3 -26 90 109 -243 -35
1435 -35 -107 -7 -101 -85 -20 -163 -274 -189 -300 -205 -230 -440 -219 -358 -367 -222 -429 -347 -394 -258 -347 -336 -337 -142 -419
1460 -419 -256 -116 -223 -21 38 -159 -274 -136 -161 -228 -255 12 -33 -113 79 84 -46 72 37 165 74 68 182 129
1484 129 -96 280 188 24 72 247 438 180 203 458 158 260 365 373 307 227 242 192 188 434 210 91 82 349
1508 349 255 353 48 276 271 13 227 103 43 18 -121 94 -40 -132 -29 -18 11 131 -151 -341 -138 -390 -55
1531 -55 -161 -217 -253 -280 -58 -283 -365 -122 -198 -237 -512 -440 -314 -269 -243 -297 -406 -262 -233 -406 -60 -107 -238 -212 -233
1556 -233 -233 -39 -267 -192 -44 -95 1 74 12 61 -224 102 163 39 22 -10 101 348 84 202 158 211 275 231 315
1581 315 357 167 305 384 85 235 287 491 271 233 304 129 227 44 281 120 246 351 252 289 117 188 242
$$ packed form
1412C05J59k49L4J89p1k41L34j34k28N4J04Nj59K34j50r1M8j46k3J16J9l52K08
1435c5p2J00r4J6O5j43j11Q5j11R5k5k10K21j39rJ45k07Q2m7J36q9J1jJ95k77
1460d19J63J40j07K02N9j97j15J38k5o7k7K67m5q0J92Nj30J18l5J28r1oJ14n3
1484A29k25L76r2j64M8J75J91k58K3K55l00J02J05Qo6q0J5n0mK46k24j19rK67
1508C49r4R8l05K28nk58K14j24o0k5j39K15j34r2J03J1K9J20k82j90K03k52L35
1531e5j06n6l6k7K22k25q2K43p6l9k75P2J26M5K6n4j09J44K9j73L46m7j31K6k1
1556b33%J94k28P5J48n1R6P3o2M9k85L26O1j24j7l2J11K47k64J18m4N3O4m4Q4
1581C15M2j90J38P9k99J50N2K04k20l8P1j75R8j83K37j61J26J05r9L7j72P1N4
$$ plain form
1604 242 12 321 221 -36 -111 68 -10 17 -49 53 -70 -138 -63 -279 -21 8 -378 -306 -58 -273 -142 -231 -306
1627 -306 -342 -193 -348 -387 -200 -277 -364 -205 -197 -369 -255 -285 -384 -291 -91 -280 -184 -146 -179 -142 -82 -16 -346 14 100
1652 100 -244 59 171 -153 -121 -6 -96 -30 142 149 135 249 272 -59 346 206 83 133 305 -52 -67 89 150
1675 150 96 188 363 110 293 336 268 298 348 102 235 202 285 102 329 26 84 82 185 137 82 63 -60 121 96
1700 96 -99 -243 139 112 -192 -71 127 -166 -153 -95 -194 -99 -238 -405 -269 -101 -138 -169 -313 -346 -261 -210 -221 -285
1724 -285 -357 -155 -244 -254 -61 -324 -394 -249 -98 -372 -67 -12 -256 -175 56 -12 -166 -11 -135 -251 80 -49
1746 -49 -220 -121 -122 244 257 54 14 -87 405 232 121 99 -92 199 307 178 235 109 -68 160 319 120 163
1769 163 50 287 195 13 386 328 -99 317 217 271 299 302 201 77 320 155 18 51 47 -3 -53 30 -240 -86
$$ packed form
1604B42k30L09j00k57p5J79p8K7o6J02j23o8P5k16K58K9l86P2K48k15J31q9p5
1627c06l6J49j55l9J87p7q7J59Qj72J14l0r9R3K00j89R6L8l3L7O0O6l30L60Q6
1652A00l44L03J12l24L2J15r0O6J72Pj4J14K3l31M05j40j23N0J72l57j5J56O1
1675A50n4R2J75k53J83M3o8L0N0k46J33l3Q3j83K27l03N8kJ03m8n5j9j23J81k5
1700I6j95j44L82k7l04J21J98k93J3N8r9R5j39j67J36J68l7l1j44l3Q5N1j1o4
1724b85p2K02q9j0J93k63p0J45J51k74L05N5k44Q1K31o8j54J55j24j16L31j29
1746d9j71R9jL66J3k03m0j01M92j73j11k2j91K91J08j29N7j26j77K28J59j99M3
1769A63j13K37r2j82L73n8m27M16j00N4K8Lj01j24K43j65j37L3mn0n0Q3k70J54
$$ plain form
1793 -86 -174 -160 49 -169 -160 -156 -132 -20 -110 -240 -392 -402 -242 -177 -224 -71 -266 -339 -143 66 -93 -272 3 -260
1817 -260 -269 -136 -240 -259 -310 -34 -9 -7 151 -138 -230 -121 -32 152 -40 -141 -150 -71 90 -111 21 93 55 238 236
1842 236 141 134 242 97 179 198 105 62 165 343 202 333 196 76 149 301 270 173 166 215 292 252 312 12 -56 212
1868 212 52 360 106 57 133 126 93 242 -56 -165 17 77 130 -125 -46 -38 58 -140 185 -105 -194 -287 108 -373
1892 -373 -337 -104 -63 -294 -159 -9 -156 -137 -136 -218 -331 -181 -27 -199 -321 -155 -189 -77 -338 -4 -106 -159 -84
1915 -84 34 -247 -125 -37 -56 -28 -104 45 -276 -67 77 -7 -62 181 2 11 52 62 43 -44 198 262 164 172 279 157
1941 157 80 262 175 265 180 191 162 -67 302 332 131 21 112 331 106 66 154 110 0 314 80 -17 60 46 56
1966 56 -32 135 127 -44 62 25 -250 -125 -52 49 -142 -107 -55 -6 -34 -30 -111 -374 -226 -203 -6 -340 -234 -233 -287 -161
$$ packed form
1793h6q8J4K09k18RMK4J12r0j30j52j0J60O5m7J53j95p3J96K09j59j79K75k63
1817b60rJ33j04j9n1K76K5KJ58k89r2J09Q9J84j92j01rP9J61k01J32P2l8J83k
1842B36r5pJ08j45Q2J9r3m3J03J78j41J31j37j20P3J52l1r7pM9P7m0O0l00o8K68
1868B12j60L08k54m9P6pl3J49k98j09J82O0N3k55P9QR6j98L25k90q9r3L95m81
1892c73L6K33M1k31J35J50j47J9Jq2j13J50J54j72j22J66l4J12k61L34j02n3P5
1915h4J18k81J22Q8j9K8p6J49l21K09J44q4n5K43j79RM1J0j9q7K42O4r8QJ07j22
1941A57p7J82q7R0q5J1k9k29L69L0k01j10R1K19k25m0Q8m4j10L14k34r7P7j4J0
1966E6q8J67qj71J06l7k75J25P3J01j91L5N2M9k8Mq1k63J48K3J97l34J06Jn4J26
$$ plain form
1992 -161 -146 -309 -257 -133 -133 -292 -84 -141 -120 -312 -288 -9 -153 -110 -57 -55 -109 -48 57 17 84 68 -47 -55 -145 79
2018 79 219 53 144 -10 17 -2 35 199 86 182 200 66 176 255 36 200 118 185 45 361 25 95 244 289
2042 289 183 57 -59 -37 135 17 145 138 -42 110 30 8 189 -23 169 91 140 228 -154 -85 60 -70 -139
2065 -139 -92 -1 -157 -60 -224 -184 -57 -185 -180 -271 -171 -202 -283 -208 -138 -104 -62 -363 -135 -167 -149 -67 -188 -168 -130 -33
2091 -33 -86 -235 -122 -8 -26 -153 -168 -16 -19 -156 -118 10 -50 32 109 -57 -62 77 61 -27 -31 98 83 113 -118 240
2117 240 164 300 153 129 122 29 346 305 283 245 155 316 163 206 207 108 118 299 -6 65 344 -98 105 77 129 -3
2143 -3 107 -105 50 -40 106 -98 -5 48 -100 -61 -104 -35 -126 -63 0 59 -29 26 -188 -273 -97 -71 -106 -46 -189 -136
2169 -136 120 -32 -21 -21 -133 -209 -360 -117 -308 -118 -108 -150 -28 -93 -75 -60 -144 -233 -21 -150 -67 -104 -128 6 -107
$$ packed form
1992a61J5j63N2J24%j59K08n7K1j92K4K79j44M3N3Kn4O1J05m0O7j6j15qr0K24
2018G9J40j66R1j54K7j9L7J64j13R6J8j34J10P9k19J64q2O7j40L16l36P0J49M5
2042B89j06j26j16K2J72j18J28pj80J52q0k2J81k12J92p8M9Q8l82O9J45j30o9
2065a39M7R1j56R7j64M0J27j28Nr1J00l1q1P5P0L4M2l01K28l2J8Q2j21K0L8R7
2091c3n3j49J13J14j8j27j5J52lj37L8J28o0Q2P7j66nJ39j6q8mJ29j5L0k31L58
2117B40p6J36j47k4pr3L17m1k2l8r0J61j53M3Jr9J0J81l05P1K79m42K03k8N2j32
2143cJ10k12J55r0J46k04R3N3j48L9m3O9r1O3O3N9q8N5k14q5J76K6l5O0j43N3
2169a36K56j52J1%j12p6j51K43j91J90J0m2J22o5J8J5q4q9K12j29Q3l7k4J34j13
$$ plain form
2194 -107 6 17 54 50 52 24 118 81 155 55 71 171 270 72 58 64 39 198 128 17 224 111 267 148 199 262
2220 262 82 167 143 174 65 68 -19 229 61 141 127 229 168 34 33 101 -131 129 211 45 116 -24 -130 94 95
2245 95 -183 40 -82 -110 -211 -151 88 -139 -39 -66 -205 -54 -82 -313 28 10 -207 -3 -311 -27 -336 -75
2267 -75 -95 -91 -172 -114 -69 -32 -142 -118 -185 -38 -225 7 44 -20 -140 -89 85 -215 81 57 152 -89 287 173 -112
2292 -112 -32 -68 215 205 13 8 75 131 150 90 39 64 -5 270 161 152 260 107 80 106 121 2 136 148 177 -26
2318 -26 71 123 31 137 88 128 45 -82 74 -58 190 114 64 0 39 -73 -231 -24 -223 -8 57 -256 -39 123
2342 123 -76 -171 -98 -18 -47 -207 -259 -278 -44 9 -243 50 -161 -150 -78 -19 -2 -210 -200 -220 -60 -78 -31 -149 -62
2367 -62 -81 -59 18 102 -125 17 116 36 80 122 34 40 87 33 -75 92 73 -82 182 104 23 69 -28 154 -3 227
$$ packed form
2194a07J13J1L7mKk8R4l7P4j00J6J00R9j98j4Ok5J59p0j11K07j13J56j19N1O3
2220B62j80Q5k4L1j09Lq7K48j68Q0j4J02o1j34jO8k32K60Q2j66P1j40j06K24J
2245I5k78K23j22k8j01O0K39k27J00k7j39J51k8k31L41j8k17K04l08K84l09K61
2267g5k0Mq1N8M5L7j10K4o7J47j87K32L7o4j20N1J74l00K96k4R5k41L76j14k85
2292a12Q0l6K83j0j92nO7N6J9o0n1K5o9K75j09rJ08j53k7K6J5j19J34J2K9k03
2318b6R7N2r2J06m9M0q3j27J56j32K48p6n0o4L9j12j58K07j99K15O5l13K17J62
2342A23j99r5P3Q0k9j60n2j9K34N3k52K93k11J1P2N9J7k08J0k0J60j8M7j18Q7
2367f2j9K2P7Q4k27J42R9q0M4M2q8OM7n4j08J67j9j55K64p8q1M6r7J82j57K30
$$ plain form
2393 227 65 162 70 136 113 95 194 25 186 223 102 245 141 -31 120 41 51 125 -46 65 58 183 -36 -53
2417 -53 103 -33 -146 -30 -63 101 -27 -61 -114 -153 -119 -101 -173 -2 -98 -193 -41 -246 -48 -140 80 -110 10 -45
2441 -45 -96 -96 56 -44 -121 -12 -110 -92 105 -126 57 -91 -118 -196 -244 61 33 35 -11 -133 -51 238 -57 60 -27
2466 -27 38 77 -36 -143 111 23 261 -149 -20 127 149 66 58 200 111 70 30 229 -7 148 116 110 292 -20 133
2491 133 165 112 198 183 89 7 13 -37 62 3 119 -28 -27 129 165 47 -69 149 9 -151 35 -60 2 -89 -2 -125
2517 -125 -132 -275 -97 -101 -241 -189 35 -172 -201 -142 -104 -151 -59 -132 -146 -114 -36 -15 -87 -115 -185 81 -28 -49 -35 -136 -13
2544 -13 -9 -259 -13 -23 -17 27 -195 -66 14 63 33 21 44 -8 129 61 14 -64 17 156 82 85 -21 58 83 135 -82 -72
2572 -72 -15 -7 14 110 -82 241 257 254 48 121 47 260 -9 148 100 -3 64 20 67 133 99 -84 43 -6 164 -2
$$ packed form
2393B27j62R7r2O6k3j8R9j69J61L7j21J43j04j72J51p9J0P4j71J11pJ25k19j7
2417e3J56j36j13J16l3J64j28l4n3l9L4J8p2J71r6r5J52k05J98r2K20j90J20n5
2441d5n1%J52j00p7J09r8J8J97k31J83j48k7p8m8L05k8Km6j22Q2K89k95J17q7
2466b7O5L9j13j07K54q8K38m10J29J47K2q3qJ42q9m1m0J99k36J55l2oJ82l12J53
2491A33L2n3Q6j5r4q2On0R9n9J16j47JJ56L6j18j16K18j40j60J86r5O2r1Q7j23
2517a25pj43J78mj40N2K24k07k9N9L8m7R2p3j4L2P8K1p2k8p0K66j09k1J4j01J23
2544a3Mk50K46j0OM4k22J29Q0M9l0j2K3n2J37o8m7p8Q1J39p4Lj06P9K5N2k17J0
2572g2N7QK1R6j92L23J6lk06P3p4K13k69J57m8j03O7m4M7O6l4j83J27m9J70j66
$$ plain form
2598 -2 -4 130 25 -78 -102 101 5 -8 -74 -57 -113 27 -20 -299 31 -77 -178 -2 -176 -132 -32 -37 -101 -75 -16 -30
2624 -30 -90 -124 -41 -116 12 -84 -202 -71 -127 -107 116 -184 82 -72 -85 16 -108 -30 -32 -149 2 111 -30 100
2648 100 21 20 -30 41 174 113 110 220 -48 84 62 -48 -3 -85 44 33 183 143 151 191 42 -1 26 165 133 151 26
2675 26 25 73 255 49 51 -42 84 207 -73 29 212 25 32 -16 39 20 7 -165 35 207 -48 4 -164 -67 -106
2700 -106 -51 -170 25 -35 -172 117 31 -217 -136 -184 -240 -133 -148 -91 -44 -90 -101 -138 -88 -42 -94 -83 -69 -49 -119 -208 -159
2727 -159 11 -49 -142 -100 32 -213 -6 -76 -62 174 28 -11 -80 80 42 25 154 121 -7 -11 166 -24 125 132 -9
2752 -9 89 -205 248 66 176 60 154 21 108 169 256 40 -6 102 104 -37 153 50 -5 161 125 212 -127 22
2776 22 -22 -123 65 -26 -4 85 0 73 8 1 -50 -155 -169 -114 -190 -127 -139 -175 83 29 -207 -102 -36 -59 -110 -280 103
$$ packed form
2598bkJ34j05j03k4K03r6j3o6J7n6J40m7k79L30j08j01J76j74M4J00no4K6N9j4
2624c0o0l4Q3p5J28r6j18J31n6K0K23l00K66j54j3J01j24P8kj17J51J09j41J30
2648A00p9jn0P1J33o1lJ10k68J32k2j10M5q2J29j1J50m0QM0j49m3K7J39l2J8j25
2675B6jM8J82k06Kr3J26J23k80J02J83j87Pm8N5j9j3j72K00J72k55N2j68R7l9
2700a06N5j19J95o0j37K89q6k48Q1m8n6J07j5N7M7m6j1l7N0M6n2J1J4K0p0q9M9
2727a59J70o0r3M2J32k45K07p0J4K36j46l9o9J60l8j7J29l3j28mJ77j90J49Pj41
2752iR8k94M53j82J10j16R4j33Q7O1Q7k16m6J08Kj41J90j03n5J66l6Q7l39J49
2776B2m4j01J88r1K2Q9q5P3o5pn1j05j4N5p6O3j2l6K58n4k36J05O6k3n1j70L83
$$ plain form
2803 103 -75 -78 -26 -18 -200 -124 -136 -151 113 -119 59 48 -74 87 -24 107 -50 80 81 -18 46 81 143 26 -54
2828 -54 35 -111 -8 193 60 138 -86 -36 -112 45 -30 50 142 31 -75 -39 39 175 131 80 86 175 18 154 42
2853 42 18 111 89 143 140 -38 184 130 -45 -34 79 136 -2 -100 148 80 59 -91 -163 19 -209 31 -104 -86 18
2878 18 -92 100 32 -76 -72 -152 -98 81 -35 85 58 -270 -154 -156 20 -158 -97 -89 96 -252 -96 -65 -57 100 -149
2903 -149 -102 -36 -121 -55 129 -147 -71 16 -125 54 -31 49 22 1 -115 7 -21 5 18 36 126 112 260 95 13 -34
2929 -34 -55 166 142 44 -20 49 152 194 34 -2 63 -17 64 31 97 -53 111 103 -70 19 -47 8 -64 227 153 -52 -13
2956 -13 -19 51 64 19 -21 -10 -40 -64 137 20 -137 -168 -5 -165 -92 -95 -251 -33 -206 -121 -10 46 -112 -203 -32 -1
2982 -1 -8 -130 -44 12 -53 -45 -125 -19 -220 -19 21 47 -66 -37 36 -136 -227 -95 -95 -197 -51 -167 16 -82 -36 156
$$ packed form
2803A03j78lN2Qj82P6j2j5K64k32J78j1j22J61j11J31j57J30Jr9O4L5O2j17q0
2828e4Q9j46J03K01j33P8k24N0p6J57p5Q0R2j11j06L6P8J36m4n1OQ9j57J36j12
2853D2k4R3k2N4lj78K22n4j75J1J13N7j38r8K48o8k1j50p2J82k28K40j35J8J04
2878A8j10J92o8j08Mq0N4J79j16J20k7l28J16kJ76j78O1QJ85l48J56L1QJ57k49
2903a49M7O6q5O6J84k76P6Q7j41J79q5Q0k7k1j16J22k8K6J3J8R0j4J48j65q2m7
2929c4k1K21k4r8o4O9J03M2j60l6O5q0Q1l3O6j50J64qj73Q9o6N5p2K91p4k05L9
2956a3oP0J3m5m0J1l0k4K01j17j57l1J63j60P3lj56K18j73Q5J11N6j58r1J71L1
2982apj22Q6N6o5Qq0J06k01K01M0K6j13K9P3j72r1J32%j02J46j16J83r8M6J92
$$ plain form
3008 156 -86 -109 116 -41 80 86 149 2 101 148 133 131 228 -3 -36 160 -18 176 208 48 -182 92 -86 -121
3032 -121 263 41 148 -35 -34 39 94 164 -41 -62 2 160 -119 -57 56 33 66 -32 -94 -114 2 76 -229 71 68
3057 68 55 -213 -40 -96 60 3 -82 -65 -6 62 47 36 -106 -13 9 -16 -64 -98 -156 -127 133 -265 -47 -103 -184 -74
3083 -74 -75 29 130 37 -70 115 -83 74 -53 -43 42 -45 -276 -5 145 47 -34 -96 155 85 57 -100 26 19 103
3108 103 -111 67 52 32 167 61 -117 8 170 73 87 37 -146 139 70 158 204 -48 64 6 -60 48 83 -13
3132 -13 22 -31 98 30 0 114 75 -91 64 63 6 -174 -53 29 101 -45 -111 -160 -147 16 -77 2 -113 105 -147
3157 -147 111 -89 -95 -105 -76 23 -178 -23 -73 -59 -74 -15 -131 84 -7 -4 -192 0 -79 107 -59 -115 24 -66 4
3182 4 -146 -62 254 38 23 121 20 -129 -69 179 6 54 146 15 50 94 180 187 -50 164 244 -70 -161 83 51
$$ packed form
3008A56k42k3K25j57J21OO3j47R9M7j5kR7k31l3J96j78J94L2j60k30K74j78l5
3032a21L84k22J07j83JP3N5P0k05k1O4J58k79O2J13k3L3r8o2k0J16P4l05L00l
3057F8j3k68J73n6J56n7q5J7N9O8j5j1j42R3K2k5m8l4n8K9K60l98K18n6q1J10
3083g4jJ04J01r3j07J85j98J57j27J0Q5q7k31K71J50r8q1o2K51p0k8j57J26pQ4
3108A03k14J78j5k0J35j06j78J25J62r7J4n0j83K85o9Q8M6k52J12n8o6J08L5r6
3132a3L5n3J29o8l0J14l9j66J55jn7j80J21Q2P2j46o6m9J3J63r3P9j15K18k52
3157a47K58k00oj0K9R9k01J55n0J4j5N9j16K15r1Lj88J92p9J86j66n6J39r0P0
3182Dj50Q4L16k16j5R8j01j49O0K48j73M8R2j31L5M4Q6Pk37K14Q0l14r1K44l2
$$ plain form
3207 51 4 260 236 -252 -11 90 19 88 149 21 18 216 -46 -9 4 96 224 23 136 -12 -80 18 30 -41 25
3232 25 -138 -42 -89 -69 8 -39 -105 -132 -50 9 -150 41 -115 -48 -40 -37 46 -156 -34 -170 6 -53 24 -153 -142 -119 -181
3259 -181 -223 -66 7 -100 -5 -35 10 7 -28 37 63 -25 -83 12 50 6 39 -102 -32 99 8 24 129 15 -97 49
3285 49 136 31 -15 29 61 68 136 118 -11 9 229 -4 -20 126 36 190 -59 65 64 28 118 -45 244 96 -31
3310 -31 -108 37 -51 -41 2 1 129 -153 80 130 -59 -261 -87 -60 -74 19 -164 28 89 -157 112 -136 -233 25
3334 25 -136 -164 -166 -153 184 63 -55 -36 -58 -20 55 -104 8 -19 -185 6 -106 -21 -83 43 58 -47 113 43 88
3359 88 -86 -150 -30 74 38 -8 72 151 -17 105 136 107 -49 168 -4 91 160 12 98 59 134 95 -29 64 -40
3384 -40 76 125 9 40 -5 100 57 111 59 -127 -85 119 130 48 27 -117 -138 -152 -25 111 -143 15 82 165 102
$$ packed form
3207E1m7K56k4m88K41J01p1O9O1j28lJ98k62L7J3R2J28k01J13j48o8R8J2p1O6
3232B5j63R6m7K0P7m7o6k7Q2N9j59J91j56O7QLQ3k02J22j36J76n9P7j77J1K3o2
3259a81m2J57P3j07R5l0M5ll5O5K6q8n8R5L8m4L3j41P0J31r1J6J05j14j12J46
3285D9Q7j05m6M4L2PO8j8j29K0K20k33j6J46r0J54k49J24jl6R0j63K89j48j27
3310c1p7J45q8J0M3jJ28k82K33N0j89k02J74K7j4R3j83J92O1k46K69k48r7K58
3334B5j61k8kJ3L37j21j18J9k2L8P5j59J12k7j66J91j12Q5o2J26J5j05J60p0M5
3359H8j74o4J20J04l6m6Q0P9j68J22L1k9j56K17j72R5O9j48Q6l9P5l9j24R3j04
3384d0J16M9j16L1m5J05m3N4n2j86M2K04J1q2k1j44k1j4J27J36k54J58O7Q3o3
$$ plain form
3409 102 20 -59 64 69 18 -87 40 -57 -33 -53 145 -122 -164 53 -39 32 51 41 185 43 109 169 9 -162 -139
3434 -139 -175 -17 6 97 -111 -82 -145 -25 -63 121 121 -98 -64 -43 -2 87 69 -65 17 -60 119 -39 -48 42 212 129
3460 129 -29 -120 22 45 -16 232 81 226 172 -19 -71 308 213 -123 -2 222 60 185 231 115 -119 152
3482 152 88 -7 59 32 -202 -36 -31 -68 0 -102 -65 -57 60 -97 88 -1 83 61 19 18 -84 5 -96 9 -42 90
3508 90 -104 -30 -125 -73 -37 -286 21 111 71 -70 0 -28 118 8 -165 75 -98 -54 61 -86 -49 39 74 45 -59
3533 -59 78 -156 -30 -78 5 -90 -63 57 -101 -49 -70 33 24 118 167 -52 -72 -38 192 80 153 10 25 -79 50
3558 50 6 -85 -53 -39 147 88 142 137 12 -32 68 188 41 35 34 8 139 198 -41 218 1 55 33 -23 26 -73 17
3585 17 32 72 -78 115 75 -119 -110 -111 22 59 -36 33 -119 -39 114 -169 -139 102 -151 -12 -79 -49 -152 49 -41
$$ packed form
3409A02q2p9J23Nn1j05J27r7K4k0J98k67m2K17r2P1J9j0J44j42O6O0j60j71K3
3434a39l6J58K3R1k08K9o3J20l8J84%k19L4K1M1Q9j8j34Q2p7J79j58rR0J70q3
3460A29j58r1J42K3o1K48j51J45n4j91n2L79r5l36J21K24j62J25M6j16k34K71
3482A52o4r5O6k7k34J66Nl7O8j02L7QJ17j57J85q9Q4k2m2jj02Q9j01J05n1J32
3508I0j94P4r5N2L6k49L07R0m0j41P0k8J46j10j73K40j73M4J15j47L7Q8L5k9j04
3533e9J37k34J26m8Q3r5K7J20j58N2k1J03rR4M9k19k0L4K30j12P3j43J5j04J29
3558E0m4r1L2J4J86n9N4nj25m4J00J20j47ojk6J31N9k39K59k17N4k2n6M9r9R0
3585A7J5M0j50J93m0j94RjJ33L7r5O9j52Q0J53k83L0K41k53J39o7L0j03K01r0
$$ plain form
3610 -41 -134 -52 -75 -83 -134 72 48 67 -50 88 -96 -106 53 54 -16 66 159 -2 7 -47 -83 87 -283 -62 94 42 80
3637 80 -28 -83 -2 -12 -90 170 41 -21 -154 48 6 31 -83 8 -93 134 140 -43 215 -60 227 -49 78 35
3661 35 190 191 -71 -69 206 164 3 82 -53 -35 110 103 40 49 154 59 -76 47 -11 183 -82 -37 -135 -49 95 -58
3687 -58 -123 -102 6 -57 155 -4 21 -48 -80 -86 9 -179 62 11 -23 -37 -73 121 -12 -48 -151 92 89 -138 -152 -78
3713 -78 54 -11 58 -154 -38 -108 -79 40 26 -136 -197 93 -38 56 -75 -21 94 97 -21 -114 126 -143 -29 -62
3737 -62 -49 48 15 -19 88 59 81 52 113 -97 122 -32 -37 76 -20 -18 -64 -58 58 11 -52 21 38 -57 89 103 36 -41
3765 -41 35 15 4 127 -63 -160 -18 105 56 -59 -122 -49 -98 -24 18 -9 83 -80 -67 12 37 30 26 -69 -61 -71 -199 -150
3793 -150 -1 -95 -96 -56 4 17 74 105 -52 -50 -76 -81 -175 124 26 -13 82 181 31 -114 56 39 -148 -123 6 17 102
$$ packed form
3610d1r3Q2k3qn1K06k4J9j17J38j84j0J59Jp0Q2R3j61Rn4l6J70l70K21J56n2L8
3637H0j08n5Q1j0p8K60j29o2j33K02m2K5j14R1j01K27Oj83K58k75K87k76J27m3
3661C5J55Jk62KK75m2j61P9j35J8J45po3RJ05r5j35J23n8J94k65M5r8Q6J44j53
3687e8o5K1J08o3K12j59K5o9l2oR5j88K41n1l4j4l6J94j33l6j03K43lk27j4P4
3713g8J32o5O9k12J16p0K9J19j4j62o1K90j31R4j31N4J15Lj18r3K40k69J14l3
3737f2J3R7l3l4J07k9K2k9O1k10K19j54nJ13r6Km6OJ16m7o3P3J7r5J46J4o7p7
3765d1P6k0j1J23j90r7J42J23m9j15o3P3m9P4M2k7R2j63J3P9K5pmr5Qj0j28M9
3793a50J49r4jM0O0J3N7L1j57Kk6nr4K99r8l9R5R9j50j45J70j7j87K5J29J1Q5
$$ plain form
3820 102 -38 -59 20 -181 91 33 -27 -77 135 -71 20 169 -6 138 217 109 -88 -159 147 13 129 118 -161
3843 -161 108 24 -78 -38 -52 -41 125 71 0 -63 -141 -139 80 -95 22 -96 107 -106 76 45 8 -134 -38 108
3867 108 19 0 182 -81 2 -65 3 -88 -202 -59 -112 59 94 133 -142 28 -93 28 -128 -140 -125 -43 -65 -99 -224
3892 -224 -81 152 1 -27 -73 84 -27 -106 -47 47 25 -37 -156 121 -114 -37 12 -106 151 -20 18 38 98 87
3916 87 -11 -45 53 98 -154 55 69 145 131 92 169 83 143 -66 -36 56 27 173 152 23 121 -35 35 95 64 121 -53
3943 -53 4 20 -22 109 -40 -122 -80 0 139 -65 -192 119 24 7 44 -20 37 -58 69 -14 -19 39 41 -46 -151 -161 -38
3970 -38 142 -29 14 -28 -114 44 -273 -76 -104 -90 -11 -24 -177 46 -128 61 -9 2 168 29 -97 27 24 -124
3994 -124 -178 -70 98 66 42 69 63 39 -30 91 144 -110 42 -48 22 150 108 -41 205 36 -10 29 106 98 42 85
$$ packed form
3820A02j40k1P9k01K72n8o0n0K12k06R1J49j75J44P9j08j97p1L06j34J16j1k79
3843a61K69q4j02M0j4J1J66n4p1o3p8KK19j75J17j18K03k13J82l1l7j42R6J46
3867A08q9j9J82k63Q3o7O8r1j14J43n3J71L5L9k75J70j21J21j56j2J5Q2k2l4j25
3892b24J43K33j51k8m6J57j11p9N9R4k2o2j19K77k35P7M9j18K57j71L8K0O0j1
3916H7r8l4R8M5k52K09J4P6j4l9P7q6O0k09L0R2k9J46k1j29R8j56P0O0l1N7j74
3943e3N7J6m2J31j49q2M2Q0J39k04j27L11r5j7L7o4N7r5J27q3nN8Kq7j05j0J23
3970c8J80j71M3m2q6J58l17J97k8J4P9j3j53K23j74J89p0J1J66j39j26J24lj48
3994a24n4J08J68l2k4K7ok4o9J21N3k54J52r0P0J28m2j49K46j69m6L9P7qn6M3
$$ plain form
4020 85 32 36 14 -6 210 10 161 -79 97 -79 -135 2 104 87 1 10 32 169 167 -73 -12 57 37 129 -92 -48
4046 -48 -21 54 -236 43 71 -123 7 12 135 58 51 22 -103 -45 -83 11 62 16 -79 125 -21 -69 -43 -88 0 47 264
4073 264 37 -43 -92 -38 122 80 -138 -115 186 -65 76 -19 -151 191 117 -12 60 22 80 118 -102 -166 42 -53
4097 -53 -114 -136 99 -45 109 241 12 96 113 -120 -4 77 128 13 93 -107 100 33 -86 -53 83 201 74
4120 74 58 -62 1 -165 -68 -180 -54 12 -44 -19 97 -66 -18 33 -49 -21 -200 -25 -125 -93 69 -233 -17 43
4144 43 -137 -87 -98 -101 -14 -97 112 -16 23 -60 77 -119 -54 124 -63 9 128 -17 -44 21 -60 -98 -134 43 -10 -11
4170 -11 -120 -49 134 93 -97 66 72 -116 -66 48 -64 -35 128 -7 -34 -34 9 -83 -7 141 33 156 -48 26 -17
4195 -17 229 48 18 71 85 -47 -160 -21 143 30 -59 73 -28 18 69 43 3 -159 -146 30 156 83 113 36
$$ packed form
4020H5n3Mk2k0K16k00J51k40J76j76n6J37J02j7q6RK2J37kk40O1O9k0R2k21M4
4046d8K7P5k90K79K8j94J30NJ23p7pk9j25N8l8R4N1m6r5K04j46m8K6m5Q8M7K17
4073B64k27q0m9N4J60m2k18K3L01k51J41r5j32L42p4j29P2l8N8L8k20o4K08r5
4097e3o1k2K35j44J54J32k29Q4J7k33J16Q1N1j15Q0k00K07o7j19L3J36J18j27
4120G4j6j20O3j66R7j12J26O6n6K5J16j63M8N1q2K8j79J75j00L2J62l02K16O0
4144D3j80N0j1lQ7q3K09j28L9q3J37j96O5J78j87P2J19j45k7O5q1l8l6J77n3j
4170a1j09P1J83m1j90J63Oj88N0J14j12K9J63j35k7%M3r2P6J48j08J23k04P4m3
4195a7K46j81l0N3J4j32j13J39J64j13q9J32j01M6N1k6m0j62J3J76J26p3L0p7
$$ plain form
4219 36 96 63 11 -89 21 -45 -8 -10 -130 -122 -33 -53 24 -133 -256 -87 -34 -39 -37 -178 -115 -79 -69 -185 -3 78 64 12
4247 12 41 20 56 39 152 146 -24 -69 9 -127 -57 26 -32 100 -118 22 -104 29 -44 -27 7 18 -75 -70 169 -39
4273 -39 203 56 42 106 83 11 -19 -101 -83 -18 -81 127 -53 38 -29 92 -98 -140 -33 54 -62 -62 53 45 -34 -175
4299 -175 9 73 -76 2 61 53 4 33 -6 5 -87 -57 37 -122 131 -123 57 -14 -13 0 46 71 106 -16 149 158 -108
4326 -108 22 -115 -141 -176 86 -22 -106 -95 -6 7 -149 -10 -46 -40 -21 -69 -35 -213 11 5 -129 -123 -80 -31 -120 34
4352 34 -164 -32 -148 111 14 84 32 -60 -88 -32 137 87 -108 99 156 212 122 107 2 55 147 16 -45 -91 -93 132
4378 132 39 -35 -113 -28 24 15 -14 -14 196 43 45 82 7 -113 137 -104 102 123 -53 -128 41 141 -22 148 22
4403 22 -118 -65 -136 29 103 -34 53 -13 -46 -85 26 46 -12 96 -32 33 -154 -147 -61 -119 -43 -272 201 36 -4 112
$$ packed form
4219C6O0l3n2j00J10o6L7kj20QQ9k0P7j57j23J69N3nKj41O3L6J0j16J82Q1j4n2
4247A2K9k1L6j7J13oj70m5P8j36P0Q3n8J32k18J40j26J33p3J7L4J1r3NK39k08
4273c9K42j47j4O4k3p2l0q2J8O5o3K08j80R1o7J21j90m2J07Q7j16%J15qp9j41
4299a75J84O4j49P8N9qm9K9l9J1r2L0R4j59K53k54J80p1JJ3M6K5L5j22J65Rk66
4326a08J30j37k6l5K62j08q4J1Q9J3j56J39l6OJ9m8L4j78K24oj34OM3M9q9J54
4352C4j98J32j16K59r7P0n2r2k8N6J69n0j95K07N7N6r0j5j05N3R2j31o1m6kK25
4378A32r3p4p8Q5N2rk9%K10j53KL7p5j20K50k41K06K1j76p5J69J00j63J70j26
4403B2j40N3p1J65P4j37Q7o6l3l9J11K0n8J08j28O5j87PQ6n8P6k29M73j65m0J16
$$ plain form
4429 112 -76 -55 23 204 -101 -84 145 47 -19 -66 -43 -51 85 -56 18 52 105 -9 -94 132 -90 -31 -45 78 137
4454 137 -59 127 -66 -49 166 -65 11 -41 -134 -7 151 185 75 314 124 52 56 155 -121 -89 275 -37 143
4477 143 65 98 -30 77 6 -23 -38 7 61 -14 41 68 -42 112 15 -229 -90 20 -88 -6 147 -13 88 -97
4501 -97 65 84 8 23 54 184 27 73 49 -84 -79 -72 -213 -92 -112 -179 139 -66 -84 -181 -37 -39 -113 -144 -106 36 -52
4528 -52 56 193 -134 -38 186 57 -68 -1 -90 83 31 50 135 -31 100 138 70 64 73 157 71 156 -131 -56 45 113
4554 113 258 100 139 -97 -8 -32 84 -134 29 122 54 -23 -138 101 45 130 131 85 75 93 -42 110 -35 -73 62
4579 62 87 61 -138 -30 -67 -110 115 -75 15 -22 153 49 -194 -46 -159 25 -82 134 -125 15 111 184 -64
4602 -64 -15 -41 -16 212 -12 41 -54 48 101 57 9 3 33 58 27 -18 -77 -131 -12 -141 -136 -113 90 70 85 -158 -219 11
$$ packed form
4429A12j88K1P8J81l05J7K29r8o6m7K3qJ36j41P4L4N3j14q5K26k22N9j4J23N9
4454A37j96J86j93J7K15k31P6n2r3J27J58L4j10K39j90p2MR9k76L2L64l12J80
4477A43p8L3j28J07p1k9j5M5N4p5N5K7j10J54r7k44J39J10j08Q2J53j60J01j85
4501i7J62J9p6J5L1J30j57M6k4j33NPj41J21k0o7L18k05j8r7J44kp4l1L8J42q8
4528e2J08J37l27R6K24j29j25O7q9J73n2J9Q5j66J31L8o8oRQ4q6Q5k87P5J01O8
4554A13J45j58L9k36Q9k4J16k18J63R3o8p7j15K39n6Q5Jm6j0J8j35J52j45l8J35
4579F2K5k6j99J08l7m3K25j90R0l7J75j04k43J48j13J84j07K16k59J40R6P3k48
4602f4M9k6K5K28k24N3r5J02N3m4m8oL0K5l1m5n9n4J19j29NK3K03k0J5k43o1K30
$$ plain form
4630 11 26 151 34 72 104 -124 -64 -95 -10 -286 222 122 128 65 -82 68 17 123 46 125 -102 28 18 169 98
4655 98 -45 8 83 249 54 19 2 -172 8 -85 -46 25 40 20 255 -25 -38 18 -172 123 -20 -120 -10 155
4679 155 0 90 -25 12 59 -32 115 -173 -130 36 20 77 70 85 -126 -16 -33 61 -18 151 -119 -26 -21 133 45 74
4705 74 -49 -232 -11 -134 23 41 -43 50 6 1 -28 15 -49 -138 -71 -63 20 -66 -174 -84 113 -131 -11 21 -167 54
4731 54 -56 164 145 48 30 84 100 -45 56 114 17 -134 83 163 184 122 -36 -57 53 14 69 -23 54 -67 -90 74
4757 74 -131 235 95 20 -47 90 -6 194 -69 -135 10 61 -45 -91 -43 -77 61 99 -80 74 -122 22 36 -17
4781 -17 -14 -72 -44 169 88 51 -56 124 -40 -20 17 34 74 -35 37 114 -63 -76 -7 -124 39 -43 197 78 -92
4806 -92 -63 -1 80 174 104 6 124 -47 169 -140 94 28 29 120 118 -6 -99 -49 -112 45 -5 187 -90 24 -30 46
$$ packed form
4630A1J5J25j17L8L2k28O0l1Q5k76N08j00Oo3j47J50n1J06p7P9k27J30j0J51p1
4655I8j43N3P5J66j95l5j7j74J80r3L9P1J5k0K35k80j3N6j90K95j43j00J10J65
4679A55j55R0j15L7M7r1J47k88M3J66j6N7pJ5k11J10j7R4p9J69k70R3NJ54q8K9
4705G4j23j83K21j23J57J8q4R3m4nk9M3o4q9O7QQ3q6j08R0J97k44J20L2j88K21
4731E4j10K20j9r7j8N4J6j45J01N8r7j51K17Q0K1o2j58k1J10l9N5r2P7j21k3J64
4757G4k05L66j40p5o7J37r6K00k63o6J45N1j06m6M8l4J38L8j79J54j96J44J4n3
4781a7Ln8K8K13q1l7j07J80j64K0L7J7M0j09P2P7j77j3O9j17J63q2K40j19j70
4806i2K9O2Q1R4p0r8J18j71K16l09K34o6JR1kj24r3N0o3J57n0J92k77J14n4P6
$$ plain form
4832 46 -86 -49 167 104 31 -27 84 50 32 93 -107 -64 87 -127 21 36 -124 159 -237 -119 -89 -146 -29 5
4856 5 -67 -9 -151 91 100 -19 100 12 -54 65 -92 -56 -16 -66 -25 -75 71 -118 -10 -43 -46 -78 -1 -15 146 38
4882 38 186 -21 -6 45 30 -22 82 61 116 -35 145 27 225 122 96 67 14 120 2 162 61 -72 106
4905 106 93 163 173 -24 176 95 65 -132 -15 -80 109 -130 21 78 5 36 83 126 49 -7 -24 -12 64 -10 41 142
4931 142 -74 -247 -92 116 144 34 -14 167 -78 -46 87 -26 -86 41 -83 2 -161 53 -91 -53 -40 37 -9
4954 -9 41 45 53 -169 56 -38 -104 -188 11 -210 42 -84 -109 -85 -106 4 -190 36 -78 12 -99 146 161 114 60 -17
4980 -17 -30 -4 25 145 127 70 14 -49 77 -39 96 106 -45 -137 -70 -2 186 5 53 -25 -29 -1 -212 18 -41 -63
5006 -63 -29 46 50 -91 -64 36 5 44 283 -11 -140 28 75 -25 -66 132 20 49 -96 -18 16 -113 83 20 15
$$ packed form
4832D6j32L7K16o3p3n8J11l4j8O1k00M3J51k14J48J5j60K83l96J18L0n7J17L4
4856Ep2N8j42K42Rj19J19q8o6J19j57L6M0n0M1n0J46j89J08l3ll2P7j4J61j08
4882C8J48k07J5N1j5n2J04k1N5j51J80j18J98j03k6k9n3J06j18J60j01j33J78
4905A06j3P0J0j97K00q1l0j97J17o5J89k39J51N7p3L1M7M3p7n6j7J2P6p4N1J01
4931A42k16j73J55K08K8j10m8J81k45L2J33j13o0J27j24Q5j63K14j44L8J3P7m6
4954iN0MQk22K25r4o6q4J99k21K52j26k5K4k1J10j94K26j14R0j11K45J5m7n4p7
4980a7j3K6K9J20j8n7n6o3J26j16J35J0j51r2O7O8J88j81M8p8mK8k11K30n9k2
5006f3L4P5Mj41K7J00l1L9K39k94j29J68M7j00m1J98j12K9j45P8L4j29J96o3n
$$ plain form
5031 15 141 111 -99 -43 60 -165 -130 -138 26 -34 -229 3 23 -37 26 3 -101 163 135 18 -1 -138 -53 -149 124
5056 124 6 23 -201 -60 -130 -44 -20 -166 0 -141 -80 30 -200 -280 -2 -10 -70 -9 -126 -108 53 144 29 11
5080 11 -18 -62 -72 3 -51 17 242 38 135 225 -34 -55 -42 -59 -60 57 80 186 -112 -12 122 174 92 -68 -152 -16
5106 -16 -101 125 -15 40 181 27 144 74 -164 4 -4 -70 -35 -72 75 158 36 110 54 -16 48 107 -31 -81 -54 48
5132 48 -36 -32 -50 58 -136 -138 16 -5 56 31 -6 -114 -16 34 51 -70 -123 60 -181 41 27 -99 75 -44 92
5157 92 137 8 113 -138 -89 17 44 -18 65 -14 35 -47 -36 13 25 -142 24 181 -8 54 -44 42 114 -115 21
5182 21 -113 -43 108 -104 1 65 -47 56 27 -6 -100 -248 -75 56 -64 -95 -26 -141 54 26 -29 -37 -128 31
5206 31 36 44 26 -135 -98 62 -98 -1 -16 -112 -119 84 56 -66 71 -43 39 -115 27 -138 12 -63 -149 -237 70 -195
$$ packed form
5031A5J26l0k10N6J03k25L5qJ64o0j95K32K0o0O3k3j04K64k8j17j9j37Q5r6K73
5056A24j18J7k24J41p0Q6K4j46J66j41O1J10k30q0K78qo0O1j17J8J61R1j15j8
5080A1k9m4j0P5n4O8K25k04R7R0k59k1J3j7jJ17K3J06k98J00J34N2q2j60q4J36
5106a6q5K26j40N5J41j54J17p0k38J68qo6L5l7J47Q3j22P4n6p0O4N9j38n0K7J02
5132D8q4Mj8J08j94kJ54k1O1k5l7j08R8N0J7j21n3J83k41K22j4j26J74j19J36
5157I2M5j29J05k51M9J06K7o2Q3p9M9q2J1M9J2j67J66J57j89O2r8Q6P2k29J36
5182B1j34P0J51k12J05O4j12J03k9l3r4j48J73J31j20l1O9j15J95k8n5qr1J59
5206C1NQj8j61L7J60j60R7j5r6pK03k8j22J37j14Q2j54J42j65J50p5q6q8L07k65
$$ plain form
5232 -195 -11 -153 -81 58 115 15 19 -17 91 -44 -62 118 1 78 75 64 -218 -76 -54 -22 -116 -41 -1 -170 15
5257 15 -119 -97 -71 -164 27 -33 133 -23 76 44 -10 -124 103 109 68 218 66 -53 -75 127 126 -13 64 -84 -76 121
5283 121 91 -105 28 -149 58 186 -37 -244 -188 93 72 78 -64 88 90 70 -48 -57 3 7 -48 -47 -135 51 141 117
5309 117 -125 12 217 -73 -44 4 -121 -128 83 27 -117 -28 57 -17 60 -22 15 -58 19 -57 57 44 -74 45 69
5334 69 -61 111 269 -47 81 151 -112 0 -48 -148 -116 79 6 14 85 65 -7 -172 132 -31 -23 138 69 -60
5358 -60 135 -4 -20 47 -30 -76 167 -192 -25 -120 -48 79 -97 77 -3 28 9 -5 14 -13 3 47 -138 46 14
5383 14 -70 108 54 -44 -147 67 21 48 0 -120 73 -34 -32 -5 95 -131 -45 149 -88 73 -7 -143 -98 -26 -142
5408 -142 54 4 -47 -103 3 1 91 131 -75 -43 -33 60 66 -158 -82 -38 -12 -79 -33 -8 99 -51 -37 3 -171 -147 -46
$$ packed form
5232a95J84j42P2J39N7j00Ml6J08j35j8J80j17P7lj1k82J42K2L2r4P5M0j69J85
5257A5j34K2K6r3J91o0J66j56R9l2n4j14K27Om1J50j52j19k2K02jj39P7j48QJ97
5283A21l0j96J33j77K07J28k23k07N6K81k1Oj42J52Kk0j18rO0Mn5Jq8J86R0k4
5309A17k42J37K05k90K9M8j25pK11n6j44Q9Q5p4P7q2L7p3P7p6J14j3j18J19K4
5334F9j30J72J58l16J28P0k63J12m8j00L2J95p3QP1k0p2j65L04j63QJ61o9j29
5358f0J95j39j6O7p7m6K43l59J67r5P2J27j76J74q0L1j9j4J9k7J6M4j85J84l2
5383A4q4J78n4r8j03K14m6K7m8j20J93j07KK7J00k26Q6J94k37J61q0j36M5P2j16
5408a42J96n0n1n6J06kR0M0k06L2J0R3Ok24P6M4K6o7M6K5J07j50J4M0j74K4J01
$$ plain form
5435 -46 -31 -184 -187 134 66 -42 -51 126 -27 -40 -52 43 17 51 103 -311 -13 -10 45 18 -183 -18 216 -71 -226 -114
5461 -114 28 89 171 143 -20 51 59 -171 134 217 26 34 -67 24 -126 -30 -18 99 153 -12 34 -90 -32 -77 -87 -60
5487 -60 -59 57 31 149 -9 2 -74 64 -19 -120 28 -59 -63 83 -27 -9 -84 76 20 -140 46 -13 123 217 54
5512 54 -25 -72 -59 -8 -14 43 -136 -11 -64 -7 52 -29 -148 110 21 -126 145 -94 -40 30 74 -4 39 148 39 119
5538 119 -17 -102 -22 58 -69 187 16 77 30 -9 -28 -48 115 70 -198 -125 1 15 18 51 101 -186 -64 -60 -74 159
5564 159 -41 119 -93 77 -173 -52 43 35 -60 109 -75 -45 188 47 -110 -26 16 43 -6 67 -18 -18 -22 33 119 -91
5590 -91 -58 -141 -86 -61 -109 -40 66 165 -70 -36 35 -6 225 -16 54 -72 -87 -33 24 -68 -148 112 -10 -15 -10 -32 -131 193
5618 193 1 122 -66 48 -106 19 -147 27 5 -9 -15 -73 -46 115 -11 -68 103 110 180 194 -16 20 56 -16 66
$$ packed form
5435d6J5j53lL21o8j08rJ77j53j3j2R5k6L4N2m14K98LN5k7k01J65K34k87j55J12
5461a14J42O1Q2k8j63P1Qk30L05Q3j91Qj01R1j50R6J2J17N4j65M6j24N8m5j0K7
5487f0JJ16k6J18j58J1p6J38q3j01J48q7mJ46j10J8p5J60n6j60J86n9J36R4j63
5512E4p9m7J3N1oN7j79J25n3N7N9q1j19K58q9j47K71k39N4P0M4p8M3J09j09Q0
5538A19j36q5Q0Q0j27K56j71O1m7l9j9k0J63m5k68P3J26J4LL3N0k87J22Mj4K33
5564A59k00J60k12J70k50J21R5qr5J69j84L0K33j41j57Q4M2K7m9P3q5%mN5Q6k10
5590i1L3q3N5K5m8O9J06R9k35L4P1m1K31k41P0j26j5N4N7r2q0K60j22nNk2r9L24
5618A93j92J21j88J14j54J25j66J74k2j4on8K7J61j26n7J71PP0J4k10L6L6p2Q2
$$ plain form
5643 66 -22 34 -121 126 36 104 14 -14 125 -6 -110 -17 131 140 200 -15 -65 136 -183 -2 -30 23 60 -29 -34 -73
5669 -73 -75 7 57 55 -73 136 -35 -144 -20 -92 -87 -115 -19 67 -15 143 -7 -53 56 -1 -77 -10 -16 87 46 55 11 56
5697 56 33 -61 55 -116 145 -2 -110 45 -173 -10 -41 34 113 158 82 -51 54 -14 -166 95 -84 -24 -34 54
5721 54 35 38 53 -17 8 253 117 44 76 28 -21 167 -13 43 -3 41 168 138 128 67 -50 -72 -62 32 109 -41 -13
5748 -13 -39 143 96 -37 5 132 69 15 121 -52 -80 -122 66 19 33 -130 -88 -37 -82 107 -64 -78 -62 28 23 -80
5774 -80 -1 -90 -132 124 116 96 -80 -155 -69 -172 103 -98 -181 69 -106 52 29 135 71 84 -32 -32 -129 -30 -152 71
5800 71 -14 -105 180 -82 -5 128 -2 88 8 26 51 186 -103 146 89 24 -81 -118 26 63 -117 -237 68 0
5824 0 25 -108 128 -157 18 85 154 -75 -3 -125 27 -58 -77 -185 15 152 38 -16 64 55 11 -90 -111 57 -146
$$ packed form
5643F6q8N6j55K47r0O8r0k8J39j31j04R3J48RO0k15n0K01l19J81k8N3L7q9nl9
5669g3kQ2N0kj28K09j71j09J24p2Nk8R6Q6q2J58j50m6J09n7p6O7oJ03m1Rm4M5
5697E6k3r4J16j71K61j47j08J55k18J63l1P5P9M5p6j33J05o8j52K61j79O0j0Q8
5721E4j9LJ5p0K5K45j36p3L2m8m9J88j80N6m6M4J27l0j0o1j17k2J0R4P7j50K8
5748a3k6J82m7j33M2J27o3n4J06j73k8m2J88m7J4j63M2N1m5J89j71j4J6R0nj03
5774h0P9q9m2K56qk0j76p5Q6j03K75k01q3K50j75J58k3J06o4J3j16%r7R9j22K23
5800G1q5r1K85k62P7J33j30R0q0J8K5J35k89K49n7o5j05l7J44L7j80j20L05o8
5824@K5j33K36k85J75O7O9k29P2j22J52q5j9j08K00J37j14n4Q0rm4j01k1J68k03
$$ plain form
5849 -146 62 -169 103 -88 28 -22 -18 -307 48 -31 -21 -136 -144 -9 -176 68 0 -100 174 -29 -178 -51 87
5872 87 37 -100 -44 13 -2 185 105 107 -33 -4 55 -93 69 66 19 17 97 57 60 7 -13 16 -106 41 -125 -144 16 10
5900 10 149 96 92 -270 53 -161 -185 17 -167 -68 -118 6 153 33 196 82 17 -2 27 -72 67 -32 -39 129 2
5925 2 -38 105 123 -188 -73 76 171 -179 -114 63 84 71 -77 35 22 -34 72 -75 12 -75 -70 36 111 6 70
5950 70 38 98 40 -77 79 40 -56 -131 -3 40 -29 -30 -83 -21 -65 59 -7 -110 19 57 -65 -6 107 39 69 43 21
5977 21 -1 -63 158 11 -56 -6 -96 47 57 147 92 -15 125 179 94 61 51 -103 45 -6 34 -104 -149 102 -2
6002 -2 -13 114 8 11 278 62 81 49 34 -6 155 -170 58 -29 26 -153 -125 -106 -111 -1 101 95 3 144 -19 -2
6028 -2 -111 -123 -196 -178 -75 -4 109 -176 75 -103 -23 112 88 51 -135 70 61 -11 -107 163 -15 -146 -120 -138 81
$$ packed form
5849a46K08k31K72j91J16n0Mk89L55p9J0j15qJ35j67K44o8j00K74k03j49J27J38
5872H7n0j37N6N7j5J87q0Kj40K9N9j48J62lm7kQ0m0Ln3k0K9j22J47j66j9J60o
5900A0J39n3ml62L23k14k4K02j84R9n0J24J47j20J63j14o5j9K9r9J39r9pJ68j27
5925Bm0J43J8l11J15J49R5l50O5J77K1j3j48J12j3n6J06j47Q7q7NJ06P5j05O4
5950G0l2O0n8j17J56l9r6p5J28M3o9jn3O2m4J24o6j03J29L8j22N9J13o8L0k6k2
5977B1k2o2K21j47o7N0r0J43J0R0n5j07J40N4q5l3j0j54J48n1M0j38m5K51j04
6002bj1J27j06LK67k16J9l2j5m0J61l25K28q7N5j79K8J9nJ10J02or2J41j63J7
6028bj09j2p3J8J03P1J13k85K51j78Q0J35k4l7j86K05rp2r6K70j78j31K6j8K19
$$ plain form
6053 81 -86 76 -7 115 -141 -79 24 58 121 -104 -28 67 79 92 142 -85 -40 -28 -8 58 68 89 -236 -15 75 96
6079 96 -22 107 37 50 75 -116 -75 93 17 42 110 -78 -54 30 138 1 3 74 -25 -46 7 12 69 -43 56 -54 -9
6106 -9 137 83 10 -33 -23 -42 10 -5 -245 128 20 -53 -37 39 -135 -93 -26 96 152 -134 -96 0 -164 -18 -133 -135
6132 -135 -51 -32 0 122 15 -27 63 -154 101 -23 -35 25 -138 -40 51 44 -95 -25 -81 -84 44 81 -91 -3 -38 41
6158 41 33 -124 93 -32 96 -128 -44 -32 73 -150 107 197 -8 23 77 -10 -163 -92 90 -81 101 -79 -169 14
6182 14 118 -72 64 68 81 -14 -94 87 50 65 17 -49 95 -31 -75 72 -71 -66 22 45 62 -28 -104 -41 -83 7 -107
6209 -107 -136 111 80 -163 4 56 -128 -123 160 -109 -29 13 19 -86 0 -66 -103 107 -214 -72 -16 -67 -54 53 -59
6234 -59 51 76 -39 88 14 113 33 -89 0 -42 69 -15 44 18 -104 -112 -18 131 97 119 83 16 32 -7 36 -16 -84
$$ packed form
6053H1j67J62q3J22k56O2J03L4O3k25P6R5J2J3N0k27M5J2K0O6J0K1l25K21R0K1
6079I6j18J29p0J3K5j91M1J68p6K5O8j88K4Q4J08j37KP1r9k1N3NN7j12R9j10M5
6106iJ46n4p3m3J0j9N2j5k40L73j08p3J6P6j74M2O7J22N6k86L8R6j64J46j15k
6132a35Q4J9L2J22j07m2R0k17K55j24j2O0j63R8R1pj39P0n6lJ28L7j72Q8l5P9
6158D1qj57K17j25J28k24Q4J2J05k23K57R0k05L1N4q7j53P1J82j71J82j80r0J83
6182A4J04j90J36MJ3r5q0J81l7J5m8o6J44j26m4J47j43NQ8K3J7r0p6O3m2R0j14
6209a07k9K47l1k43J67N2j84NK83k69Q0M2Oj05Q6o6l7K10l21J42N6n1J3J07j12
6234e9J10K5j15J27p4R9q0j22Q9m2J11q4N9k6j22qR4J49l4K2l6o7J6l9M3n2o8
$$ plain form
6261 -84 137 54 -138 -38 -80 112 -12 12 24 -18 45 -64 -77 4 53 49 39 -10 -74 97 -109 67 6 -36 -22 -24 75
6288 75 -108 -57 -73 -1 8 -52 101 -34 -9 -93 121 -37 201 27 -130 -49 55 -30 -105 59 -17 1 -66 33 -7 -68
6314 -68 -20 -136 43 165 -132 -179 7 17 14 -144 -50 -81 -44 -87 64 237 -2 129 27 41 129 -78 117 -147
6338 -147 -98 194 13 62 139 -48 -67 -179 -22 3 174 -51 -138 44 -51 136 -31 180 131 6 63 -112 118
6361 118 152 -92 -12 -18 79 32 20 80 35 90 -28 174 109 85 29 1 51 -98 57 -202 -53 197 -2 -10 -42 -163
6387 -163 -222 212 146 -17 83 -6 57 -29 -151 33 -110 -16 -28 75 -110 -99 -8 -198 -24 26 -58 -88 6 -181
6411 -181 55 174 -78 -41 62 -56 69 61 154 20 11 -87 57 -84 22 -177 -54 68 70 -17 -98 -26 32 160
6435 160 46 -37 -32 -27 238 -12 -27 136 -23 105 98 89 9 110 -84 77 -84 184 201 6 -41 182 68 22 106
$$ packed form
6261h4K21q3j92J00m2J92j24K4J2m2O3j09j3Q1M9mj0m9o4J71k06J76o1m2J4kR9
6288G5j83N1j6P2Ro0J53j35K5q4K14j58K38j74j57Q1J04q5p5J64p6J8o7R9m0o1
6314f8M8j16J79J22k97m7J86J0lj58R4l1L7m3J51J73k39J31j02J4Q8k07J95k64
6338a47M9K92j81M9P7j87j9j12J57K5J71k25q7J82r5J87j67K11m9j25N7j75K30
6361A18L4k44Q0oR7m7j2O0m5N5j18K02o5k4n6k8N0j49J55k59J49K50j99ql2j21
6387a63n9M34o6j63J00q9O3q6j22J84j43R4j2J03j85J1R1j90J74N0q4l0R4j87
6411a81K36J19k52L7J03j18J25qR3j34rr8J44j41J06j99J23J22Kq7q1P2N8J28
6435A60j14q3NNK65k50j5J63j59J28prq0J01j94J61j61K68J7j95m7K23j14m6Q4
$$ plain form
6460 106 -189 -86 41 -39 -177 80 41 -20 82 87 105 -48 127 -98 83 25 53 -15 -7 10 -91 36 42 52 -47
6485 -47 53 -96 64 16 -51 -195 19 37 109 159 -88 -22 52 69 67 44 99 6 -111 60 23 -186 51 -24 32 106
6511 106 246 71 -106 133 79 -167 148 154 80 19 -52 121 89 -83 29 25 -206 155 -102 157 79 -85 108
6534 108 134 45 52 -29 -1 -63 142 130 -83 -144 -15 -86 -55 54 -96 -3 70 17 -5 -3 -36 -17 -101 79 102 -38 -14
6561 -14 42 126 -122 -131 -178 -38 -32 57 -32 -162 22 -65 -147 33 -18 42 2 54 44 11 -140 4 -8 -74 117 39 61
6588 61 76 54 -19 -43 19 65 -72 47 77 -15 -123 -109 -192 -56 23 34 28 -61 40 -55 -79 -8 118 -47 93 15 144
6615 144 -156 28 73 15 85 78 97 84 -44 42 128 -68 -175 28 -26 -82 166 -30 175 -134 -9 143 145 -86
6639 -86 -29 -85 23 -9 88 -144 11 55 72 83 -62 176 59 -185 -73 -96 185 -61 -116 -17 -5 -16 -27 20 24 14
$$ packed form
6460A06k95J03J27q0j38K57l9o1J02NJ8j53J75k25J81n8K8o8QJ7j01J27OJ0r9
6485d7J00j49J60m8o7j44K14J8P2N0k47O6P4J7kk3N5r3j17J71l7k09K37p5N6P4
6511A06J40j75j77K39n4k46L15Op4o1p1J73l2j72J12mk31L61k57K59p8j64J93
6534A08K6q9Pq1K8o2K05j2k13o1J29p1L1J09j50R3P3n3k2Kl3J9q4J80K3j40K4
6561a4N6Q4k48rm7J40OQ9q9j30J84q7q2J80n1O0m0N2j0l3j51J44j2o6J91p8K2
6588F1J5k2p3k4O2M6j37J19L0r2j08J4q3J36P9J1oq9J01r5k4P1J26j65J40p8J29
6615A44l00J84M5n8P0pJ9j3j28Q6Q6j96j07K03n4n6K48j96K05l09J25J52Kk31
6639h6N7n6J08l2R7k32J55M4J7J1j45K38j17k44J12k3K81k46n5R9J2j1j1M7Mj0
$$ plain form
6665 14 -9 49 -192 29 -41 103 64 -101 -8 55 -27 -123 -89 54 86 49 75 -122 -188 105 -12 12 -25 -88 81 -91
6691 -91 103 -34 206 -8 16 91 -96 -24 47 -6 -56 111 -33 -96 -17 35 9 100 2 139 134 -27 140 -111 -78
6716 -78 205 144 -35 29 100 -33 -76 0 45 -191 135 110 80 -110 -63 16 40 -57 26 -82 -60 -145 4 -80 16 -63
6742 -63 181 -81 106 1 -3 -12 37 30 124 -108 -20 -80 24 3 23 54 8 -46 -1 117 225 3 36 -150 89 -95
6768 -95 -77 -88 161 -31 80 105 114 -6 -149 -77 10 -96 -64 108 71 -64 -23 -5 -135 -5 37 59 -32 -66 162
6793 162 3 -29 80 96 55 -69 -29 72 -37 73 104 -36 232 64 1 45 85 83 -34 15 -115 16 305 -27
6817 -27 7 61 -53 16 29 142 124 14 -6 13 1 103 -59 66 -157 105 -83 -85 203 -133 -65 -29 91 -11
6841 -11 -68 -135 -216 -93 -71 187 -71 -62 45 33 41 18 -30 56 88 -34 13 -140 67 107 -210 -27 -24 -80 -122 -30 -47
$$ packed form
6665A4k3N8k41K21p0J44l9j65R3O3q2r6L4J43L2l7K6j97o6K93j17K4l7o3J69j72
6691i1J94j37K40k14K4P5j87P2P1n3n0J67j44o3P9N2k6R1r8J37nj61J67k51L3
6716g8K83o1j79O4P1j33m3P6M5k36L26k5l0j90M7P9K4r7Q3j08K2q5J49q4R6p9
6742f3K44k62J87j05mrM9pR4k32Q8o0J04k1K0L1m6n4M5J18J08k22L3j86K39j84
6768i5J8j1K49j92J11K5Rj20j43P2Q7j06L2J72l7j35M1J8j30J30M2K2r1l4K28
6793A62j59l2J09J6m1j24M0J01j09J10L1j40K68j68o3M4M0kj17M9j30J31K89l32
6817b7L4N4j14O9J3J13j8j10k0J9j2J02j62J25k23K62j88kK88l36O8L6J20j02
6841a1n7o7q1J23K2K58k58RJ07j2Qk3m8Q6L2j22M7j53K07M0l17J83Ln6m2R2j7
$$ plain form
6868 -47 49 95 77 -4 -139 72 57 -99 104 -70 -91 -87 60 -116 -92 -25 91 165 135 1 -30 130 -80 -22 113
6893 113 82 129 34 -174 70 -73 56 145 71 -35 50 -112 66 -9 88 -11 -18 31 36 -5 137 175 60 113 125 -3
6919 -3 -25 -49 -83 162 0 -67 -1 -38 -40 87 1 -54 84 -6 -90 248 112 19 -19 -96 -86 5 -95 20 31 -1 0 -36
6947 -36 -62 -28 8 144 -11 0 -81 -32 -91 -11 107 6 -157 -31 -66 -86 -62 31 56 23 -26 159 27 -84 -26 -36
6973 -36 155 117 33 52 -31 -12 -98 44 158 -174 4 -38 49 67 -33 -34 72 39 89 -31 -61 132 210 110 -96
6998 -96 121 91 11 26 34 -9 54 -85 -19 17 -72 -87 -208 102 -144 51 7 -72 21 -144 164 -1 -131 234 -152
7023 -152 147 -60 -36 -117 -73 9 -95 -91 -63 113 -131 -64 -68 134 -43 -151 -7 -176 -151 127 102 79 -75 125
7047 125 -62 -116 47 72 119 -38 -133 -39 -53 -57 -10 -27 51 25 100 11 -102 -84 130 -60 -55 -64 -63 -161 76 -5 37 167
$$ packed form
6868d7R6M6j8q1j35K11j5j56K03j74k1MJ47j76K4O7J16P4l0j34l1J60k10N8J35
6893A13l1M7r5k08K44j43J29Q9p4j06Q5j62J78p5R7r9pM9Nm1J42L8j15N3J2j28
6919ck2k4l4K45j62o7O6l7kJ27q6n5J38r0q4L38j36r3l8p7J0R1j00J15J1l2Jl6
6947c6k6L4L6J36j55J1q1M9n9Q0J18j01j63J26l5k0K4R3K5l3m9J85j32j11N8j0
6973c6J91l8q4J9q3J9q6J42J14l32J78m2Q7J8j00jJ06l3N0j20l0J93P8j00k06
6998i6K17l0q0J5Qm3O3j39O6L6q9j5j21L10k46J95m4p9R3j65L08j65j30L65l86
7023a52K99k07K4q1M4Q2j04MK8J76k44O7mK02j77j08J44j69K5K78k5k3j54K00
7047A25j87n4J63K5M7j57r5R4j4mM7j7P8k6P5q9j13J8K14j90NrJr8K37q1M2J30
$$ plain form
7075 167 -274 5 -13 -41 -106 210 -73 -75 36 -83 26 135 52 -4 69 -131 122 -19 -26 109 22 -27 -35 -23 -50
7100 -50 83 -27 81 -116 97 39 1 -101 19 -55 -37 -27 -107 45 -279 -93 17 13 9 -147 -69 53 214 -67
7124 -67 -143 -201 -74 78 97 -32 -34 43 48 45 39 16 69 179 109 -40 -34 29 -91 138 137 -53 33 -2 -56 144 92 -5 -27
7153 -27 37 72 -181 -18 -29 101 13 72 29 43 163 94 133 18 -85 -11 62 -13 30 -22 139 83 65 104 126 -127
7179 -127 -45 33 17 64 32 75 -130 3 116 -123 -18 10 -149 45 2 -39 187 -183 118 -9 -72 7 6 -34 14
7204 14 49 11 -151 -169 49 -28 -111 53 -173 -47 -159 -9 99 -127 -61 93 135 -20 64 28 -50 -41 -146 -2
7228 -2 67 76 -10 120 31 59 -11 -67 -4 78 -2 21 -8 -136 -16 132 -18 81 -208 -13 -36 59 41 -238 139 -118
7254 -118 -44 -70 -34 12 38 93 -23 90 -77 -13 -3 114 21 44 -14 -133 34 22 68 16 -77 -24 119 182 -37 -24
$$ packed form
7075A67m41K79j8k8o5L16k83kJ11j19J09J09q3n6P3k00K53j41pJ35q7m9qJ2k7
7100e0J33j10J08j97K13n8l8j02J20p4J8J0q0J52l24J86J10mmj56P8J22J61k81
7124f7p6n8J27J52J9j29kP7Nlok3N3J10p0j49OO3j20K29jj90Q6l5n4K00n2r7k2
7153b7O4L5k53J63j1J30q8N9m3J4J20o9L9j15j03P4P3p5M3n2J61n6j8L9K2k53
7179a27Q2P8j6M7l2M3k05J33J13k39J05K8j59J94m3m1K26l70L01j27o3P9jm0M8
7204A4L5l8j62j8K18p7q3J64k26J26j12J50J08k26O6J54M2j55Q4l6p8Rj05J44
7228bO9Rq6J30q9K8p0n6O3Q2q0K3k9j28J20J48j50R9k89J95k3R5j8k79L77k57
7254a18P4k6L6M6K6N5j16J13j67O4J0J17r3K3n8j19J67j2M6n2r3N3J43O3k19J3
$$ plain form
7280 -24 -113 -138 108 94 -63 167 -86 144 -84 27 -97 -67 -22 100 -45 203 -58 -125 -6 44 -80 56 -1
7303 -1 -51 11 -77 -17 -77 70 76 -171 41 135 63 -86 -123 -42 27 237 95 113 131 108 -5 -53 17 -121 103 -172
7329 -172 -48 4 -55 200 110 38 17 153 131 -169 73 -58 -71 -119 -56 28 46 74 7 38 29 15 -50 256 143 -4
7355 -4 60 115 -49 -108 92 -67 -35 -68 73 -4 -175 -47 55 123 -45 -87 73 -66 11 159 -25 105 -151 -95
7379 -95 -183 217 101 128 -43 -142 -6 74 -132 182 -81 -56 20 57 82 -26 106 -39 -86 57 12 -101 22 60
7403 60 -23 12 -109 63 -107 -98 187 -25 38 7 -186 152 -155 9 -48 -38 -78 -49 -127 -6 76 73 -8 15 -75 35
7429 35 77 -60 0 4 7 114 59 119 -71 -11 14 -63 -39 -68 -47 30 -120 -13 36 174 71 5 76 54 -20 -30 37 125
7457 125 17 22 147 -67 -3 186 -66 -7 15 7 68 14 -79 -49 -90 12 -32 138 40 -77 -28 1 66 76 -89 -130
$$ packed form
7280b4q9k5K46j4j57K30k53K30k28J11j24L0M5J22j45K48k61o7J19N0j24J36n7
7303an0O2q8O0o0J47Ok47K12R4p2j49l7Q1O9K10j42J8J8k3j13m8P0j38K24k75
7329a72J24N2n9K55r0p2k1J36k2l00K42j31j3m8O3Q4J8K8o7L1rj4o5L06j13j47
7355dO4N5j64n9K00j59L2l3J41p7j71J28J02O8j68m2J60j39P7J48j84J30k56N6
7379i5q8M00j16K7j71r9J36Q0k06L14k63K5P6L7K5j08J32j45m7J43m5j13J23L8
7403F0q3L5j21J72j70RK85k12O3l1j93L38l07J64n7J0m0K9p8J21Q2lq1K3r0J10
7429C5M2j37O0MLJ07n5O0j90O0K5p7K4k9K1P7j50J07M9J38j03o6P1k2p4j0O7Q8
7457A25j08NJ25k14O4J89k52N9K2qO1n4r3L0m1J02m4J70r8j17M9K9O5J0j65m1
$$ plain form
7483 -130 108 -142 -117 -185 46 97 21 59 35 -65 42 -165 137 24 109 -22 -68 33 -13 49 -53 56 -39 68
7507 68 -62 -24 34 -53 -97 -5 106 89 -220 -33 68 -48 -44 -32 -109 -130 30 22 40 -39 -182 -9 -100 -28 -40 -30 -60
7534 -60 0 -114 -21 146 -7 -122 90 156 -58 51 -18 -199 -8 -48 1 59 -52 31 -7 -97 -17 19 -49 80 111
7559 111 58 -132 -79 -15 74 -8 77 74 22 104 100 30 -40 91 82 -49 155 -20 91 -83 139 108 150 -204 -88 -244
7585 -244 63 164 -18 83 -67 152 -32 -32 105 -81 35 -85 -132 -64 59 10 26 11 -2 4 29 5 -67 -46 -215
7610 -215 50 -4 -114 -87 32 -50 -32 9 -113 -6 121 39 -24 25 80 -60 -99 -137 -92 18 -48 -219 50 -39 -74
7635 -74 -98 40 -37 1 59 208 -63 -55 160 96 -48 65 66 -194 27 7 -74 -70 -68 -104 101 65 -30 -104 24 -67 -50
7662 -50 -27 -50 61 30 -49 18 17 7 -43 -81 3 -12 126 71 22 11 -8 -34 12 -59 82 -108 -5 -124 -81 96 181
$$ packed form
7483a30K38k50K5o8K31N1p6L8k4j00J07k07L02j13Q5j31m6J01m6O2j02J09r5J07
7507F8j30L8N8q7m4R2J11j7l09J87J01j16MJ2p7k1J60qJ8p9j43J73r1P2j2J0l0
7534f0O0j14R3J67j53j15K12O6k14J09o9j81J91m0M9N8j11Q3l8r0Q0L6o8J29L1
7559A11n3j90N3O4Q9q2Q5ln2Q2mp0p0J31rj31K04j75J11j74K22l1M2l54J16j56
7585b44L07J01j82J01j50K19j84%J37j86J16j20m7O8J23m9J6j5j3OK5k4p2K1j69
7610b15K65n4j10K7J19q2J8M1j22J07J27q2o3M9N5j40l9l8M5J10o6j71K69q9l5
7635g4k4J38p7L8N8J49k71QK15o4j44J13Jk60K21k0q1MKl6K05l6r5p4J28r1J7
7662e0K3k3J11l1p9O7jj0n0l8Q4j5J38n5m9j1j9k6M6p1J41j90J03j19M3J77Q5
$$ plain form
7689 181 -44 163 -38 157 96 -64 155 11 -59 118 -132 57 60 -104 -78 54 199 29 9 57 -55 -57 20
7712 20 -122 59 -34 -4 -1 -98 -112 -23 -108 101 -4 -170 -40 -34 80 -15 9 215 -122 21 56 -110 55 168 42
7737 42 -51 -93 99 -13 -66 85 126 -97 -15 31 56 -55 111 7 24 18 -82 78 -24 -36 -246 69 -254 -14
7761 -14 17 3 54 -95 180 -75 -74 154 23 24 -165 -77 -128 -7 195 -166 43 -46 -105 -37 49 40 -29 94 77 -93
7787 -93 -39 127 -5 63 -80 -104 67 -66 151 78 105 289 -53 113 -119 -44 274 236 66 -87 17 110 24
7810 24 -8 26 -169 -198 41 -70 -138 23 225 90 -16 164 -95 -57 -89 -59 -50 -7 -138 232 -117 -173 4 -12
7834 -12 83 -109 -55 66 -10 -93 -138 -44 112 -83 121 -11 59 43 -74 38 -38 -35 -91 24 17 -55 -124 -115 -156 59 6
7861 6 -46 -138 -76 63 6 -54 84 -19 89 -31 57 -10 79 73 -24 -75 -3 49 55 14 -39 -47 23 14 -45 -7 -25 84 53 60
$$ packed form
7689A81k25K07k01J95o1j60K19j44p0J77k50J89Lj64K6J32J45j70k0M8j12kP7
7712B0j42J81r3L0Lr7j4Q9q5K09j05j66J30OJ14r5K4K06l37J43L5j66J65J13j26
7737D2r3m2J92j12n3J51M1k23Q2M6K5j11J66j04J7oj00J60j02j2k10L15l23K40
7761a4L1j4N1j49K75k55JK28j31Jj89Q8n1J21K02l61K09q9n9O8Q6ro9J23j7j70
7787i3N4J66j32O8j43k4J71j33K17p3K7J84l42J66k32P5L18l8j70j53J04R3q6
7810B4l2L4j95k9K39j11o8J61K02j35j06J80k59L8l2L0RM3j31L70l49n6J77j6
7834a2R5j92N4J21p6q3m5R4J56j95K04j32P0j6j17J12p6Ln6J15pp2o9Rm1K15n3
7861Fn2r2O2J39n7o0J38j03J08j20Q8o7Q9or7n1P2N2Om1n3qP0rn9L8j8J09l1P
$$ plain form
7891 60 -82 23 -9 71 191 -78 211 22 35 -6 141 -49 10 175 109 76 -137 -58 28 136 31 112 -16 -22
7915 -22 40 -1 -85 70 12 9 133 7 142 -37 232 -39 31 -106 -135 -43 -72 22 -41 -42 -15 95 -110 68 -154
7940 -154 231 -69 -24 -121 59 -168 -101 208 99 55 -127 -56 -19 -62 -46 69 196 -236 -29 73 -63 108 12
7963 12 -47 44 -65 254 -34 -139 -88 -1 24 27 -107 -6 76 60 81 33 16 -12 240 5 -52 76 41 82 52 7
7989 7 -173 -33 -58 -91 -39 -155 -12 44 -16 61 60 -15 52 -10 124 82 -100 15 36 114 13 -27 180 96 -38 -118
8015 -118 47 -31 72 42 111 -82 -129 58 8 -157 26 65 67 47 -39 136 -65 -129 35 158 -60 -14 36 -32 -141
8040 -141 97 -38 147 -49 6 -67 37 -56 -30 6 34 119 7 -108 -25 36 -47 -1 80 24 66 9 -224 -23 118
8065 118 10 97 90 45 -70 -194 -102 48 117 -230 -84 152 -31 86 177 121 91 -21 -151 144 -130 65 0
$$ packed form
7891F0j42J05l2Q0J20k69K89j89J3m1J47j90N9J65o6l3k13P9Q6J08j05Q1j28o
7915b2O2m1q4J55n8lJ24j26J35j79K69k71P0j37k9R2k9R4o3jK7J10k05J78k22
7940a54L85l00M5r7J80k27O7L09j09m4j82P1L7m3J6J15J27m32K07J02j36J71r6
7963A2n9R1j09L19k88j05N1Q7K5Lj34J01Q2j6K1m8j7k8K52k35n7J28l5M1l0m5
7989Gj80J40k5l3N2j16J43N6o0P7jp5O7o2J34m2j82J15K1P8j01m0K07q4j34q0
8015a18J65p8J03l0O9j93m7J87n0j65J83L9Kk0q6J75k01o4J64J23k18M6N0o8j09
8040a41K38j35J85j96N5p3J04r3K6L6K8Q5j12j15Q3O1q3M6Q1n6M2n7k33K01J41
8065A18j08Q7pm5j15j24R2J50O9l47J46K36j83J17R1n6l0j12j30K95k74J95o5
$$ plain form
8088 0 -72 10 66 -163 -12 74 -58 30 -75 -22 -162 57 11 5 119 27 -12 -12 200 -62 -23 26 -127 -22 -159 32
8114 32 -78 -20 -65 -80 -196 145 -84 -7 105 189 72 -73 -132 -62 191 -243 22 14 40 42 -23 -15 -118 132 16
8139 16 -54 243 -108 60 -43 10 -24 128 22 72 8 -80 99 -30 38 7 30 -251 129 -135 17 -22 -23 82
8163 82 65 -3 134 108 34 46 25 -1 -133 98 -101 -88 -98 109 18 -8 9 19 16 70 27 -6 -3 -86 -37 -108 39 -38
$$ packed form
8088@p2Q2N6k29J51Q6j32Q8j05N3j40K19m6oJ14r2l9%K12k62L9M9j53J05j37J91
8114C2j10N8m5j5j16L41k29P7J12Q4j17j45n9P0K53m34K65qK6Ko5Qj03K50j16
8139A6p0K97l51J68j03N3l4J52j06N0o4q8J79j29O8l1K3k81L80k64J52l9jJ05
8163H2j7o8J37k6p4J2k1k6j32K31j99J3j0K07r1k6J7J0lN4m3l3Lq3M9p1J47p7
8191c8
$$ Imaginary data points
##PAGE= N=2
##DATA TABLE= (X++(I..I)), XYDATA
$$ plain form
0 0 0 0 0 0 0 0 0 0 0 0 0 0 0 0 0 0 0 0 2 -8 8 -8 8 -8 8 -14 16 -16 18 -24 24 -29 32 -36 40 -47 50 -58 64 -71
40 -71 79 -89 97 -106 120 -129 144 -160 176 -194 214 -234 257 -287 317 -352 392 -436 491 -555 633
61 633 -731 856 -1027 1263 -1625 2228 -3430 6698 -33337 -90152 27167 56637 -25179 -34157
75 -34157 22021 8632 -22278 -8145 4435 -3473 5403 2993 -16532 -13019 8437 4210 -11908
88 -11908 -4550 12291 -2304 -22337 -6242 14789 2882 -9538 -1528 -36 -8694 -132 5668
101 5668 -7189 807 16396 -8845 -25924 7679 24436 -4273 -13109 5806 2322 -7708 4479
114 4479 7717 -1628 3662 4135 -8306 -3230 11328 7325 -3666 459 6563 -1635 -5766 7254
128 7254 12073 -1777 -4800 9349 3877 -14050 4213 25789 -2138 -21069 9239 17800 -12839
$$ packed form
0@%%%%%%%%%%%%%%%%%%Kj0J6j6J6j6J6k2L0l2L4m2M8n3O1o8P6q7R7j08J22j35
40g1J50j68J86k03K26k49K73l04L36l70M08m48M91n44O04o69P44q28R27j046J188
61F33j364J587j883K290k888L853n658J0128m0035n6815J17319K9470q1816q978
75c4157N6178j3389l0910J4133J2580p908Q876k410j9525L513K1456m227j6118
88a1908P358J6841j4595k0033J6095K1031j1907j2420Q010J492q658Q562N800
101E668j2857P996J5589k5241j7079L3603J6757k8709q836J8915l484j0030J2187
114D479L238r345N290M73j2441N076J4558m003j0991M125O104q198m131J3020
128G254M819j3850l023J4149n472j7927J8263K1576k7927j8931L0308Q561l0639
$$ plain form
141 -12839 -9066 22086 9907 -18462 -5227 12941 1785 -3309 4442 1011 -4267 110 504 -2735
155 -2735 1823 5820 -2896 -8095 -97 3367 -3048 -3432 3788 1866 -9180 -5947 5352 1 -5695
170 -5695 2537 1340 -10126 -5388 5128 -792 -4624 2865 -2113 -10778 -325 6478 -4159 -4753
184 -4753 3712 -761 -8271 -1800 4777 433 -2588 -653 -2269 -1956 1962 999 -2568 788 5080 -1366
200 -1366 -9110 778 12022 1076 -10034 1820 10358 -3136 -8682 6981 11069 -3191 -5509
213 -5509 2866 3320 2332 2526 321 491 3915 1228 -3621 2145 8583 1957 -4324 354 4118 1619
229 1619 -380 2117 3443 -91 -1181 1261 328 639 4222 1817 -4606 -1988 4997 884 -4843 2007
245 2007 4654 -3550 -4796 1241 2127 -424 -331 -1274 -2973 -574 736 -2781 -1552 2240 -1354 -5491
$$ packed form
141a2839L773L1152j2179k8369J3235J8168j1156n094P751l431n278M377L94l239
155b735M558L997q716n199P998L464o415l84P220j922j1046L233J1299n351n696
170e695Q232j197j1466M738J0516n920l832P489m978q665J0453O803j0637n94
184d753Q465m473p510O471O577m344l021J935j616L13L918r63l567L356M292o446
200a366p744R888J1244j0946j1110J1854Q538j3494n546J5663M088j4260k318
213e509Q375M54r88J94k205J70L424k687m849N766O438o626o281M678L764k499
229A619j999K497J326l534j090K442r33L11L583k405o423K618O985m113n727O850
245B007K647q204j246O037Q86k551R3r43j699K399J310l517J229L792l594m137
$$ plain form
261 -5491 -2321 1883 -318 -3199 -1046 24 -3456 -3245 494 276 -2468 -1341 325 -3194 -3918 2241
277 2241 1929 -3702 -1991 1627 -1287 -2986 365 1924 -515 -1442 -665 -901 649 2047 -447 -254
293 -254 1794 298 -1470 486 3755 2601 -1344 -296 2606 1449 -550 1407 3892 1119 -1533
308 -1533 1457 2757 581 1836 2877 370 114 1898 1483 547 2082 2643 -216 -441 1618 1098 680
325 680 1318 837 -230 -47 356 340 95 945 808 -1459 -1583 783 963 -1139 -1558 907 -670 -3234
343 -3234 -832 1162 -1178 -1683 -588 -1423 -2003 -697 -177 -1902 -1078 -337 -2570 -2449 32 -472 -1525
360 -1525 -1010 -1149 -1477 -1715 -642 -137 -1033 -973 -857 -1342 -955 -318 487 -177 -1525 89 412 -1183 80
379 80 1835 542 -857 9 986 526 479 1290 388 570 932 39 797 2230 1348 299 594 1543 1282
$$ packed form
261e491L170M204k201k881K153J070l480K11L739k18k744J127J666l519p24O159
277B241l12n631J711L618k914j699L351J559k439r27P77k36J550J398k494J93
293b54K048j496j768J956L269j154l945J048K902j157j999J957K485k773k652
308a533K990J300k176J255J041k507k56J784m15r36J535N61k859k25K059n20m18
325F80O38m81j067J83M03j6k45Q50j37k267j24K366J80k102m19K465j577k564
343c234K402J994k340n05J095q35n80J306N20j725Q24P41k233J21K481n04j053
360a525N15j39l28k38J073N05q96O0J16m85L87O37Q05o64j348J614L23j595J263
379H0J755j293j399Q66R77m60m7Q11r02J82L62q93P58J433q82j049K95R49k61
$$ plain form
398 1282 558 1262 1838 1095 556 428 1397 1851 697 928 1208 248 608 1165 766 618 1083 810 -382
417 -382 -324 1291 604 -55 272 -115 -128 177 -296 -505 -61 202 -919 -1547 -272 462 -674 -1415 -971 -285
437 -285 -747 -1766 -1134 -17 -682 -1466 -1751 -1305 -256 -606 -1444 -1371 -453 -454 -1892 -1641 49 -16 -1036 -1552
457 -1552 -1165 157 101 -1120 -996 247 262 -1074 -1046 684 976 -454 -887 314 930 223 -158 686 858
476 858 403 676 525 437 959 1390 1047 -87 673 1500 784 601 1225 1041 1035 953 580 1021 1392 1614 600
497 600 -467 717 2019 1239 -671 -256 2163 1315 -1365 -195 2387 903 -1228 -765 1096 1163 -494
514 -494 -1334 99 1194 71 -1892 -1171 838 378 -790 -1609 -1089 452 -132 -2182 -1299 993 77
531 77 -3119 -2007 1206 333 -2337 -2154 -77 716 -1481 -2193 -78 82 -1448 -1221 -396 -764 -965 -15
$$ packed form
398A282p24P04N76p43n39j28R69M54j154K31K80r60L60N57l99j48M65k73j192
417c82N8J615o87o59L27l87j3L05m73k09M44K63j121o28J275P34j136p41M44O86
437b85m62j019O32J117o65p84k85M46J049l50q38P3R18jj438K51J690o5j020n16
457a552L87J322n6j221J24J243J5j336K8J730K92j430m33J201O16p07l81Q44J72
476H58m55K73j51q8N22M31l43j134P60Q27p16j83O24j84oq2l73M41L71K22j014
497F00j067J184J302p80j910M15K419q48k680J170K582j484k131M63J861O7j657
514d94q40J433J095j123j963P21K009m60j168q19N20J541n84k050Q83K292r16
531G7l196J112L213q73k670J83K077P93k197p12K115J60j530K27Q25l68k01R50
$$ plain form
549 -15 -231 -1514 181 885 -1412 -1175 1148 833 -734 -464 114 107 370 712 278 -509 446 1136 974 -157
569 -157 -25 2150 1179 -1591 516 3479 1397 -1938 162 3172 1580 -861 -85 1341 2221 995
585 995 -672 841 2049 860 -98 488 1183 1318 368 -1033 2 2708 1687 -2790 -1569 3295 1718
602 1718 -2392 -1299 1830 1194 -1483 -1618 1130 1235 -1727 -2448 506 1273 -1312 -1655 -245 -865 -382
619 -382 217 -1815 -2045 452 302 -2160 -1324 500 -1081 -2127 -201 -5 -1055 -1015 -1025 -682 -287 -485
637 -485 -469 -550 -1368 -591 1342 412 -2055 -691 1622 -214 -1334 648 881 -261 -255 425 596 814 422
656 422 -505 384 1766 645 -326 248 332 1149 1724 -517 -399 2285 1468 -982 368 2719 678 -1210
674 -1210 540 2169 1131 -65 -422 768 2021 270 -695 904 1018 -143 321 807 213 -170 200
$$ packed form
549a5k16j283J695P04k297K37K323l15j567K70N78pK63L42m34p87R55O90j62j131
569a57J32K175r71k770K107K963k082l335K100L010j592k441P76J426Q80j226
585I95j667J513J208j189r58N86O95J35r50j401J035K706j021m477J221M864j577
602A718m110J093L129o36k677j35K748J05k962p21K954P67k585l43J410o20M83
619c82N99k032k30K497j50k462Q36J824j581j046J926J96j050M0j0L43L95j98
637d85J6q1q18P77J933r30k467J364K313j836j120J982K33j142OO80J71K18l92
656D22r27Q89J382j121r71N74Q4Q17N75k241J18K684q17k450J350K351k041j888
674a210J750J629j038j196l57J190J253j751r65J599J14j161M64M86n94l83L70
$$ plain form
691 200 -469 -181 1129 -293 -1632 482 831 -623 -685 143 -628 -709 -44 -59 -717 -571 -997 -676 205 -693
711 -693 -1438 -172 -413 -1565 -465 -35 -1154 -1232 -258 -444 -770 -303 -761 -1404 -6 279 -1015 -686 -112
730 -112 -347 12 -36 -607 -38 372 -690 -581 970 598 -1021 -418 1105 470 82 224 211 662 636 183
750 183 423 1129 675 -211 755 1337 469 439 881 410 1061 1131 108 277 1180 698 322 955 664 -23 688
771 688 682 -49 587 831 -188 -29 594 260 -15 186 -203 -2 493 -160 -637 62 228 -833 -322 125
791 125 -542 -487 -221 -370 -566 -308 -608 -644 -480 -364 -905 -530 -348 -810 -596 -234 -836 -909 -136 -559 -580 -284
813 -284 -216 -610 -638 -325 -525 -368 31 -637 -119 179 -478 -394 160 -20 -292 138 221 119 54 222 186 518
835 518 320 138 414 839 270 248 717 419 433 412 897 399 651 695 472 469 750 573 471 744 382 508
$$ packed form
691B00o69K88J310j422j339K114L49j454o2Q28p71q1O65j5o58J46m26L21Q81q98
711f93p45J266k41j152J100M30j119p8R74j86l26M67m58o43J398K85j294L29N74
730a12k35L59m8n71N69M10j062J09J551l72j619O03J523o35l88J42j3M51k6m53
750A83K40P06m54q86R66N82q68l0M42m71O51P0j023J69R03m82l76O33k91o87P11
771F88op31O36K44j019J59O23l34k75K01l89K01M95o53m77O99J66j061N11M47
791A25o67N5K66j49j96K58l00l6J64J16n41L75J82m62K14L62o02p3P73m23k1K96
813b84O8l94k8L13k00J57L99o68N18K98o57Q4N54j80k72M30Q3j02o5J68l6L32
835E18j98j82K76M25n69k2M69k98J4k1M85m98K52M4k23lK81j77j02K73l62J26
$$ plain form
857 508 791 379 168 517 640 394 183 611 365 268 279 -51 75 378 -183 -89 282 -96 -314 -239 -131 -158
879 -158 -213 -262 -343 -240 -421 -579 -718 -250 -709 -632 -276 -465 -437 -602 -605 -720 -661 -281 -687 -610 -145 -617 -708 -467
903 -467 -562 -95 -294 -626 -267 -87 -379 -398 -199 18 -300 -461 122 -37 -205 89 8 207 301 -141 103 318
925 318 610 458 219 527 534 446 298 395 537 651 193 474 766 431 376 459 490 576 396 534 330 297 509
948 509 350 187 376 336 545 431 192 298 243 70 16 52 191 -19 -337 -68 142 -169 -113 -451 -200 15
970 15 -232 -373 -208 -122 -328 -513 -407 -362 -592 -328 -678 -502 -306 -254 -710 -515 -351 -395 -698 -667 -297 -450
992 -450 -364 -512 -429 -57 -317 -391 -301 -124 -179 -360 -183 -139 -20 93 45 -121 140 151 -25 191 380 151 526
1015 526 303 242 270 388 290 -75 562 579 361 342 412 325 799 594 252 266 666 752 330 120 503 551 128
$$ packed form
857E08K83m12k11L49J23k46k11M28k46r7J1l30J26L03n61R4L71l78k18P5J08k7
879a58n5m9q1J03j81j58j39M68m59P7L56j89K8j65lj15N9L80m06P7M65m72r1K41
903d67r5M67j99l32L59J80k92j9J99K17l18j61N83j59j68K94q1J99R4m42K44K15
925C18K92j52k39L08Pq8j48R7J42J14m58K81K92l35n5Q3L1Q6j80J38k04l3K12
948E09j59j63J89m0K09j14k39J06n5j73n4L6J39k10l18K69K10l11N6l38K51K15
970A5k47j41J65Q6k06j85J06M5k30K64l50J76J96N2m56J95J64m4l03L1L70j53
992d50Q6j48Q3L72k60p4R0J77n5j81J77M4J19J13m8j66K61J1j76K16J89k29L75
1015E26k23o1K8J18r8l65O37J7k18j9P0q7M74k05l42J4M00Q6m22k10L83M8m23
$$ plain form
1038 128 192 451 721 213 -219 308 505 -64 39 94 214 186 -39 101 -372 178 227 -263 -556 87 168 -641
1060 -641 -288 17 24 -463 -612 -368 -47 -208 -770 -505 -58 -421 -341 -354 -373 -372 -435 -461 -379 -465 -345 -340 -548 -300
1084 -300 -204 -300 -401 -592 -128 185 -370 -359 95 33 -226 48 72 -89 -229 447 151 -283 333 527 -332 -72
1106 -72 849 821 123 -239 560 634 334 275 485 580 259 215 521 515 221 369 142 278 583 659 -177 14 805
1129 805 499 -72 -29 580 288 74 73 92 458 -22 -132 158 387 152 -585 -72 326 -252 -74 -14 -382 -180
1151 -180 -162 -268 -290 -480 -378 -197 -464 -206 -314 -254 -499 -602 -57 -279 -865 -298 -183 -828 -226 125 -595
1172 -595 -937 -272 330 -535 -701 159 -179 -530 -109 319 -45 -283 -307 107 195 189 109 -177 244 465 403 185
1194 185 -164 275 505 -123 381 591 101 75 333 785 529 437 122 299 596 990 -29 55 660 356 281
$$ packed form
1038A28O4K59K70n08m32N27J97n69J03N5J20k8k25J40m73N50M9m90k93O43Q1q09
1060f41L53L05Pm87j49K44L21j61n62K65M47l63Q0j3j9Jo3k6Q2q6J20Nk08K48
1084c00R6r6j01j91M64L13n55J1M54o2k59K74K4j61j40O76k96m34O16J94q59K60
1106g2R21k8o98l62P99P4l00n9K10R5l21m4L06ok94J48k27J36L05P6q36J91P91
1129H05l06n71M3O09k92k14jJ9L66m80j10K90K29k35p37N13L98n78J78O0l68K02
1151a80J8j06k2j90J02J81k67K58j08O0k45j03N45k22n86N67J15o45O02L51p20
1172e95l42O65O02q65j66Q60l38l51M21M28l64k38k4M14Q8oq0k86M21K21o2k18
1194A85l49M39K30o28N04K10m90k6K58M52k56r2l15J77K97L94j019Q4O05l04p5
$$ plain form
1215 281 518 376 -28 6 436 411 181 332 -9 21 252 396 -41 -7 -82 246 204 -18 139 -25 -309 -242
1237 -242 264 -67 -561 -380 56 -478 -482 70 -222 -708 -415 93 -382 -489 -51 -602 -488 -129 -150 -605 -375
1258 -375 -91 -342 -174 -178 -239 -429 -266 63 82 -243 -311 -271 216 -116 -28 172 -322 -270 501 28 -78 147 146
1281 146 75 234 613 73 -124 360 337 55 442 339 165 364 521 283 440 360 425 222 425 416 226 202
1303 202 281 439 389 253 47 439 105 195 432 368 -40 -130 318 237 -265 222 204 -320 -10 330 -149 -358
1325 -358 64 -147 -157 5 -264 -266 -443 -173 -279 -312 -284 -473 -352 -447 -376 -355 -506 -650 -253 -140 -522 -454 -158
1348 -158 -132 -310 -118 -102 -584 -273 14 -324 -108 -54 -51 -284 -182 -41 -151 -198 39 -133 129 115 47 83 203
1371 203 284 19 145 307 351 196 195 198 322 259 25 563 503 116 326 456 69 340 555 231 45 395 499
$$ packed form
1215B81K37j42m04L4M30k5k30J51l41L0K31J44m37L4p5L28m2k22J57j64k84O7
1237b42N06l31m94J81M36n34mN52k92m86K93N08m75j07M38n51J14L59k1m55K30
1258c75K84k51J68mo1j90J63L29J9l25o8M0M87l32Q8K00m94N2P71m73j06K25j
1281A46p1J59L79n40j97M84k3k82L87j03j74J99J57k38J57q0O5k03K03rj90k4
1303B02P9J58n0j36k06L92l34R0K37o4m08r0M48q1n02M87j8n24L10L40m79k09
1325c58M22k11j0J62k69kj77K70j06l3K8j89J21r5P1K1j51j44L97J13l82O8K96
1348a58K6j78J92J6m82L11K87l38K16N4Lk33J02J41j10m7K37j72K62j4o8L6J20
1371B03Q1k65J26J62M4j55jLJ24o3k34N38o0l87K10J30l87K71K15l24j86L50J04
$$ plain form
1394 499 -65 230 424 123 59 286 371 101 212 204 65 -171 128 242 -220 196 135 -34 112 -191 -12 116
1416 116 -255 -220 -122 -358 -341 -132 -190 -356 -357 -124 -347 -453 -116 -446 -534 -189 -274 -477 -265 -188 -374 -333 -265 -138
1440 -138 -322 -119 -99 -132 -93 -336 107 -243 -188 -88 -34 -58 27 -120 -86 120 166 -8 62 134 120 -54 22 122
1464 122 173 123 289 341 218 125 395 307 184 293 288 345 481 362 223 338 214 62 65 184 280 150 284 264
1488 264 150 75 139 135 381 8 58 257 44 -24 50 -91 -158 -11 -105 -50 -138 -107 -26 -236 -198 -103 -262 31 -187
1513 -187 -126 -188 -302 -319 -295 -82 -259 -359 -267 -220 -221 -127 -271 -321 -199 -265 -377 -77 -215 -364 -127 -271 -97 -128
1537 -128 102 -57 -357 -124 -129 -78 -41 99 52 213 31 178 154 5 346 159 178 209 185 315 366 117 460
1560 460 424 108 323 209 440 217 238 463 373 457 505 230 412 242 154 303 260 359 133 125 150 30 160 105
$$ packed form
1394D99n64K95J94l01o4K27Q5k70J11qj39k36K99J14m62M16o1j69J46l03J79J28
1416A16l71L5R8k36J7K09n8j66jK33k23j06L37l30q8L45q5k03K12P7j86M1O8J27
1440a38j84K03K0l3L9k43M43l50N5J00N4k4Q5j47L4K06M6j74P0P2j4j74P6J00
1464A22N1n0J66N2j23r3K70q8j23J09nN7J36j19j39J15j24j52LJ19R6j30J34k0
1488B64j14p5O4mK46l73N0J99k13o8P4j41o7J47r4N5q8L1Q1k10L8R5j59K93k18
1513a87O1o2j14j7K4K13j77j00R2M7jR4j44n0J22o6j12L00j38j49K37j44J74l1
1537a28K30j59l00K33nN1L7J40m7J61j82J47k4j49L41j87J9L1k4J30N1k49L43
1560D60l6l16K15j14K31k23K1K25r0Q4M8k75J82j70q8J49m3R9k26qK5j20J30n5
$$ plain form
1584 105 25 210 215 12 227 47 -189 -87 -103 -84 -280 -140 -307 -368 -129 -184 -340 -99 -165 -303 -281 -67 -469
1607 -469 -365 -193 -225 -209 -254 -202 -360 -208 -295 -334 -290 24 -195 -334 -93 -394 -161 -87 -134 -196 -46 -173 -209 -8
1631 -8 -19 -104 -288 40 164 94 -87 141 214 241 160 177 321 255 229 297 448 114 131 337 114 171 429 145 151
1656 151 390 401 234 159 255 158 233 375 82 132 239 -45 166 225 105 -26 74 120 -50 8 97 -134 -171 253
1680 253 42 -86 2 -147 -139 -63 83 -94 -176 -162 -350 -260 -162 -453 -285 -165 -301 -234 -22 -293 -477 -110 -173
1703 -173 -272 -261 -179 -177 -414 -209 -189 -229 -207 -305 -224 109 -22 -154 -86 -247 -55 47 -3 -113 -121 -17 220 -5 132
1728 132 32 -2 100 343 130 57 116 5 212 370 208 21 313 152 65 334 312 -70 70 318 207 280
1750 280 80 22 173 229 374 194 101 224 18 346 -8 30 114 59 -131 186 -9 15 -140 13 -80 -200 129
$$ packed form
1584A05q0J85Nk03K15j80k36J02j6J9j96J40j67o1K39n5j56K41o6j38K2K14m02
1607d69J04J72l2J6m5N2j58J52q7l9M4L14k19j39K41l01K33P4m7o2J50j27l6K01
1631hj1q5j84L28J24p0j81K28P3K7q1J7J44o6k6O8J51l34J7K06k23N7K58k84O
1656A51K39J1j67p5R6r7P5J42k93N0J07k84K11N9j20j31J00M6j70N8Q9k31l7M24
1680B53k11j28Q8j49QP6J46j77q2J4j88R0R8k91J68J20j36O7K12k71j84L67o3
1703a73r9J1Q2Kk37K05K0m0K2r8Q1L33j31j32O8j61J92J02n0j10qJ04K37k25J37
1728A32j00l4J02K43k13p3N9j11K07J58j62j87K92j61q7K69k2l82J40K48j11P3
1750B80k00n8J51N6J45j80r3J23k06L28l54L8Q4n5j90L17j95K4j55J53r3j20L29
$$ plain form
1773 129 -225 -213 -139 146 -51 -200 -94 -280 -207 -91 -155 -380 -237 -130 -251 -330 -179 -423 -308 -201 -335 5
1795 5 -234 -293 -363 -80 -116 -148 -208 -44 -297 19 -24 -225 -10 -4 -185 143 212 51 -187 80 134 265 23 444
1819 444 180 20 291 436 154 104 267 -50 178 204 110 118 85 360 119 300 151 146 263 162 205 222 62
1842 62 -14 159 399 54 7 142 65 172 129 218 -167 -39 -46 1 81 84 -19 86 -107 -76 -21 -175 -102 -173 -146 -258
1868 -258 -136 -272 -231 -205 -227 -341 -317 -234 -330 -256 -182 90 -289 -300 -211 -142 -170 37 -136 -213 -69 -128 -255 -191 5
1893 5 -61 -231 13 92 -116 -156 4 -94 -87 80 19 86 39 280 81 33 90 245 166 224 117 191 87 44 170 225
1919 225 155 2 159 40 158 297 257 32 19 307 147 176 231 116 276 322 219 64 42 113 100 98 107 54 -85
1944 -85 42 -136 161 -62 -41 90 -238 -78 -40 -101 -362 -38 -162 151 -295 -268 0 -230 -258 -54 -177 -178 -100
$$ packed form
1773A29l54J2P4K85j97j49J06j86P3J16o4k25J43J07j21p9J51k44J15J07j34L40
1795Ek39n9p0K83l6l2o0J64k53L16m3k01K15Oj81L28O9j61k38K67N4J31k42M21
1819D44k64j60K71J45k82n0J63l17K28K6r4Ql3K75k41J81j49nJ17j01M3J7j60
1842F2p6J73K40l45m7J35p7J07m3Q9l85J28pM7Q0Lj03J05j93L1N5j54P3p1K7j12
1868b58J22j36M1K6k2j14K4Q3r6P4P4K72l79j1Q9O9k8K07j73p7J44n9j27O4J96
1893Eo6j70K44P9k08m0J60r8PJ67o1O7m7K41j99m8N7J55p9N8j07P4j04m3J26N5
1919B25p0j53J57j19J18J39m0k25j3K88j60K9N5j15J60M6j03j55k2P1j3kRn3j39
1944h5J27j78K97k23K1J31l28J60L8o1k61L24j24L13m46K7K68k30k8K04j23jP8
$$ plain form
1967 -100 -200 -205 -70 -147 -5 -298 -115 4 -250 -34 -102 -210 -18 27 -62 -199 -118 -75 -99 -22 -146 -148 97 -34
1991 -34 -134 34 -160 -81 131 34 162 47 116 -12 53 32 213 89 212 204 -58 72 189 152 188 377 258
2014 258 316 102 382 216 110 148 148 137 156 214 241 104 26 91 -50 325 -17 8 -26 91 -30 205 -109 -22
2038 -22 102 -34 142 -25 -278 -71 -141 -40 -73 -71 -57 3 -80 -146 -103 -223 -77 -165 -332 -252 -132 -164 -144 -106 -77
2063 -77 -90 -184 -107 -77 -164 -114 -185 -145 -152 -118 -117 -282 -222 -135 114 -108 -42 46 -133 50 71 -78 116 53 313 144 113
2090 113 80 -14 146 219 161 110 62 277 102 257 28 207 174 145 184 125 55 250 369 18 171 183 129 -106
2114 -106 200 141 -37 130 132 -21 22 -31 20 -110 151 -58 6 -23 -91 -3 -168 14 -90 -25 -129 -74 -111 -2
2138 -2 -165 -207 -67 -165 -119 -182 92 -228 -168 -215 -226 -173 1 -243 -200 -150 -168 -93 -208 -88 -218 -110 -242 -37 -127
$$ packed form
1967a00j00nJ35p7J42k93J83J19k54K16o8j08J92M5q9j37Q1M3k4P7j24kK45j31
1991c4j00J68j94P9K12r7J28j15O9j28O5k1J81j24J23qk62J30J17l7L6J89j19
2014B58N8k14K80j66j06L8%j1J9N8K7j37p8O5j41L75l42K5l4J17j21K35l14Q7
2038b2J24j36J76j67k53K07p0J01l3KJ4O0q3o6M3j20J46q8j67Q0J20l2K0L8K9
2063g7j3r4P7L0q7N0p1M0pL4Jj65O0Q7K49k22O6Q8j79J83K1j49J94o3K60j69l1
2090A13l3r4J60P3n8n1m8K15j75J55k29J79l3k9L9n9p0J95J19l51J53J2n4k35
2114a06L06n9j78J67Kj53M3n3N1j30K61k09O4k9o8Q8j65J82j04O5j04N5l7J09
2138bj63m2J40r8M6o3K74l20O0m7j1N3J74k44M3N0j8P5j15J20j30J08j32K05r0
$$ plain form
2163 -127 -67 -9 29 29 -51 13 -67 -6 50 -59 -142 119 132 47 -37 90 113 81 322 183 -69 119 81 117 144 169 207
2190 207 158 -28 226 139 55 179 -60 263 109 77 66 87 236 234 222 143 85 183 49 71 42 73 -165 -181 84
2215 84 -12 112 -85 11 -72 -159 -136 7 -165 -167 -145 -66 -138 -160 -271 -62 -117 -316 -70 -23 -16 -42 -173 56 -100 -132
2241 -132 -288 -271 -2 -53 -12 -125 -181 -307 11 -74 17 -29 51 -10 -82 -110 12 105 -24 34 -82 -44 84 -46 218
2266 218 82 -5 -36 156 32 78 94 -31 79 210 88 163 348 102 -59 246 217 19 78 42 190 110 311
2289 311 -123 195 68 -9 80 211 140 23 157 161 93 84 26 -51 -35 -72 -132 118 -62 -173 -66 118 -40 -124 -13
2314 -13 -118 -10 -104 -52 -87 -285 -66 -86 -246 -124 -254 -25 42 -352 -85 -100 -132 -86 -55 70 -182 -115 -7 -143
2338 -143 -198 -121 -57 -150 -106 86 22 158 47 59 -217 64 -70 113 -27 34 -77 119 98 51 7 -14 27 220
$$ packed form
2163a27O0N8L8%q0O4q0O1N6j09q3K61J3q5q4J27K3l2K41j39k52J88l8L6K7K5L8
2190B07m9j86K54q7q4J24k39L23j54l2j1K1J49kj2p9n8R8j34K2k9L1k38j6K65
2215H4r6J24j97R6q3q7K3J43j72kK2P9p2k2j11K09n5j99K46M7Pk6j31K29j56l2
2241a32j56J7K69n1M1j13n6j26L18q5R1m6Q0o1p2k8J22R3j29N8j16L8J28j30K64
2266B18j36q7l1J92j24M6J6j25J10J31j22P5J85k46j61L05k9j98N9l6J48q0K01
2289C11m34L18j27p7Q9J31p1j17J34Mo8rn8p7J6l7o0K50j80j11J07J84j58q4J11
2314a3j05J08r4N2l5j98K19k0j60J22j30K29O7l94K67j5l2M6L1J25k52O7J08j36
2338a43n5P7O4r3M4J92o4J36j11J2k76K81j34J83j40O1j11J96k1m7m4k1M1J93
$$ plain form
2362 220 242 116 73 215 116 156 141 -59 -47 279 198 122 144 82 -84 111 277 151 57 -20 94 157 214 -12 109
2387 109 47 131 178 101 34 49 43 7 -149 -43 234 -98 -12 16 67 -119 2 -49 3 -104 -25 -67 -163 -121 -146 -254
2413 -254 49 19 -185 -280 -166 -233 -146 -71 -70 90 -149 -1 -162 -94 -124 -197 -21 -125 -155 -112 -111 -115 -37 27 29 91 -45
2440 -45 25 -3 -154 -43 -246 106 239 -20 -6 156 84 92 -12 38 146 102 155 121 179 127 113 56 130 147 188 156
2466 156 33 181 41 97 203 108 181 310 76 91 -23 48 129 130 9 1 257 15 32 -36 -60 35 20 -101 -57
2491 -57 -80 109 -163 -20 -111 -69 -164 -142 -141 -99 -21 20 -75 -74 -28 -236 -72 12 -67 -164 -74 -82 -113 -206 -169 -17 -22 -89 -244
2520 -244 28 -40 -285 212 -114 22 -160 -96 13 8 -20 152 -78 -72 211 -2 138 60 127 -76 -20 161 238 137
2544 137 115 120 56 -17 49 236 167 69 94 -49 69 135 182 138 33 47 90 -39 35 -104 118 104 125 95 188 175 -50
$$ packed form
2362B20K2j26m3J42r9M0j5k00J2L26q1p6K2o2j66J95J66j26r4p7J14O3N7k26J21
2387A09o2Q4M7p7o7J5ol6j56J06K77l32Q6K8N1j86J21n1N2j07P9m2r6M2k5j08
2413b54L03l0k04r5J14o7Q7P5JJ60k39J48j61O8l0p3J76j04l0M3JmP8O4KO2j36
2440d5P0k8j51J11k03L52J33k59J4J62p2Qj04N0J08m4N3l4N8n2j4n7P4J7M1l2
2466A56j23J48j40N6J06r5P3J29k34J5j14P1Q1Jj21qK56k42J7o8k4R5j5j21M4
2491e7k3J89k72J43r1M2r5K2JM2P8M1r5JM6k08J64Q4p9r7R0ql1r3L7J52no7j55
2520b44K72o8k45M97l26J36j82O4J09nk8J72k30OK83k13J40p8O7k03N6J81P7j01
2544A37k2No4p3O6J87o9r8K5j43J18O6M7m4j05J4M3j29P4j39K22j4K1l0R3j3k25
$$ plain form
2571 -50 10 -87 187 232 15 -36 101 13 -114 24 51 179 -83 -39 -185 -44 -94 -229 35 -111 -157 -237 -95 -164
2595 -164 -56 -227 -233 -20 -85 -176 -12 -136 -40 -68 -272 -154 -185 -241 -66 -148 40 42 102 137 -55 -64 -63 119 19 -78
2621 -78 11 147 -3 89 -74 164 26 170 72 218 -70 61 168 32 58 164 -101 -44 160 63 226 -66
2643 -66 268 114 195 -2 211 42 41 193 39 163 44 142 107 5 175 106 -34 19 -10 -12 -60 80 -53 48
2667 48 -151 -82 50 -74 7 80 6 73 94 9 74 -43 -2 -272 -140 -282 -193 -191 -335 -243 55 -90 65 -36 -209
2692 -209 -81 38 -21 -24 -253 -39 -257 -29 -28 -177 -139 103 -56 -63 132 -15 72 -28 95 114 96 -28 11 87
2716 87 25 75 114 50 -2 -101 -102 42 151 126 -15 171 123 160 251 11 9 -31 20 125 -84 43 72 67 189 108 116 6
2744 6 118 0 116 287 -95 44 -3 112 -90 10 11 -10 -178 -112 -113 -103 50 25 28 -75 -186 -81 -154 -115 23
$$ packed form
2571e0O0r7K74M5k17n1J37q8j27J38K7J28k62M4j46J41n0j35K64j46m6q0J42o9
2595a64J08j71oK13o5r1J64j24R6k8k04J18l1n6J75q2J88KO0L5j92rJJ82j00r7
2621g8Q9J36j50R2j63K38j38J44r8J46k88J31J07j36K6J06k65N7K04r7J63k92
2643f6L34j54Q1j97K13j69jJ52j54J24j19R8l5j02J70o9j40N3k9km8J40j33J01
2667D8j99O9J32j24Q1P3p4O7K1q5O5j17M1k70J32j42Q9Kj44R2K98j45J55j01j73
2692b09J28J19n9lk29K14k18K28Jj49L8K42j59pJ95j47Q7j00J23J9j8j24L9P6
2716H7o2N0L9o4n2r9jJ44J09k5j41J86m8L7R1k40km0N1J05k09J27K9nJ22q1Qj10
2744FJ12j18J16J71l82J39m7J15k02J00Jk1j68O6jJ0J53k5Lj03j11J05p3L9J38
$$ plain form
2769 23 -106 19 58 -57 -18 -82 -203 -138 -128 -131 -171 -84 88 -154 -98 -159 -333 -98 -139 -34 -158 -219 149 -54 -47
2794 -47 -183 83 -125 43 117 -46 94 43 119 -101 66 275 -106 152 75 46 47 -15 87 -78 28 205 109
2817 109 65 79 82 8 68 135 -39 -131 156 -74 -19 108 97 30 -67 -17 135 69 240 40 24 43 147 192 -105 -129
2843 -129 9 1 29 5 -63 -65 -84 24 -153 69 42 146 -138 -208 -115 -68 -187 -168 -123 -128 -10 -24 -72 68 -122 15
2869 15 -44 -130 -62 -102 -39 -39 44 -149 83 59 -20 -11 -162 -48 -67 -26 24 -115 1 36 50 -27 69 216 152 -6 -64
2896 -64 -4 102 64 6 172 105 296 105 97 98 94 355 -51 -83 59 191 155 60 14 -11 102 -22 -77 203 50 -69
2922 -69 7 18 -56 58 -39 58 -5 2 264 -24 80 -167 -49 -36 22 39 -152 -81 7 125 -68 -42 -145 1 -170
2947 -170 27 -62 -104 -133 -171 -157 -10 -19 -135 -102 19 -94 -105 -40 -100 31 -242 -140 8 -40 31 -44 -200 -11 28
$$ packed form
2769B3j29J25L9j15L9o4j21O5J0lm0Q7J72k42N6o1j74K35m1J05j24o1L68k03P
2794d7j36K66k08J68P4j63J40n1P6k20J67K09l81K58p7k9Jo2J02j65J06J77r6
2817A09m4J4Lp4O0O7j74r2K87k30N5J27j1o7r7N0J52o6J71k00j6J9J04M5k97k4
2843a29J38qK8k4o8kj9J08j77K22k7J04k84p0R3M7j19J9M5nJ18j4m8J40j90J37
2869A5n9q6O8m0O3%Q3j93K32k4p9Rj51J14j9M1N0j39J16L5J4p7R6J47o4j58n8
2896f4O0J06l8n8J66o7J91j91qJmK61m06l2J42J32l6r5m6k5J13j24n5K80j53j19
2922f9P6J1p4J14r7R7o3PK62k88J04k47J18J3N8J7j91P1Q8J18j93K6j03J46j71
2947a70J97q9m2k9l8J4J47rj16L3J21j13j1O5o0J31k73J02J48m8P1p5j56J89L9
$$ plain form
2972 28 -203 -131 71 -123 22 -18 -102 -30 100 -86 15 -76 70 29 102 102 14 -27 33 147 140 145 37 135 -16 108
2998 108 105 61 20 55 81 96 -22 -87 184 50 88 -100 54 82 61 131 -62 211 154 188 -10 -113 -113 -11 101
3023 101 -18 62 30 160 86 -94 -58 -73 -120 73 -60 -52 -2 -70 -90 2 -66 -159 24 -175 -22 -60 -85 -176 73 -125
3049 -125 -133 -170 -196 -56 -62 178 -105 -180 66 85 -73 153 -67 12 -92 -153 -103 -28 143 138 9 -105 -26 -32 2 70
3075 70 28 168 42 -52 -31 102 111 -40 -18 -15 163 20 -19 64 128 -27 68 40 153 129 -97 -3 184 -5 242
3100 242 83 -58 -170 -38 -45 -32 19 48 130 96 16 -50 47 -129 84 -49 -24 -99 -3 43 -41 147 56 -60 -102 157
3126 157 11 0 -86 116 -38 -68 20 -115 -21 34 15 25 -120 -81 5 -107 -156 -61 -13 -196 -123 -146 -60 -96 -146 -86
3152 -86 -114 21 -218 -65 -59 98 58 20 26 27 79 56 97 177 -23 11 4 -26 78 80 -60 33 9 -16 -38 62 83 47 63
$$ packed form
2972B8k31P2K02j94J45m0q4P2J30j86J01r1J46m1P3%q8m1O0J14pNj08R8j51J24
2998A08lm4m1L5K6J5j18o5K71j34L8j88J54K8k1P0j93K73n7L4j98j03%J02J12
3023A01j19Q0l2J30p4j80L6j5m7J93j33QN0o8k0R2o8r3J83j99J53l8k5r1K49j98
3049a25ql7k6J40oK40k83p5K46J9j58K26k20P9j04o1N0P5J71nj29j14P9oL4O8
3075G0m2J40j26r4K1J33Rj51K2LJ78j43l9Q3O4j55R5k8J13k4k26R4J87j89K47
3100B42j59j41j12J32pJ3N1K9Q2l4q0o6R7j76K13j33K5p5R6M6q4J88r1j16m2K59
3126A57j46j1q6K02j54l0Q8j35R4N5j9J0j45L9Q6j12m9R5M8j83P3k3Q6l6n0O0
3152h6k8J35k39J53OJ57m0l8OJN2k3M1Q0k00L4pl0J04Kj40R3k4k5k2J00K1l6J6
$$ plain form
3181 63 78 102 23 87 4 -32 -69 -12 56 -109 183 79 13 9 31 71 -28 -31 163 86 -161 85 -6 78 117 -44 40 38
3209 38 -56 110 -4 -58 4 -154 27 -35 -259 -163 -168 -64 -245 50 -190 -66 100 -17 4 -158 -34 32 -100
3232 -100 -188 2 -70 18 166 -70 58 -126 55 -14 18 -120 -89 -108 -140 37 -102 -174 39 -25 107 205 -143 -89
3256 -89 16 180 -18 87 34 112 75 -31 77 153 46 99 98 99 43 -26 94 1 128 8 289 -123 -68 27 113
3281 113 -17 75 7 58 -161 10 -20 181 -82 -4 202 82 -6 10 -158 23 94 -115 -73 -40 -76 -70 -78 -69 -60 -77 57
3308 57 37 -188 -28 22 1 -134 74 -46 -133 -53 -39 -137 -99 -12 -68 -55 37 -43 11 -6 -111 -70 -21 113 -265 -33
3334 -33 -102 135 71 163 117 -128 83 45 104 -53 -54 88 -102 104 96 98 14 64 154 -21 58 91 163 -31 -43 -57 170
3361 170 94 -16 89 121 -43 40 -10 -5 37 127 10 -108 165 293 5 48 71 105 25 3 106 -55 134 -5
$$ packed form
3181F3J5K4p9O4q3l6l7N7O8j65K92j04o6mK2M0r9lJ94p7k47K46r1Q4L9j61Q4k
3209C8r4J66j14n4O2j58J81o2k24R6nJ04j81K95k40J24J66j17K1j62J24O6j32
3232a00q8J90p2Q8J48k36J28j84J81o9L2j38L1j9l2J77j39p2K13o4J32R8l48N4
3256h9J05J64j98J05n3P8l7j06J08P6j07N3jJn6o9J20r3J27j20K81m12N5R5Q6
3281A13j30R2o8N1k19J71l0K01k63P8K06j20q8J6j68J81P1k09M2L3l6OqRRj7J34
3308E7k0k25J60N0k1j35K08j20q7Q0J4r8L8Q7n6J3R2q0N4j7j05M1M9J34l78K32
3334c3o9K37o4R2m6k45K11l8N9j57jJ42j90K06qKq4N0R0j75P9L3P2j94j2j4K27
3361A70p6j10J05L2j64Q3n0NM2R0j17j18K73J28k88M3K3L4q0k2J03j61J89j39
$$ plain form
3385 -5 -107 -20 46 -9 -70 136 -145 44 34 27 31 -56 -136 145 -88 14 -130 -14 -87 154 -193 -21 18 27 -74 -148
3411 -148 -47 -98 -228 -112 -111 -141 56 6 56 22 63 -41 29 -9 82 -23 -5 -28 103 60 70 54 -76 51 121 104
3437 104 -72 67 114 -23 55 90 19 -18 108 69 -34 -53 96 10 21 -92 178 137 -106 16 3 -163 -48 55
3461 55 66 -10 91 -39 12 84 181 157 -34 245 23 124 -53 237 31 -23 -3 -9 -12 73 -38 -49 -107 121 171 -36
3487 -36 97 -8 -8 -161 -2 80 20 -109 -56 -203 97 33 -89 -11 -11 -59 -110 -74 101 -56 -94 -141 -69 126 -12
3512 -12 60 -97 -26 -75 -80 67 -96 191 45 106 -55 30 -70 -3 -36 -29 41 -146 -60 17 -14 -85 76 75 149 47 -38
3539 -38 -78 44 -43 -178 58 -25 -5 -73 32 48 245 -178 6 218 -13 132 -72 50 -26 18 -62 -59 27 85 87
3564 87 -76 -57 -33 -177 -112 -16 -132 -171 -25 113 -32 -120 55 -34 -84 60 30 -25 78 -115 -107 -29 -17 -74 -109 110
$$ packed form
3385ej02Q7O6n5o1K06k81J89j0pMq7q0K81k33J02j44J16p3K41l47J72L9Rj01p4
3411a48J01n1j30J16Jl0J97n0N0l4M1j04P0l8R1j05J8k3J31m3J0j6j30J27P0j7
3437A04j76J39M7j37P8L5p1l7J26l9j03j9J49q6J1j13K70m1k43J22j3j66J15J03
3461E5J1p6J01j30N1P2R7k4j91K79k22J01j77K90k06n4K0olQ5j11j1n8K28N0k07
3487c6J33j05%j53J59Q2o0j29N3j47L00o4j22P8%m8n1L6J75j57l8m7P2J95j38
3512a2P2j57P1m9nJ47j63K87j46O1j61Q5j00O7l3PP0j87Q6P7l1p1J61jP4j02q5
3539c8m0J22q7j35K36q3K0o8J05J6J97m23J84K12k31J45k04J22p6M4q0LQ6N8K
3564H7j63J9K4j44O5R6j16l9J46J38j45q8J75q9n0J44l0n5J03j93QP8J2n7l5K19
$$ plain form
3590 110 -72 -109 10 -107 -45 -2 -148 64 -185 60 -85 5 5 98 -80 197 2 49 12 16 -20 102 72 13 -185
3615 -185 41 155 -96 41 59 2 -35 117 11 60 -33 -56 -24 15 -32 128 21 113 21 54 -62 89 -31 -11
3639 -11 -107 95 -167 47 18 62 -34 69 85 -170 -86 88 -42 -30 56 -61 -43 55 -153 14 -83 -163 -31 11 169
3664 169 100 10 -18 -33 -30 -55 -48 108 35 -10 -92 -84 -79 -152 -52 78 -68 -37 -6 -52 -45 -8 -35 -88 -95 -81 -169 79 157 -19
3694 -19 69 101 130 -125 -145 -66 -42 68 -86 20 163 -65 45 167 108 -20 32 116 -39 -25 87 -24 -1 211
3718 211 50 6 12 -41 94 -13 -66 62 -26 -31 20 87 60 33 3 -82 -111 -55 1 -61 12 -32 -32 -34 -25 23 -52 24 107 35
3748 35 -57 96 146 -54 29 -134 10 236 -1 39 -138 78 -36 -119 -107 42 -173 59 -138 2 -75 -71 -128 -158
3772 -158 134 -135 -57 -57 -89 23 -97 12 -189 8 -39 -49 44 -90 -17 110 -60 -45 -81 -174 145 28 -154 30
$$ packed form
3590A10j82l7J19j17O2M3j46K12k49K45j45R0%R3j78K77j95M7l7Ml6J22l0n9j98
3615a85K26J14k51J37J8n7l7J52j06M9r3k3L2L9m7J60j07R2r2L3j16J51j20K0
3639a1r6K02k62K14k9M4r6J03J6k55Q4J74j30J2Q6j17J8R8k08J67r7q0J32M2J58
3664A69o9r0k8j5Lk5PJ56p3m5q2QNp3J00J30j46L1L1m6PL7k7n3pJ4q8K48P8j76
3694a9Q8L2K9k55k0P9K4J10j54J06J43k28J10J22n9j28N2Q4j55J4J12j11K3K12
3718B11j61m4On3J35j07n3J28q8nN1O7k7k7l0q5k9N6N6o2P3m4%kRM8p5P6Q3p2
3748C5r2J53N0k00Q3j63J44K26k37M0j77K16j14q3J2J49k15K32j97J40p7Mn7l0
3772a58K92k69P8%l2J12j20J09k01J97m7j0R3j34P3J27j70J5l6r3L19j17j82J84
$$ plain form
3796 30 -61 81 -78 126 -63 -34 -26 209 -51 4 95 47 93 229 159 -13 66 8 32 182 120 -20 82 5 178
3821 178 113 118 1 64 30 -1 -73 94 -36 2 -34 -100 -74 319 -94 -101 -80 -174 14 113 -118 -118 2 -97 -90 70 -29
3848 -29 -88 54 27 50 -14 123 -113 -64 -60 188 1 -112 -12 187 -179 28 27 -51 9 -61 -71 -35 102 -67 106
3873 106 43 78 -93 -75 44 41 -152 -74 97 -104 0 -133 -62 67 17 23 62 76 155 199 71 133 -111 -50 -39 58
3899 58 190 148 6 184 -199 80 73 -17 -107 209 41 57 64 203 96 63 -14 -38 -55 35 -19 51 -41 -23 48 -56
3925 -56 38 -19 90 39 -107 127 -5 70 -56 -87 -134 121 156 -149 -218 103 64 -214 -60 -46 50 6 -148 49
3949 49 -46 82 147 121 -73 45 91 -69 -30 204 -118 -46 68 -54 -130 28 97 188 2 -44 25 -128 75 -157
3973 -157 76 25 -114 -86 36 59 -6 81 -64 67 156 -91 216 89 33 32 17 -25 -19 4 35 52 41 -51 49 169
$$ packed form
3796C0r1J42j59K04j89K9QK35k60N5R1m8M6J36p0j72P9n8K4J50o2j40J02p7J73
3821A78o5Nj17O3l4l1p2J67j30L8l6o6K6L93m13pK1r4J88R9k31%J20r9PJ60r9
3848b9n9J42k7K3o4J37k36M9MK48j87j13J00J99l66K07jp8O0p0j0L6J37j69J73
3873A06o3L5j71J8J19lj93P8J71k01J04j33P1J29n0OL9J4P9M4j28O2k44O1J1R7
3899E8J32m2j42J78l83K79pr0r0L16j68J6PJ39j07l3p7k4j7R0n4P0r2J8P1j04
3925e6R4n7J09n1j46K34j32P5j26l1m7K55L5l05o9L21l9k78J54J4R6m4j54J97
3949D9r5J28O5k6j94J18M6j60L9K34l22P2J14j22p6J58O9R1j86m6O9j53K03k32
3973a57K33n1j39K8J22K3o5Q7j45J31Q9k47L07j27n6jj5m2OK3L1J7j1r2J00J20
$$ plain form
3999 169 22 -72 25 96 137 -91 8 -66 27 55 128 142 -54 -65 0 -96 -85 170 -215 279 -140 86 60 -56 -115
4024 -115 -136 143 -147 -21 -15 -274 2 2 -100 8 -105 -128 -133 -2 -80 -17 5 -66 -157 52 64 -57 33 -64 -40 43
4050 43 12 39 34 88 -10 -51 -172 7 8 -20 1 -38 -45 -8 -33 -166 -122 -24 -48 -115 -33 247 66 121 -31 48 -8 -64 206
4079 206 118 -63 89 26 45 149 -77 -129 34 102 206 52 56 13 -52 38 33 32 97 -102 -29 -89 95 153 -131 167
4105 167 122 128 26 190 83 -12 119 -41 14 -178 1 -16 184 109 -53 -51 -108 -63 -58 -84 -21 -55 -3 94 -50 -79
4131 -79 156 72 -38 2 -61 -42 -177 -57 -33 117 20 169 -51 -37 -68 88 5 -72 88 -92 -203 116 8 59
4155 59 -49 -43 116 81 126 265 101 -162 3 31 33 96 124 59 -11 44 38 13 41 19 166 -17 -32 157 -88 -31 -70
4182 -70 -69 -10 12 -9 -83 17 -19 23 -36 -5 -109 65 -148 -89 47 160 160 -18 -5 71 34 -137 45 -116 -9 -15
$$ packed form
3999A69j47r4R7P1M1k28R9p4R3K8P3J4j96j1O5r6J1K55l85M94m19K26k6j16n9
4024a15k1K79k90J26Ok59K76%j02J08j13k3nJ31p8O3K2p1r1K09J2j21R0r7K4Q3
4050D3l1K7nN4r8m1j21J79Jk8K1l9pL7k5j33M4R8k4o7Q2K80j81N5j52P9n6n6K70
4079B06q8j81J52o3J9J04k26n2J63O8J04j54Mm3o5R0njO5j99P3o0J84N8k84K98
4105A67m5Oj02J64j07r5J31j60N5j92J79j7K00p5j62Kn7M5Nk6O3l4N2R7j44k9
4131g9K35q4j10M0o3J9j35J20K4J50r7J49k20J4l1J56q3p7J60j80j11L19j08N1
4155E9j08OJ59l5M5J39j64k63J65K8KO3K8o5p0N5ok5K8k2J47j83j5J89k45N7l9
4182g0JN9K2k1p4J00l6M2n9L1j04J74k13N9J36J13%j78J3P6l7j71J82j61J07o
$$ plain form
4208 -15 -77 74 64 -86 -57 -150 83 -82 -114 15 5 71 -88 -109 -111 -50 -125 82 -12 90 -79 108 -6 165 -46
4233 -46 -41 -82 -9 72 -24 -259 88 189 -94 74 69 23 -2 -4 -95 -48 -136 -1 26 140 128 78 -87 15 43 200 -1
4260 -1 110 -54 -6 -61 147 17 -11 -81 -29 -111 14 55 -91 63 -30 -22 30 -34 -22 -33 46 125 -62 -94 90 114 -74
4287 -74 -136 -51 8 -26 57 -84 -41 -327 -22 -60 65 52 -176 -103 5 25 -32 99 -11 76 45 -170 32 18 -82
4312 -82 22 -38 -2 -17 188 32 19 -63 -60 -65 14 21 -48 -36 -18 -68 41 2 -1 -95 -65 -146 -96 1 54 30 86 -37 54 31
4342 31 -45 17 -98 2 44 42 49 -24 85 62 82 -56 92 -106 -23 -101 21 104 -58 -15 -33 5 11 241 60 -15 127
4369 127 -55 -52 48 12 87 21 22 -89 -60 -4 85 24 74 -18 -50 21 -1 95 -42 6 -66 -42 198 -116 -107 218 -53
4396 -53 -142 -198 -19 64 -78 -38 51 85 143 -31 -68 87 54 -86 -125 -89 -107 63 30 -53 -271 129 135 -72 39 90
$$ packed form
4208a5o2J51j0j50K9r3K33j65l2J29j0O6j59k1kO1p5K07r4J02j69J87j14J71k11
4233d6Nm1P3Q1r6k35L47J01k83J68nm6k5kr1M7q8J35K7J14j2n0j65J02K8J57k01
4260aJ11j64M8n5K08j30k8p0N2q2J25M1j46J54r3QN2o4J2j1P9P9j87l2J84K4j88
4287g4o2Q5N9l4Q3j41M3k86L05l8J25j3k28P3J08K0n7J31j10Q7l1k15K02j4j00
4312h2J04o0L6j5K05j56j3q2LnP9Po9J2J8n0J09l9lr4L0q1N0R7N3k4N6j23R1k3
4342C1p6O2j15J00M2kPp3J09k3K0j38J48j98Q3p8J22Q3j62M3j8L8OK30j81p5J42
4369A27j82LJ00l6P5o6Jj11K9N6Q9o1N0r2l2P1k2R6j37M8p2K4K40l14RL25k71
4396e3q9n6J79Q3j42M0Q9L4N8j74l7J55l3j40l9L6j8J70l3q3k18M00Ok07J11N1
$$ plain form
4422 90 -88 -190 -58 -123 1 -139 -176 144 -7 -66 76 -124 -129 -37 112 113 105 170 -64 -22 -15 -29 24 26 60 51 41 120
4450 120 119 8 -168 80 61 -13 64 61 139 47 31 -54 -61 13 7 -1 2 71 106 -50 -146 171 30 -80 -117 23 -34 21 158
4479 158 -23 -82 -81 -16 -81 7 3 -71 -65 -167 -131 25 6 -238 -158 -50 -92 -47 118 196 62 -95 49 187 40 14
4505 14 -41 136 7 -20 117 -84 109 9 38 -95 -158 -14 74 -35 90 -16 -24 -49 72 -214 212 -21 157
4528 157 -43 -23 45 -88 -34 -102 -64 17 -14 -12 -28 141 -26 63 -26 95 -136 45 234 101 70 3 3 39 127 5
4554 5 -165 -5 -113 55 29 32 6 -36 -10 2 -20 25 -74 -75 -133 32 -43 71 54 24 -74 -35 -93 121 19 -70 -176
4581 -176 -135 36 -52 -61 -130 -82 -98 -154 48 4 -30 64 -119 195 6 -70 -75 74 180 12 46 -114 -14 -69 36
4606 36 -82 -142 53 -95 7 44 -111 139 121 -37 61 50 -64 -21 32 -24 -11 187 -53 -11 143 -135 -235 24
$$ packed form
4422I0j78j02J32o5J24j40l7L20j51n9J42k00nR2J49JqO5k34M2Pj4N3KL4rj0P9
4450A20jj11j76K48j9p4P7lP8r2j6q5pP4oqLO9L5j56r6L17j41j10l7J40n7N5J37
4479A58j81n9JO5o5Q8mp4Oj02L6J56j9k44Q0J08m2M5J65P8j34j57J44J38j47k6
4505A4n5J77j29k7J37k01J93j00K9j33o3J44Q8j09J25j06qk5J21k86M26k33J78
4528A57k00K0O8j33N4o8L8Q1l1Kj6J69j67Q9q9J21k31J81J89j33l1o7%L6Q8j22
4554Ej70J60j08J68k6Lk6m2K6J2k2M5r9jn8J65p5J14j7l0r8L9n8K14j02q9j06
4581a76M1J71q8ro9M8j6n6K02m4l4R4j83L14j89p6nJ49J06j68L4j60J00n5J05
4606C6j18o0J95j48J02L7j55K50j8j58R8j1j14M3N3n6J3J98k40M2J54k78j00K59
$$ plain form
4630 24 65 54 53 83 -41 32 58 124 -32 -17 168 -72 -47 -62 43 101 110 -161 -25 -149 -41 4 -52 -65 95 35
4656 35 -9 -130 -4 166 74 -4 -152 -133 -138 -43 -99 19 -118 142 -43 -102 81 -264 -91 91 -178 38 -49 -148
4680 -148 -30 7 86 -49 -62 -54 -149 25 24 16 77 0 -122 31 99 -40 162 -146 -95 -78 39 65 6 134 76 21
4706 21 2 107 99 -155 -93 58 -63 236 101 159 -73 -112 175 -170 97 200 -129 -13 46 153 -102 66 -60
4729 -60 118 -139 -73 -12 156 57 -121 38 52 304 102 9 19 68 -18 87 4 109 90 63 -40 -188 -68 77
4753 77 112 -10 -40 -10 -162 5 12 -63 -60 56 -207 27 79 -85 -70 -137 -44 1 -67 -35 166 47 -17 14 34 9 166
4780 166 -36 -31 -8 121 114 -11 34 -8 96 44 -116 -27 174 70 62 163 -87 -25 55 -55 69 59 8 128 -49
4805 -49 52 39 24 48 155 244 186 -35 31 -46 128 28 -142 51 110 122 -41 120 9 4 -126 19 -22 158
$$ packed form
4630B4M1j1jL0j24P3K6O6j56J5J85k40K5j5J05N8Rk71J36j24J08M5n6j3J60o0
4656C5m4j21J26J70r2p8j48J9nR5n6J18j37K60j85n9J83l45J73J82k69K16q7r9
4680a48J18L7P9j35j3Qr5J74jqO1p7j22J53O8j39K02l08N1J7J17K6n9J28n8n5
4706B1j9J05qk54O2J51j21K99j35N8k32l9K87l45K67J03l29J16N9J07k55J68j26
4729f0J78k57O6O1J68r9j78J59J4K52k02r3J0M9q6J05q3J05j9k7j03j48J20J45
4753G7L5j22l0L0j52J67Pp5LJ16k63K34N2j64J5o7R3M5o8L2K01j19o4L1K0k5J57
4780A66k02NK3J29pj25M5m2J04n2j60Q9K01j04qJ01k50O2Q0j10J24j0n1J20j77
4805d9J01j3j5K4J07Q9n8k21O6p7J74j00j70J93N9J2j63J61j11nj30J45m1J80
$$ plain form
4829 158 33 2 101 -52 -145 117 -37 68 204 41 -110 -40 -112 68 33 -31 5 127 -33 57 -43 -24 -120 -216
4853 -216 -15 25 4 -4 -53 -88 8 13 -83 -133 -11 -125 -107 -168 -43 6 56 -50 -129 -240 -74 7 4 185 -18 -25 -82
4880 -82 -15 -3 119 88 78 -79 94 147 -5 -102 -81 124 139 77 -135 76 211 173 157 79 13 78 112 113 -89 -96 93
4907 93 -87 42 -135 -37 186 -33 -44 -19 -161 36 44 -18 113 16 95 1 -22 -20 119 -81 14 139 227 -32 28
4932 28 -259 -40 -18 55 65 -159 31 -152 -120 -72 -7 -32 -167 58 -198 -96 31 -75 42 -66 56 138 44
4955 44 -187 -27 -251 72 -23 81 -8 -26 -49 -4 148 -22 143 6 -40 -104 218 19 -258 59 62 82 37 30 29
4980 29 20 -65 173 108 220 -6 9 -80 45 23 11 -30 -82 37 -70 -37 105 -5 89 281 -39 -20 -48 -212 20
5005 20 44 37 -28 -96 -29 48 74 106 13 -12 29 -46 59 128 21 -244 -42 12 38 -41 2 -96 -246 -147 -239 50 97 -149
$$ packed form
4829A58j25l1R9j53r3K62j54J05J36j63j51P0p2J80l5o4L6J22j60R0j00J9r6r6
4853b16K01M0k1qm9l5R6Nr6n0J22j14J8o1J25M9N0j06p9j11J66Q1lJ81k03pn7
4880h2O7J2J22l1j0j57J73N3j52r7K1K05J5o2k12K11J35l8j6p8o6O5L4Jk02pJ89
4907I3j80J29j77R8K23k19j1K5j42J97Qo2J31r7P9r4k3KJ39k00R5J25Q8k59O0
4932B8k87K19K2P3J0k24J90j83L2M8O5k5j35K25k56J02J27j06J17j08J22Q2r4
4955D4k31J60k24L23r5J04q9j8k3M5J52j70J65j37m6o4L22j99k77L17LK0m5pj
4980B9rq5K38o5J12k26J5q9J25k2j2m1n2J19j07L3J42j10R4J92l20J9k8j64K32
5005B0K4po5o8O7P7K6L2r3k5M1p5J05O9j07k65K02N4K6p9M3r8j50R9r2K89M7k46
$$ plain form
5033 -149 -4 75 36 -27 20 20 -90 136 -23 148 131 -54 -144 89 -8 -161 162 -135 49 -46 -101 -58 55 -128
5057 -128 -39 106 105 -10 30 -105 145 40 59 -41 21 108 139 67 -27 -52 49 72 193 -55 -173 -30 -27 -150 -110
5082 -110 84 -5 -11 -40 72 -3 8 -36 14 86 94 -31 -20 -30 -98 -60 130 -12 21 19 -34 -111 128 -36 6 -7 -107
5109 -107 -25 168 -145 -133 4 -226 -38 12 -27 -137 -101 -37 149 42 61 -108 -24 -14 170 -77 25 55 -193
5132 -193 -211 57 17 30 -57 -229 -56 89 -52 -196 -50 42 96 -120 -120 -121 12 10 105 -61 -118 -86 68 -90 -63
5157 -63 70 -107 28 -6 139 116 11 -19 62 22 9 74 287 74 -25 88 38 13 80 -105 13 130 42 -27 -51
5182 -51 -19 -128 139 -119 -122 40 -81 91 25 19 3 -73 13 -30 -73 -58 23 62 5 -73 -129 -4 -49 66 -74 -19 -26
5209 -26 -64 -16 -156 -25 -51 79 3 32 -126 7 -64 -133 49 -211 -5 97 44 71 -29 -92 25 43 137 76 -6
$$ packed form
5033a49J45P9l9o3M7%j10K26j59J71j7j85r0K33r7j53L23k97J84r5n5M3J13j83
5057a28Q9J45jj15M0j35K50j05J9j00O2Q7L1p2r4k5J01K3J21k48j18J43Lj23M0
5082a10J94q9ok9J12p5J1m4N0P2Qj25J1j0o8L8J90j42L3kn3p7K39j64M2j3j00
5109a07Q2J93l13J2J37k30J88N0l9j10L6O4J86j07J9j69Q4J0J84k47J02L0k48
5132a93j8K68m0J3q7j72J73J45j41j44J46R2N4k16%jJ33kR5j66n7L2J54j58K7
5157f3J33j77J35l4J45k3j05l0Q1m0j3O5K13k13r9J13n0k5O7j85J18J17q8o9k4
5182e1L2j09K67k58lJ62j21J72o6oj6p6Q6m3m3J5Q1L9n7p8n6J25m5J15j40N5p
5209b6l8M8j40J31k6J30p6K9j58J33p1o9J82k60K06J02n3K7j00o3J17J8R4o1q2
$$ plain form
5234 -6 104 -111 2 -23 105 72 8 -65 134 209 -14 200 19 -40 16 28 87 100 -111 96 4 60 104 -18 189
5259 189 14 55 156 219 -70 30 210 8 4 83 70 -85 7 -32 60 71 -44 -90 23 -39 -54 50 -90 -92 -38
5284 -38 199 98 59 -163 -38 183 -136 49 -180 35 88 -114 44 -12 24 28 12 107 -172 49 126 9 -68 67
5308 67 -67 71 120 104 -176 -41 31 102 -29 0 -79 105 -60 -64 -128 -50 -91 -9 38 -120 31 -29 48 119 1 62
5334 62 96 101 158 148 -32 -192 -36 -27 76 16 -137 -151 40 77 -74 43 113 34 -50 112 91 78 -93 17 123
5359 123 -16 37 199 -35 -92 -105 -55 -69 -56 54 -70 37 37 -59 -87 -97 37 124 102 -49 -144 -41 12 146 -73
5384 -73 75 -133 32 -33 -6 85 -42 182 -85 97 48 -89 -45 99 25 12 -169 -113 66 -177 -71 -118 127
5407 127 3 -37 -14 -36 61 -109 -89 115 98 -97 -12 -63 -57 -118 32 -129 -139 199 141 99 -124 25 -24 -41 -44 -46 13
$$ packed form
5234fJ10k15J13k5J28l3o4p3J99P5k23K14j81n9N6J2N9J3k11K07r2N6M4j22K07
5259A89j75M1J01O3k89J00J80k02mP9j3j55R2l9R2J1j15m6J13o2j5J04j40kN4
5284c8K37j01l9k22J25K21l19J85k29K15N3k02J58n6L6Mj6R5k79K21P7j17p7J35
5308F7j34J38M9j6k80J35P2P1j31K9p9J84j65mo4P8m1Q2M7j58J51o0P7P1j18O1
5334F2L4NN7j0j80j60J56RJ03o0j53j4J91L7j51J17P0p9q4J62k1j3j71J10J06
5359A23j39N3J62k34n7j3N0j4J3J10j24J07%r6k8j0J34Q7k2j51r5J03N3J34k19
5384g3J48k08J65o5K7R1j27K24k67J82m9j37M4J44p4j3j81N6J79k43J06m7K45
5407A27j24m0K3k2R7j70K0K04j7j95Q5n1Oo1J50j61j0L38n8m2k23J49m9j7lkN9
$$ plain form
5434 13 256 -37 44 -18 11 133 -39 109 29 111 122 2 65 -138 103 5 -99 89 87 -8 25 211 139 81 -8
5459 -8 4 56 -35 149 44 -53 -159 -71 -142 -43 -55 -125 16 -162 27 -38 -154 -69 32 65 66 132 193 -52 -7 -201
5485 -201 -39 193 -35 -48 -72 20 40 20 28 155 -27 -4 3 -95 -55 101 70 -36 -84 -70 -39 -77 41 67 97 -33
5511 -33 117 116 -79 130 108 -39 -19 -58 280 -11 -1 67 -179 146 118 226 -74 34 1 166 -25 -130 -49 -19
5535 -19 51 191 50 81 -58 97 -32 -74 -25 -89 100 47 100 8 -31 -60 197 -15 -94 16 59 -6 32 84 79 153
5561 153 34 74 -92 -133 38 27 0 51 -88 -20 -71 60 -4 -109 -37 -59 -25 -195 -94 -21 -186 60 4 -112
5585 -112 71 23 52 26 77 -61 -121 31 170 -27 33 11 -84 -71 -86 105 -127 4 -26 24 -102 70 140 143 188
5610 188 128 -15 33 127 -107 35 57 -111 -17 37 164 80 -80 112 200 156 39 131 49 22 -109 85 -30 -32 57
$$ packed form
5434A3K43k93Q1o2K9J22j72J48q0Q2J1j20O3k03K41r8j04J88kr5L3J86p2n8q9
5459hJ2N2r1J84j05r7j06Q8p1R9j2p0J41j78J89o5j16Q5J01L3JO6O1k45M5j94
5485b01J62K32k28j3k4R2K0k0QJ27j82K3Pr8M0J56l1j06m8J4L1l8J18K6L0j30
5511c3J50jj95K09k2j47K0l9L38k91J0O8k46L25k8J08l00J08l3J65j91j05Q1L0
5535a9P0J40j41L1j39J55j29m2M9o4J89n3N3r2l9k9K57k12p9J10M3o5L8N2nP4
5561A53j19M0j66m1J71j1k7N1j39O8n1J31o4j05P2k2L4j70J01P3j65K46n6j16
5585a12J83m8K9k6N1j38o0J52J39j97O0k2r5J3j5J91k32J31l0N0j26J72P0LM5
5610A88o0j43M8R4k34J42K2j68R4N4J27q4j60J92Q8m4j17R2q2k7j31J94j15kQ9
$$ plain form
5635 57 135 -71 55 19 99 -130 -84 184 -290 -138 -217 122 -66 -8 146 53 163 -60 -112 2 183 -35 -42 116
5659 116 -52 13 15 134 -4 -69 52 49 -47 275 -63 -26 105 57 21 78 -163 55 73 -50 4 149 14 40 -19
5684 -19 -51 -41 -61 228 0 -61 124 -151 139 121 51 -45 -118 -31 -41 -82 -60 -86 76 22 126 -97 -91 40 31 -51 19
5711 19 90 28 -146 -91 -67 147 -125 -30 67 144 157 11 33 28 112 52 58 106 -21 -39 103 37 37 -195 -43 -90 -25 -36
5739 -36 -48 -111 -137 2 -70 -6 42 -50 -44 83 -54 102 -134 -93 43 -15 7 -45 237 -41 -22 -61 -55 -122 27 -24 -82
5766 -82 99 -71 49 87 120 -48 30 54 -40 131 50 74 -78 -23 9 35 44 52 105 54 51 36 -59 -14 62 -24 -26 51 -5
5795 -5 -91 30 34 -34 -20 -79 113 48 32 75 138 6 -33 16 -157 -161 1 -30 78 66 35 191 70 -4 -1 -69 45 7
5823 7 72 42 -22 67 -101 55 -23 -81 -11 -96 -4 -43 71 30 -180 32 -93 -125 1 -138 34 71 120 -33 44 20
$$ packed form
5635E7P8k06J26l6Q0k29M6K68m74J52p9L39j88N8J54r3J10k23n2J14J81k18pJ58
5659A16j68O5KJ19j38o5J21lr6L22l38L7J31m8l6N7k41K18J8j23N4J45j35K6n9
5684a9l2J0k0K89k28o1J85k75K90j8p0r6p3Q7j0m1K2k6J62n4J04k23OJ31rq2P0
5711A9P1o2j74N5K4K14k72R5R7P7J3j46K2nQ4o0OM8j27j8J42o6%k32J52m7O5j1
5739c6j2o3k6J39p2O4M8r2OJ27j37J56k36M1J36n8K2n2K82k78J9l9Oo7J49n1n8
5766h2J81j70J20L8L3j68P8K4r4J71q1K4j52N5L2K6RQN3n1lj5r5M5P6q6kP7n6
5795eq6J21Mo8J4n9J92o5j6M3O3j32l9M9j73mJ62l1J08j2l1J56j21p4Lo8J14l8
5823GO5l0o4Q9j68J56p8n8P0q5R2l9J14m1k10K12j25l2J26j39J72L7M9j53P7k4
$$ plain form
5849 20 -146 -88 117 -43 -78 1 16 94 -125 -162 -152 -78 -2 76 60 119 66 110 40 -1 7 55 -67 143 -121 -40 170
5876 170 30 72 156 -20 193 103 128 -54 -251 73 170 47 154 -196 85 60 262 45 8 15 -68 -124 -25 18
5900 18 144 70 -118 -58 91 -50 -102 -133 -27 109 -92 -119 171 100 -4 65 -57 44 -12 35 -97 146 86 -69
5924 -69 -160 -175 87 21 -72 -48 34 114 16 -6 -74 95 -183 -79 11 99 19 8 51 -18 122 -44 63 53 93 -42
5950 -42 -84 -103 16 -78 15 80 91 -19 88 171 172 139 -114 36 46 41 -98 5 27 -17 -7 98 107 -62 -81 4 -37
5977 -37 -109 55 -143 20 31 -19 -103 59 119 165 200 29 98 -9 22 -81 35 -31 -36 105 -45 -49 -44 -2 2 153 -103
6004 -103 31 -122 -13 -23 -86 62 -23 -32 -23 -10 -62 -76 19 -22 -46 21 141 85 -100 180 -15 85 -89 3 -44 -87
6030 -87 -23 49 -104 -142 174 -207 73 -108 54 -4 -65 21 101 81 80 117 28 -27 -6 170 41 -47 -48 -4 -67 27 126
$$ packed form
5849B0j66N8K05j60l5P9J5P8k19l7J0P4P6P8j6N9n3M4p0m1QM8j22K10k64Q1K10
5876A70j40M2Q4j76K13r0K5j82j97L24R7j23J07l50K81k5K02k17l7Pq3n6R9M3
5900A8J26p4j88O0J49j41n2l1J06J36k01k7K90p1j04O9j22J01n6M7j32K43o0j55
5924f9r1j5K62o6r3K4Q2Q0r8k2o8J69k78J04R0Q8q0j1M3o9J40j66J07j0M0j35
5950d2m2j9J19r4R3O5J1j10J07Q3Jl3k53J50J0nj39J03K2m4J0J05Rj69j9Q5m1
5977c7p2J64j98J63J1n0q4J62O0M6L5j71O9j07L1j03J16o6nJ41j50mNM2MJ51k56
6004a03J34j53J09j0o3J48q5rRJ3n2j4R5m1k4O7J20n6j85K80j95J00j74R2m7m3
6030h7O4P2j53l8L16l81K80j81J62n8o1Q6Q0k0jL7q9n5K1J76j29q8jM4o3R4R9
$$ plain form
6057 126 -196 109 63 207 3 73 29 -59 -43 132 -26 -58 -39 -44 99 -72 194 76 6 23 110 196 -115 -142 -9
6082 -9 -28 151 -258 4 -24 35 -40 -119 -43 31 -70 -158 -44 148 92 -112 58 59 88 101 134 16 107 54 -122 -22
6108 -22 -42 -132 -63 -118 86 -178 -176 -76 7 85 91 -31 -74 -15 -152 76 -78 153 38 -107 -77 42 19 -41 108
6133 108 176 5 90 -55 -7 -13 129 13 53 -7 45 -128 32 121 -24 37 -308 94 265 -145 -22 39 13 79
6157 79 4 27 -239 229 172 3 -10 35 -32 13 -107 13 32 28 34 168 22 4 -12 65 9 99 5 -17 52 -69 5
6184 5 54 -70 -14 -15 43 44 146 -72 61 -83 156 157 -76 -51 -98 -34 -133 5 -277 -17 106 84 -37 -34 62 58 15
6211 15 96 15 -39 74 114 99 1 37 49 -43 27 -31 58 -71 14 64 -87 -10 -100 -55 -161 4 -74 -62 54 63 115 -50
6239 -50 -88 115 -88 11 95 34 -98 15 21 11 -65 14 -99 -33 -8 147 -71 60 -91 30 44 -28 250 -150 20
$$ packed form
6057A26l22L05m6J44k04P0m4q8J6J75j58l2J9nJ43j71K66j18p0J7Q7Q6l11k7J33
6082ij9J79m09K62k8N9p5p9P6P4j01q8J14J92n6k04J70JK9J3L3j18R1n3j76J00
6108b2k0r0O9n5K04k64KJ00Q3P8Oj22m3N9j37K28j54K31j15j45L0J19k3o0J49
6133A08O8j71Q5j45M8oJ42j16M0o0N2j73J60Q9j45O1l45M02J71m10J23O1k6O6
6157G9p5K3k66M68n7j69j3M5o7M5j20J20J9mOJ34j46j8j6P7n6R0r4k2O9j21P4
6184EM9j24N6jN8JJ02k18J33j44K39Jk33K5m7O4r9J38k82K60J23k2j21LR6mm3
6211A5Q1q1n4J13M0j5r8L6J2r2P0n8Q9j29Q5N0j51P7r0M5j06J65p8J2J16RN2j65
6239e0l8K03k03R9Q4o1j32J13Oj0p6P9j13O6K5J55k18J31j51J21J4p2K78m00J70
$$ plain form
6264 20 114 -12 -122 231 -100 -50 -106 124 66 140 -54 77 -162 25 -74 138 -105 -44 -31 -98 -151 -4 -34 95
6288 95 4 -9 153 71 -14 -38 85 44 166 -34 -16 36 -5 39 -73 -28 -15 -107 -8 -48 198 68 -116 45 182
6313 182 20 -75 -3 -8 46 -57 -66 -136 -193 195 -117 -131 159 104 121 -9 13 -17 -53 84 -18 139 0 -37 18 -51
6339 -51 183 134 60 -121 23 109 183 -17 -61 -31 -134 79 6 -21 77 -56 78 27 -69 -170 54 29 -107 27
6363 27 -52 218 -6 110 -18 125 -87 28 -92 -111 -107 -78 -2 -67 62 0 53 5 -127 -56 57 25 -87 -73 81
6388 81 80 2 179 -21 -41 31 37 -54 60 -46 40 -64 66 78 151 -31 -17 -111 34 -90 31 -87 23 150 -101
6413 -101 -15 55 41 -17 7 -76 -80 -183 151 40 41 0 20 87 -38 71 43 0 -40 124 108 78 -32 49 11 50 -93
6440 -93 210 -93 -96 153 -187 -20 -82 -59 67 -31 73 117 -127 -48 64 38 -71 -4 83 28 -10 -114 -144 7 5
$$ packed form
6264B0R4j26j10L53l31N0n6K30n8P4j94J31k39J87r9K12k43O1J3o7n3J47l0J29
6288I5r1j3J62q2q5k4J23m1J22k00J8N2m1M4j12M5J3r2R9m0K46j30j84J61J37
6313A82j62r5P2nN4j03rp0n7L88l12j4K90n5J7j30K2l0l6J37j02J57j39l7N5o9
6339e1K34m9p4j81J44Q6P4k00m4L0j03K13p3k7R8j33J34n1r6j01K24k5j36J34
6363B7p9K70k24J16j28J43k12J15j20j9MK9P6o5J29o2N3m8j32P1J13l2j12J4J54
6388H1jp8J77k00k0P2Or1J14j06Q6j04J30J2P3j82J4r4J45j24J21j18J10J27k51
6413a01Q6P0j4n8K4q3mj03L34j11Jm1K0O7j25J09k8m3m0J64j6l0j10Q1l8L9j43
6440i3L03l03lK49l40J67o2K3J26r8J04M4k44P9J12k6j09O7Q7n5l8j04l0J51k
$$ plain form
6465 5 -36 -85 18 -184 103 -74 -93 13 90 16 40 25 35 -94 -40 47 26 -46 20 113 167 45 47 145 -39 75 75
6492 75 211 251 41 -89 -55 24 -29 -10 154 49 69 43 -50 -111 -2 -240 186 -177 -124 -57 61 -141 -81 -35 -18
6517 -18 1 105 -43 -24 -143 -39 85 100 82 259 -19 147 10 97 23 13 56 -63 -15 -83 5 41 41 97 -57
6542 -57 -21 -9 -40 -73 -289 108 -70 39 131 -4 -31 85 -160 38 6 201 16 -48 12 48 105 70 -50 23 13
6567 13 129 -18 4 -88 -94 -30 -116 -242 27 70 -103 -84 -35 1 -50 -112 36 -52 -81 68 72 67 -35 23 161 73 51
6594 51 -13 89 124 176 137 -56 144 86 56 -151 37 19 -23 -35 -15 28 123 -67 82 72 33 -95 10 12 -83 43
6620 43 -197 -1 3 -125 41 158 65 -52 173 299 86 8 -98 83 -20 -77 -57 -4 101 -54 -171 47 17
6643 17 118 -102 -118 -30 48 -73 -128 -5 -78 8 72 -15 -204 -77 4 0 88 51 -49 -43 56 -37 -106 12 47 -33 -223
$$ packed form
6465Em1m9J03k02K87j77j9J06P7p4K4j5J0j29N4Q7k1p2O6R3N4j22KR8j84J14%
6492G5J36M0k10j30L4P9n3J9J64j05K0k6r3o1J09k38M26l63N3O7J18k02O0M6J7
6517a8J9J04j48J9j19J04J24J5j8J77k78J66j37Q7p4j0M3j19M8o8Q8L6%N6j54
6542e7L6J2l1l3k16L97j78J09R2j35k7J16k45J98l2J95j85o4O0L6N7l5j20P3j0
6567A3J16j47K2r2oO4q6j26K69M3j73J9M9L6n1o2J48q8k9J49Mnj02N8J38q8k2
6594E1o4J02L5N2l9j93K00n8l0k07J88j8m2j2K0M3R5j90J49j0l9j28J05Kr5J26
6620D3k40J96Mj28J66J17r3j17K25J26k13p8j06J81j03n7K0N3J05j55j17K18l0
6643A7J01k20j6Q8P8j21n5J23p3Q6O4q7j89J27Q1mQ8l7j00OR9r3o9J18L5q0j90
$$ [...]
8191a04
##END NTUPLES=NMR FID
##END=
