##TITLE=1H_Pr Am3-Cl
 CD3OD,8 sc, 
 4.02.2021
##JCAMPDX= 6.0         $$ Bruker NMR JCAMP-DX V2.0
##DATA TYPE= NMR FID
##DATA CLASS= NTUPLES
##ORIGIN= UXNMR, Bruker Analytische Messtechnik GmbH
##OWNER= root
$$ XWIN-NMR		Version 3.5
$$ Thu Feb  4 11:32:10 2021 Russian Standard Time (UT+4h)  she@DPX200
##.OBSERVE FREQUENCY= 200.1315066352
##.OBSERVE NUCLEUS= ^1H
##.DELAY= (6, 6)
##.ACQUISITION MODE= SIMULTANEOUS
##.ACQUISITION SCHEME= undefined
##.AVERAGES= 8
##.DIGITISER RES= 18
##SPECTROMETER/DATA SYSTEM= spect
##.PULSE SEQUENCE= zg30
##.SOLVENT NAME= MeOD
##.SHIFT REFERENCE= (INTERNAL, MeOD, 0, 15.7039)
##AUDIT TRAIL= $$ (NUMBER, WHEN, WHO, WHERE, WHAT)
$$ ##TITLE= Audit trail, XWIN-NMR		Version 3.5
$$ ##JCAMPDX= 5.01
$$ ##ORIGIN= Bruker BioSpin GmbH
$$ ##OWNER= she
$$ F:/spectra/data/she/nmr/H-F/1/audita.txt
$$ ##AUDIT TRAIL=  $$ (NUMBER, WHEN, WHO, WHERE, WHAT)
(   1,<2021-02-04 11:30:56.87 +0400>,<she>,<DPX200>,
      <created by zg, POWCHK disabled, PULCHK disabled
       configuration hash MD5:
       00 E9 B6 7A A2 85 ED C7 34 08 36 98 17 FE 4E 26
       data hash MD5: 16K
       D1 B2 D9 DB 6E 80 78 83 9F A9 87 4A B6 D9 71 7A>)
$$ ##END=
$$ 
$$ hash MD5
$$ DE CD 5F D4 E3 0D B4 3D EF 24 D8 0B 57 3C 52 41
##$RELAX= 
##$RELAX= 
##$RELAX= 
##$RELAX= 
##$RELAX= 
##$RELAX= 
$$ Bruker specific parameters
$$ --------------------------
##$DU= <F:/spectra>
##$EXPNO= 1
##$NAME= <H-F>
##$PROCNO= 1
##$TYPE= <nmr>
##$USER= <she>
##$AMP= (0..31)
100 100 100 100 100 100 100 100 100 100 100 100 100 100 100 100 100 100 
100 100 100 100 100 100 100 100 100 100 100 100 100 100 
##$AQSEQ= 0
##$AQ_mod= 1
##$AUNM= <au_zg>
##$AUTOPOS= <>
##$BF1= 200.13
##$BF2= 200.13
##$BF3= 200.13
##$BF4= 200.13
##$BF5= 200.13
##$BF6= 200.13
##$BF7= 200.13
##$BF8= 200.13
##$BYTORDA= 1
##$CFDGTYP= 0
##$CFRGTYP= 5
##$CHEMSTR= <none>
##$CNST= (0..31)
1 1 145 1 1 1 1 1 1 1 1 1 1 1 1 1 1 1 1 1 1 1 1 1 1 1 1 1 1 1 1 1 
##$CPDPRG= <>
##$CPDPRG1= <>
##$CPDPRG2= <>
##$CPDPRG3= <>
##$CPDPRG4= <mlev>
##$CPDPRG5= <mlev>
##$CPDPRG6= <mlev>
##$CPDPRG7= <mlev>
##$CPDPRG8= <mlev>
##$CPDPRGB= <>
##$CPDPRGT= <>
##$D= (0..31)
0 1.2 0 0 0 0 0 0 0 0.06 0 0.03 0 0 0 0 0.0002 0 0 0 0 0 0 0 0 0 0 0 0 
0 0 0 
##$DATE= 1612423856
##$DBL= (0..7)
120 120 120 120 120 120 120 120 
##$DBP= (0..7)
150 150 150 150 150 150 150 150 
##$DBP07= 0
##$DBPNAM0= <>
##$DBPNAM1= <>
##$DBPNAM2= <>
##$DBPNAM3= <>
##$DBPNAM4= <>
##$DBPNAM5= <>
##$DBPNAM6= <>
##$DBPNAM7= <>
##$DBPOAL= (0..7)
0.5 0.5 0.5 0.5 0.5 0.5 0.5 0.5 
##$DBPOFFS= (0..7)
0 0 0 0 0 0 0 0 
##$DE= 6
##$DECBNUC= <off>
##$DECIM= 32
##$DECNUC= <off>
##$DECSTAT= 4
##$DIGMOD= 1
##$DIGTYP= 9
##$DL= (0..7)
0 120 120 120 120 120 120 120 
##$DP= (0..7)
150 150 150 150 150 150 150 150 
##$DP07= 0
##$DPNAME0= <>
##$DPNAME1= <>
##$DPNAME2= <>
##$DPNAME3= <>
##$DPNAME4= <>
##$DPNAME5= <>
##$DPNAME6= <>
##$DPNAME7= <>
##$DPOAL= (0..7)
0.5 0.5 0.5 0.5 0.5 0.5 0.5 0.5 
##$DPOFFS= (0..7)
0 0 0 0 0 0 0 0 
##$DQDMODE= 0
##$DR= 18
##$DS= 0
##$DSLIST= <SSSSSSSSSSSSSSS>
$$ [...]
##$SUBNAM2= <"">
##$SUBNAM3= <"">
##$SUBNAM4= <"">
##$SUBNAM5= <"">
##$SUBNAM6= <"">
##$SUBNAM7= <"">
##$SUBNAM8= <"">
##$SUBNAM9= <"">
##$SW= 16.9725356469052
##$SWIBOX= (0..15)
0 0 2 0 0 0 0 0 0 0 0 0 0 0 0 0 
##$SW_h= 3396.73913043478
##$TD= 16384
##$TD0= 1
##$TE= 0
##$TE2= 300
##$TE3= 300
##$TEG= 300
##$TL= (0..7)
0 120 120 120 120 120 120 120 
##$TP= (0..7)
150 150 150 150 150 150 150 150 
##$TP07= 0
##$TPNAME0= <>
##$TPNAME1= <>
##$TPNAME2= <>
##$TPNAME3= <>
##$TPNAME4= <>
##$TPNAME5= <>
##$TPNAME6= <>
##$TPNAME7= <>
##$TPOAL= (0..7)
0.5 0.5 0.5 0.5 0.5 0.5 0.5 0.5 
##$TPOFFS= (0..7)
0 0 0 0 0 0 0 0 
##$TUNHIN= 0
##$TUNHOUT= 0
##$TUNXOUT= 0
##$USERA1= <user>
##$USERA2= <user>
##$USERA3= <user>
##$USERA4= <user>
##$USERA5= <user>
##$V9= 5
##$VALIST= <valist>
##$VCLIST= <CCCCCCCCCCCCCCC>
##$VD= 0
##$VDLIST= <DDDDDDDDDDDDDDD>
##$VPLIST= <PPPPPPPPPPPPPPP>
##$VTLIST= <TTTTTTTTTTTTTTT>
##$WBST= 1024
##$WBSW= 4
##$XGAIN= (0..3)
0 0 0 0 
##$XL= 0
##$YL= 0
##$YMAX_a= 249056
##$YMIN_a= -198616
##$ZGOPTNS= <>
##$ZL1= 120
##$ZL2= 120
##$ZL3= 120
##$ZL4= 120
##$ABSF1= 10
##$ABSF2= 0
##$ABSG= 5
##$ABSL= 3
##$ALPHA= 0
##$AQORDER= 0
##$ASSFAC= 0
##$ASSFACI= 0
##$ASSFACX= 0
##$ASSWID= 0
##$AUNMP= <proc_1d>
##$AZFE= 0.1
##$AZFW= 0.1
##$BCFW= 1
##$BC_mod= 2
##$BYTORDP= 1
##$COROFFS= 0
##$CY= 11.3945322036743
##$DATMOD= 1
##$DC= 2
##$DFILT= <>
##$DTYPP= 0
##$F1P= 15.9154993809931
##$F2P= -4.1035820241983
##$FCOR= 0.5
##$FTSIZE= 0
##$FT_mod= 4
##$GAMMA= 1
##$GB= 0.15
##$INTBC= 1
##$INTSCL= 1
##$ISEN= 128
##$LB= 0.24
##$LEV0= 0
##$LPBIN= 0
##$MAXI= 10000
##$MC2= 0
##$MEAN= 0
##$ME_mod= 0
##$MI= 1.114404
##$NCOEF= 0
##$NC_proc= 0
##$NLEV= 6
##$NOISF1= 3.799351
##$NOISF2= 2.8
##$NSP= 1
##$NTH_PI= 0
##$NZP= 0
##$OFFSET= 15.70392
##$PC= 1
##$PHC0= -10392.27
##$PHC1= -1.399052
##$PH_mod= 1
##$PKNL= yes
##$PPARMOD= 0
##$PSCAL= 0
##$PSIGN= 0
##$REVERSE= no
##$SF= 200.130013532006
##$SI= 16384
##$SIGF1= 3
##$SIGF2= 2
##$SINO= 400
##$SIOLD= 16384
##$SREGLST= <1H.CDCl3>
##$SSB= 0
##$STSI= 0
##$STSR= 0
##$SW_p= 3612.71676300578
##$SYMM= 0
##$S_DEV= 0
##$TDeff= 0
##$TDoff= 0
##$TI= <>
##$TILT= no
##$TM1= 0
##$TM2= 0
##$TOPLEV= 0
##$USERP1= <user>
##$USERP2= <user>
##$USERP3= <user>
##$USERP4= <user>
##$USERP5= <user>
##$WDW= 1
##$XDIM= 8192
##$YMAX_p= 0
##$YMIN_p= 0
$$ End of Bruker specific parameters
$$ ---------------------------------
##NTUPLES= NMR FID
##VAR_NAME=  TIME,          FID/REAL,        FID/IMAG
##SYMBOL=    X,             R,               I
##VAR_TYPE=  INDEPENDENT,   DEPENDENT,       DEPENDENT
##VAR_FORM=  AFFN,          ASDF,            ASDF
##VAR_DIM=   8192,          8192,            8192
##UNITS=     SECONDS,       ARBITRARY UNITS, ARBITRARY UNITS
##FACTOR=    0.0002944,     1,               1
##FIRST=     0,             0,               0
##LAST=      2.4114304,     0,               0
##MIN=       0,             -198616,         0
##MAX=       2.4114304,     249056,          0
$$ Real data points
##PAGE= N=1
##DATA TABLE= (X++(R..R)), XYDATA
$$ [...]
1851c91N08K19l66l45M53J75n24l48N20N48j48m89lL92k13k28M46L60m94k81J1
1872a98N73k46k31O1J75j35m10K60P08p4q02j40O87m4l60Q2L92J46j014j6Q90
1893C04N6k47l74M06J18m78j23P11M0o74l47N02N39l68k27K67J6k23o70Q94M54
1914E76o14j47l4N49l93p0L97L05p18m54M80M75j79j79p9L99l07m13M67M83k93
1935B51p17J23N37J3m74J11O31m16n09L02N74L04q50k8K22j87l67K75O46l19n25
1956d03j47P18L16o09j58N92L8q48K36O54J45p61j82P57q1n28j63P44o5o20o4
1977d29O76K78m56o15M68L75k79l86O50L17m74n63J68O11k39k99K36K52l92j08
1997b09O6N14k0n34O0N21j09o26N48J10j6q84K54O60j29m44qM03k94j76K07O23
$$ y = [-391, 117, 336, -30, -375, 78, 253, -271, -619, -99, 449, 301, -188, -191, 201, -12, -240, 206, 566, 72, -209, -198, 375, 129, -102, -41, 134, -1, -411, -151, 557, 483, -319, -459, 228, 184, -176, -94, 298, 444, -570, -586, 304, 360, 113, -261, 145, 263, -215, -338, 373, 413, -261, -608, -106, 433, 65, -162, 105, 121, -102, -772, 122, 576, -38, -185, -219, 330, -63, -133, 264, 569, -149, -603, -123, 352, 173, -6, -85, 314, 7, -406, 61, 544, 251, -466, -343, 194, 207, -267, -156, 475, 59, -450, -148, 426, 730, -120, -148, 74, -113, -480, -205, 441, 122, -403, -550, 168, 484, -125, -283, 309, 347, -501, -265, 389, 534, -227, -409, 348, 267, -261, -424, 320, 255, -365, -429, 247, 525, 69, -546, -78, 297, 18, -368, 282, 599, 125, -438, -270, 341, 102, -197, 39, 291, -101, -209, -143, 371, 351, -183, -123, 398, 289, -337, 211, 321, 305, -579, -325, 335, 206, -238, -246, 157, -137, -313, -106, 517]
2019E17j55q49RO81n2k39p5M41j26o16K20N51K05o76l4N09l95k56j99R97j91n44
2041b77k33N32L34l59j58O35l34l20j9O37O6n96j87N37k6k73k07L14M67o10k56
2062c33J50L25L7n67M48L85m97m31O68M75m48p20L41N89j77l15q0J36k29l08M12
2083a39O37l35o01J01N02k29j95n7O66p8n25l6K80J98m57l8P00l45k30O8O09j82
2105C14p79J11K71K57k45k57P45J33o49N7J43M92q43K00K08J99m15l79P39K28
2125E30o35l55P07N77j175j72L26O40o22q40J073Q18r61j18N32L5k38l76O25J39
2145E10m88m34M08L9J91o59M45q4K13o96O04L58L0j146O56L02j83k74J07M75j79
2166A95o54J58P03j30m43k54O55J3m69j0L09J30k85k55O45j62k33j19L14K04o57
$$ y = [517, 362, -487, -478, 203, 151, -88, -163, 278, 152, -464, -244, 307, 512, -164, -198, 311, -84, -340, -539, 458, 267, -277, -510, 22, 356, -3, -161, 474, 140, -180, -199, 438, 504, -92, -279, 258, 232, -41, -248, 66, 533, -77, -333, -183, 142, 179, -388, 60, 445, -52, -483, 185, 660, 212, -508, -167, 422, 245, -70, -150, -14, -243, -551, -139, 498, 163, -438, -337, 165, -64, -259, -316, 350, 272, -253, -289, -9, 189, -268, -306, 394, 49, -181, -113, 496, 314, -465, -354, -83, 174, -71, -328, 417, 550, -99, -42, 101, 593, -250, -50, 158, 357, -58, -437, 302, 530, -105, -460, 247, 824, -351, -523, -197, 443, -179, -1019, 54, 872, -89, -207, 325, 360, 122, -254, 371, 510, 22, -412, -4, 35, 226, -433, 12, -72, 141, -555, 49, 407, 437, -709, -53, 249, 66, -208, -101, 374, 195, -459, -301, 402, 272, -171, -425, 230, 243, -226, -236, 73, 203, -82, -337, 308, 146, -87, -206, 108, 312, -345]
2187c45pO62J45n79m85O74J84m39k3L20L05m93n12P17M58l64m80J7N43k86n30
2208e18N35N30l85n08L39N47j84n27P9M27k93m59K76O29l46m62K0N41k42l09k8
2229c38P62l81j78j03L94K19o60J8M02R1o15L93K69J64p04M1N24m2m00J3M04Q3
2251C56n78j10N70Ql43k09O45o2l56r3j4M45o16J86L85N2l54j84M07N62p83o73
2273g59Q87k0k65n40M59L60j46p7J44k94R2j1J02L96k78o32N89k21K49l84L63
2294A4L43k97n67K29M51j13k93J6O93j39o15J28K96K55n58k85N93k17J7l40M46
2315E7K80m96l27P99M3o16J88M9L21l62l7L71l9m60j06L70L22n27nK32L01m69
2337a11k52M57M72o45l77O1K19O61o41K44K73r8j081M98N90k79K64o03J13J14
$$ y = [-345, -352, 310, 455, -124, -609, 65, 249, -190, -213, 107, 412, -81, -593, 124, 582, 218, -262, -245, 298, 12, -518, 17, 547, 162, -346, -7, 540, 356, -171, -92, 335, 42, -417, -141, 488, 142, -320, -300, 241, -1, -310, -338, 424, 43, -135, -238, 156, 375, -285, -267, 135, 226, -389, 4, 273, 437, -267, -226, 298, 256, -144, -131, 273, 356, -222, -332, 238, 246, -97, -306, 339, 277, -79, -172, -186, 259, -357, -171, 214, 266, -88, -272, 135, 697, -86, -759, 128, 108, -157, -697, -238, 122, -24, -101, 43, -251, -159, -170, -68, 328, 50, -582, 7, -214, 35, -349, 14, 357, 60, -507, -278, 173, 60, -233, -217, 476, 337, -278, -150, 146, 401, -157, -442, 151, -66, -49, -389, 57, 337, -159, -486, 313, 356, -260, -72, -23, 298, -64, -101, 270, 231, -229, -335, 35, 357, -170, -175, 57, 358, -111, -363, 94, 566, -79, -456, -395, -176, 485, -156, 88, 361, 263, -818, -320, 270, -9, 255, -348, -235, -121]
2357a21l95O65Q3j40l22k34M20K06n7n39L18j50N30q52M96K85M1p24k87O74J38
2378C5k91K07L12j388R12O77p07k10k86J172l35j14k66j23L41pQ6q61N63J033
2398G50m61l02K31j62n3m21M50j42K05l00N50l73j40M71o14J06Lk72L13l57k23
2419g41P83K93k98k27j28N86rq7l24L09O3l41j29L39j00J0l2%N4j98K72J36k94
2442f3K04l94O94j68m44K27o0Q6p6k36K44K88m23J56j83L1J40l72L09o9K2k2Q0
2465b9O7n5o6%L8qP0l9j30K97j7k52J64l2RJ62l6m7J33k55J92J7k63k0K11j19
2491hK6J0J53j03k89K77R2k62Nl5K47l65K97j51K90l38J33j02J57m0j84j7K72
2514F5p8J63p8j76K9j34K31j40k12N82m92K12P08n51r47P14k77r8J004nq84R92
$$ y = [-121, -516, 149, 232, 92, -230, -464, -44, 162, 105, -434, -116, -266, 264, -588, -92, 193, 234, -490, -777, -103, 35, -256, -49, 263, -1125, -213, 464, -243, -453, -739, 433, 98, -16, -282, -405, -64, -71, 15, -846, -283, 750, 289, -13, 218, 56, 3, -418, 32, -110, 95, -205, 345, -28, -168, 303, -311, -205, -202, -474, -161, -518, -741, 42, 335, 37, -190, -318, 268, 259, 172, -152, 157, 220, -121, -250, 89, -11, -1, -33, -33, 21, -177, 95, 231, -63, 141, -253, 441, 273, -171, 56, -4, 82, 6, -230, 14, 302, -121, 35, -148, -117, 23, -349, -40, -109, -87, -109, -29, 38, -17, -83, -83, -45, -53, 17, -22, -152, 145, 128, -124, 40, 8, 17, 179, 143, 96, 229, -26, 166, 183, -80, -100, 111, -8, 18, 28, 181, 78, -211, 66, 158, -104, -99, -134, 113, -252, 45, -106, 184, -154, -21, -123, 34, -6, -190, -207, 65, -13, 150, 72, -104, -75, -209, 22, -118, -330, 252, -240, -28, 680, 129, -818, -104, -381, -479, 525, 520, -364, 628]
2536F28p66k16J82L00j74m43O76j13k39Rr3J38J46o52L83k50K88m3o7O5L08m71
2558d04R20o84o6K36M67o44o2n76N91L30J55k50o66O48M20j45Jj2n73J5J016p87
2580g0L81K8j39l6n83k13J076n90l87K86P0L90n08N15j94r23k58R88L46k38l38
2601c97M71l7P4p88P12L47j041J119j84j80P3k71O73l04m90J99j04N22l50L43
2621C87l42r8l63J63Q7K03K37o1j26n65j32N72O0m99M81K9j45k84P30o07M74n66
2643c65Q03N0l64k24n1K97k76K99j076Q03k2O3K31jo07P22j32l98M50j4l86L27
2665A29K7q5J9k99J97n8k14K15M2J57l88pK39k3q0M40p9m36k85j01R04j52J42
2688C04Ll03k57M45M3P4j06j10k59K69J06L94O08j325p9P7l01j20P13j61k21K97
$$ y = [628, -138, -354, -172, 128, -46, -489, 187, 74, -165, -156, -249, -111, 35, -617, -234, -484, -196, -239, -306, -241, 67, -404, 516, -168, -234, 2, 469, -175, -237, -813, -222, 108, 263, 13, -653, -5, 415, 270, 271, 259, -314, -299, 717, -70, 311, 339, 200, 164, -419, -632, 444, -146, -533, -247, -177, 213, -295, 220, 26, -897, -1155, -167, 179, -59, -397, 74, 37, 111, -677, 35, 382, -659, 460, 276, 96, 169, -102, 571, 267, -223, -24, -128, 394, 44, 387, 45, -53, -416, -253, -166, 37, 274, 213, 87, -478, -610, -38, 22, -477, 4, 33, -112, -396, 334, -273, 201, -365, 438, 488, 124, -100, -151, 146, -130, 169, -907, -104, -126, -63, 168, 167, -440, 282, 150, -248, 202, 188, -198, 129, 156, 71, 90, -209, -12, -70, -284, -69, -27, 130, -258, -265, -26, -49, -129, 311, 232, -204, -489, -590, 314, 162, 304, 307, 4, -253, 192, 235, 309, 203, 93, -166, 103, 209, 603, 1211, -114, -193, -116, -417, -537, 176, 15, -206, 91]
2710I1R8J35o74O20r12M94J46q6j17O9J30J93j36J76J07m44P63o03K00p46K98
2731a98k70M36K9j85K26m26N69l33Q0K82j17o8rk30J05M3K59k12L83j68n8j24
2753A4J7j74L09j80P3l9j27J6J73m2j46m9K55j32j06K85r0J64j81j49r4L49Q3
2776B29l55K39k58l7J59J94j21J11k66L04k39P9l7Q4p5j18J88M8m7m3L40l55j7
2799GJ55j82L9k53K94n7N8n7l0L6j14J22j44L64l53K33K5q2J8j49J74p0k14J01
2823g9N6J20L0k05k9L0kR6j8K6l0j41M7R2R2rj54j4K1l3L0J99%j65N18l43k28
2850i3L26j43j55M2j90R3K79m8j21P2m9lp5K72l73P5J40k86K45q1K24j59l3J10
2874F9l9q2j19M22l58p7K62J78l04m3K30q5j24k25M95o7j43l4j28L20r6k23K83
$$ y = [91, 189, 324, -350, 270, -642, -148, -2, -88, -205, -136, -6, 187, 51, 227, 334, -110, 653, 50, 250, -496, -198, -468, -32, -3, -188, 38, -388, 181, -152, -72, 210, 93, 25, 16, -214, -109, -66, 193, -19, 364, 196, 138, 14, 31, -143, 166, -14, 59, 20, -107, -91, 82, 40, -106, -155, 100, -32, -138, 147, 57, 221, 40, -109, -203, 146, 229, -126, 113, -145, -182, -23, 171, 50, 161, -105, 199, -40, 39, 2, 86, 11, -107, 81, 129, 82, 39, 379, 24, 7, 162, -20, 19, -234, 60, 3, 61, 4, -26, 10, -104, 18, -126, 238, -115, 118, 143, 61, 79, -70, 104, 34, -180, -79, -23, 97, 127, -78, -107, -77, -79, 17, -1, 25, -5, -146, -99, -7, 85, 76, -78, -92, -71, -104, -74, 125, 125, -40, 478, 135, -93, 233, 90, -65, -23, -213, -120, 159, 111, -10, 62, 13, 10, -65, 207, -166, -91, 49, -237, 8, -73, 151, -8, -41, 69, 30, -52, -171, 251, -107, -184, 78, 256, -48, -91, 139, 54, -70, -295, 200, 133, -10, -44, -172, 148, 52, -171, 112]
2897A12J71k11j43R5P3n4p4j25O0o1K65p3J24pj82K32k69N1K2J60J42l69J25J85
2921B49k29q3J06p6N1Q6j50k1J41K34j19j84j17L43l08J1N4O4j82L6K00j00L13
2944C19m46L06r1j74R5l2K41j68j75n4O4J48p2l8J10j28J1J7K44q3O1J7m3j57
2968b8k19L37qj77K98l68J63K32k73j20K67J23l01OJ80q7O3l06K55j6j06j8P2
2991c1j66K60o8j4Q3r3p7J48p7k2J00j95J53k69L00J16j00N7j98K23j07j55K4
3014a08k6p6O3K30N0R1k42K00j72K0J17n5k84J08J0M7J07K24l04J44Qj89K8j07
3038a16J47j03j26K02k7o6J29n6m4P8K67j68mk88M23Q6l06k3K7J11j1l39K01P2
3062F6L3l38Q7R5K6K1j7l5J86n4nj51M2J49j73J47k39J49n4J09j42K43j52J19
$$ y = [112, 283, 72, -71, 24, 97, 43, -31, -156, -96, -157, 108, 35, 159, 152, -30, 202, -67, -16, 6, 166, 308, -61, 64, 249, 20, -63, 43, -33, 18, 104, -46, -67, 74, 308, 189, 5, -112, 231, -77, -66, -12, 52, -130, -94, 106, 6, 319, -127, 179, 88, -86, 9, -23, 218, 50, -125, -179, -115, 33, -39, -77, 33, -95, -84, -67, 177, 94, 155, 172, 129, -28, -247, 90, 82, -95, 203, -165, -2, 230, -43, -163, 104, 227, -74, -68, 112, 25, 88, -218, 37, 21, -85, -103, -31, -197, 63, -5, -19, 64, -29, -106, 42, -35, -57, 43, -152, 1, -268, 32, 148, 48, 105, -93, 130, 23, -132, -108, -134, -210, -147, 83, 133, 224, -18, 182, 10, 30, 147, 92, -192, -84, -74, -27, 80, 304, 0, 144, 152, -37, -9, -116, 31, -72, -198, 4, -23, -89, 40, -16, -60, 18, 285, 117, 113, -175, 248, 334, 28, 5, 32, 143, 132, -207, -6, 66, 99, -239, -152, -57, -31, -10, -27, -62, 124, 70, 65, -86, -44, 105, -68, 79, -160, -11, -65, 44, -98, 145, -7, 112]
3086A12k15o1L03p1J31j98Pp3K55j61k1q5LN2J79j63M5M6j17K6j13J52o6L7n6
3111e2J63j68m4O0l1l3J93k76K24J08j58M0q8L3L25k95J2K64l03j20K11j76K52
3134A41M8j35l8qJ31j25J30q9j95J06m4m7K50jmj76L00n0j42n4l6k4l2j0N4N2
3160Bn1j6k8Q1o5J47j0R4R2l69J07r0O0L0m9K7Q6R5r7K51k95j68J74k6L52l61
3186b7o6K71k88K94l22RJ14O6r4K35k3k46Qm0J35j77J79n7qj93L09k8q9n0k37
3211c25K95J98j43j03J44J51l68J51j01O4Mq9J08J96j6l71M80j90q2j2J46p4k15
3234a52%J93J19j83Rj02J96J5l79M07q9k44K59M0m8l11K58J10k92K84q3k06L9
3257a60L17l07J11O1n8r4L23j02j15J62j07k56K25l1r9O9J09n8J90k51J05j03
$$ y = [112, -103, -164, 139, 68, 199, 1, 8, -65, 190, 29, 8, -77, -74, -22, 157, -6, 39, 85, -32, -6, -119, 33, -33, 4, -52, 111, -57, -101, -41, -72, -105, 88, -188, 36, 144, -14, 26, -62, -29, 296, 1, 13, 277, -26, -146, 65, -111, 141, 189, 54, 16, 8, 139, 14, 144, 55, -140, -34, -78, -125, 125, 124, 120, -56, 244, 194, 52, -2, -38, -62, -94, -104, -50, 2, -49, -65, -93, -12, -77, 70, 60, 154, 246, -123, -16, -106, -46, -16, -65, -38, 48, 143, 46, 297, 2, -166, 8, -18, 334, -27, -93, 178, -110, 184, -138, -129, -15, 51, -43, 192, 169, -77, -69, -109, 26, -151, 28, -29, -37, -230, 79, 51, -38, -88, -325, -30, 168, 25, -78, 66, 217, -151, 0, -101, -37, -33, -122, -14, 182, 166, -205, 275, 85, 3, -9, 137, 63, -152, -152, 41, 160, -23, -14, -116, 80, 95, -284, 123, 34, -210, 49, 89, 41, -270, -12, 98, -194, 90, 7, -199, -160, 157, -150, -39, 22, -36, -130, 193, 91, -24, 138, 31, -225, 0, -31, -130, -61, 48, -10, 180, -71, 34, -69]
3279f9J7j30j2K62l33L21k0r9J32m2j65L30l36J60k72J96j95J96n2K10j36j47
3301a84J02K68k60k9J36p4J33R6l99J97l4j17J57j12K78m7k26R9J93J12l68q9
3323a68L36j26M7q2j16Q8r7J44j3P2K5k27K15Q6J6n36R7L00j64J44p1j30L04j54
3347a0J88j92R8j99q4K69j64P7J6OP4j51J96j23r5k8n9J30K37j43K2l08K57k40
3371b26K99j74K02j83l0J04l15L08K57l03Oo1j18L04J42k30J12J44j68N3l23M58
3393B58k19J99n8n4O6k80k0o2K41p8L3N2l9J11k45K22l5n5Mj30m9K09k29K19j45
3418h4J2J58Mk83K35j74J69JM3R0k82K62j44n3k4K42l8j41j14M0J61j18r6K12
3442G8Om9j47L71k29J21l37P4P3l4l5L48l18J11Rj17J02k07M60r4l83L17j50J9
$$ y = [-69, -52, -182, -194, 68, -265, 56, 36, -63, 69, 27, -138, 192, -144, 16, -256, -60, -255, -59, -111, 99, -37, -184, -82, 186, -74, -103, 33, -41, 92, 188, -211, -14, -48, -165, -8, -120, 158, 111, -115, -16, 177, 289, -79, -168, 168, 42, 89, 7, -109, -21, -118, 26, 13, 85, 110, -117, 98, 184, 200, -336, -239, 61, -103, 41, -30, -160, 144, -10, 178, -14, 84, -115, -199, 70, -94, -17, -1, 5, 79, -72, 124, 1, -94, -122, -181, -51, 186, 43, 65, -243, 14, -226, 73, -101, 101, -82, -112, -8, -323, -15, 242, -61, -55, -116, -234, 70, 212, -18, 94, 238, 70, 123, -200, 258, 39, 238, 180, 126, 192, -88, -108, -170, 71, -7, 26, 78, 39, 150, -95, 127, 92, 37, 41, -89, -138, 71, -158, 61, -84, -72, 86, 90, -193, 42, -132, 37, 38, 81, 171, -111, 151, 7, -46, -70, 172, 134, -7, -121, -81, 80, -38, -134, 78, 84, 35, -112, 259, 30, 151, -186, -112, -39, -73, -108, 240, -78, 33, 42, -75, 27, -180, 280, 186, -197, 120, -30, -11]
3466a1k9k3j09M65j85p3r0J50Q9k92J43k06N4M63l69p0j6L86l80Q7m6J95m27M43
3490A49j89r8J17k65L55k20J09J70j14j5O4J4k88K36M0N3k55j8p8L67Nm5J44l46
3514a08j82L15K45j80m6k44qJ83J04o0p0J24j25o2R0N1k67l3K94r2q2M9J28N8
3538H2j14J37j90n5J11R0J01j68j37K26k37L57o7k51K48j26n4J15r9OK0M2j4j93
3562a70R5R6j46K43k56K13m3J86k18k2N7Mk4np6Q0k83R6K42K4j76j08J83o4j32
3587b04Q4J75Q5O6j79Q4j63P1j2j5n5J24j46m0K17p1M1j92Q1J79m6mr2M6k7K7
3613C4o0J15pj14J52n49N93m50L54o2q8L4N6J14j43pM5O2p7rJ43k57K10j68J34
3638E5j50J8R2q9R9J00k21L9L3l48M77l25J11J46N6k23J83rr5nR7n4o6K66j13
$$ y = [-11, -40, -63, -172, 293, 108, 35, -55, 95, 184, -108, 35, -171, -117, 346, -23, -93, -109, 277, -103, -16, -62, 133, -294, 149, -40, -138, -21, -286, 69, -151, -42, 128, 14, -1, 63, 77, -211, 25, 65, 118, -137, -155, -233, 134, 139, 94, 238, -108, -290, 25, 270, 90, 44, -200, -208, -25, 79, 19, -51, 73, -52, -114, -24, 27, -240, -273, 21, -71, -153, -104, 24, 82, -32, 105, -85, -140, -29, 61, 162, -6, -143, 83, -154, 203, 136, -115, 133, 7, -47, 68, -31, -25, -5, 37, 23, -170, -75, 21, -125, 118, -138, 75, 32, 218, 0, -22, 35, 39, 15, 10, -66, 14, -269, -173, 69, 93, -83, -191, -8, -72, -204, -120, 55, 140, 206, 27, 111, -52, 19, 7, -8, -63, 61, -85, -125, 92, 21, 62, -130, -49, 130, 84, 80, -12, 34, 7, 34, -26, 89, 82, -32, 120, -429, 164, -286, 68, 6, -82, -48, 8, 122, -21, -28, 17, 79, 2, -7, 136, -121, 89, -79, 55, -95, -77, 15, -74, 25, 125, -96, -57, -24, -372, 105, -220, -109, 37, 93, -130, 53, 44, -51, -56, 41, -13, -79, 187, 74]
3663G4L2K3k28K76r6j9j90J43M3n4O4k98M29j65J09j8J10k41K33k15Q2n8k8j98
3687a90K47j69M06j64l42K96q6K4J0q3J09k48P2K44j60O5N4j21q9M5K76l79PK53
3711G7K59j52j72k1k1NJ46j49J50k6m0o1K5K5N5k09k9J57R8k75J50k86L01N6j05
3736d2J69k51L40k83J42q8P8j61R8J2K22J8n3m0j15j57K70K0k62PP8r7M2m9J93
3761I1k27J55l94Q1N88m07J48k88M3M72n11L12k29J64j83J42p0O1j78J26J21l2
3783a5K0O3l6k32K90K00j82k42L87m24J17J1K0o1R0Ol72N78l20M2J26j4K0j18
3807d6K11j94Q7k14J90o6J43o25N64N6m25L85L06o26M47m99N54m32k02O45j95
3828F4m53L66m05M51K5j11J01p99Q01l83J47K21J99k06l5j07K35j85j35l7M79
$$ y = [74, 106, 129, -99, 177, 81, 62, -128, 15, 58, 4, 68, -230, 199, 34, 143, 125, 235, -6, 227, 12, 94, 36, 8, -190, 57, -112, 294, 130, -212, 84, -2, 22, 32, -51, 58, -190, -118, 126, -34, 31, 85, -36, -125, -80, 196, -183, -176, 77, 336, 184, 12, -9, -30, -25, 121, -28, 122, 96, 56, -5, 20, 45, 100, -109, -138, 19, 117, -158, -8, -294, 7, 63, -42, 127, -124, 216, -67, 75, -13, 65, -96, 2, 14, 236, 254, 201, 161, 46, -111, 159, 179, -83, -76, 2, -95, -53, -102, 91, -136, 19, -375, -294, 294, -113, 35, -253, -210, 262, -249, 63, -166, -2, -185, -43, -113, -52, -230, -104, 17, -15, 5, 68, 32, -200, 90, 290, 108, -134, 253, -171, -54, -43, -23, -84, 6, 12, -360, 218, -102, -60, 66, 52, 72, -46, 165, -29, 58, -156, 34, -32, 111, -514, 50, 106, -319, 66, 372, -254, 193, -306, 248, -184, -386, 259, 64, -389, -23, -428, 23, 48, -63, 38, -761, 40, -343, -196, 25, 224, 18, -17, -124, 111, -74, -209, -246, 233]
3849B33M8m95M30k63M71k11l61L4J72jo2R7m68K03k34K29K24ll96j2L35J24j33
3872c9j15N3J8K52j86j6L5K17n70L40O2n2J77k94M27n29J21K29k04k01P5m5O05
3895C60l02k83M55m31K80Q9J53k85J65J10l69k6j85K60k06J73J79j80K1J92J25
3916B95o19l0q0M45J45m74N5J80P4J00M4k92J7M44k98J36J58rn46L96l8J60L31
3939E94n51M85k37j3L4q09K38K68P6J65j8m1j1k49k56L44R4K2l05n6K06N17q78
3962c81K59M01o81K5J98N01n15Q8j77K69o14M01j31L16j15m21Q61O1m75M51r74
3983f53R07k2n88K78Q3Q70r36O7j15J64j10j52N13l19K39J19k90j04L1Q6j35K3
4005d4L7J7J83n9k59L27l16L54l62K00j69J51n3m3o5J58k69J18j2J20o1n6J69
$$ y = [233, 281, -214, 216, -47, 424, 213, -148, -114, 58, 57, -5, 92, -376, -173, -407, -178, 46, 43, -353, -365, -30, 94, -39, -154, -101, -83, 169, -17, -33, 2, 219, -351, -11, 51, -1, 176, -118, 309, -220, -99, 130, -74, -275, -200, -245, 360, 58, -225, 230, -201, 79, 168, 321, 36, 201, 311, -58, -84, -269, -9, -215, -42, 137, -43, -22, 170, 295, -324, -354, -434, 11, 156, -318, -263, -83, -9, 91, 135, -157, -140, 304, 6, 142, 300, 291, -255, 141, 103, 263, 594, 43, 528, 291, 278, 312, -497, -259, 9, 85, 250, 232, 191, 180, -69, -325, 19, 113, 135, -170, -226, -20, 497, -381, -122, 279, -402, -377, -179, 322, -193, -105, -282, -13, -627, -226, -357, -41, -156, -577, 284, 345, -130, 321, -653, 254, 232, -356, -78, 5, 875, -61, 6, -109, 55, -55, -207, 306, -13, 226, 345, 55, -49, -18, 68, -67, -44, -7, 10, 193, 134, -125, 202, -114, 240, -122, 78, -91, 60, 7, -36, -101, 57, -212, -94, -106, 14, -47, -103, 66]
4028F6K9k6j41%p0P3p9J64J31j54l0Q8J6p5L68n33J80j68P1J15M4l25K84M5M1
4053A14j42k78M27o5j60K72j02Nj02k0k08r3L23j28O1L5J99k53J59k44J95n6J75
4076A14j86n2O0QK50o3j75J36J10k14J04l17K88k1q8k2K61m19K15K87l62J01j35
4099a20j86K23J99j37J07k90K27K21l44q1K32pk13K21Q0o0j51j05L22k04LJ04
4121D1j6J01k18j29L32k18L77l78J10K1l8K4q6m7O5J16k8Q2l14P5P3K41k90J1
4145i3R8J21J3k20Q1O5k43J56J02j94P5k15R1K07j59J03N0l9J90l18N9lJ26l13
4169b60L93k38M9J24J51j17l64K83j19p1L35k09N4L9m5j36J62K3Q5l63K67j67
4191a24K48O0m1k15J33J91l02rJ76k3j95j1j06P39n80o9J59kj3n4Mnl9J40Ol1
$$ y = [66, 95, 69, -72, -72, -142, -69, -148, 16, 147, -7, -37, 51, 67, -8, 360, -173, 7, -161, -90, 25, 69, -256, 28, 73, 114, -28, -306, 121, 56, -104, 168, 66, 71, -31, -51, -259, -352, -29, -157, -96, -61, 138, -115, 44, -200, -5, -61, 114, -72, -124, -64, -56, 194, 131, -44, 92, 202, -12, 92, -225, 63, 42, -46, -68, 193, -226, -11, 276, -86, 15, -120, -306, -83, 116, -21, 86, -204, 23, 244, -100, -181, 51, 44, -169, 52, 132, 72, -79, -184, 138, -66, -63, 41, 25, 126, -92, -221, 111, -107, 270, -108, 2, 23, -15, 9, -77, -124, -59, 57, 29, 111, -203, -128, -55, 186, -104, -93, 5, 126, 139, -81, 0, 65, -178, -22, 80, -114, -39, -254, -163, 44, -115, -12, 38, -1, 189, -129, -70, -73, 53, -260, 133, -105, -56, 68, 219, 102, -262, 21, -98, -169, 166, -43, 11, 50, 5, -131, 31, 54, 139, -224, 43, -124, 124, 184, 143, -72, 61, 252, -50, -59, 117, 94, -101, -112, -218, 521, -59, -128, 31, 29, 16, -38, -34, -39, -78, 62, 68, 37]
4217C7j56J86j04rK4k6K05k10K95l32N1J45O1k27j10J3L21l71M44r7l24J75N7
4240D8r1j37J62J66j89J24km2j20P5K65l57J02K5M3M6p4j13J21K0n5k1J5K4j88
4265a53M15j31k10j8NK11r4Q5n9N5l91K18K13J9qk80K00qJ98m12K78o0m6q7Q9
4290B9k32M04l32L8r6qP7J28M4j49K1m8K45j78m8L15m99J71L7p5P9l%K07L0j88
4316c1l5n3LpJ14J83j70p0K68k23k1L14k68L3r7OM7J71O3l32l2J65j53o7K36j12
4342f8M1n2K0m7K48j73k8J87n5k3p0k9N1M4L4m7J06l29P5L36l42k1O0J78j46J2
4368c8m6j26R0P6o3Q2J29m8l1jK22l84L24l31L10j56K6kj06J85l35J68r7J80L2
4393F0L5j59m6L58j66j16J95l31J18K9l3J17K1j28J61j20j23K21r0j56J46nj72
$$ y = [37, -119, 67, -37, -46, -22, -48, 157, -53, 242, -90, -39, 106, 167, -60, -170, -157, 164, -207, 237, 140, -184, -9, 48, -43, -180, -18, 148, -41, 83, 81, 39, -81, -6, 259, -98, 4, 29, 72, 118, 44, -69, 52, 72, 17, -4, 11, 35, -153, 262, 131, -79, -97, -92, 119, 25, 110, 51, 106, -285, -67, 146, 165, 157, -123, 77, 69, 267, -145, 133, 73, 27, -60, 29, -203, 201, -131, -93, -189, -197, -120, 8, 52, -97, -76, -124, 121, -57, -105, 210, -289, -118, -81, -156, -77, -80, -80, 127, 157, -31, -66, -119, -116, -123, -9, 174, 4, -66, 202, -21, -42, 272, 4, 37, -60, -54, -7, 164, 227, -105, -137, 28, -125, -192, 44, -68, -27, -79, -59, -106, 142, -31, -59, 128, 73, 50, -20, -49, 2, 46, 80, 33, 139, -190, -115, 221, -121, -142, -82, 96, -50, -38, -84, -210, -120, -44, -107, -25, 104, 56, 25, 24, 246, -138, 186, -145, 165, 9, 35, 33, -73, 112, -223, -55, -152, 28, 60, 95, -64, -110, 248, 82, -34, 161, -170, -52, -23, -56, 61, 82, -46, 115, -5, -128, 93, 3, -153, -7, -12, -184]
4416a84m6J31K99k84Q1J37j88J32o4L1L2k50J40l2J17L49o55J74L5j69J92l2K3
4439c1r7L84m07J09j82J47M28m82n67L80Q18j29l35M52m99K15K50k51j68l5j05
4460a05j1O45m10o78Q44o69J005n41Q8j92L06o35j04P71k52K73m53n4r7K54N5
4481D0o5j18M98m51O38p24K06K21k30M8jp2k30r0R19l90k90J42J93n08K62R5j54
4504f1L3J05l28L95k93j09R7J77k27J59qo9J32p6K85l22J62m16M83O3k51L12Q2
4527C25m75j09J13J42k59K43J79k99M44l02O1K74l08J35j42k25ML1R2M53k30l03
4549a56L40L32l38J96l50q5J43m2M92q61N5J23k45N66j10R7m36K46P5j79l3K20
4571E0k36J09j35n9L73K67k33n29N71j21m2l7J14j25O0K85l37J15j3o3J45m20
$$ y = [-184, -230, -99, 200, -84, -3, 134, -54, 78, 14, 45, 77, -173, -33, -65, 52, 401, -254, -80, -45, -214, -22, -54, -31, -128, 256, -151, -42, -224, -77, 351, -131, -698, -318, 500, 371, 36, 488, -11, 204, 454, 203, 35, 0, -105, -116, 529, 119, -559, 285, -384, 621, 80, 168, -24, 282, -353, -457, 314, 62, 335, -118, -172, -269, -15, 40, -25, -143, 355, -96, 542, -182, 24, 245, 15, 63, 62, -10, -240, -330, 589, 199, -91, 51, 244, -264, -2, 93, -61, -28, 77, -251, 144, -149, -258, -161, 16, -211, -52, -60, -129, 3, -73, 212, -110, 52, -364, 119, 182, -69, 243, 325, -150, -259, -146, -4, -263, -20, 159, -140, 304, 2, 63, 337, 29, 164, 22, -203, -199, -168, -76, 377, 147, -156, 184, 516, 178, 374, 24, -61, 82, 40, 532, -329, -274, -151, -396, 170, 60, 157, -279, -33, 42, -137, -170, 50, -186, -77, -212, -271, 102, 369, 136, -393, 178, 57, 15, -22, 92, -33, 27, 312, -25, 90, 77, 14, 159, -261]
4593b61O15l26k45K46q7rp1N9J61j54p1k2J66k84K57m5Q6k51J93P9R4m6k32K33
4617H5k47M3K1L1L2J01R5J29k72n5q3J34J57l8k11J51nj67J74j48K04p8K62j42
4641A73k50J09j47O9Q8k03L4R1J38j13J56M3k89J75J03l3j16j62K31l40J98j88
4663b33L0N1J5J78J49p9j20J50m0j84n0R5k69N42m40R2J69N9r2J22K7j33m1l4
4687c6l7J58p9j13o6P8K83r3j27O3L8j15K10j02N1o0j13K71k45J57j87j9J34l3
4711A8o0q2Q6j8J52J29l19O6J66n8m32K15J84n8K45n7j24n0K74j27k7j80LR0O7
4736A03k39J91j93J2J34j70L51l28J9K91o0l22L04j43j61nJ07K27j32j2J54j33
4758eM0j4J09k66J57K49l88j09J61k8k57M36k61K78K0j33K48k73P5J3N1j91K39
$$ y = [-261, 354, 28, -217, 29, -58, -67, -138, -79, 82, -72, -143, -165, 1, -283, -26, -71, 15, -236, -43, 36, 130, 84, -148, 85, -162, -119, -98, -67, -35, 66, 161, 290, 18, -37, -120, 14, 171, 133, -78, 73, 68, -99, 75, -73, 131, 53, 315, 173, -77, 32, -115, -46, 42, -161, -127, -36, 102, -11, 145, 188, -101, 74, 177, 144, 28, -134, 97, -243, -45, -233, -203, -152, -137, 41, 190, 111, -9, 141, 101, -83, -133, -38, -307, 235, -205, -113, 56, 115, 23, 145, 172, 39, -2, -36, -73, 85, 6, -107, -173, -95, 188, 95, -32, 31, 69, -46, 164, 62, 113, 53, -60, 211, -34, 123, -64, -83, 51, 18, -42, -124, -38, -56, 96, 225, -94, -28, 138, 80, -352, -137, 47, -11, 234, 177, 53, 3, 277, 150, 123, -57, -54, 36, 103, -136, 55, -138, -126, 8, -162, 189, -139, -120, 171, 111, -211, 93, -50, -211, -216, -109, 118, -14, -26, 128, -5, 35, 21, 130, -136, 21, 270, -118, -227, -66, -94, -351, 85, -176, 102, 122, -11, 237, -36, 39, 52, 103, -88, 151]
4781A51l53N9L8J44J05k31j29O2m0Q5j29K63K09j88j11J13j47O7pp7j13K34r5
4804i0M8N9m9r9L26r7Q2k86J80q5N1Jj8k00J36J28k81J72M5P6n5p5Q3j66J17k37
4830b34M94r5j98J1L2Q2N0j67J83k39k0J45K6k04J71J0j44K16j15J64L2j67j26
4853i3O9K28l87K63r5j05K11J14q7l5J84k95j22J72j23N2L01j43j91K1k9K99j68
4876D1J33j56R6j60k9M9K08k35K9NL15k74r3K23k12N0j48K97k17J65m9o9Kl0O2
4901CJ00K6j14J95j45L3M9j70J13k83J28J01j5k0%L6k30J46j93Q9J91j95j4K42
4925G3p7P8J2k6K6J30l01j1L4M0K2n1J03Q2O8k80L33k58P2mk0J37p6J62j09P1
4951B30j07j60q5N2j53K74l24K51j9q8o1L36j60J19l13J59j11L85l84N5J24j24
$$ y = [151, -202, -143, -105, 39, 144, -87, -216, -154, -194, -109, -238, 25, 234, 46, -65, 48, -99, -32, -39, -116, -229, 5, -90, -42, 17, -32, -131, 195, 98, 180, -106, 74, -11, 40, 41, 23, -177, -41, 87, -194, -22, 23, 99, 44, -31, 52, -114, 3, -234, 260, 165, -33, -22, 10, 92, 142, -25, 158, -81, -101, 44, 70, -134, 37, 47, -97, 119, 4, 168, 200, 33, -93, -24, 204, -183, 80, -15, -120, 91, 205, 118, 83, 267, -28, -150, 22, -101, -49, 252, 109, -82, -61, -90, 209, 41, 174, 18, 114, -46, -75, -26, 182, -53, -24, -19, 296, 22, -71, 152, -60, -10, -158, 139, -78, 87, 38, -31, -29, -59, 3, 103, 129, 15, 210, 65, 98, 147, -23, 90, -193, -65, 36, 21, 1, 1, 37, -193, -47, -240, -151, 40, -155, -169, 73, -4, 74, 86, 60, 86, 216, -85, -96, -62, -22, 0, -51, 52, 134, 202, -78, 255, -3, 69, 65, 45, 182, 106, 268, 159, 230, 123, -37, -122, -70, -223, 51, -273, -22, -41, -129, -190, 146, -14, 105, -208, -49, -160, 225, -159, -104, 20, -104]
4973a04K71l09K15r4J30j48Q5j79l6LJ31l3J03j37R7j01J29L4o7J49k26J25k5
4996A3L3q8J2K6J5n9ko3J85j51J23J15j39j75N4m4R3K4J91n8j2j20j80L37k93
5021a63J48Q2j51j06J10k3J45O1j99J45J44m55K36pJ7j11J77R0J75k71l7P3nJ08
5045A83k48P8R5k60R0o6K1L9J83M1j26J3k04R9K15j85o7K80j22o5R4J1o4m8n4
5070f7L05k27L2l4J61k18L34k71l4p0q4K25k11K57q1k31K06k0K22k68j23K24n4
5093b7j03K97o9K6j29k28L09k43K90j06p0K1q6M9l3J39j52O3O5j8J88k29j6L32
5117B70k89O2k77L88j1l82K15p9R6K0J24K04n60MK86n4L4M0j48Q9K07p8q4k5k08
5142a56K57k41K65l0k81J38L84l56O1p3om3Q2K45l00O5J38j29j21N4J36L5l18
$$ y = [-104, 167, -142, 73, -21, 109, -39, 46, -133, -169, -166, -35, -68, 35, -102, -5, -106, 23, 57, -10, 139, -87, 38, 13, 46, -42, -30, -4, 11, -48, -50, -113, 72, -79, 44, 159, 20, -155, -101, -145, -52, -28, 163, 105, 93, -27, -207, 130, -163, -15, 67, -84, -190, -80, -103, 42, 103, -96, 49, 193, -262, -26, -33, -16, -127, 50, 140, 315, 44, 7, 80, 75, 183, -65, 13, 108, -152, -62, -128, -107, -68, 115, 156, 30, 43, -161, -62, 153, -32, -99, 181, 59, -6, 88, 99, 35, -13, -67, 238, 11, 43, 9, 170, -48, 286, 15, -19, -89, -173, 52, -159, 98, 17, -214, -8, -28, 194, -74, -197, 27, -27, -130, 167, 98, 124, -5, -233, 76, -167, 123, 17, -53, -32, -118, -69, -102, 37, -115, -52, 13, -5, 183, -46, -62, 270, -19, 43, -234, 154, 143, -239, -24, -103, -7, 13, 137, 341, -219, -215, 71, 17, 51, 91, -57, 32, 239, 161, 77, 52, -156, 101, -140, 125, 95, -186, -48, 336, -20, 41, -32, -38, -81, 1, 246, -54, 11, 149, 20, -101, -47, 89, 124, -194]
5165a94L13j94J15o9K4p9P2L15l78L00m46J62J85j60K01j86L1j4l6j21J39J25
5187A05j11K12k57R4l1k29K4J29J42k99K74M4j12p1r5K71N5l50O5J95J29q3J80
5210B81l82J53j03J61j21J52k08j58K57m0n5J84l34L40k00j14J09l7L15j19J29
5231B10n7j77J26N7n6Rj37p2J53r6j53K07m6j23J01J23j30J54k47J92l9M3K3k25
5255a60K44J9j7k76K77J24j6k21j49J73p5J63K5j08r2p3J63K41M1m21K47n05L27
5278f9q4J59J74k36J29k79K39J57j42J01r7j26J28r2p8J02M7J07J0r3k45q8K69
5301gJ15q3o3k41L63K4J6l9k7j6K9l8K07k67PJ62l58K89J70j27l49K00K44j41
5325G0k2o2n8Q2J05k98J94J59k69R2L2j91M8j99M85j09LQ0k47J12n9K96l33q1
$$ y = [-194, 119, -75, 40, -29, -5, -84, -12, 303, -75, 225, -221, -59, 126, -34, 167, -19, 12, -2, -38, -159, -20, 105, -6, 206, -51, 43, 12, -217, -193, -64, 78, -221, 53, 97, -15, -86, -181, 90, 145, -205, -140, 55, 184, 101, 281, -101, 52, -51, 110, -11, 141, -67, -225, 32, -8, -63, 121, -213, 127, -73, -187, -78, -115, 200, 81, 210, 153, -24, 102, 159, 103, 112, -25, -97, 56, -40, -193, 14, -32, -155, -54, 69, -61, 93, -154, 38, -1, 42, 65, -160, 84, 103, 86, -190, 87, 211, 195, -26, -175, -2, -77, 86, 111, 3, -89, -162, 1, 242, 283, -138, 109, -396, -69, -153, 6, 180, -56, 73, -206, 33, 190, 48, 149, 52, -74, 54, -38, -116, -14, 33, 140, 150, 57, -188, -276, -7, 108, 25, -38, -279, 84, 108, 124, 85, 58, 42, 71, 33, 240, -27, -20, 142, -216, 73, 243, 116, -233, -33, 211, 70, 48, -14, -72, 10, 115, -183, 11, 170, -99, -7, 25, -166, -118, -317, 168, 59, 62, 142, -105, 7, -52, 244, -89, -170]
5349a70J59K87n07L48k26J91m2K35j23n00N12rj57kJ11j17P1q3j92J77J46k70
5371a61N0J40N5q4k1J75J09k46K60l92L08k54M3j66J30K10l5j88j90M26r6q9o3
5394g9K33q0L0j19J83O5m63j0O3K48O8n1k68K79o5k2K5j92j2n6K09%K9k94K49
5419c0K48j5j48p3L97m00J82j6j71j12L28k11J13N3j53nK48l38N4Orl9J26j49
5443a14L30n60K05J63j12k15K27O5l0pr0L77l68K98j37n8N5jq0m8j1R2k07J88
5467c8jM41k58l13J17j0q9J63n5j12J55J02j96J33L5j30Q6l7J08k75O8K37j30
5490Aj86m9J49j3J99k53K91p1L5j09L2k10J64M7m1J38j33L1n6K06k79oro3M68
5515B83k9k89j26J54j15J87J02O6j26N9k96K87k44O3j5PJ31l76K59J69p2j09M3
$$ y = [-170, -11, 276, -231, 117, -109, 82, 40, 275, 152, -348, 164, 155, -2, -4, 107, -10, 61, -22, -214, -37, 109, -161, -111, 29, 84, 0, -21, 154, 263, 17, 277, -115, 193, -61, -18, -184, -54, 156, 121, -67, -257, 169, 73, -16, -79, 154, 74, 104, -15, 168, 233, -230, -240, -177, 71, 139, 88, -180, 99, 34, 12, 37, -155, -167, -223, -14, -14, 15, -279, -30, 218, 203, 55, -18, 379, -21, 161, 145, -26, -138, 190, -21, 92, 145, -8, -13, 235, -103, -49, -43, -52, -91, 35, -114, 216, -344, -139, 24, -88, -303, -76, -11, -41, -48, -138, 239, -129, 169, 32, -26, 29, 28, -52, -100, -111, -19, -226, -38, -39, 402, 144, -169, -52, -62, -151, 12, -43, -155, 0, 102, -94, 39, 74, -56, 30, -7, 101, -174, -106, 131, 1, -185, -234, -85, -98, 101, -152, 139, 68, 103, -6, 26, -184, -20, 27, -14, 124, -9, 22, -34, 172, -107, -113, -122, -185, 283, 254, -35, -161, -7, -122, 65, 167, 233, 107, 166, -130, 157, -87, -24, -39, -32, 99, -277, -18, 151, 79, -30, 13]
5538A3m3Jj0K3n0m4l68L04J50N9l36L81o6o4l33L41P1J28j28J45j78j1K3l7K46
5563B17k30Q4K51k67q6J31k32Q0j96k0J68PR0J55j72Q9m1J70l14K07o2N2M3q4
5587D0j80J02lJ57l6j09J78k22MR7o4K0j39K03M8k87P4K41K12l96J1J34j36M9
5611bK94l09J36j95L8r8J35o1L02j18k59j01J45K47k77K80j75l3M7j9K2j3K6R2
5635A04o4j83K5j44K90k16L04k90k6m5Q5L2L46j62J8R2j87J23j22J08k53J46j3
5658c2J30p4J19o8j37M2J23o2j75N0L27j20j38o2p6P2r3K82lLj48l5Q3L3J18n5
5684A04Q5j27n9lK8P2J78l38q7J02K7p4j83K24J24n2J13j13R9lm0k41N4J27k14
5709a97K52J15j29k71J45m9J41j09J25Q1j70J23l4j13J77l5q0k29M4J73k05J96
$$ y = [13, -30, -29, -39, -16, -66, -110, -478, -174, -24, 35, -301, 80, 14, -50, -383, -42, 29, 157, 29, 174, -4, -15, 8, -29, 217, -13, 71, 322, 55, -31, 100, -132, -52, -248, -268, -100, -93, -3, 152, -20, 69, 28, 198, -116, 91, 29, 81, 124, 40, -140, -38, -41, 116, 80, -29, 149, -73, -69, 28, -36, -16, -155, 48, 96, -191, -117, 124, 336, -60, -49, 85, -51, -2, 292, -17, 119, -76, -38, -136, -1, -62, 240, 122, -137, -238, -93, 154, -123, 157, -18, -51, -4, -23, -1, -14, 12, 104, 40, -143, -118, -262, 28, -188, 116, -174, -200, -245, -160, -128, 218, 56, 74, 166, -21, 102, -20, 88, -165, -19, -32, 98, 24, 143, 75, -62, -20, 103, 41, -134, -84, 243, 123, -15, -77, -153, -81, -174, 108, 105, 108, -40, -75, 8, 41, 159, 104, 189, 62, 3, 0, 28, 100, 278, -60, -147, -45, -18, -92, -275, -51, 73, 21, 134, 21, 120, 117, 77, -164, -110, 17, -197, 55, 170, 41, -230, -85, -134, 7, -102, 23, 104, -66, 57, 23, -90, 87, 52, -28, -257, -213, -40, -245, -49]
5731d9J49Qrj63J69l9J18j35m8R0R2k08J72j08o7kj9J17j7J3r3k2J5O1M5j19K19
5758A70L6l39K04J9j29J19n0n1N0R5k14L7j5K20l82R6J24n0O0j17J08L6J53j49
5782C1np0J94m43K93J95l14J59J52l58J35n5K02l87K92K5j10k3K01k88Q3J07J13
5805A29o9p2K43k93K37k1o0Q1n5n0p4J99k33J59j95KK55o8j43j17M8j4L04k38
5829d5j23L26k23J4R1j90L02j03m6J31j15m0J95M1k76J32j78r0J98j24J16K12
5851B05o5j92K05j60Jj56K78N5j31Q5M9j69m1j9J90n7r9R3j66L08j38k54J77Q0
5875G9K46k74M7j89R8J88j29j85J80p8J61k74Q6R9r4j32J30j80Q5RJ18J9M5o6
5899a1k2m1K15J66k14j42K19l75L92m1m8J18j50O1j40QK11L0k06j5M9K6j74K41
$$ y = [-49, 100, 108, 99, -64, 105, 66, 184, 49, 1, 91, 183, -25, 147, 39, -28, -30, -49, 68, 51, 64, -29, -51, -36, 25, 70, -49, 170, 206, -133, 71, 90, -39, 80, 30, -21, 29, 124, -90, -53, -68, 152, -230, -134, -10, -60, 0, -117, -9, 27, 180, 31, 26, -44, 150, -293, 0, 195, -119, 40, 192, -166, -31, -86, 116, -271, 21, 46, -64, -87, 114, -174, -91, 16, 129, 60, -12, 231, -62, 175, 154, 94, 175, 120, 70, -4, 195, -38, 121, -74, -72, 183, 115, -28, -145, -97, -111, 193, -45, -168, 158, -65, -51, 40, -150, 152, 49, 3, 134, 19, -21, 174, 215, -61, 71, -107, -197, 1, -123, -7, 205, 140, -52, 153, -7, -6, -162, 116, 171, 40, 125, 174, 5, -36, -55, 135, 78, -21, 72, -94, 214, 76, -178, -1, 79, 325, 51, 98, -91, 7, 195, 66, -119, 61, -17, 144, -130, -44, 55, -39, -171, -41, -221, -136, -127, -9, 10, 55, -11, -33, -74, 141, 307, 93, -49, 170, -205, 187, 146, 98, 216, 66, 127, -13, -5, 206, 236, 30, 15, 64, 90, -84, 157]
5923A57l98L52k52J9L53m6l26L4K3N9J88K84K27j123N49l19L87j79j0j52J89l09
5945b93L70j14J44M1l02L18l10N7J52o6L0R1k54L96k82K00m17L29j63O1N6M1k30
5968a45m9P6K7N3K0J57l24K42m5j28K76l22J09N9N9J41j53j89J02J07r0l3J82
5991A32l36K51o2R2K55l10q1J5N5m1J64j73Q5k34K56j61P6K8r1J38J62j02m6l8
6015C4J5o7l0n5J92j3j86Lk4o7K52r7k8Q4k67K92j49J41j21K22N9k43j10J44P2
6040E3K3j67O3K60k23k21J91ON2k08L2L9Q7K9J03j90P5%J58j14Nl4O8r7n3K20
6066A57m6j49Q2nK2j49Q4L06l09k8Q7R2k50jQ2nK6P9J06j64k06K68K3k2m4r3J33
6093G6j83R1J33q6n0L3J86j01j20O8j11m8r2M39l99J56J12k69Q3j7lL0J53j59
$$ y = [157, -241, 111, -141, -122, 231, 185, -141, -107, -84, -25, 163, 447, 674, -449, 100, -219, 168, -11, -21, -173, 16, -293, 77, -37, 107, 148, -154, 164, -146, -89, 63, -3, 27, 118, -136, 260, -22, 178, -239, 90, -73, -12, 44, 85, -145, -194, -118, -91, -38, -18, 139, -185, 57, 12, -116, 160, -162, -53, 6, 65, 206, 53, -136, -34, 73, -17, -50, 132, -204, 47, -15, 77, 332, 22, -59, -44, 11, -30, 134, -39, 46, -188, 68, -93, -17, 11, -80, 58, 220, 118, 72, 34, 49, -18, -48, -103, 89, 76, -110, -107, -131, -198, 54, -43, -71, 13, -254, 38, -111, 30, -91, 131, 190, -53, -163, -19, 53, 76, -91, -28, 232, 9, -212, -21, -15, 37, -171, -139, -100, -13, 16, 119, -71, 4, 4, 162, 48, 53, 19, 87, -10, -63, 157, 111, -38, 44, 39, 61, -88, -4, 302, -7, -35, 52, 144, -106, -107, -25, -30, -4, 75, 181, 17, -189, 79, 102, 80, 36, -57, 76, -107, -16, 117, 31, -19, 14, 200, 99, -21, 47, -64, -112, -204, 235, -164, -8, 104, -165, -82, -99, -102, -72, 81, -78]
6117g8K02j11j04j5K52k45qJ15K24k24J98l38K06l5j38J23J7J4k20K01j46M8o1
6140a23K38k42p3K79l75K79R1o2q0o2K12k46J84o6L6o6MK39o8j70J21K31k70K4
6164C5k3r4j09J18K19k18M5K43l49J42p0j31K36j41K19j64M8k75J87L18k60K04
6186A80l6l61M55m63J81J49j37M6N5j64J8J46J05j78j63K75l28R8P1j9K43j24
6208D9Oj55K60j01k20K83j57O6N1n8m7J77j39p0N6J69j95L1R1j38r8J75k71J9
6232b16K11j8L71k89J12p2nm1j37K6N5J89k56PO4j28K36o4o7L03l80J30k3n3L8
6257gj16m3J26O0o4J2nj6m9M54k45k24PK91k4l14Q1N6j45j17J30K3mO3Q1J23k61
6284a27K20j27J95j13N4k32K49j33l6J91k64K04j11J05k23J23R2j79L12l99L19
$$ y = [-78, 124, 13, -91, -106, 146, -99, -107, 8, 232, 8, 206, -132, 74, 39, -99, 24, 41, 55, -165, 36, -110, -62, -123, 115, -127, -200, 79, -296, -17, 74, 12, -68, -130, 82, -164, 20, -46, -10, -76, -72, 167, 99, -71, 50, 281, 11, 35, 12, -82, -191, -73, 146, -72, -27, 216, -133, 9, -61, -192, 44, -97, 122, -42, 6, -269, -82, 236, -24, 180, 144, -217, 238, -225, -44, 105, -32, 14, 69, -95, -77, 69, 174, -4, -167, 108, -220, -122, -51, -70, 173, 49, 55, -100, 160, 59, -161, 122, -35, 31, 82, 24, -23, 154, 15, -55, 1, 170, -25, 6, 97, -41, -139, 36, -235, -216, -5, -23, 348, 59, 171, 99, 94, 53, -84, -58, -3, 186, -70, -63, 1, -127, 109, 45, -22, 281, -99, 31, 8, -45, -7, -123, -166, -40, 20, -44, -32, -37, -53, -102, 352, 107, -117, -110, 181, 157, -157, -76, -20, -165, -282, -152, -129, -133, -70, 11, 134, -127, 93, -34, 161, 48, 102, -130, 119, -14, -50, 141, -123, 81, -30, 75, -148, -25, 67, -112, 200, -199, 120]
6305A20j57M7N2k26J25k8R4j56p2O7J04J03j56K14m6j39J84j02l3o6k7J48k81
6328b31M92n4k7p8Ol7K4k04N6M2J00L2kj88Q3N2j20O4p6K56o2m2l3N6M6k46M9
6355d2oK7k10J76K04k08L25k58N0m78O0P61o8n34R4J99K32n37o11Q80m89Q76j241
6378g98R19L2J13j0l07j10J61n97P27K94j274J350K74j187O03O62Kq31J33L26
6398D82K64k41k16p15P81n29M23J77n27K5O08n30n7K55k40L99n24Q5K70l09P2
6419d7K54p7K1j29J26j31o4N0j44K57M5j37j21oJ30R2k57J27j02J90j75J88Q8
6442A78k12J21j61K31j97j81J47J10J05j99K95l55L03m7j56R1q3Q0J39p6p1r0
6464b8J8m4j24J31J03R2L7j74K2k7J6o8j71J76nO5O1j42J09J19p7r8J11o5j39
$$ y = [120, -37, 10, 62, -164, -39, -67, 27, -129, -201, -134, -30, 73, -83, 131, 85, -54, 130, 28, -5, -71, -98, 50, -231, 261, 207, 180, 102, 108, 71, 95, -109, -53, -11, 89, 121, 119, -69, 14, 66, -54, 10, -66, 190, 128, 86, 53, 109, 155, -91, -42, -48, -21, -231, -55, 149, -59, 266, 8, 58, -420, -360, 401, 333, -201, -107, 92, 324, -213, -824, 56, -433, 443, -798, 121, 153, 266, 256, -51, -161, 0, -597, 130, 424, -850, 500, 774, -413, 190, 852, 854, 23, 156, 482, 746, 505, 289, -426, 355, -174, 249, 426, -101, -76, 532, 2, -55, 200, -40, 359, -165, -80, 190, -119, -47, 207, 130, 151, 22, 148, 17, -47, 3, -141, 116, 161, 24, -97, -103, 27, 119, -138, -11, -113, 77, -98, 90, 178, -34, 87, -74, 157, -40, -221, -74, 36, 141, -58, 237, -118, 185, 138, -18, 73, -10, 70, 209, 133, 62, -28, -10, -54, -178, -47, 56, 148, 185, 11, 33, 6, 22, -46, -217, -41, -46, 19, 80, -62, 47, 166, 89, -9, 102, 37, -102]
6489a02P2L02j68k0r4j06k5L23k56mlm2K48j06p0m2J7K54j29K7j07j44R3K7M6
6514io6K23j36j07N8n2OR3q0K99q4o7j54J25q3o1J53k32O1J89k68M18l52Q6K01
6539A61k09J86r0r6J37j91Q7L96j65k76M3j05J11o2j6K49l4lj92m5L1L3O9l50
6563c31M32j18j26J51j06K47k1k32J53k1J50l51N1L75l96P1J49K6j59J45o0qq1
6586f0j30J14L9K17k07n2J48q7j33K06R1k67J19J87j26n9o9j22J29R5L8q9P8k
6610E8j20L1J75l23M9K94l21K08J64M6l83J92j81J49K9o2N6r9M0o8j11Q2P3j4
6634c6P7o6K8O2r9K03k4j15O2k51J32K59m04J49L8J04l68J21J40o3m4Nk27J56
6658a61Q9R7l8M1J44k14Q4K48r7l00j50O42j97j97k47K73m3j49M97r3k67j36K93
$$ y = [-102, -30, 272, 104, 84, -10, -116, -141, 182, -74, -78, -81, -123, 125, 19, -51, -93, -76, 178, 49, 76, -31, -175, -82, -55, -9, -75, 148, 12, -95, -37, -89, -83, 10, -70, 229, 145, 78, -76, 49, -34, -95, 58, -174, -113, 76, -192, 226, -126, -40, 161, -48, 138, 48, -48, 89, -102, -15, 381, 216, -60, -17, -122, -11, -73, -89, 160, 126, 123, -69, -114, -83, -50, 19, -331, 101, -17, -143, 8, -98, 149, 128, -104, 49, 28, 178, -173, -122, 253, -143, -72, 77, 103, -56, 89, 29, 21, -60, -190, -76, -37, 180, -27, -79, 69, -18, -151, 55, 146, -121, -2, 185, 59, 0, -69, -191, -62, 33, 71, -18, 60, 58, -62, -31, 144, -179, -130, 164, -157, 51, 215, 261, -122, 70, -111, 38, 67, 5, 61, -38, 2, -66, -177, -95, -22, -36, 41, -25, 3, 65, -34, 169, 145, 30, 92, -159, -27, 232, -172, -23, 15, 119, -249, -128, 12, -51, -95, -90, -317, -161, -72, 25, -13, 28, 172, -42, 42, 290, 193, -107, -257, 385, 188, -9, -256, 17, -26, -175, 322, 229, -38, -174, 119]
6681A19k20k1O64p34j98K69R4l56J62k16J375n78n63L1P99M48j764O90O42n59
6701H4k0O0Q1L66n33k56K14k98k56P26q33O77j74M4K33j0o8O9j34K46l37o2J31
6724e0O8j57K61j19p0o2J65L3m2j28K85l6Q2j95r2p5K58k75O0K76l05K23j00J1
6748A6l03M40j74J8R0j67K47j83k04L30q0p6J38M7j5j43Kp1J27j47K47r0n7L12
6772C04k68P9j85J34m9J48L6k08N1j5j39K73k10j90K42K94l43J87k36P4p2R9J1
6795A7Njorp6j1j2j9L29k00qj72R6M5j92K13M6K07Rj62k60J94p0J59J44j55rj64
6823f2J62k46K3L6J50n9M7j5q2P5N0%l22Q9K21Q8j33j83O2k5OP4O9j53J34j70
6849a64J73P9L2L5o0j13J0L44l29j3J61j63k3J25M05n18J00k78N81j93m45K68
$$ y = [119, -101, -122, 542, -192, -390, -121, -27, -383, -221, -437, 938, 360, -203, -172, 627, 1075, -689, 1, 643, 84, 64, 124, 205, 571, 38, -218, -4, -302, -558, 168, -665, 12, -162, -118, 115, 105, 37, 106, -28, 218, -119, -181, -50, 18, -139, 122, 3, -67, -129, 36, 69, 27, -101, 184, 148, 230, 35, -57, -132, 126, -149, -89, 187, -118, 105, 5, 16, -287, 153, -21, -3, 87, -80, 167, -16, -220, 110, 30, -46, 92, 139, 124, -19, -17, -88, 39, -108, 139, 49, -8, 304, 36, 115, -70, 64, 15, 163, 199, -9, 42, 27, -112, 161, -49, -239, 3, 297, -46, 141, -95, -21, -93, 6, 17, 22, 21, 15, 6, -70, -81, -93, -112, 217, 17, 9, -163, -67, -22, -214, -1, 45, 252, 261, 99, -161, 33, -37, 122, 266, 111, 102, -62, 100, -146, -123, -87, 63, 4, 51, 36, -46, 29, 79, 79, -243, -154, 67, 155, 22, -161, -99, -124, -118, -44, 25, -128, 6, -164, 9, 88, 120, 155, 95, -18, -8, 336, 7, -6, 155, -8, -31, 94, 499, -19, 81, -197, 384, 191, -254, 14]
6871A4J29j6K94m50j01J03on0L43k80m6J37m63L03KJ34J7j79O39m91k6R1J91l30
6895d1j99K73J13j73K64q5k79J44k42O3R4J07j23j46j66K94J42j04J05J08k25
6916g6j16K01m8J24J84l97L73n40J06Q0K04M32l46k24J27k60L12k41j13K2L74
6937A78M13n32m0q5J88M95m59n8k78O60l94K14n34K05J87j17j3J8k3O8l15L82
6959A60k89K35J65k95K4R3J57j56r7J9j39R4J66k26O2o3L94r3l51J75k1L4J85
6982B33n31K25P1OJ3J22R3n5l17N3L81j32j52K6J45k78R0l8n4j5K04r1P2J54k53
7007b8l1j24q2L16P9l24J90p2J23Q9j23j49k3K41k39J54j83K33o7O6M0j7jj62
7031i4O9J53j95J16R8j46J87l28J86R7m26L22l8o0L0j42P5K58j20M6n0Q9p6j92
$$ y = [14, 143, 127, 421, -29, -130, -27, -33, -83, 260, -20, -66, 71, -392, -89, -87, 47, 64, -115, 524, 33, 7, 98, 289, -41, -240, 33, 146, -27, 237, 152, -127, 17, -225, -162, -68, 39, -84, -230, -396, -102, 40, -64, 41, 149, -76, -192, 9, -39, 85, 269, -128, 245, -295, -189, -109, 95, 527, 181, -43, 84, -176, 136, -105, -218, -196, 178, 591, 59, 19, -66, 122, 617, 158, 100, -178, 482, 88, 302, -232, -27, 160, 43, 30, 48, 25, 93, -222, 160, -129, 106, 271, -24, 0, 93, 250, 94, -3, 16, -123, -29, 137, -89, -27, -90, 304, 211, -140, 35, 14, 48, 233, -298, -73, -2, 4, 17, 139, 232, 177, -140, -87, 294, 162, 10, 36, 181, -97, -7, -45, -99, -114, 90, -1, 71, 225, -28, -59, -183, -265, 51, 130, -194, -4, -76, 47, 136, 13, -136, -159, 82, -157, -3, -186, 47, -20, 46, 86, 69, 68, -94, -25, 128, -67, 49, 147, 1, 188, -140, 46, 143, -283, 39, 1, -59, -29, -171, -96, 162, 42, 88, 38, 127, 51, -141]
7055a41L27m6r8j58M8K71r2j13k1Q2j41J04j32l2J19l1K49k19L33l61j20L0K6
7078a16k19N28M5l31Q7j16J40j16J56j05m2R0J72j39N7j41J17k08K36n4J01J86
7100C28m78O1m5J5K80k47O7J53k90L30l48K16J06m29K16K63l02K09k8j84j8O5
7122f0P7o9J64o9n8j35O1q2KJ29L27l90K02k06J10J93k81N9J58j8j42j63K4K55
7146H8o1L7j74J61R2Jk54K90k35j6J75k61M69m57J47q7j15J48k4J34j16J30k57
7169a85K14Q2j81J37o0J34q1j02J14j09k00L10k52K04p1o4J20k15L51r4L8k88
7191a98L01j03JK7MJ2J4O7j55J99k76M7K27j22j0j33P6J45K1k66OQ0m7j23K06
7216@J67k98M8L32j85k12K73k01Q6m37N42q7j58K16K9k23K32K16k83M2K2l56J00
$$ y = [-141, 186, 140, 42, -116, -68, 203, 111, -2, -23, 59, -82, 22, -110, -142, -23, -54, 195, -24, 309, -52, -172, -142, -116, -335, 193, 238, -93, -6, -122, 18, -98, 58, -47, -89, 1, 173, 34, 91, -50, 67, -141, 95, 41, 142, 328, -150, -89, -134, -119, 161, -86, -19, 134, -156, 174, -174, 42, 148, -281, -65, 198, -104, 105, 77, -107, -125, -60, 17, -52, 112, 43, -15, -150, -89, -171, -169, -40, 287, -103, 99, -107, 3, 196, -85, -26, 132, 114, -28, -191, -167, 88, 27, 64, -110, 51, 143, 144, -110, 180, -55, -71, 104, -157, 312, -145, 2, -85, -200, -52, -76, 58, -58, 72, -185, 29, 111, -70, 67, 7, 141, 60, -42, 72, -37, -237, 73, -179, 25, -46, -110, 10, -205, 146, 52, 90, -198, 103, 0, 1, 28, 32, 44, 58, 125, -30, 169, -107, -60, 167, 45, 35, -98, -22, 123, 144, -122, -116, -36, -83, -206, 0, 167, -131, -83, 249, 64, -148, 125, -76, 10, -427, 115, 28, -130, 86, 115, -108, 124, 340, 57, 99, 121, -235, -135]
7239a35j19J47J68P7j14r3J45j46N0J3Oj32J30J72k86K53j0r4k7J36j03k27J56
7262c3p3Q9P8l47K32j3J64o3p9O7l6J34j37j02m1J13J02J65k85o7J48K9k6o3n
7287d9r3R6J27L2l95K94k7Q2j96K39Kl09J73K28J8l15K68p2r3J08k93J56j02n0
7311a71J2J89N8J48k94K27m0q2k06O1L54l06M5o3K74k27m3L09k88k6K49q4k4k07
7335a35l2J46k03J3L58l76K13q8K15P1k08K0op2K26k66o8K64k01PL80l62k47K15
7359a36r1j6L28m0k33K24j50k78K95K5l0k1m7K86l31q4L10J30Qm59L77nJ41M2
7383B45k70q1J90L02o93L69M55o13J65K58o61M46l27k85K91n56P72l16K67P9J29
7404A66k87L4J86L69l60Mj52J57k39J20j3J52Q5N2P2j98j72K48m72j45L76J64
$$ y = [-135, -254, -107, 61, 138, 24, -69, 76, -70, -20, -7, -1, -133, -3, 169, -117, 136, 126, 32, 5, 141, 38, -189, -33, -106, -17, 61, -286, -54, -67, 97, 34, -45, 22, -14, 120, -17, -119, -160, -47, 55, 220, -65, -132, 16, 45, 19, -44, -49, -142, -46, 81, 113, -282, 12, -15, 67, -129, 110, 112, -197, -24, 204, 222, -93, 175, 103, 10, 118, -175, -19, -121, -171, -159, 30, 88, 236, -58, 169, 129, 47, -159, -98, 256, -50, -5, -68, 206, -21, -64, 245, -43, -69, 180, 96, 72, -135, -167, -21, -224, -211, 147, -229, -16, -104, 111, 182, -26, -6, -12, -84, 142, -124, -192, 72, -129, -122, 258, -104, -351, -136, -227, -243, 85, 45, -188, 36, -114, -392, -97, -72, -102, -123, -170, 116, -215, -299, 11, 141, 149, -310, 67, 62, 203, 245, -25, -106, 84, 386, -307, 62, 517, -96, 69, 327, -334, 112, -215, -500, -209, -765, 7, -309, -42, 37, 166, -121, -87, 99, 468, 108, 112, -40, 117, -122, -2, -15, 137, 222, 274, 346, 148, -24, 224, -248, -393, -17, 147]
7426A47r9m1K99l45J72m13L59j79l9K15mJ68j85R8O1j32k55K38j91J88P6j64j02
7449a28J47J29k84J91j12J16J14N9l60K43j86j80L44m1j23M4k5kJ9L9k9L9l03
7472b89L96J37m90J72p5Q3L2J31k00Q2R0K04q1k28O7L2l10L83j23O0J15J41n95
7495b66J68m7J43Q3J06n07J80L4L9j5K11k23k9J81j2M5N1k19J65k63J70j28R0
7518d3l1Q6l3J96k84L0j37Q1K65p4j12J55m2r0J10n3k7j2j57P4M4M8J3J46r8J63
7544B18j00J29r5p5Q3j8O5j56K9j45o3K69j52K6N0o5J17N2l69L36r2j54N3RL82
7569C34m87M02k72K01k81Q8J86j78o9k28K62o7K3L66j32j47P9l53M6R8p1K46j9
7592B7J51l39J77Q8N4k13No6j9n7J83o3N5M8l97L99k2O6m7n9j07K52j74RP5J23
$$ y = [147, 48, 7, 306, -39, 133, -280, 79, -100, -139, 76, 72, 240, 55, 153, 214, 82, -173, 65, -126, 62, 138, -26, -128, 19, 148, -136, 55, -57, 59, 173, 232, -128, 115, -71, -251, 93, 52, -71, -27, -52, -54, -35, 4, -25, 14, -289, 107, 244, -246, -74, -149, -66, -34, 97, -103, -21, 69, 273, 192, -36, 31, 63, -247, 136, 13, 73, 188, 329, -266, -98, -145, -2, 81, 187, -320, -140, -106, -67, -82, 129, -94, -123, 58, 46, 91, 142, -77, 88, -175, -5, -133, -43, -74, 12, -21, 175, -109, -79, -216, -135, 130, 56, -56, 99, 57, -33, 77, 24, -3, -15, -172, -98, -54, -6, 7, 153, 55, 218, 118, 247, 152, 77, 160, 142, 207, 51, 80, -65, -128, 141, -11, 15, 65, 0, 117, 169, -200, 136, 44, -110, -57, -48, 334, -153, 249, -23, 178, -103, -15, 171, -7, -76, -304, -42, -109, -86, 280, 148, 1, 80, -273, -227, -129, -200, 46, 27, 178, -161, 16, 104, 158, -55, -50, -116, -135, -192, -9, -72, -17, 31, -366, 33, 11, 77, 30, -29, -136, 116, -58, -49, 26, 149]
7618A49k20L9j87K81j29J88p7J60k5r8J97k90p3J16j45L06J5j05j5k11K63j2l
7641A24l3j54M9J41q7J2m8l01K42O3k18L18j69J95q4R0j31K5R0M6l71J02J59J77
7665B37k35p8J96j84L7J16K92j23j65lk07J28M5j8J1j29l7J53Mo9j77L76q7m4
7689C9J41r2q8m2K00OJ43m17K2J59o3K0R5k40J07j30L88P9l33J32l29p0M05j43
7713a1J00K0q8K31k21j32J52N1j64L8j16N8o1nN60l31q4O5j62J8j2J04Mj90Q7
7738h9R5K6m7L9j51R5%N7j01J61j8j53L4R0N9j17K0N9j5o2J36L7p8k62J22L31
7764B68l88K85n13L53J95j51K38m81K53j1k17L25m42N06n06N73l61J33L0m0k28
7785a79J34O41n81l03O03k39J6p6P7L76l70m9k86Q4N40p1j11L2l42K95L78n70
$$ y = [149, -71, -32, -219, 62, -67, 121, 44, 204, 179, 81, 278, -12, -85, 31, -114, 192, 207, 102, 87, -124, 139, 127, 124, 91, -63, -14, 127, 40, 52, 4, -297, -55, 8, -210, 108, -61, 134, 50, 140, 9, 34, 124, 170, -201, -99, 60, 237, 2, -76, 120, -64, -27, 89, 381, 258, 93, 90, -117, 11, 56, 38, 49, -80, -117, 36, 40, -29, -206, 170, 83, 39, 180, 88, 0, -42, 158, 164, 307, -110, -88, 71, 8, 28, 123, -117, -10, -140, 248, 327, -6, 126, -203, -273, 132, -11, 89, 109, 21, 252, 31, -101, 51, 102, -62, -24, -140, -82, -143, -148, 412, 81, -3, 62, -100, -82, -94, 10, 14, -176, -89, 6, 32, -15, 24, -127, -32, -32, 25, -76, 85, 67, -86, -52, 38, 97, -20, 0, 59, 44, -18, 118, 155, 77, -185, -63, 268, -120, 165, -348, 5, 200, 49, 287, -194, 59, 48, -169, 156, -286, 220, -286, 287, -74, 59, 89, 49, -179, -45, 596, 15, -288, 315, 76, 92, 16, 93, 469, 99, 50, -236, -152, 388, 317, 206, 238, -104, 191, 569, -1]
7807ajM58n29J91N58o05j48j35N14Ok25n57N80L39l26L23k7o14j36N8lL91k3K83
7831C71l03j91K16k12K06K1j94K39j66j34J32k37M57k43K12j47M03K5o29K83K23
7852C32n02O56o17L24m0P2K51p11L49r3K22n07k07j84K99M00l16j18J48P23k79
7873B02O38l02m05J94o66K8M37M9j64P64M01p47k61n26Q29L32q19J37j54M7N96
7894F10p66K51k82K80k06m48M84R2J87K15k85k72L03m0N55m68K20l01k99mL98
7915B24l40J36J49l38M2K37k17l3K39m83M98O4j59J6J96l19K08n9l46J49J80j69
7937a25J86J28k85Q8K4k36M14k44Q9k9J05k16K45p9k20K63L9l6k19PR1q0L2K0
7961c8n6M3p8K47J13k71J58l97L39j28J13m5j91O9L10k49j01p1L34o9o4k8J0l1
$$ y = [-1, -2, 456, -73, 118, 676, 71, -77, -212, 302, 308, 83, -474, 106, 445, 119, 442, 415, -199, -335, -277, -280, 111, 88, 371, 68, -123, 93, -119, 87, 108, -86, 153, -13, -147, -15, -252, 205, -38, 174, 27, 430, 455, -174, 109, 332, -170, 486, -131, 193, 153, 225, 476, -235, 114, 21, 243, -264, -471, -655, -356, 44, -272, -390, -242, 481, 202, 840, 538, 133, 327, -339, -311, 126, 175, 11, 775, 1176, 429, 168, -358, 471, 803, -16, 121, -33, 14, 610, -156, 95, -187, 93, -113, -561, -77, 15, 202, 417, 132, -140, 163, 123, 678, 210, 430, 129, -170, -174, 224, -116, 20, 169, -169, -127, 110, -107, -140, 99, -384, 114, 178, 19, 35, 231, -88, 120, 61, -285, -136, 44, -125, 61, 189, -96, -8, 16, -220, 194, -50, 39, 10, 115, -101, 144, 65, -155, 108, 147, 111, -108, -101, -10, -90, -58, -38, -94, -51, -129, 118, 231, -40, 118, -279, 60, -68, 45, 0, -191, -122, 188, -61, -162, -233, 101, 32, -32, -60, -50, -81]
7985h1K30m0j49K54J40k73J23k71L6k4j1K80K06p47K79j59K66O7K56q61J90O18
8007C29l08j00K62K51n15j89J46L52l49L85m47J73Qk79M15m7J16k45K28j26R8
8028A58O0l06K86J71l41o1M57o65K80J2J12q39R23j89j41k72%K14L98o5l47L44
8050A89k83K45L98p25M61l68r7Q73p41Q35p82k35J96Q1m51O02l65K67O8j03J7
8071H2l4J74j40j48M0K32k88K5J67j51L80p21K29K9M29j18n15J23L55l07L40j1
8093A72k9k27J26m57M46k13M57k13j87q3J34J91q5J59j27k33K52jJ15j74K68m04
8115a13R4J0J4P3J81l64rj53N85l94J70j19N3K60k38j69J60o2L6k52K71J46o9
8138A11j38j55K55n7L0k00R9j53K76k51J92j1r6N3J10jr6J51MJ19j86j03Q4j83
$$ y = [-81, 149, 109, -40, 214, 354, 81, 204, -67, -31, -55, -66, 214, 420, -327, -48, -207, 59, 126, 382, -479, -289, 329, 21, -79, 183, 434, -81, -270, -124, 228, -121, 264, -183, -10, -2, -281, 134, 87, 203, -42, 186, 60, 158, 218, -88, 198, 369, 28, -33, 424, -241, 39, 51, 163, -676, 247, 58, -83, -355, -355, -141, 257, 192, -155, 189, -94, 151, 549, -176, 285, -83, -180, 693, -48, 787, 5, -230, -34, 47, -404, 198, -167, 100, 168, 65, 82, 48, 222, 82, -66, -26, 206, -82, -57, 110, -41, 339, -382, -153, -124, 305, 187, -328, -205, 150, -157, 183, 172, 143, -84, 42, -415, 31, -182, 275, 62, -125, -208, -74, 117, 32, 191, 64, -169, 83, 82, 197, 23, 291, -113, -19, -9, 5, 78, 259, -105, -114, -267, 318, -76, 94, -25, 28, 288, 50, -119, 41, -21, 15, -237, 34, 180, 111, -27, -182, 73, 16, 46, -154, -55, -208, 68, -183, 9, -2, -98, -45, 65, 64, -32, 119, 123, 242, 56, -47, 37, -146]
8162a46L16j74O1K4j45j66Q0J90J18j99J20J13j10j37P8P4J58j1j81p1J45j34
8184Ck02J34O7N9j7Qo8
$$ y = [-146, 170, -4, 57, 81, -64, -230, -150, 40, 158, -41, 79, 192, 82, -55, 23, 97, 255, 244, 63, -8, 137, 3, -199, -65, 2, 61, 44, 52, -16]
8191a6
$$ Imaginary data points
##PAGE= N=2
##DATA TABLE= (X++(I..I)), XYDATA
0@%%%%%%%%%%%%qJ6j6J6j6K4l2M0m8N6o4P2q8J04j21J45j68J92k23K53k87L27
34A74l70M16m69N28n91O60p35Q18r09J009j119J236j364J507j661J829k016K220
52A163k446K698k977L290l644M046m511N052n690O460p410Q614j0199J2393j5655
67h816K1088l2338R9639j80319r7870K08792j9539L7464Q9557l6804j41570p1099
79a31815K9151J69810Q0530j12098p8741K3397o7825L159J54480O2034q3952q8959
91d0829o4655K6822R6492O3305J0489n5891j20189k5126P4506P2213P8703j8350
103I7490j68712n0827R3451L4878M1333O0119p8727j11923L333L9216O5132Q8875
115A13638n3159j15106O528K251r494J12035O2591r0504q3421l5985K6754J10037
$$ y = [0, 0, 0, 0, 0, 0, 0, 0, 0, 0, 0, 0, 0, -8, 8, -8, 8, -8, 16, -16, 24, -24, 32, -32, 40, -48, 56, -65, 80, -88, 104, -119, 134, -153, 174, -196, 220, -249, 279, -312, 348, -387, 431, -478, 531, -588, 648, -716, 791, -870, 959, -1057, 1163, -1283, 1415, -1562, 1728, -1916, 2130, -2381, 2671, -3019, 3441, -3969, 4645, -5554, 6839, -8816, 12272, -20066, 79573, -100746, -198616, 10176, -9363, 28101, 117658, 80854, -60716, -131815, -102664, 67146, 147676, 35578, -43163, -19766, -87591, -84432, 70048, 132082, 48130, -40829, -105484, -78662, 17830, 81135, 91624, 35733, -84456, -109582, -35076, 37137, 115840, 97490, -71222, -122049, -28598, 6280, 47613, 107732, 29005, -82918, -79585, -40369, 24763, 113638, 60479, -54627, -48099, -45848, -55342, 56693, 119284, 28780, -54641, -90626, -63872, 46165]
127D6165M6269n6111l4114m1300o6670O0556J38827J1085r7319o8613k0L3044
139b8201K9093M6524M1744o7010j15260J2005R2362L0671M226J544n7715n9203
151f9220K560N8327Q6230N327r1063m8728N733R781O4461O7105m2034q2527k6296
164f0344O808M4422P5684L256o8808m3031j0693J6245N7382M1898j5248n0051
176b480n6429n424O3586M9593R25k0917m9652m6966K0309O4204M8118q221o3300
189f654n2267O384M2822M4823K4853k7021o3721l0722K5066M8552M3436o797n5797
202g043l1932j130J2754M8604M1957k4971o0588l2773J4327M6083L8019L602k8169
215A8740m9930l3390L2017O9395K4365l3561m4129l0117L222M2503M3902O133
$$ y = [46165, 92434, 36323, 2209, -39091, -105761, -45205, 93622, 104707, 7388, -61225, -61245, -28201, 892, 47416, 89160, 22150, -93110, -81105, 11257, 41928, 46154, 47698, -10017, -69220, -66660, -8333, 77897, 83224, -7839, -56567, -50834, -41053, 23408, 90513, 48479, -34048, -60344, -53536, -9114, 66570, 69826, 1018, -42013, -52706, -36461, 20921, 62819, 47571, -2480, -58909, -64333, -747, 48846, 49771, 28854, -20798, -67764, -47455, 16749, 64867, 56646, -6654, -58921, -52537, -9715, 35108, 59961, 32940, -30781, -61503, -36437, 12115, 55551, 48754, -7043, -38975, -40105, -27351, 21253, 63210, 38239, -22349, -55122, -40795, 5288, 43307, 46909, 18740, -31190, -64580, -32563, 36832, 61197, 27636, -16493, -46610, -43388, -885, 43017, 49150]
227D9150l4092n1208j7161L4793M0575J9612p391l8021l6856j290L0854M2472
239C1437K0081k8803m9941k1665J9859L9406L3711p38m1658m3106p497L5592N0698
252C7376J4033l5946l9603j6109R202L7713L4744l082l4997l7494q751L0312L8418
265B5816J2288j4323l1321k9599j440L5747M0760O223l3624m2793j1693K6654
277a7305L5302K1686n115m1094l9641P841M1739L4142k87l1034l0009j0285J1337
290b2723L2811L0215q777l8924k7619N443K4364K6610J3818j4641l4252k5797
302c9472Q309L9881L2186r458l2784k7844o510K3473L5403J6133j7631l8590k3834
315d0738J6262L5161K0721m629k3340k6216j0218J7401L3018J7941j2969l2848
$$ y = [49150, 15058, -36150, -53311, -18518, 22057, 41669, 34278, -3743, -40599, -41889, -11035, 31437, 51518, 22715, -27226, -48891, -29032, 10374, 44085, 43347, 1689, -41417, -48914, -13322, 37376, 51409, 15463, -24140, -40249, -31047, 6666, 41410, 38328, 3331, -34163, -42914, -12602, 25816, 38104, 23781, -7540, -37139, -38579, -2832, 37928, 44151, 10527, -32266, -43959, -17305, 17997, 39683, 34568, -6526, -46167, -38326, 3413, 37555, 37268, 6234, -23775, -34060, -22723, 10088, 40303, 31526, -7398, -35017, -29574, -5210, 21400, 35218, 20577, -13675, -39472, -31163, 8718, 40904, 31446, -1338, -29182, -35692, -12219, 23184, 39317, 21686, -16904, -40738, -24476, 10685, 31406, 26777, 3437, -22779, -32997, -15596, 17422, 35363, 22394, -10454]
327a0454k2014P221K4260K4534J0060k0077l5476j5479J7774L6208K0715j4640
339B2632l1450k0602J513K3808K9406Q321k2540l2704j1502J8269K7163J5203
351B7517o704k0774k1998p540J9282L1821J0134j7913k7631j5326Q832K3413K2558
364B5671L990k3979l2133o438K4098K9605R370j5957k4949j6675N055K4989K3672
377B6319N75k3984k5360l023J6111K1224J2603o001k2919j9547j542K2602K5426
390B2484M137j8448k3699j0875J1095K3672J8183m121k5765k1973N86K2046K3697
403B1019K962j6934k0106j0328P550K2493J7035k892k1924k0766J068J6242J7966
416A3385Q875p821k1285j7738L633K4949K0195l086j9228j8154o763J2094K2775
$$ y = [-10454, -32468, -25247, -987, 23547, 33607, 13530, -21946, -37425, -19651, 16557, 37272, 22632, -8818, -29420, -27907, -4099, 25307, 33628, 11088, -21616, -33118, -14849, 12314, 27517, 20813, 39, -21959, -29499, -10217, 21604, 31738, 13825, -13806, -29132, -20300, 3113, 25671, 29661, 5682, -26451, -32889, -8791, 20814, 30184, 14227, -10722, -27397, -22342, 2647, 26319, 26894, 2910, -22450, -25473, -9362, 11862, 24465, 18464, -4455, -24002, -25544, -2942, 22484, 26621, 8173, -15526, -26401, -15306, 8366, 26549, 22428, -3337, -25310, -24724, -2678, 21019, 23981, 7047, -13059, -23387, -15837, 6656, 23691, 20799, -1125, -21891, -20823, -4581, 13385, 22260, 14439, -6846, -24584, -20951, 3998, 24193, 21107, 1879, -16275, -23038, -10944, 11831]
429A1831J5340j1041k5869j5182O956K1103J6898j026j4599j7956r009J1214K2354
442A1014J0606q074j7608j4287o7J5596J7751O159j1337k0459j2543Q387K3304
455H442J3765o145j7577j6168k855J5559K0220P271j2992k1793r216R842J7985
468F338J1370l310j2145j5718o693J2600K0495O780j0450j5960j0464K374J3945
481h38J6690L948j4286k0451p199J4458K0138O016q231j3218j4146q29J7751J7704
495A7507O18j5727j5554k928Q401J3389R525j667j3669j5468j945J6003J5164
508A3649J632q319j3769r948L883J5981J4282j180j6568j5792p75J4134J5027
521A2237K902p146j3822j1370M234J7088J2244l127j3645j1645p35P232J1932
$$ y = [11831, 27171, 16130, -9739, -24921, -17965, 3138, 20036, 19010, 4411, -13545, -22554, -11340, 11014, 21620, 13546, -4062, -18349, -18416, -2820, 14931, 21090, 9753, -10706, -23249, -14862, 8442, 22207, 16062, -1515, -17683, -20538, -4979, 15241, 22512, 9520, -12273, -21489, -11647, 6338, 17708, 14398, 2253, -13465, -20158, -7558, 12937, 19717, 9267, -6693, -17157, -14783, -838, 15852, 19800, 5514, -14937, -22136, -7678, 12460, 18476, 10245, -2973, -17119, -17948, -197, 17507, 18125, 2398, -13156, -16084, -7683, 5706, 15231, 13564, -105, -15573, -17518, -1515, 13649, 15281, 6962, -6807, -16755, -12872, 3109, 17391, 16211, -357, -16149, -16924, -2790, 12237, 15139, 7993, -5829, -17199, -12965, 4123, 16367, 13240, -405, -12050, -12785, -5553, 6379]
534F379Q671l629j5134j2849L079J5650J0805j31q318j2969q180O808J7174J0747
548A8103p301j6154r460K706J2552J1049J707p413j4238q058R070J4441O444m547
562H901j0042r432j760Q433J2373O122o849j5096q140O820J2984P584n89r360
576A949j2772m245J0282J5328M830r652j3272m639M051R342R927R84j0124j2143
590a0154l160R430J1387L568m449q351q590j352J0071J2609J957r507j1606m663
604a2810O603J0728P392k005j0320j2285P29J2139R698J376p860j0030m329M024
618f950R878Q548j802j1006q623L02P532Q483M241m297j0471p003K155J0371R556
633A0914o29r760q759k754O409J1193M547m194j0874p934L112J1119P220j172
$$ y = [6379, 15050, 11421, -3713, -16562, -13483, 2167, 12972, 12841, 4523, -8446, -16626, -9818, 7356, 18103, 10802, -5352, -14812, -12106, 446, 11495, 13202, 5789, -8449, -16507, -7437, 7004, 13448, 8901, -1141, -10573, -12333, -3900, 8473, 14595, 7746, -7350, -15490, -8670, 4314, 11898, 11309, 1949, -10823, -15068, -4786, 10542, 15372, 5720, -7552, -12191, -8140, 1202, 11129, 12113, 1989, -10154, -13314, -3884, 7503, 11071, 6622, -1729, -10319, -11671, -1600, 11009, 12966, 3459, -8147, -12810, -6207, 4521, 11913, 9908, -412, -12697, -11968, 171, 9869, 11245, 3385, -6645, -10974, -6950, 2928, 11476, 9674, -1332, -9955, -9653, -2121, 6362, 10603, 6306, -4165, -11168, -9013, 1358, 10914, 10285, 525, -8234, -10988, -4579, 6614, 11161, 6967, -3907, -11841, -8729, 2390, 9610, 8438]
647H438p087p782l383M534R885N829l179j0054o810K183P034O232L992m615j1186
662e969n736N602J0151O107k912p917p201j743P336R791L071p035r309l903M495
677e172P662N868o78p554p052k122O275Q708K919m287p391n600J413P485P324
692G798J244p061r351k448O591Q428L584l306q013n978J281P356P578M55o766
707A392p769j383M387O556M418j169p313o437n3O106P808J574n602o498l897K206
723e674P441O732q71q282p556P13O634O815J590m167o684n013K546Q387N429k118
739E922o387n431l99L774N577M380k220p439n475J843O444N813L43n157o257l173
755g842L877P645M697k683q651m535K250N421N387R60m587n870l350L169P348
$$ y = [8438, 1351, -6431, -9814, -5280, 4605, 10434, 7255, -2799, -9609, -7426, -392, 5840, 9832, 5217, -5969, -11705, -6103, 4048, 10155, 7243, -674, -7875, -9618, -2282, 7509, 10580, 3545, -5764, -9667, -5172, 2490, 8358, 7680, 126, -6926, -9048, -2773, 5935, 8854, 4567, -2824, -8424, -7011, 474, 7798, 9042, 1981, -7370, -9818, -3227, 5201, 8785, 5479, -2534, -8512, -7231, 125, 7703, 8158, 1392, -6377, -7760, -3373, 3183, 7601, 6432, -881, -7318, -7371, -1265, 6543, 8117, 2515, -3983, -7880, -5674, 1767, 8499, 7628, -654, -8210, -7497, -863, 5952, 7542, 3375, -3309, -8322, -5776, 2611, 8040, 5922, -465, -5896, -6295, -2521, 3056, 7436, 5216, -2223, -7698, -5855, 589, 6402, 6745, 1588, -4669, -7842, -3965, 3680, 8377, 5694, -2957, -7492, -5242, 179, 5566, 6526, 1939, -3931, -7281, -4112, 3236]
770C236L599k679n160m300j90L851N711L181l524p414l445K639O332M350q36m830
786E21n853j897M945P248K255m229o591k563K645M440M412L75m810n546j769M113
802b304O000K153k899m377l464q8L927N862K248n371o235j834L365N883L103j831
818D138m792n165R9N567N419M67m496n016j563K576M568L474o64m822m824j11
834e145M364N004P57k613m639l008J264M584M957j9n461n194K42L596M685J917
850E291k357n024l464J476N289L625l56m288l970n13K339L924L201j802m709l292
866d630O12L820M099P81l030m786k142K560M698K979j086n094l531P07L914M212
882D083M87k838m438k227K332M726K151q97l781l118j12K254L971K168k446m605
$$ y = [3236, 6835, 4156, -1004, -5304, -5494, -1643, 4068, 7249, 3725, -3689, -7134, -4495, 1837, 6187, 5351, 521, -5332, -7229, -2284, 4964, 7219, 2990, -3601, -6164, -3519, 921, 5333, 5708, 898, -4648, -6417, -2304, 3696, 5849, 2950, -1427, -4891, -4979, -1052, 4810, 7058, 1687, -4548, -6382, -3017, 2866, 5969, 4138, -654, -5819, -5720, -153, 5266, 5733, 1237, -3779, -5342, -2766, 1802, 5276, 4612, -210, -5034, -5145, -781, 4223, 4980, 2367, -2272, -5280, -4016, 568, 5525, 5506, 45, -5149, -4907, -1311, 3374, 5291, 2934, -2090, -5554, -4078, 1211, 4836, 4480, 192, -3778, -4291, -1952, 1972, 5173, 3371, -1338, -4630, -4018, -198, 3901, 4682, 1652, -3134, -5276, -2716, 1982, 4961, 3875, -1219, -4750, -4043, -129, 4083, 4570, 1732, -2706, -4933, -2601, 2125, 4276, 3379, -402, -3520, -3632, -1378, 2593, 4761, 2315, -2290]
898b290k069J276L938L398l20l338m378p37K832M495K149k241n066j924J292L644
914F61L363n65k968l596o36K336L764J536j502l375k322k53L236L418Q37k651
930A283l809j702J918L871K558j116l642l135M63K972L238J189k757m002j110
945c781J741L461J906m35l103k961l37K810L092P94j299l505j753N01L155L100
961C386Q0l180l616k83K321L395J873j691l531k732J362L070K280N73k740l088
977b521o32J688K914J721j107k705k163j22K925K681N26j834l409j305J378L102
993A137K410r85k945k768M0K852K638R19k091k905j432J445K798J660k70k657
1009a54k488j09J753K462J514j060l271j540N34K898K034L23k112l305o27K134
$$ y = [-2290, -4359, -3083, 855, 4253, 3933, 595, -3783, -4520, -1688, 2807, 4956, 2715, -2351, -4275, -2983, 661, 4024, 3459, 491, -3105, -3741, -1405, 2359, 3895, 2393, -982, -3304, -3557, -321, 3097, 3934, 1283, -2526, -4228, -2310, 1561, 4119, 3003, -639, -3774, -3311, -339, 2899, 4088, 1331, -2671, -3781, -2040, 1421, 3327, 2892, -211, -3172, -3509, -699, 2393, 3187, 1888, -1617, -3370, -2869, 286, 3386, 3466, 286, -3330, -3613, -1292, 2103, 3976, 2285, -1246, -3978, -2616, 454, 2734, 3307, 567, -2521, -3153, -1465, 1449, 3170, 2063, -642, -2805, -2927, -2, 2679, 3205, 1371, -2038, -3343, -1965, 1137, 3547, 2562, -383, -3151, -3111, -259, 2379, 3298, 1207, -1698, -3130, -1685, 1113, 2773, 2503, -154, -2642, -2751, -998, 1464, 2978, 1918, -1353, -2893, -2359, 539, 2573, 2896, 784, -2521, -3148, -1014]
1025a014K758J323j285k945j777O76K287K852k82j982k923l58J586K242J477q13
1041A822k150k275M15J973K401J92j352k399j279J056K431J766j91k622k322M45
1057b089J864K258R71j927k506o83k45K788J856p72j432k413j37J828J931J487
1073B779r13l074j140Q22K143J867O94k642k892k80J195K492J306j83l403j757
1089b986J133J931J835K03j551j807n96P4K852J538j335j286k416K26J346K757
1105A918L72j562j608j817R93K450J646o46k040j467q84K566J503O58j067k108
1121a093j753J889J622J478k25j474j973j076K210J534R56q24j328j690k63K186
1137A76J652K24j588k059k84L80K612J057j015j574j248j03J852J663N46j725
$$ y = [-1014, 1744, 3067, 1782, -1163, -2940, -2264, 23, 2875, 2593, 611, -2312, -2670, -1084, 1158, 2635, 1822, -328, -2603, -2188, -215, 2186, 2378, 1026, -1373, -2652, -1596, 835, 2601, 2410, -212, -2534, -2089, -225, 2033, 3004, 1077, -1429, -2112, -2357, 431, 2287, 1515, 83, -2330, -2467, -639, 1292, 2779, 1866, -1208, -2348, -1526, 617, 2484, 3178, 536, -2356, -2636, -1441, 1051, 2357, 2174, -1229, -2986, -1853, 78, 1913, 2116, 565, -1242, -1838, -1764, 1088, 2626, 1291, 5, -2411, -2185, -839, 1918, 2290, 728, -880, -2697, -1704, 746, 2392, 1746, -294, -1761, -2645, -79, 1424, 2082, 1015, -1093, -2846, -957, 665, 2143, 1918, 444, -1529, -2605, -395, 1139, 2095, 1271, -57, -1747, -2010, 176, 1828, 2052, 464, -1595, -1879, -1499, 1113, 2170, 1155, -419, -1667, -1770, 82, 1745, 2291, 566]
1153E66k176m47R74J522P43k59j386j016m34J915J226L99r42j732q73N45J417
1170D2K121l74j573j384n66J187J665J047j421j412o54K5J947J340n97j301j520
1187a428O5Q08J027J042m76j930r79L90J919Q47M80r38j438j612Q37K161J105
1204A880o75k011j008K78J483J269L48r89r71j374P27J717J166q21j088j098L81
1221g86M05J195P42q07j590o90L99J704M98J7p71j049j004J206J739O88j165j498
1239g67p24O44J180P66M0q69j151m58P78J483L74l25j485o09J08Q27J177M75r11
1258E53j563l12L28J725N86m75j132r53p6J217J315J32q13j367m05N94J043R26
1276A323m33o60j396n1J031J141J43l62j093r73M01J071R41J00j225r44k01P85
$$ y = [566, -1610, -2057, -1083, 439, 1182, 923, -463, -1479, -1913, 2, 1228, 1627, 685, -1047, -1920, -1375, 42, 2163, 1789, 216, -1168, -1734, -547, 1118, 2165, 744, -668, -1322, -1297, 650, 1990, 1393, 92, -1428, -1363, -555, 472, 1514, 1038, -892, -1871, -1481, 438, 1285, 1765, 827, -611, -2223, -1386, 775, 1880, 1205, -806, -1814, -1536, -53, 1216, 1564, 575, -396, -1770, -1043, 674, 1840, 1019, -69, -1167, -786, -381, 814, 1556, 749, -841, -1531, -1132, 572, 1070, 1087, 316, -733, -1737, -531, 1208, 1896, 731, -767, -1491, -847, 333, 1099, 1139, 270, -881, -1339, -561, 922, 1296, 971, -514, -1123, -1015, -188, 989, 1464, 553, -1010, -1322, -994, 731, 1317, 842, -290, -1243, -1319, -102, 1213, 1345, 532, -835, -1240, -646, 397, 1323, 890, 230, -1166, -1217, -186, 955, 1098, 736, -357, -1330, -929, 142, 1083, 1183, -42, -986, -1187, -402]
1294d02J044N70l39j226q91J65J244R29k64n16j273l7M54P97Q28k41j047p66O1
1313i10Q04P69M54o38j051m95N55J040P75m38j037o21q8O38J349J30p82j097n14
1332a157N55Q57O08j6j004q48N7N04J040N92q53o32r20K42J180O91R9p63j294
1351a062k49J032P35N65m67j030m10K76P70R57L8j164p25j92N12O42N26r6r59
1370c01o44L43O05R73j38n29p91k95K25O67P45l0r87q79R0J031M58K83k91j227
1390f92l49O81O98O75l33p49o45R8O45K97O10l19r35n84K30Q95N24j13j41j025
1410e32l96M69P88N86l18j148j44J89P03N89k77k86o76n71N20R31N58o69p69j30
1430e83j94Q51M43L39l43j080l10K54J142J7J86o07o99k82O11R79J4o25o78j71
$$ y = [-402, 642, 1212, 873, -353, -1244, -1079, 165, 1094, 830, 314, -959, -996, -542, 255, 1083, 842, -205, -971, -910, -106, 663, 1117, 479, -572, -1067, -512, 528, 1303, 865, -172, -793, -881, -243, 1106, 1236, 454, -643, -1157, -602, 255, 863, 847, -157, -1005, -948, -444, 596, 1188, 335, -297, -1217, -975, 205, 896, 995, 232, -1062, -1311, -279, 456, 1021, 554, -476, -886, -610, 160, 1117, 1155, -9, -734, -926, -414, 228, 754, 658, -301, -945, -602, 3, 976, 838, 309, -482, -777, -552, 115, 860, 830, -157, -1036, -946, 85, 543, 826, 535, -692, -1041, -360, 338, 1013, 680, -69, -714, -616, 29, 326, 936, 617, -318, -902, -672, 223, 747, 634, 493, -532, -928, -459, 329, 915, 597, -551, -695, -506, 197, 786, 509, 223, -453, -1024, -504, 427, 985, 316, -453, -583, -777, 74, 517, 856, 513, -567, -877, -623, 519, 536, 722, 115, -584, -866, -255, 724, 738, 113, -565, -736]
1450g36K89O61L81K83o30p04k80L76J022j4m72n47p3J28L23M99M45p18m93k21
1470d81L74N92J60k88n55m76j10Q52P47K7p36q01j5O45L88M86n61m28m79O5O01
1491GP38k25k66q52P7J14P43L95j7q60p55L65N73K57K66j09n20n62j25R56M17
1512F17k82m29m51mM28M02J87j6q58n03O33K31O08K1l38n04l85L37M17P48l33
1533E26p55l02L37K25K09J99j55o29l01L47P21J46k17o06rk41L24N61L11l03p10
1554c22l24M26N35K35j52k56m93l20N15M71J19k36n40k05L39M4N99pm28l65j32
1575d97M5Q74r1j17m32k17Q0L10N71p7j45o99m9K21M50Q2J09o28k74k04N53N88
1597D53J85n12n64QK61L06M00k90l56k66N6L06K95J81m06l55k10l2O27L82l4n23
$$ y = [-736, -447, 214, 595, 878, 248, -456, -736, -360, 662, 648, 176, -371, -444, -316, 7, 506, 951, 233, -260, -481, -107, 485, 645, 357, -198, -674, -784, 68, 815, 842, 106, -695, -710, -65, 323, 809, 248, -180, -659, -594, 7, 745, 520, 254, -598, -521, -407, 336, 731, 714, -146, -901, -536, 37, 294, 560, 451, -69, -631, -756, 200, 617, 335, -94, -545, -549, -121, 281, 468, 452, -406, -909, -276, -45, 563, 584, 246, -258, -643, -306, 111, 859, 526, -229, -531, -194, 31, 240, 439, 284, -345, -646, -299, 422, 568, 351, -255, -264, -505, -181, 380, 691, 388, -322, -646, -220, 315, 550, 398, 142, -351, -671, -156, 315, 434, 198, -342, -547, -208, -164, 435, 428, 0, -365, -497, -452, 422, 331, 214, -218, -435, -355, -45, 526, 449, 304, -395, -444, -223, 227, 309, 418, -210, -484, -688, -135, 453, 638, 126, -438, -430, -169, 137, 537, 247, -109, -375, -319, -13, 282, 463, 57, -298, -508, -540, 87, 469, 435, -88]
1619h8l23J00K31K90K84j38o12m26K57N70M07k70l63l70K76r8L51N45l75n22j32
1640d06K6L84L75j17J03o55r9K55K55M14k80m45J18j87Q4M09K24l48k33m12M05
1661a30L17J33O1l31k41l14K75N61K3p78L22j57k55M99L71j31k28l83j23O40K27
1682C58K23l19n37p4j79N75L63J00o77k26O9N42M3k2J21m78j48k05M62M06j06
1703B91k80m5q8j10J94N17o0p00j49K31K44j23K56j12o4k34O7J64L89r0m93j18
1725c13M17l10J05M91j56l82m61O06O18k47q7p9k5l65k37M74M22j77o67K0J81
1746a72L68n94N91J08l96l32N06J96K73o16j50Q7j79P3L91K96j2o54j43J68L83
1767A92J54l81l2R5l64J2O39K36m96l56k3M97k79k01M95L19o67m30N41L92r3m28
$$ y = [-88, -411, -311, -80, 210, 494, 356, -256, -682, -425, 145, 552, 282, -81, -451, -175, -273, 78, 623, 248, -274, -406, -380, 4, 379, 262, 365, -290, -389, -134, 121, 535, 255, -190, -72, -259, -175, 234, 458, 110, -123, -535, -130, 187, 320, 381, 50, -191, -505, -230, 331, 354, -424, -102, -259, -514, -15, 356, 225, -3, -386, -509, 131, 358, 581, 262, -275, -349, -528, 47, 410, 510, -167, -393, -324, 218, 261, 239, 360, -118, -266, -471, -9, 397, 291, 11, -34, -122, -232, -38, 479, 419, -281, -430, -199, 45, -78, 178, 66, 2, -232, -165, -1, 388, 298, -195, -313, 104, -206, -101, 390, 234, -148, -609, -3, 615, 368, 281, 202, 177, -188, -425, 49, 471, 294, -373, -353, -172, 196, -398, 193, 301, -95, -427, 79, 275, 548, -68, -218, -131, -310, -237, 154, 450, 438, -216, -359, -191, 192, 346, -35, -67, 28, -336, -324, 315, 551, 55, -301, -324, 173, -106, -307, 188, 507, -160, -590, -49, 343, 250, -178]
1789a78J96R9l65K6M19M54n60n23J08O90k72k50L21q3j58o16O82M27J01q65O2
1810b85L67k0k70K78L16K2r05Q8O67P4k21j41J96k92k33L25L79j74l77k07M77
1831F4J71k87j21M42M7p95J93K77L64k7p13J27L98l45J15K48L77m80o57P09L53
1852D60j28o14L34m2m91p5P80M76n04p13K25M80j90Q2L27J85n76l25R8P09k18
1873B80j68l33N44l02r9k40Q88j41r84J49M88J54m31K11J87j03n33O7Q52q6o68
1894b68M9J64K00l23m7N86P0o93j32P26J41m92l07N96k3p93J76O73N48p59q25
1915g33P51M09l98j36K48J52m06l79O73J35j70n73K12K54J8m29N98L19o36m31
1935e22L12O72j24m76j12N30l81k07K65N09J15r37J50M36J67m28J24L30M1j200
$$ y = [-178, 18, 117, -248, -222, 197, 651, 91, -432, -324, 366, 94, -156, 165, 82, -76, -692, -10, 417, 518, -347, -285, 82, 62, -208, 70, 386, 408, -497, -409, 258, 332, 111, -30, 166, -126, -359, -34, 345, 171, -206, -413, 64, 235, -52, -173, 269, 316, -479, -286, -9, 355, 328, -385, -258, 140, -205, -90, 158, 535, 55, -602, 107, 460, 332, -282, 52, 10, -481, -556, 224, 700, 196, -517, -292, 188, -2, 80, 407, 592, 16, -309, -211, 498, 280, 112, -221, 323, 21, -78, -318, 570, 429, -555, -406, 82, 236, -195, 16, 203, 100, -433, -366, 486, 400, -268, -219, -55, 145, -178, -225, 361, 431, -262, -394, 332, 473, -19, -326, 270, 247, -546, -370, 303, 851, 92, -733, 18, 427, 29, -107, 141, 293, -113, -492, 181, 316, 146, -427, -215, 39, 57, -372, 226, 545, -91, -522, -210, 462, 338, -138, -250, 280, -101, -308, -43, 466, 581, -356, -206, 230, 397, -31, 93, 423, 464, -736]
1955g36K34Q26J64m77k67M01J4n50l4P96K02p16l80P43J69m38j46K41K78o06K2
1976b60L71N61p88m78N05L33l99j79N56L42o38m48M28M08o18J66K24L61n11k62
1996c26K42N14m42n23L77O86k47o01L93M34m98k90K86M92j61n39M5L69k3j88N6
2017E6J43R9o96o5P35r7n93L70L86m20l53Q4N52K35r12K10M88J21o66K47N33k79
2039A78l53k93N22K81k01l73L17J49l20j89L56M36p90j45K80N96m22l11K34L24
2059B76m27k51L72J91k09l46L49J19j21k92J99P22m86o13J83R41n47m35L76L27
2079C28l04m02M75K73j71n73K48N81k02p09M29M87l82m06J20N67Q9n40k06O37
2099C39j29l50p9M94K36q50L9K43M12p95K60M25k8l47j12P27k53k64m12L35M39
$$ y = [-736, -502, 324, 488, 11, -256, 145, 159, -391, -425, 371, 573, -143, -523, 220, 389, -49, -195, 46, 324, -282, -260, 111, 672, -116, -594, -89, 244, -155, -334, 222, 564, -74, -522, -94, 314, -304, -138, 86, 447, -64, -326, -84, 430, -12, -535, -158, 528, 281, -320, 73, 507, 9, -281, 5, 497, 336, -203, -158, 211, 188, 0, 56, 199, 298, -398, -463, 272, 175, -418, -48, 338, -82, -435, -351, 201, 436, -476, -266, 222, 343, -323, -76, 457, 178, -175, -468, 54, 335, 134, -239, 78, 227, -93, -282, 74, 510, -280, -425, -145, 451, 29, -282, -48, 276, -151, -402, -30, 161, -48, -394, -45, 74, -47, -339, -140, 582, 96, -517, -334, 607, 60, -375, 1, 328, 24, -378, 97, 370, 199, -374, -126, 455, 253, -456, -27, 460, 78, -328, -208, 359, 448, -92, -298, 339, 210, -140, -219, 275, 511, -339, -300, -57, 355, -440, -180, 245, 217, -130, -242, 485, 232, -32, -444, -109, 330]
2120C30o09p5R24Q4r70l20R06N8m60J7M8P65j174o5P75K37q61q46J281K82r38
2141f11M64L72j44m82O2L25M11j63p21M08K93m25k66L47M21j78p89L95O17k59
2161G7j87o7L95qm55M2O67K6q54K16M61J38q44Q4O58k46m86Q8O97r6m14l80P01
2184B13K38q26K18M79K5m67n70P18M51n47p9J19K25k41l72K00O48l68n17L60L89
2205B96k20k89M67J80m10j94K03M71j02p72K22L77qo32M98M85l46l05J4L67l85
2226h3k01n0O45j94n90K98M78j19m70R7L30m4l59k6O71J95r81J42L45kj68N7J21
2249I2Q2m64k23O43L49n30n89O70M25m85j17N8L70m85k40M92N9k37k07N61Q6o19
2271c09l97Q35L21Mn95MR04n49m03N00k8K5l94K70L68k80q97M08K25M0l85N10
$$ y = [330, -279, -354, 570, 654, -316, -636, 270, 328, -132, -115, -67, 698, -476, -541, 234, 471, -390, -1236, 45, 327, -611, -147, 225, 81, -401, -339, -14, 397, 234, -487, -79, 214, -211, -477, -130, 291, 113, -676, -281, 336, 77, -110, -177, 218, 210, -245, -203, 464, 490, -364, -148, 313, 451, -393, -309, 349, 103, -383, -295, 402, 306, -108, -488, 213, 451, -375, -157, 322, 347, -120, -690, 28, 479, -68, -147, -28, 197, -44, -416, -216, 432, 64, -453, -93, 296, 76, -213, 254, 434, 24, -170, 33, 504, 402, -370, -148, 229, 221, -411, 87, 572, 226, -79, -65, 302, -83, -284, -334, 311, 117, -473, -175, 303, 184, -286, -189, 141, 97, -262, -288, 383, 578, -403, -261, 84, 82, -86, -29, 92, 174, -290, -513, 130, 479, -51, -640, 30, 455, -30, -147, -89, 281, -204, -444, 48, 107, -130, -337, 224, 310, -309, -706, 129, 450, 454, -141, -137, 767, 218, -185, 315, 287, 312, -82, 188, 556, 276, -621, -213, 12, 52, -333, 177]
2293A77R2J90j168N68K17l9k21J2M11J75o70M52J79q6p15K41L24Qn36m0P69l92
2315e2p8k59M31j52k49o2O49k05k94j46M66L3J9m62N68k24J14l91K84M10m71j79
2337b50M67O8m85n1M2J81K74o48L23L37k23m58O72L36n61j03J18P1J21o41M67
2358E7J30l6m2k47K3M40k44MJ76L47j183P16j71J41l8m64K34L27L0j92k04k38
2380d34O21l96K49Q0j2p8j69J83l42J92P5O79l83o64O69k09R8K44k49L87k56q98
2402f13J078q10J98J65M99r21R82n66J58O79o31o76N13N2M67o51N73l03j88l81
2422c76L77J71n4n6j56K14J91m37j74L88L76p79L87j04N9k0j50L49j41Q4jJ21
2444B69n5n09N3M93m09J41j1L9K24k18k5r8J95k86KP2K60l02K81j79J79m4k10
$$ y = [177, 269, 459, -709, -141, 76, 37, -184, -172, 239, 414, -256, 196, 375, 289, -426, -185, 139, 147, -389, -429, 340, -52, -130, -389, 42, -110, -359, -421, 228, 23, -271, -417, 49, 82, 101, -361, 207, -17, 97, -294, -10, 400, -71, -250, 217, 285, -200, -251, -209, -28, 246, -402, -79, 258, 35, -423, 249, 585, 24, -79, 39, 110, 231, -410, 57, 187, 151, 109, -138, -115, 325, 81, 85, 261, 608, -575, 141, -30, 111, 73, -391, -157, 170, 200, 8, -196, -434, 187, -209, 40, 120, 108, 30, -139, 44, -298, -106, -31, 648, 265, -399, 270, 61, 159, 403, 154, 541, 285, -613, 465, -345, -147, 18, 517, -404, 578, 12, 170, 849, 218, -458, 55, 107, 574, -77, 496, 193, 5, -376, 1, 172, 118, 62, -94, 120, 311, -126, -300, 88, 464, -315, 72, -32, 27, 7, -143, 206, 65, 149, 148, 269, 214, -295, -242, 251, -158, -17, -28, 11, 235, 17, -8, -106, 89, -197, -195, -123, 137, -165, 116, -63, 116, 72, -138]
2467a38K41R2k32K7p4N8l2j33K28L51m75j58R5K50p4k53N29p8j85pj48J25J85
2490A94m8m4k15L3PJ19k0l5k87J02J24P3k98L26M5j06p3J76Q9J11m17R8K00l6
2514A18p9J2j11J81k85R4l08L21M31r31O17k2K5R8l61K36L2n50O32o8P3l67j71
2537c83R28l56K13j89k71K73q23N92L49m14K63k9k24J22q23O74j34N05k50O7O
2558I6k27P66j289N66j18o7O21j23l28K97n50J75J282n61l50L82n01J25L3K91
2578E20o92K41n20K02J64J78o59O12j93l76N36m59NL78N24m64ol76K87P23l15
2599C10l01k51K01M13j42n61O39n75K52J43j76O41m90k39j98N14m60K77J89m21
2619b35P68o75j87N90M12n45k12l17P43r5m55N09p02Q67m80j93j04Q41j323J534
$$ y = [-138, 103, 195, -37, -10, -84, -26, -58, -191, 37, 388, -87, -245, -150, 100, 26, -227, 302, 224, 39, 32, -116, 9, 194, 146, 102, -113, -80, -73, 46, 26, -9, -296, -194, -70, 3, -295, 31, 76, -30, -103, 73, 162, 273, -144, -46, 154, 118, 39, 51, -60, 121, -164, -70, -378, -57, 374, -557, 60, 38, 63, 161, -200, 36, 68, -482, 150, 82, 155, -212, -383, 545, 189, 402, 213, -58, 215, -608, -16, 333, -81, 182, 153, -71, 51, -772, -98, -232, 273, 23, 90, 96, -131, 635, -654, -88, -206, -273, 348, 225, -103, 194, -356, -181, 1101, 540, 190, 572, 71, 196, 229, 520, -172, 69, -451, -249, -85, 93, -566, 46, -147, -523, 13, -446, -441, -63, 461, -3, -9, -385, -98, 625, 310, 9, -242, -41, 372, 230, -331, 308, -267, -15, 128, -48, 593, 103, -136, -334, 180, -280, -3, 186, -235, 533, -142, -329, 261, 673, 128, -84, -401, 342, 247, -208, 301, -401, 466, -14, -207, -311, 530, -793, 741]
2639G41r14L55L2l3L74m62j98R4J99j23P8r90J056J97r85P32k10n74J6N95O2o30
2661e88M06M36j47Q9j96J6L11j95q9n3l31L77k43P0L13k59J58m65kJ67O9P30l53
2684B21j038R46J25P9n02K30J32k79j94L53q3M8M19q08O53k97J94O80n53P8m27
2705b3M21l93M78n66K44m37Q64m86m79j35K96r9O23l54L27m75M14l40L79M8k58
2726D9j45M03k4l58K80k85j39J21K12M0M2n08M82r9J97lj32j23M7j67o6J47N5
2749B6k53N89n74L80j26j69l29O89k44J35m37J51M07l07L02l12n3J97k24JL88
2770B37j97j04k1o6K93K75m54L07j9n81K51J16J65k06K8j89l5K65Klq2J2j19J58
2794C3K6n7O4J01q3n1n5j92K12Rj15J26n7O0R2J57m28J97p7j40K72j20l1L0M6
$$ y = [741, -173, 182, 214, 181, 555, 93, -105, -11, 188, 65, 143, -847, 209, 406, -579, 153, -57, -631, -615, -20, 42, -588, -182, 254, 107, 196, 0, 16, 327, 132, 43, -10, -341, 36, -207, -137, 176, -83, 75, -390, -392, -225, -156, 574, 221, -817, 129, 254, 333, -169, 61, 193, -86, -280, 73, -10, 38, 457, -351, 302, 5, 199, 879, 326, 404, -23, 398, 5, 483, -83, 161, -276, 588, 102, -377, -512, -216, -315, 308, -46, 281, -194, 220, -120, 259, 307, 49, -96, 307, 283, -75, 205, -80, -219, -98, 114, 154, 196, -312, 170, 71, 268, 265, 133, 10, 57, -110, -176, -29, 26, -227, 362, -212, 168, 42, -127, -456, 233, -11, 124, -313, -162, 245, -62, 240, -72, -125, 72, -152, -151, 237, 40, -64, -85, -151, 142, 417, -37, 270, 251, -330, -79, 37, 202, -4, 24, -165, -200, 65, 67, 64, -18, -6, -125, 33, 59, 2, 66, 167, 84, 33, -22, -214, -2, 7, -108, 18, -39, 21, 113, 270, -158, 39, -38, -178, 94, -26, -57, -27, 19]
2819A9J57k02n9J29K4k7J41l98J90k55q0L86J34k68J56K8k46K93K1j13J88l62
2841a44j81M41j17O4lL23j79j00j16l1J07j33Lj35K48pp6M5q7J37k3j06K68m0
2865A58j48m1P3O1p7j05Q5O1l7J68Oj21k2r5J6N8J6j20n1P3k41J05K59n0J40l15
2891a44L09J4j20m2O3l0%r9J8J92o6m3k43K40j70K35R3j30J23l16K27l02L25j30
2915Dk52L77K6j76j12L78j70R8k36Oj84K59M6j50P5R0q1j94L47L2j96K36l16K25
2939A32L1k21L1O5j19j1k7j28M86j57L9k29K51j46J71j46p8o4q0J75l8L1R2k28
2963a68P6K6j8J2J48j71K2K68j53J8j18j28K86M1l00J31J28q0j67L58k36j72K07
2986A0k2k4lJ82j51j60J54j27J66J9k43K16k7j86K19n9m9P6K9p9k0LK01r1j15
$$ y = [19, 176, -26, -85, 44, 68, 41, 182, -216, -26, -281, -361, 25, 159, -109, 47, 75, -171, 122, 143, 30, 218, -144, -325, 116, -1, 63, 60, 383, 204, 104, -12, -43, 64, -69, -66, -201, 47, 40, -36, 9, -78, 59, 36, -70, 198, 158, 10, -31, 42, 103, 26, -79, 6, 67, 30, 198, 204, 83, 61, -34, -18, 40, 56, -64, -115, -42, -283, -178, 81, 31, 171, -144, 165, 179, 59, 17, 80, 50, 50, -49, -31, 161, 95, 52, -191, 49, -121, 114, 207, 77, 200, -116, 111, -191, 134, 4, -248, 129, 155, -21, -133, 245, 75, 173, -63, -57, -241, 18, 64, -86, -11, 79, -2, -196, 151, 183, -13, 223, -93, 132, 163, -58, -27, 38, -81, -92, -119, -247, 239, 82, 121, -108, 143, -3, 168, 22, -56, -120, -200, -25, -63, -32, 60, -168, -92, -66, -84, -72, 76, -95, -73, 195, 42, 60, -58, -186, 100, 141, -159, -28, 100, 20, -147, 211, -25, -197, 10, -12, -36, -39, 143, -8, -168, -14, -141, 25, 44, -199, 17, -10, -196, 23, -36, -85, -9, 20, -59, -79, -76, 125, 34, -81]
3011h1N1J95j26J21kk06P1r5K80m47J98K2R5o7o6K78j51j55J61j42j61J22L91
3034B86j24k24j2L3o2K63M6j81L0P3k10J6j59K17p0J66k29J68j14J41j52o5k7
3057a90j08J89j43J32J76Kk15L85k30o4R8N3q5K8n6k8o8J11K9LP1q1J1j36J24
3082Hj49N1J9O0J23k5j00m1J70R5r6r2j29j80J54J0L34m58K94O4n9L8nj64Q6J76
3108A84k37J82m1k73J94Q3q7k19K38j43J05m0j92L90m6k20J88j36J00P7l0j82
3130a05K87l37J84J58l47j86L00J54r5J50m68K78K44j40q3j62P6o2P4j18K77j40
3152f1K52m19K09K87p9q8k58J52k0j5n7J77J2j14LKp6o2L4K17o3k78K22j90J61
3177e2RK29j15o3l0p6J27p2r3O9l5k7J61j65J93j11J2N8kJ68k07K33k43M1J12
$$ y = [-81, -30, 165, 39, 160, 158, -48, 23, -72, 208, -239, -41, -19, 76, 9, -57, 221, 70, -85, 76, -66, -227, -105, 286, 162, -62, -74, -41, -103, 160, 206, 25, 55, 128, -82, -66, -225, -8, -78, 88, -141, 27, -87, 54, -98, -163, -190, -298, -109, -252, -120, 56, 58, -157, 228, -2, -66, 32, 85, 0, 28, -28, -56, -124, -13, 16, 19, 90, 9, 20, -116, 8, -141, -90, -71, -11, 112, 87, -13, -54, 116, 211, 115, 23, -106, -286, -132, -122, 212, -246, 48, 112, 53, 91, 86, -78, 8, 184, -53, 129, 88, -185, 9, 92, 5, -214, 24, -119, -14, -54, -246, 144, 98, -122, 66, -70, 30, 107, 77, -105, 182, -155, 29, 187, -160, -346, -46, 108, 13, 163, -305, -27, 217, 77, -6, -168, -92, -154, -80, -198, 79, -61, 191, -228, -19, 268, 189, 101, -157, -5, -25, -40, -97, 80, 92, -22, -19, -17, -93, -155, -121, 96, 33, -245, -23, -213, -52, -43, 186, 71, 8, -22, -98, 29, -43, -136, -67, -102, -129, 32, -133, 60, -51, -39, 19, 17, 185, -22, 211, -32, 9, 121]
3202A21j25K13k98LJ8K03k71J06l7J89j00N3K18k67K4j25j19K20J7k5J81j33m2
3225B4N6j38k6K91k64J10L4j46r2j9K55j32o1j31K01j0j00N5K08j41J64k83mK76
3249A27r6j90J06L7j65n9L16j74Q9j27p4K02o8J6L9Q9j17q7J45N4Jk69J21n2J55
3274A9l4L49l42q7K37l12K38j13J28j43J86j75Q6j14J1Q4Q3j63l3r0M11l12r7
3297a83J91J66j5j59j28K50j64J41J74j43l25K29j48J96n2j97K10k19Q5lK44l60
3319b10M37l73Q3N5J73j96R8j10J1o1j48J74L08j5k99r3J88L6L3j31q2L12k22
3342c2o9K28J5j24J11k17m7J85j17j4R1n7L19l27L18j21n6l7j57K36n4j27k48
3365c01N33j35n9J13k75p4L1J53J13j29K49l54J93J1n7J92k52J37j2j43J67l9
$$ y = [121, -4, 209, -89, -86, -68, 135, -136, -30, -67, 122, 22, 75, 293, 26, 50, -75, -194, 26, 43, 18, 199, 66, 24, 80, -58, -84, 207, -57, 53, 87, -59, -151, -170, 85, -47, -108, -239, -38, -48, -148, -93, 115, -26, 138, -145, -149, 127, 31, -159, -53, -16, -181, -240, 76, -98, -9, -136, -210, -8, -76, -60, -21, 68, -49, -136, 9, 63, 64, -205, -84, -136, 19, -15, 334, -8, -95, 142, -170, 68, -45, 83, -60, 126, -49, 37, -77, -66, 18, 101, -62, -95, -185, 226, -86, -183, 8, 174, 159, 0, -128, 122, -42, 99, 273, 130, -195, 34, -114, 82, 30, -167, 43, -176, -91, -94, 150, -210, 227, -146, -63, -8, 165, -31, 67, -43, -32, -93, -241, -67, 241, 226, -73, -166, 22, 58, 91, -40, -122, 190, -32, -101, 127, 142, 18, 129, -88, -135, 50, -67, -81, 10, -47, 272, -55, 263, 142, 86, 49, -108, 128, 74, -53, -301, 232, 97, 38, 151, -124, -198, -167, -14, 99, -30, 219, -135, 58, 69, 12, 204, -48, 89, 77, -66, 101, 62]
3387F2q5K8j17K23l01j02L52q3NP7R5k16P9l3P3Q7k91L24j75O9J03r5m11L20j15
3412a27K26k2J20k36J73l1k40N1J26j43J09o1J80J2L9l73J32l4kJ71k31J33J20
3435I2j50K5J9o2J40r4K47l98K54j74N5j25J49Oj3j04n2j80L99L59l80LN9L8J2
3460A25k65J74j45K16nj70P0M0P2j93k3J03K32l47M11l49L6J23j1k33J36P2J28
3483A97Nk29np7P1J93k27L8J66l24O4M6R6p6l8K71k77N6j96L41Q2p8l06K80n2
3508B1l4O0j80K91j89P7J73k90L3j05Q3Q1L77n02kJ50J73k87J67J58j07j05K0
3531F3l5q5k42M00j38Q6J99l86K25k11J56J48l8j88o7K05j43j5k46J08J25J75
3553I6J0r6K5l9l6J66j39j43J5K3j95L81j42n7L2K00j02J5J68k18p5j5q3M30j51
$$ y = [62, -23, 5, -112, 111, -190, -292, 60, -23, -18, 59, 154, -62, 17, -16, 57, 144, -147, 177, 2, 71, 174, 79, -332, -12, -127, 99, 77, 197, -39, 134, 103, -137, -86, 40, -103, 6, -55, 125, 137, 176, -197, -65, -99, -101, 70, -161, -28, 92, -58, -33, -14, -76, 64, -30, 217, -181, 73, -101, -46, -171, -22, -16, -29, -133, -185, -365, 34, 393, 13, 16, 75, 113, 125, -140, 34, -111, 105, 100, -70, 0, 40, 112, -81, -104, -1, 231, -116, 295, -54, -18, 105, 94, -139, -3, 69, 197, 202, -27, -32, -109, -38, 155, -72, -34, 132, -192, -128, -82, 14, -62, -100, 171, -106, -50, -246, 95, 177, 99, -207, 73, 21, -13, 47, -133, 158, -31, 46, 219, -71, -38, -143, -60, 21, 398, -104, -106, 44, 217, -70, 97, 255, 148, 43, 63, 28, -57, -299, 101, -37, 49, 248, -138, 87, -124, 32, 180, 142, -46, -113, 92, -51, -66, -312, -204, -79, 96, 106, 10, 35, -4, -40, 126, -13, -156, -141, -118, -313, 68, -74, -131, -99, 101, -1, 14, 182, -36, -111, -126, -209, 221, 70]
3578G0k4P7n0m9J12M2Kl25L8J57n6O9P8k83J15J93j22J1qj35M8l0K6N2M3o2o9
3605h0N8Q8p8j46J97qJ7nJ50p2j81O7L1R2J02k41q0K99kl13M5n1j46L7R3J79k7
3632B5j08N7k9K53j13j99K14j3m2k21J98p8j8K3j50K38J5k01l0K33N7k91L36J7
3656A73m04J93Qk03L75q8m6L07l30k3j40Q6L68k78J91k63J36K0Q4k23J15P2o0
3679G0j2k53L63o0k18K07l10J55K68k62k1K50o3k76J02j52J64K53m24M36j3n43
3701c39M13j47Q1J31L9j02J1k21J15Q4o8r1K56k35J47N2L8r1k62J69N3L7j21n5
3725a06K98o8l09P5jL88o41M88j53N4q1O4n6N2J16j51qN1m9R0N0j38K07j06j84
3750a18K56j15j76K13j36J56k11j5R0L90k35K0j18J2K73n11K35kK4k81L55j03
$$ y = [70, 46, 123, 73, 24, 136, 178, 180, -145, -107, 50, -6, 63, 141, -142, -27, 166, 44, 55, 47, -88, -40, -70, -44, 8, 51, -11, -80, -22, 66, -12, -158, 39, 31, 48, 43, 193, 121, -60, 7, 38, 130, 232, -9, -89, 210, 208, -105, -60, -111, -257, -220, -127, 52, 25, -83, -26, -55, 198, 85, -114, 100, 87, 45, -176, 22, -56, -74, -51, -201, 37, 52, -149, -179, 54, 111, -180, 156, 173, -231, -38, -30, -233, 142, 54, 8, 315, -15, -38, -178, -92, 276, -2, 189, -74, 62, 82, 166, -57, 58, 130, 70, 58, -195, 168, 108, -110, 97, -213, -58, 210, -52, -73, 177, 114, -162, -60, -212, -48, 205, -219, 217, 204, -339, 74, -73, 8, 139, 178, 76, 87, -134, -19, 65, -3, -94, 162, -73, 74, 126, 164, 73, -189, -20, 33, 70, -51, -106, 192, 124, -185, -110, -111, 277, -364, 124, -29, 25, -56, 8, -48, 4, 120, -31, -39, 12, -37, 53, 103, -35, 172, 66, -118, 138, 23, -153, 60, -76, 80, -131, -146, -56, 334, 99, 119, 1, 13, 286, -225, 10, 8, 32, -249, 106, 3]
3772CJ26k17l8J86k27Q1J07j82K02k30L20K0k78K88k74J38o9K21l7o2K4j91j53
3795b42K95q9J63l16L70k59J60j76J37o2r2Mj81J28M4J8N65l32m75P05l5m98M19
3818B51l2k55L65p39R94j322L86P49k5k39k44m89K93P31n80N40j64m63J151q47
3838F1o8J75N24q87K09K68k54N63m28q4J33Pm61L17j53M51m62k73J04K43j22N15
3860C78j54l89k04P18j76R6m55m64P18Jj69j88M33n29K52K21l64M19K28o78L52
3881D6pK51l25L9k36m0J72L20k45m8M05k91j34j72M2J54R2K83o17j33K70N79l31
3904G4k20M06j84R6n5J09j65k67j05L73L31k29k84K34K17m24K99K0K4K2n20L63
3926A15l20M56m63M01O2n78P25m61M50p73M03K5k69M34j76j64N85n11j73K14k12
$$ y = [3, 129, -88, -126, 60, -167, -86, 21, -161, 41, -189, 131, 151, -127, 161, -113, 25, -44, 177, 140, 78, 102, -89, -242, 53, -36, 127, -189, 181, -78, 82, -94, 43, -19, -111, -107, -288, -160, -116, -98, 467, 135, -340, 365, 330, -168, 251, 219, -36, 329, -410, 584, -738, -352, 397, 372, 133, -111, -600, -307, 424, -156, 384, 220, -243, 908, 61, -7, 168, 692, -195, 14, 282, 28, 591, 163, 79, 212, 219, -242, 75, -78, 373, -89, -362, -258, -15, -137, 378, 224, -165, -369, 349, 173, 269, -186, -650, 68, 69, -100, -288, 145, -384, -132, 89, -275, 144, 372, -306, 46, 39, 290, -35, 4, -232, -272, -100, 220, -25, -73, 332, 41, -93, -265, -223, -69, 23, 306, -311, -444, -174, 405, 74, -146, 260, 76, 172, 117, 226, 61, -206, -311, 62, 393, 164, -120, 114, 331, -93, 206, 226, 250, 272, -248, 115, -205, 251, -212, 189, 251, -327, 398, -63, 387, -386, 17, 42, -227, 207, 31, -133, 452, -59, -232, -18, -230]
3947b30J2L63m38K32J9j66N69J5k86L15k20k57M71j089R60n11J59n95Q62J75n4
3968C06o6j28Q5J82n12L10l25L51o25J76K98n51K06m96J302o72n77O88P73r32
3988b07Q22n03J00l50m06O44P0j72j60O65n53N0o0R1j76j1J18j27K45m26M49l
4010A00K6l04K49M5k88J04j38K37l14K99M3j58M0L2o0J98k17N30j58m33J99m4
4032a2k5m6j75L11k40J23J15k12K56l08K76J65l53K75l45K65N2k26J21J98l06
4053i1Q7L5l14K08M0O3J02j51q6L48o6l13l9J64j4J27j18P1j18J08J32j99l5j30
4077a89K92j25j33n6K21m0J31j48m8N7L61n17L98j82L7J11J05k23j7l7J8j27m0
4100a51J83Nk4j11m7J72j68K28joqj64j2r3Q3J13L46k93O4k12L89q2m46J94n0
$$ y = [-230, -218, 145, -293, -61, -42, -208, 361, 376, 90, 405, 185, -72, 399, -690, 270, -241, -82, -677, 185, 360, 306, 240, 112, 197, 379, -133, 177, -148, 203, -422, -246, 52, -499, -293, -789, 513, -159, -736, -48, 725, -207, 615, 112, 212, -138, -544, 100, 170, -2, -162, 503, -50, 0, -60, 31, -145, -156, -38, -165, 80, -346, 103, 100, 126, -178, 71, 116, -172, -68, -206, 31, -283, 16, 59, -99, -59, -27, -87, 111, -106, 424, 266, -167, 32, -12, -37, -83, -258, 53, -187, -64, 51, -161, 95, -213, 63, 228, -125, 150, -195, 70, 122, -104, 17, 215, -91, -4, 31, -283, -75, -35, 28, 130, -21, -107, 241, 175, -138, -177, -13, -27, 100, -18, 53, -65, 43, 175, -24, -59, -189, 103, -22, -155, -211, 10, -30, 101, -47, -95, -38, 323, -194, 204, 22, 59, 170, 275, 52, 35, -2, 16, -111, -151, 32, 37, 13, -98, -145, 27, -141, 87, 86, 80, 72, -92, -104, -197, -114, -1, 345, 52, 116, -96, 293, 211, -235, -41, -91]
4125i1k3j1J29j39J92l69K21r1M36k62j26RK48l45K73j57K88j17j65J18n2N4M6
4148F6j77J59k74J5L91k61m1K94j87k04L45k16L7k7o8r7M36j93k06K30j29L59
4170B52j70P9l26K48j23R3j00K96l51N3J41rj56o4R9j8l7L51m22q6M19j8k12J48
4194H7J83m63O4R5K03j57l6J24n7j12K33j35P3k97M5N7K26j84J6o8n1J38o1Q9
4218A2N0j03J19M3l57J68K0R4M6l9j39J52J81l07R7q0J15k64J74O4n4k9K6K2L3
4243D4Q2j0r3L1J23k07n5Q4JJ03n4m8j74M92k85j65J22O4q9O9P1m8r8l0J64j15
4269b1o1K66k48j57K01q5M6M16l47L8k90M11j97P5k42J14J98j69K06j59J1Q3l2
4292E7j76J06M3k52J62K01l08R2q6K71j64NR7j2r8O9o0q5q1K42P7m1J%Lj12K61
$$ y = [-91, -114, -125, 4, -135, 57, -312, -91, -182, 254, -8, -134, -125, 123, -222, 51, -106, 182, 65, -100, 18, -34, 20, 66, -111, 48, -226, -211, 180, -81, -122, 172, -15, -219, 126, -90, -53, -80, -148, -245, 191, -2, -208, 22, -107, 252, 82, 161, -165, 83, -40, 53, -47, 249, -102, -49, 92, 83, -73, -137, -38, -56, -93, 258, -164, -250, 169, 151, -61, 87, 270, -193, -129, -34, 169, 12, -24, 100, 43, -69, 164, 29, 102, -195, -150, -93, 133, -51, -35, -103, -154, -16, -77, 12, 62, -41, 78, 121, -236, -68, -48, 46, 92, 53, -86, 66, 247, -60, 37, -43, 72, -192, -18, 46, -8, -37, -11, 11, 44, 126, 116, 23, 54, 177, -30, -85, -1, 0, 103, 49, 1, -173, 319, 34, -131, -9, 55, -34, 35, 106, 58, -40, -70, 94, -21, -82, 184, -64, -221, -20, -105, -59, 357, 10, 48, -242, 169, -28, 47, -195, -81, 117, -52, 154, -5, 6, 89, 57, -119, -13, 30, -222, -60, 141, -167, -75, -161, 110, -54, -49, 48, 36, -62, 7, -53, -138, -219, 23, 100, 59, 60, 60, 63, -49, 212]
4319B12k26m3OJ00j36J44Mk61K72k11L09l99L11l39J85j43J97p4p0J34o7J15j96
4342a76n5L50j81k26M66l43K68j29J06n5j88K36O7j91j00Q2R1l70M41j67nJ63
4364H4m0j5Q7k89j20J0M34j36M8j89K35j47k83K93Q2L4k89M62j83N0k99R8M8R9
4388G4j74J50P5k18K97k52n1M5J95k46L67m8j94J37M0l12J76jJ8j44L9j41L90
4411B22j63J82j65j90J55j67K17j34J04o4k4J80p1j93L3K32k33Mj09Q2n8k7L63
4434A76m70L79O3j36L36l51J46m0m81J03L50K99n05r4p4k6L75l16J78P24n36p65
4456f65O21l42M11J35L7j88j58O1N79o36l28N59k02L69n87j0J30Q57j22q05r1
4477c75P19m51K62L34r04L31j35L44n1O0j65m13P00q2P7m7j83Q8k98L80j10l40
$$ y = [212, -14, -57, -51, 49, -87, 57, 61, -200, 72, -139, 170, -229, 82, -257, -72, -215, -18, -92, -162, -28, -95, 20, -176, -231, 119, -62, -288, 178, -165, 103, -26, 80, 25, -163, 73, 140, -51, -151, -69, 22, -348, 93, -74, -79, 84, 44, 29, 116, -173, -293, -283, 151, 15, 63, -126, 109, -38, -321, -28, 54, 88, -201, 261, 78, 128, -171, -73, -25, 74, -100, 50, 125, -93, 204, -48, -99, -54, 141, -105, 262, 214, 20, 157, 197, -115, 61, 60, 78, -66, -27, -168, 222, 59, 241, 76, -114, 41, -126, 91, -43, 61, -3, -27, 153, 82, -111, -78, 154, -79, -75, -184, -102, -160, -187, 176, -294, 85, 148, 12, 348, -3, 143, 103, -378, -275, 75, 374, -131, -225, -299, -325, 50, -266, -88, 636, 100, -665, -44, -386, 25, 160, 197, 9, -149, -88, 491, -145, -473, 86, -116, 253, -334, -344, -214, 643, 521, -284, -375, 344, -107, 155, 489, -415, -84, -219, 125, 74, 134, -31, -444, 256, 174, 251, 204, 21, 109, -189, 191, 81, -259]
4499b59L5L26n8l6J01Qj61k30P94k14l16k43N46l10P9K79N3n61L80k81j63j68
4521c99M57J79k33M0j88k07K59j8j07M56j21k81K88K89j85j28J02j82J46k15K76
4542B28R8k47Q7J54j57j57L21n10k3j24M50l47j19L32j79P14o21j55P41p39N40
4563B87J57m62m95O10J30k41o9J71M04m36l52L98j37K98l12N0J1r5Mk17K75J5
4585fk20J82j9NJ15k2k05L14j6j57l6L18k90J55n1o0k6m9J40k12J35P6j50j45
4609b24K40j37j17R4J80L1r0K14k85K01j22K23j52J79j37k30l4K23P8k75K23l21
4631b38L06j6k26L28J0pj51J43r9l3J26n4K1k11m0k1O7L33l87J5J54p6J3m2J22
4656C7j50K08l8j93k6J62k35L64K2j64N4o4r0L58j05k20L32k44n7J50k50K04l6
$$ y = [-259, -224, 102, 44, 8, 109, 117, -44, -274, 520, 306, -10, -253, 293, -17, 62, 341, 394, -167, 213, -68, -231, -399, 58, 237, 4, 44, -144, -351, -92, -110, -217, 239, 118, -163, 125, 414, 229, 101, 203, 21, 167, -48, 228, 326, 79, 166, 320, 163, 6, 327, -183, -206, -330, 120, -227, -346, -14, -193, 521, -100, -255, 486, -253, 287, 444, -18, -513, 97, 227, -14, -83, 88, 492, 56, -296, 102, -35, 263, -49, 1, 12, -83, -79, -296, -21, -6, -226, -44, -63, -58, 57, 35, -170, 144, 128, -29, -65, 253, -37, 118, 67, 7, -19, -68, 72, -140, -5, 71, -79, -224, 16, -121, -238, -144, 36, 67, -23, 191, -94, 107, -15, 208, 56, 235, 98, -132, -166, 57, 135, -140, 83, -238, 68, 52, -174, 154, 164, 157, 6, 149, 50, 17, 143, 89, 110, -101, -141, -162, -95, 238, -149, -134, 20, -56, -43, -85, 37, -113, 95, 57, -136, -162, 0, -235, 129, 151, -13, 41, -23, -113, 245, 140, -80, 252, 8, -49, 101, -149, 55, 19]
4679A9r1Q4O9j00M1N0n4k0J22j40R4p6j4J81k09n4J26R6mj86J72J9m83L70r0O4
4705a4J5O6j5k23m5J27R7r3J80o2j6N2n6o8mJ38j79L44l10pJ42K8r3j03p5K01
4731B7R3j08qj78J68k6N4j1j18J9L0J76r2n8j1K64j61j62LL0K7j44J61m0o5L22
4757A92Q5k30p5pJ83k5L6P6n75K23J58K3o6K4K1M7L2p2k35K07m4K06k02J9j68
4782a67J70M8j30K35l6j40L9l5j45R4j50J72L8J58l01K11k11Q3J40j66K20Q8k55
4805d0j23Q3oJ11L5J28q6j57K09M4l55J65Q7n4j0j29JR4J11j69K70m27K45o8p8
4830a19J07q3K26k27L57l26L2m4K8j2Mp8K51J60J5k92j28J89J55o6l25J09R3o9
4854d3n1j04K78L0P1m62Q0L28k23R6K69j85j32j31J81m9J11k83J01J18K81j30
$$ y = [19, -72, 12, 81, -19, 22, 72, 18, -2, 120, -20, 74, -2, -16, 165, -44, -98, 28, 124, 120, -66, 106, 125, -358, 12, -78, -14, 1, 67, 52, -171, -216, -89, 8, -85, 95, 33, 17, 69, 13, -55, -59, 79, -100, 244, -66, -73, 69, 97, 4, -99, -174, 27, 120, 12, 4, -174, -6, -32, 22, 11, -107, -88, -58, 118, 26, -32, -43, 221, 60, -102, -99, -69, -42, -186, -25, -65, -130, 192, 277, 47, -28, -35, 148, 123, 159, 235, -340, -117, 41, 64, -2, 22, 43, 90, 122, 50, -185, 22, -22, 184, -18, 1, -167, 3, 51, -79, 156, 120, -20, 19, -16, -161, -67, -217, -45, -7, 151, -150, 61, -150, -67, 73, -93, 127, 215, -40, -163, -80, -86, 25, 60, 188, 102, -55, 154, 198, -157, 8, 95, 41, 31, -98, -97, -3, 108, -61, 209, -218, 27, -41, -119, -12, -95, 131, -96, 261, -65, -33, -77, -49, -61, -57, -135, 116, 276, 291, -1, -129, 60, 215, 149, -176, -67, 26, -43, -94, -198, 80, 110, 181, -281, -201, 127, -96, 0, 269, 84, -48, -179, 2, -47, 64, -219, -118, 0, 281, 151]
4876A51j47j79K35K76k77qN1J10p2j92m5O8J00j73Q5j40J38J85l40L05k31J07
4898GQ7q7k0p2K33j03k44J4j0J80K3K38q6k29J47K1J50m24J61k6k8q8N5Q6K20
4923B05k49j35J15N4j7M1r6l7Q5l9J67J21k19J33j08j1j34M9L40m28J25K93j04
4946A51j54l1lj40J25O5j45N9J39j95n8K03J72k48r7J97L4j84Q8n1J02J82j99
4969A2l8P3l6J7j63j10R7J05J61j77RK1J5J33k75J55j96L33j77J20l9L7k2j72
4993a17J45j21J61j39j65K37K6n0m3j22L04k42m3K77j85K26k31Q4PqJ38ol07K22
5017D8p8k4q5K55r5j21L50l37J56p0l3M9k07K78j2M5J72k74j83K60P2k96K83j32
5041B1j74K64l92J43J22m5K48l12J54o9N6N7j82L8K6lR6l1j15J01J16k42K47k71
$$ y = [151, 4, -175, 60, 336, 59, 51, 102, 212, 140, -52, -97, -29, 71, -102, -17, -157, -19, 166, -174, 131, -100, 7, 94, 7, -13, -85, 148, 45, -199, -185, -195, -15, 8, 246, 160, -69, 78, 99, 249, -175, -14, -40, -68, -156, -101, -15, 205, -44, -179, -64, -10, -27, 14, -82, -119, -34, -73, 94, 215, -4, 129, 21, 10, -124, -75, 265, -163, -38, 255, 151, -3, -34, -37, -177, -52, 13, -132, -73, 66, -129, -187, 16, 188, -60, -157, 40, 74, -110, -22, -73, 29, 211, 12, -26, 47, 11, 28, -135, -245, -148, -43, 118, -59, -50, -29, -14, 119, -156, -1, -197, 136, -41, 79, 40, 77, 55, -117, 28, -93, 68, -71, -236, 1, 27, -23, -66, -188, 116, -126, -169, 108, -77, 149, -82, 2, 9, 1, 139, 133, -174, 48, -30, -54, -139, 116, 21, -100, 250, -87, 69, -1, -34, 15, -192, 86, 74, 119, 291, 17, -166, 94, 166, -130, 153, 21, -153, 111, -281, -138, -16, -61, 187, -125, 29, -40, 16, 73, -109, -71, -45, -48, 48, 17, -98, 3, 119, -123, 124, -147]
5065a47K35j56K05K44n00J02lK8j4M3j4j64L10k01J22R4n3m4m39M31q7K09l47
5088a46J52J28r3j68K03l4m6L2Jqj54M9N7oj04J68J04l18Q4J99M5j2m01K24Pj18
5114a55L73n2k70l7L34J05m44m8J12j66K28m5J53nm80M37r2q2J8j36K32k9lR8
5138D6o4m3L1q6J35j81J70O3K5q1Oj70J54J5r6J22p3J71o2j13J01j10Q4M4q2k2
5164a6j62K92j08j23J78N8k81K38q2P8p0N2l45K32L6J06j61lO9r3J10M4p7n3M1
5189d0L16j31k71L97m05R8K4J92o7o2j41J69j78L0j21J49j21K26J58n04M23q2
5211E9pN3n3j17j82L53R2qj13n9r7J45j6Q7j90j0J46J59k02p2O3M3j6j18j56K39
5237B3n5O1l1k3J10l15J64L6k50M39p2j13k07J70k6j32L99j63l2k88M24n0rq2
$$ y = [-147, 88, -68, 137, 381, -119, -17, -20, 8, -6, 37, 23, -141, 169, -32, 90, 184, 131, 87, -352, 79, -8, 201, -146, 6, 134, 41, -127, 76, 42, -4, 28, 29, 21, -133, -84, -27, -33, -137, 31, 135, -183, -99, 100, 145, 133, -268, -44, -37, -155, 218, 166, -104, -141, 193, 298, -146, -194, -82, -248, -20, -65, 88, 83, -397, 40, -52, -134, -116, -252, -20, -49, -52, 46, -18, -61, -30, -116, 19, -162, 8, 71, 96, 15, 21, -149, 5, 20, -76, 46, -27, 144, 82, -31, 70, -40, 44, 88, 6, -16, -178, 114, 6, -117, 61, 119, -162, 76, -6, 72, 2, 54, -291, -59, -23, 83, -78, -81, -12, -105, 5, 49, -28, -81, -40, 276, 145, -126, 271, -134, -36, -12, 180, 113, 51, -90, 79, -99, -69, -190, -41, -162, 64, 222, -282, 141, 59, 52, 105, 52, -65, -247, 106, 198, 190, 77, 18, -79, 66, 50, 137, -53, -63, 83, 242, 40, -32, 31, 74, 58, -60, -216, 23, -32, 29, -2, -25, 85, -230, -66, -30, -280, 159, 87, -26, -233, -63, -89, -221, 178, 15, -17, -305, 119, 69, 60, -22]
5261b2j22J3J41R8j38LJ13p6n0J75l98K70J47mj06K3J6k19K22q3m5j35J82j61
5285a56J11j57K50p8L26m62K75M1p2j57Qj33O6K40o1j19J6k4Q3kL1k3o9J64n2
5310D6k40J25J24J80l27o9K37j71P0M5J40j04R3j60J28m3m0k33L01j03J09j33
5332b5P9J56j46r3k23R2K35o7K6J9j04J92m4r8oj26N6PJ06J26l37J43K8J65k19
5357e8J14j06Q4kj93J70k6MK24k75Q0kq7L3J90j88l3p8J91lj64L25l07K07Q8k24
5383c6j96M11q6M6l66L49j01p5J19p4j24J43J6j7j83L47k15J90j87L8j66J03j46
5406b10J20K52j56J3N8Jj18J39j31o8J25q1J92oj38R8L6J19l13J17m9K0L9O0j25
5431fj15Q3J57l7j16R6j59K90j02Mj25J82N0j04P6j34j10J68k18R1j10O2M9jQ
$$ y = [-22, -144, -131, 10, 108, -30, -27, 86, 10, -40, 135, -263, 7, 154, 150, 44, 67, 83, -136, 86, 3, -42, -177, 5, -156, -45, -202, 48, -30, 296, -166, 109, 150, 78, -79, -71, -204, -138, 102, 41, -78, -62, -86, -3, -5, 26, 3, -66, 98, 46, -194, -69, 55, 235, -92, -161, 76, -95, -25, 20, 160, 56, 149, -11, 117, 74, 34, -199, 102, -1, 108, -25, 54, 210, 64, -29, -252, -160, 75, 8, 34, 53, -51, 141, 97, -1, -7, -133, -77, -70, 36, 162, -175, -32, -4, 161, -58, 56, -50, 34, 32, -161, 9, -17, -13, 211, -64, 16, 14, -73, -40, 150, -38, -71, -149, 42, 39, -125, 200, -107, 100, 188, -36, -232, 179, 93, 139, -227, 122, 21, -54, 65, -9, -133, 10, 26, 9, -174, 173, -42, 148, -39, -1, -167, -64, -210, -90, 162, 6, 19, 77, 78, -40, 99, -32, -100, 25, -56, 136, 130, -8, 90, 126, 245, -68, 49, 0, 20, 59, 119, -6, -121, -38, 119, 82, -34, 62, -97, 193, 91, 95, -30, 152, 202, 98, 174, 40, -70, 98, -120, -29, -139, -77, -28, -29, -21]
5456b1l2q0J47j96J34M0Rr3P7J30j34Q1l5q1Q0n8J57j96p8L26q1j25j66KK52j15
5482e6M0l7m4L2J82j32k13L3J84oJ10j57N6L5j92K15MPk16L50k11J17Q6j09L5
5507A13Q0l44K61k48J32N5O5j58J63k85J76J72k10L2K20j08j47N4j45j47K72K58
5529B61l51k53M87j50J07j27K64k14nN1k48K29R4j65N7j11K67k57J45l5l08L08
5551D6j96J37J30J00l40J10j61J45m2J82k5p9j21R7l3Q2k79K75pp8J5J98j11m3
5575Bj49n2l5R5L3J07j34J15o1J2J53pj6k61L9L27j90%N8j48J48LJ21n0J30k24
5601A6j01P6J19l26K07o1K8J1J11m4N4k96L26pk97L44q9m6J03j03j33j4m5J81
5625A4j36L72j67j52O7O9k07K91q6rj6k06o3P4K64k8k68P6J99j02J3j77J73j12
$$ y = [-21, -53, -133, 14, -182, -48, -8, 1, -92, -15, 115, -19, 62, 27, -54, 26, -32, 125, -71, -149, 177, 96, -29, -195, -193, 59, -56, -16, -53, -97, -65, 117, -15, -228, -195, -11, -17, 93, -64, -8, 27, -165, 50, 54, 61, -155, 195, -16, 101, 187, 78, 113, 193, -151, 110, -138, -6, 49, 114, -44, 119, -166, 10, 182, -28, 4, 224, 116, -31, 23, -122, -269, 3, 261, -90, -343, 144, -6, 101, -26, 238, 24, 19, 70, -178, 51, 145, -20, 37, -74, 193, -64, 81, 46, -262, 46, -150, -13, 117, 217, -123, -13, -174, -29, -71, 111, 86, 7, -114, -17, -50, 32, -247, 28, 21, -57, -42, 156, 45, 2, -147, -199, -234, -139, -106, 1, -133, -18, -79, -67, 86, 79, 63, -198, -159, 168, -22, -22, 36, -112, 36, 39, 160, 110, 240, 16, -85, -9, 110, -216, -9, -70, -42, -31, 80, 36, 90, -206, 120, 113, -184, 160, 71, 25, 128, 25, -108, -122, -167, 14, -122, 250, 83, -69, -2, 67, -140, 151, 65, 56, 40, -166, -229, -155, 109, 81, -187, -111, 88, -14, -1, -178, -5, -117]
5649a17O2L24l48J37j51q4o7Q8j4J12K81k99J4QJ58j71N5j09Q1N1L5Q4k23M4j94
5674b43L39j95R6j1P4k81OK41j60N3P5l1P8j00QJ15k56L63k35l5j8P7J74j27K22
5699B29m62P6J09M1j5J8J17j51JQ0j17K9J02q3p4kO7j43L14j93K59l4P3k88Q8
5724D1J04k0l03J17J21j84J70j05p8kP8J45l21NM6K67j13KJ48Lr9J03p3O4j30
5749a4K9K2r8J60j24j06K98J32k87m9j80J08Q0j13O1M2j2K05j74r7K57j84k8J54
5773H2j8n9o3j4J81M3k41L41l48O2j58K40r9P5k80J52K30j54J25j92J58K4j99
5796a12K0R8k67J56k5J38P9j66m8L92m01L27l09L8J39K32k19Q6P3j86Rk22J31
5819c7QQ8j10J80k3j22PJ84k81O4K6lq6P3J18j09N8p3j7k43J98J39J5M7j01O7
$$ y = [-117, -55, 269, -79, 58, -93, -177, -244, -156, -170, -58, 223, -76, -62, -54, 104, -67, -12, -121, -40, 11, 46, 130, -93, -49, -243, 96, -99, -3, -14, 60, -221, -215, 26, -134, -81, -6, -37, 41, -59, -51, 64, -192, 171, -64, -99, -117, -40, 134, 7, 229, -233, -157, -48, -7, -22, -4, 113, -38, -37, 43, -74, -45, 57, -26, -100, -102, -35, -178, 136, -57, 202, 168, 241, -47, 41, 145, 125, -178, -61, 60, -124, 46, -59, -137, -139, -61, 84, -237, -232, -186, 81, -32, -30, 118, 121, 22, 125, 52, 116, -14, 15, 37, -61, 99, -25, -131, 167, 299, 12, -37, -217, -109, -29, -142, -81, -39, -51, 154, -20, -117, 140, -44, -72, 82, 64, 5, -58, -72, 109, 152, -89, 252, -96, -34, -192, 48, -51, 24, -256, -104, 126, -28, 97, -95, 63, 87, -112, -92, 6, -261, -105, -130, 8, 87, -79, -127, 265, -136, 191, -118, -80, 59, 291, 72, 158, 231, 45, 54, -168, -37, -29, 59, -51, 129, 106, -16, -9, 175, -106, -42, -16, -19, -105, -32, 86, -23, 35, -38, -55, -298, -100, 39, 54, 101, 0, 67]
$$ [...]
8191e6
##END NTUPLES=NMR FID
##END=
