##TITLE=1H_Pr Am2-Cl
 CD3OD,8 sc, 
 4.02.2021
##JCAMPDX= 6.0         $$ Bruker NMR JCAMP-DX V2.0
##DATA TYPE= NMR FID
##DATA CLASS= NTUPLES
##ORIGIN= UXNMR, Bruker Analytische Messtechnik GmbH
##OWNER= root
$$ XWIN-NMR		Version 3.5
$$ Thu Feb  4 11:26:33 2021 Russian Standard Time (UT+4h)  she@DPX200
##.OBSERVE FREQUENCY= 200.1315066352
##.OBSERVE NUCLEUS= ^1H
##.DELAY= (6, 6)
##.ACQUISITION MODE= SIMULTANEOUS
##.ACQUISITION SCHEME= undefined
##.AVERAGES= 8
##.DIGITISER RES= 18
##SPECTROMETER/DATA SYSTEM= spect
##.PULSE SEQUENCE= zg30
##.SOLVENT NAME= MeOD
##.SHIFT REFERENCE= (INTERNAL, MeOD, 0, 15.7039)
##AUDIT TRAIL= $$ (NUMBER, WHEN, WHO, WHERE, WHAT)
$$ ##TITLE= Audit trail, XWIN-NMR		Version 3.5
$$ ##JCAMPDX= 5.01
$$ ##ORIGIN= Bruker BioSpin GmbH
$$ ##OWNER= she
$$ F:/spectra/data/she/nmr/H-F/1/audita.txt
$$ ##AUDIT TRAIL=  $$ (NUMBER, WHEN, WHO, WHERE, WHAT)
(   1,<2021-02-04 11:25:38.43 +0400>,<she>,<DPX200>,
      <created by zg, POWCHK disabled, PULCHK disabled
       configuration hash MD5:
       00 E9 B6 7A A2 85 ED C7 34 08 36 98 17 FE 4E 26
       data hash MD5: 16K
       CE FC A9 D6 6D B0 76 82 24 98 26 84 12 8E 15 C8>)
$$ ##END=
$$ 
$$ hash MD5
$$ 66 A6 99 FE 60 BB AC 3F 72 B4 C5 28 1F 67 4F A4
##$RELAX= 
##$RELAX= 
##$RELAX= 
##$RELAX= 
##$RELAX= 
##$RELAX= 
$$ Bruker specific parameters
$$ --------------------------
##$DU= <F:/spectra>
##$EXPNO= 1
##$NAME= <H-F>
##$PROCNO= 1
##$TYPE= <nmr>
##$USER= <she>
##$AMP= (0..31)
100 100 100 100 100 100 100 100 100 100 100 100 100 100 100 100 100 100 
100 100 100 100 100 100 100 100 100 100 100 100 100 100 
##$AQSEQ= 0
##$AQ_mod= 1
##$AUNM= <au_zg>
##$AUTOPOS= <>
##$BF1= 200.13
##$BF2= 200.13
##$BF3= 200.13
##$BF4= 200.13
##$BF5= 200.13
##$BF6= 200.13
##$BF7= 200.13
##$BF8= 200.13
##$BYTORDA= 1
##$CFDGTYP= 0
##$CFRGTYP= 5
##$CHEMSTR= <none>
##$CNST= (0..31)
1 1 145 1 1 1 1 1 1 1 1 1 1 1 1 1 1 1 1 1 1 1 1 1 1 1 1 1 1 1 1 1 
##$CPDPRG= <>
##$CPDPRG1= <>
##$CPDPRG2= <>
##$CPDPRG3= <>
##$CPDPRG4= <mlev>
##$CPDPRG5= <mlev>
##$CPDPRG6= <mlev>
##$CPDPRG7= <mlev>
##$CPDPRG8= <mlev>
##$CPDPRGB= <>
##$CPDPRGT= <>
##$D= (0..31)
0 1.2 0 0 0 0 0 0 0 0.06 0 0.03 0 0 0 0 0.0002 0 0 0 0 0 0 0 0 0 0 0 0 
0 0 0 
##$DATE= 1612423537
##$DBL= (0..7)
120 120 120 120 120 120 120 120 
##$DBP= (0..7)
150 150 150 150 150 150 150 150 
##$DBP07= 0
##$DBPNAM0= <>
##$DBPNAM1= <>
##$DBPNAM2= <>
##$DBPNAM3= <>
##$DBPNAM4= <>
##$DBPNAM5= <>
##$DBPNAM6= <>
##$DBPNAM7= <>
##$DBPOAL= (0..7)
0.5 0.5 0.5 0.5 0.5 0.5 0.5 0.5 
##$DBPOFFS= (0..7)
0 0 0 0 0 0 0 0 
##$DE= 6
##$DECBNUC= <off>
##$DECIM= 32
##$DECNUC= <off>
##$DECSTAT= 4
##$DIGMOD= 1
##$DIGTYP= 9
##$DL= (0..7)
0 120 120 120 120 120 120 120 
##$DP= (0..7)
150 150 150 150 150 150 150 150 
##$DP07= 0
##$DPNAME0= <>
##$DPNAME1= <>
##$DPNAME2= <>
##$DPNAME3= <>
##$DPNAME4= <>
##$DPNAME5= <>
##$DPNAME6= <>
##$DPNAME7= <>
##$DPOAL= (0..7)
0.5 0.5 0.5 0.5 0.5 0.5 0.5 0.5 
##$DPOFFS= (0..7)
0 0 0 0 0 0 0 0 
##$DQDMODE= 0
##$DR= 18
##$DS= 0
##$DSLIST= <SSSSSSSSSSSSSSS>
$$ [...]
##$SUBNAM2= <"">
##$SUBNAM3= <"">
##$SUBNAM4= <"">
##$SUBNAM5= <"">
##$SUBNAM6= <"">
##$SUBNAM7= <"">
##$SUBNAM8= <"">
##$SUBNAM9= <"">
##$SW= 16.9725356469052
##$SWIBOX= (0..15)
0 0 2 0 0 0 0 0 0 0 0 0 0 0 0 0 
##$SW_h= 3396.73913043478
##$TD= 16384
##$TD0= 1
##$TE= 0
##$TE2= 300
##$TE3= 300
##$TEG= 300
##$TL= (0..7)
0 120 120 120 120 120 120 120 
##$TP= (0..7)
150 150 150 150 150 150 150 150 
##$TP07= 0
##$TPNAME0= <>
##$TPNAME1= <>
##$TPNAME2= <>
##$TPNAME3= <>
##$TPNAME4= <>
##$TPNAME5= <>
##$TPNAME6= <>
##$TPNAME7= <>
##$TPOAL= (0..7)
0.5 0.5 0.5 0.5 0.5 0.5 0.5 0.5 
##$TPOFFS= (0..7)
0 0 0 0 0 0 0 0 
##$TUNHIN= 0
##$TUNHOUT= 0
##$TUNXOUT= 0
##$USERA1= <user>
##$USERA2= <user>
##$USERA3= <user>
##$USERA4= <user>
##$USERA5= <user>
##$V9= 5
##$VALIST= <valist>
##$VCLIST= <CCCCCCCCCCCCCCC>
##$VD= 0
##$VDLIST= <DDDDDDDDDDDDDDD>
##$VPLIST= <PPPPPPPPPPPPPPP>
##$VTLIST= <TTTTTTTTTTTTTTT>
##$WBST= 1024
##$WBSW= 4
##$XGAIN= (0..3)
0 0 0 0 
##$XL= 0
##$YL= 0
##$YMAX_a= 198292
##$YMIN_a= -144202
##$ZGOPTNS= <>
##$ZL1= 120
##$ZL2= 120
##$ZL3= 120
##$ZL4= 120
##$ABSF1= 10
##$ABSF2= 0
##$ABSG= 5
##$ABSL= 3
##$ALPHA= 0
##$AQORDER= 0
##$ASSFAC= 0
##$ASSFACI= 0
##$ASSFACX= 0
##$ASSWID= 0
##$AUNMP= <proc_1d>
##$AZFE= 0.1
##$AZFW= 0.1
##$BCFW= 1
##$BC_mod= 2
##$BYTORDP= 1
##$COROFFS= 0
##$CY= 11.3945322036743
##$DATMOD= 1
##$DC= 2
##$DFILT= <>
##$DTYPP= 0
##$F1P= 15.9154993809931
##$F2P= -4.1035820241983
##$FCOR= 0.5
##$FTSIZE= 0
##$FT_mod= 4
##$GAMMA= 1
##$GB= 0.15
##$INTBC= 1
##$INTSCL= 1
##$ISEN= 128
##$LB= 0.24
##$LEV0= 0
##$LPBIN= 0
##$MAXI= 10000
##$MC2= 0
##$MEAN= 0
##$ME_mod= 0
##$MI= 1.114404
##$NCOEF= 0
##$NC_proc= 0
##$NLEV= 6
##$NOISF1= 3.799351
##$NOISF2= 2.8
##$NSP= 1
##$NTH_PI= 0
##$NZP= 0
##$OFFSET= 15.70392
##$PC= 1
##$PHC0= -10403.41
##$PHC1= 14.60095
##$PH_mod= 1
##$PKNL= yes
##$PPARMOD= 0
##$PSCAL= 0
##$PSIGN= 0
##$REVERSE= no
##$SF= 200.130013532006
##$SI= 16384
##$SIGF1= 3
##$SIGF2= 2
##$SINO= 400
##$SIOLD= 16384
##$SREGLST= <1H.CDCl3>
##$SSB= 0
##$STSI= 0
##$STSR= 0
##$SW_p= 3612.71676300578
##$SYMM= 0
##$S_DEV= 0
##$TDeff= 0
##$TDoff= 0
##$TI= <>
##$TILT= no
##$TM1= 0
##$TM2= 0
##$TOPLEV= 0
##$USERP1= <user>
##$USERP2= <user>
##$USERP3= <user>
##$USERP4= <user>
##$USERP5= <user>
##$WDW= 1
##$XDIM= 8192
##$YMAX_p= 0
##$YMIN_p= 0
$$ End of Bruker specific parameters
$$ ---------------------------------
##NTUPLES= NMR FID
##VAR_NAME=  TIME,          FID/REAL,        FID/IMAG
##SYMBOL=    X,             R,               I
##VAR_TYPE=  INDEPENDENT,   DEPENDENT,       DEPENDENT
##VAR_FORM=  AFFN,          ASDF,            ASDF
##VAR_DIM=   8192,          8192,            8192
##UNITS=     SECONDS,       ARBITRARY UNITS, ARBITRARY UNITS
##FACTOR=    0.0002944,     1,               1
##FIRST=     0,             0,               0
##LAST=      2.4114304,     0,               0
##MIN=       0,             -144202,         0
##MAX=       2.4114304,     198292,          0
$$ Real data points
##PAGE= N=1
##DATA TABLE= (X++(R..R)), XYDATA
$$ [...]
2045A31k84j48P34j656P19L27M10j88o75K30R3N68l10M2L37j549R04Q11M34q35
$$ 131 -153 -301 433 -1223 -504 -177 233 45 -630 -400 -307 261 -49 -7 330 -1219 -315 496 930 95
2065I5o22O74Q7m49J27J022L58j454r25M55K90J99N44N12j072q06j00J421L08
$$ 95 -527 147 234 -215 -88 934 1292 -162 -1087 -632 -342 -143 401 913 -159 -965 -1065 356 664
2084F64l47j327O11L08m31j71J033J208j306q33l4R02K39K33r38O51j536k13K017
$$ 664 317 -1010 -399 -91 -522 -693 340 1548 242 -591 -625 277 516 749 -189 462 -1074 -1287 730
2103G30N9k29j477O15j21O27j68L53M45j152o94M55P01k0k93q47K223j272j509
$$ 730 789 560 -917 -302 -423 204 36 389 834 -318 -1012 -557 144 124 -169 -1016 1207 -65 -1574
2122a574M10J531j92M3j230O75Q03p55j028K138J25j048p60J031P27o60p2M44
$$ -1574 -1164 367 175 218 -1012 -337 466 -289 -1317 821 946 -102 -862 169 896 236 164 608
2140F08n28q04K5J817J4o95j326P00O56l71L1P31p16o16m29J445J006j352K68
$$ 608 80 -724 -699 1118 1132 437 -889 -189 467 96 127 858 142 -474 -903 542 1548 196 464
2159D64J85P66k438J067l81P69M6j859P85Q72J66j095J097p8r59J59o90J666J343
$$ 464 649 1415 -1023 44 -337 432 478 -1381 -596 276 442 -653 444 366 -593 -434 -1124 542 1885
2178A885k499M31N26p28k44Q30K68j075l77Q2J467p19o13Q69l32j5o31P36J132
$$ 1885 -614 -183 343 -385 -629 201 469 -606 -983 -901 566 -153 -766 103 -229 -244 -875 -139 993
2197I93J99j194j741K015j76m91P45O77m86j781j58K005J115j216p53k07P99j540
$$ 993 1192 -2 -1743 272 96 -395 350 1027 541 -1240 -1398 607 1722 506 -247 -454 345 -1195
2215a195o7K333k44p72l34j38J253o14q57J033L22o78o47P04P81l41n35p69K032
$$ -1195 -1262 1071 827 55 -279 -417 836 222 -635 398 720 42 -605 99 880 539 4 -765 1267
2234A267j231k54n8K173j292j582P11J208p05n39J87Q46r78m69J61J429N9j056
$$ 1267 36 -218 -276 1897 605 -977 -266 942 237 -302 -115 731 -247 -716 -555 874 933 -123
2252a23J81j04k3n93J19J104J16p44j65P86K46j121K31Q71j61j199k7m21K661
$$ -123 58 -46 -69 -662 -543 561 677 -67 -232 554 800 -321 -90 781 620 -579 -606 -1027 1634
2271A634j204j022Q04L39o63M34o5N17n71j815J807K31j72q70N06R66q90j143
$$ 1634 430 -592 212 551 -112 322 257 774 203 -1612 195 426 254 -616 -110 856 -34 -1177
2289a177J814L83n83o84J07j7L97n75P49P86o34j491J186Q68k95m30m99OJ13j399
$$ -1177 637 1020 437 -247 -140 -157 240 -335 414 1200 566 -925 261 1129 834 404 -95 -89 24 -1375
2309a375R59Q89L02j231m47J42Q11L39j142J413j48j205n83K069p6n08n44l27
$$ -1375 -416 473 775 -456 -903 -761 50 389 -753 660 512 -693 -1276 793 717 209 -335 -662
2327f62J441j291P3J404L5r84j093J617N37p97p66O44J94q08k82J024K57k1j341
$$ -662 779 -512 -439 965 1000 16 -1077 540 1077 280 -486 158 352 -456 -738 286 543 522 -819
2346h19J92J031K2j166J263L22k44j243J81J846j860J26k05N86j30m57q44L048
$$ -819 -627 404 426 -740 523 845 601 -642 -461 1385 -475 -349 -554 32 -98 -555 -1399 1649
2364A649j459j318J143M01r34O48L03L70m17j807J160j20Q39k51l25O20N7p18
$$ 1649 190 -1128 15 416 -518 130 433 803 386 -1421 -261 -381 458 207 -118 502 559 -159
2382a59P5N77J0J4j045J24N07j1l55Q63p55k48l0M26K81j35j20j76p45Q12p98
$$ -159 -84 493 503 517 -528 -404 103 92 -263 600 -155 -403 -433 -7 274 139 19 -157 -902 -90 -888
2403h88O99N50n58l47J70N81Q60j017j99k59p3L84l52N99K42j143N27N95k81m69
$$ -888 -189 361 -197 -544 -374 207 1067 50 -149 -408 -481 -97 -449 150 392 -751 -224 371 90 -379
2423c79O31K52p19p2K30k78M98L25m09J22m05L1J42O7M63n18l46j63M41J33p6
$$ -379 252 504 -215 -287 -57 -335 163 488 79 201 -204 -173 -31 36 499 -19 -365 -528 -87 46 -30
2444c0L04k88k32j56K47L38j07k1m06K94M6j33L65J35m77o7J69l2K89K02n91N3
$$ -30 274 -14 -246 -402 -155 183 76 55 -351 -57 -11 -144 221 356 -121 -188 -19 -51 238 440 -151 -98
2466i8L5l22P7j31P45n17M78ro94O61k99K84j15o69N39r5J82k66Q01o55J19l33
$$ -98 -63 -385 -308 -439 306 -211 267 258 -436 225 -74 210 95 -574 -35 -130 52 -214 587 -68 51 -282
2488b82L69k72L24j30j59J44J48k18K36m23N0mk41N61K31l78l03K41M5N1rq5L50
$$ -282 87 -185 139 9 -150 -6 142 -76 160 -263 -213 -217 -458 103 334 -44 -347 -106 -61 -10 -19 -104 246
2511B46j48j55Kj89N3L6K98j01o20O16m00J08L64l7M49l38m3j66K59O9n89O93
$$ 246 98 -57 -55 -244 -191 -155 143 42 -578 38 -362 -254 110 73 522 184 141 -25 234 303 -286 407
2533D07l41n80L03M15L01n3r83N19K19j79J20K51k19p27L20M23l17K33m33P9N2
$$ 407 66 -514 -211 204 505 452 -531 -12 207 28 148 399 180 -547 -227 196 -121 112 -321 -242 -190
2554a90M27k76q6O08Pr50P61j75l41R7K36L63m81m84Q93m50L19k00j30m41P26
$$ -190 237 -39 -125 483 490 -460 301 126 -215 -118 118 481 0 -484 409 -41 278 78 -52 -493 233
2575B33p13N04N70p03M0k19M79l83M70l20N6K44n70j56K72M05K56j029Q64j4n63
$$ 233 -480 24 594 -109 -69 -288 191 -192 278 -42 14 258 -312 -468 -196 209 465 -564 300 286 -277
2596b77m11J718j262O08o03j44Q1M17M7J63m0N0m59K28k31O01k77K80p49l63P22
$$ -277 -688 1030 -232 376 -227 -371 -290 127 174 337 297 347 -112 116 -115 486 209 489 -260 -623 99
2617I9j85J007j057K37l73L07N07n23QL0K84p97J20L42P06j111m09J071l42K33
$$ 99 -86 921 -136 101 -272 35 542 19 27 57 341 -456 -336 6 712 -399 -808 263 -79 154
2637A54K06n25L71l15m27N24M13k18lk04N70r09O1K67M67n18l81L14R6K07k25
$$ 154 360 -165 206 -109 -536 -12 401 183 180 -24 546 -363 -302 -35 432 -86 -467 -153 -57 150 -75
2658g5J20R0m17l4K66K59j12j84k47M55j75k06L22Q3r5k80K7M37kj29k06J59K1
$$ -75 45 135 -282 -316 -50 209 97 -87 -334 121 -54 -260 62 145 50 -230 -203 234 232 103 -103 56 77
2681G7m54J42N37K28o20J27j03L46k89J06J87l80r5k80K55K91j06n16L78P2k70
$$ 77 -377 -235 302 530 -90 37 -66 280 -9 97 284 -96 -191 -471 -216 75 -31 -547 -169 -97 -367
2702c67N49NK58m41q1j23K14O7K8R4j15K6o20Q9K60K36N8o40N20m0k37K37j25
$$ -367 182 187 445 4 -77 -200 14 81 109 203 88 114 -506 -417 -157 79 137 -503 17 -23 -260 -23 -148
2725a48L79l53n8l3O48o06L97j99K19j51j78J28K25j07j36k86M1L01j66L57J23
$$ -148 231 -122 -180 -213 435 -171 226 27 246 95 -83 45 270 163 27 -259 -218 83 -83 274 397
2746C97J31r57L55L82k45k6o36O46k58j13N12j27k13j4k4l9N34k85K47j77O9n76
$$ 397 528 -429 -74 308 63 37 -599 47 -211 -324 188 61 -152 -166 -190 -229 305 20 267 90 159 -417
2768d17L34k9K89m05j81j28L91l66J12K58K00L14j014O62L28k79Q1m37P44L2p07
$$ -417 -83 -112 177 -228 -409 -537 -146 -512 -400 -142 58 372 -642 20 348 69 150 -287 457 489 -218
2789b18M6J14k60m65R28q1M67j034J73N55k90M3Pm62O01K63m10L99o27N33n74
$$ -218 -172 -58 -318 -783 145 64 531 -503 -330 225 -65 -22 -15 -477 124 387 -23 376 -251 282 -292
2810b92Q11R2p62j6L60l95J70L2m4q8j18L5L53J99o42K73L90n30J54J19j88K33
$$ -292 519 611 -151 -167 193 -202 -32 0 -44 -132 -250 -215 138 337 -305 -32 358 -172 -18 101 -87 146
2832A46K14q42M33R9K31m38j37L00j62L70j15K97L16r79J52k59J65p3P98k57J3
$$ 146 360 -482 -49 50 281 -157 -294 6 -156 214 99 396 712 -267 -115 -374 -209 -282 516 259 272
2853B72n72J10kM36l83n28J006p63l01R70k04k29M20o68r1P28n35M20J08m69Q53
$$ 272 -300 -190 -192 244 -139 -667 339 -424 -725 245 41 -188 232 -436 -527 201 -334 86 194 -275 578
2874E78p56L22j42qM27r06K09L46J07l27K64j10m06M5N25L66o91J78N06n95J97
$$ 578 -178 144 2 -6 421 -485 -276 70 177 -150 114 4 -402 -357 168 534 -157 21 527 -68 129
2895A29pk12L45o90L09M46l00o71P36M6j09j55K8r5N04p10K58L07j37pj63L04
$$ 129 122 -90 255 -435 -126 320 20 -651 85 131 22 -133 -105 -200 304 -406 -148 159 22 15 -148 156
2917A56o5k3o23L97J05J92J71n93L27n6l77K08M26l05J19j17K05l5j06m38J15
$$ 156 91 68 -555 -158 -53 139 310 -283 44 -12 -389 -181 245 -60 59 -58 147 112 6 -432 -317
2938c17M14J58j48n96M62o3J64k23k50j85L23K05o0K78n73M20l15J72o6rK63J86
$$ -317 97 255 107 -489 -27 -90 74 -149 -399 -584 -261 -56 -116 162 -411 9 -306 -134 -200 -209 54 240
2960B40n20n0N92l84J7K93K35q1p92K94J7O88n34l42J30N01q5k71j5l00L20j08
$$ 240 -280 -330 262 -122 -105 188 423 342 -450 -156 -139 549 15 -327 -197 304 219 -52 -67 -367 -47 -155
2982a55M05j72j70M44p83R92m87m83O10l34j70oL83l56M35k31J21k92l0L67J9
$$ -155 250 78 -92 352 -431 561 74 -409 201 -133 -303 -309 74 -282 153 -78 43 -249 -279 88 107
3003A07k80P81j043rN60k48K88k72N83q39K8K96j96L7k16M25L04o63m00P64J97
$$ 107 -173 608 -435 -444 116 -132 156 -116 467 -372 -344 -48 -244 -207 -423 2 306 -357 -757 7 204
3024B04L77n30l55j58Q70o14M0R6j7K43j45j42p4L38k22m4K30M11l76j2M4oj65
$$ 204 581 51 -304 -462 408 -206 -166 -70 -87 156 11 -131 -205 133 -89 -133 97 508 132 120 164 158 -7
3047gL17J04q62L05O30j94q9J18p75Q82p1j18m68M50m49q1K87l2j55j73P15p3
$$ -7 310 414 -448 -143 487 293 204 322 -453 429 358 240 -228 222 -227 -308 -21 -53 -208 -381 334 261
3069B61o00N05K2n91K03kj13Q44L2l17l00p1L11nj26l50K45l99J30K69k06O51
$$ 261 -339 166 188 -403 -200 -202 -315 529 561 244 -56 -127 184 179 53 -297 -52 -451 -321 -52 -258 393
3091C93p20R8K48m5j52j66N53l58K4m54O65n09J30R05k53j09k77J41m56L50m52
$$ 393 -327 -229 19 -26 -178 -344 209 -149 -125 -579 86 -423 -293 612 359 250 -27 114 -342 8 -444
3112d44j14K93J80m15N00q8L36o96K23N81j11j42K3m02N33p74K45P18k6n76J26
$$ -444 -558 -265 -85 -500 0 -88 248 -448 -225 356 245 103 126 -276 257 -517 -272 446 420 -156 -30
3133c0J19j14Kj61J02J21j13K45Mn0j008L97R34j47m93L0k87N39j81m50K45R40
$$ -30 89 -25 -23 -184 -82 39 -74 171 175 125 -883 -486 448 301 -192 -162 -449 90 -91 -541 -296 644
3155F44o66k6j66o55J352j068K52P32N7p59K24J84k98O19l06Q62q44p48l1M38
$$ 644 -22 -48 -214 -869 483 -585 -333 399 456 -303 -79 105 -193 426 120 982 138 -610 -641 -203
3175b03p0M89o20N73q9M4j98o7O38k31R5j41m14J19k28M34J61k71l86J59R2J51
$$ -203 -273 216 -404 169 80 124 -74 -141 497 266 361 220 -194 -75 -303 131 292 21 -365 -206 -114 37
3197C7k96J30n4L19J10j222O52J56O6q60N46O79l83n8J053j138L56L83m28l8O8
$$ 37 -259 -129 -183 136 246 -976 -324 -168 -102 -962 -416 263 -120 -178 875 -263 93 476 48 10 78
3218G8o03L42N02l20m54j02K53j2k62K11K90k09l79J488j149N87k18q87R87J05
$$ 78 -525 -183 319 -1 -455 -557 -304 -316 -578 -367 -77 -286 -665 823 -326 261 43 -844 143 248
3238B48l75l18P76n20j56J43O36l24q9m93O71j24J22m55K42j22K76m85P5P48m02
$$ 248 -127 -445 331 -189 -345 -202 434 110 21 -472 199 75 197 -258 -16 -138 138 -347 -272 476 74
3259G4o18J26M57j89J06J21L11n20K07l94N30l22m01K51L20R4M31l78Q5l47K37
$$ 74 -544 -418 39 -150 -44 77 388 -132 75 -319 211 -111 -512 -261 59 153 584 206 291 -56 181
3280A81l17N9p3Q35q24J04L95M5l6o97M68J11k52j25J29l74N52r9r1m84O36n01
$$ 181 -136 -77 -150 685 -139 -35 360 405 369 -328 140 251 -1 -126 3 -371 181 82 -9 -493 143 -358
3302c58L83Rk1R8K66j84o54N26j29k85o9J96M42l80p0N7l01N19K76m8l34K57m18
$$ -358 25 34 13 111 377 193 -461 65 -64 -349 -418 -222 220 -160 -230 -173 -474 45 321 273 -61 196 -222
3325b22j54j17M16j52l98J141p43R9J64m40O78q43Q51j10N93q67k12J44K95n69
$$ -222 -376 -493 -77 -229 -627 514 -229 -130 34 -406 272 -571 280 170 763 -104 -316 -172 123 -446
3345d46O70j00j89r4K2q9N21L1L6p03L44l93L34L35l80K9K47k84K26q7k1ol75
$$ -446 224 124 -65 -159 -137 -226 295 326 362 -341 3 -390 -56 279 -101 -72 175 -109 117 30 9 3 -372
3368c72M97Q9k51J4K72l44J8j73N05r5j29J17n2J58n88J40LJ43k17K15k41J20
$$ -372 125 214 -37 -23 249 -95 -77 -250 255 160 31 148 96 254 -334 -194 -191 -48 -265 -50 -291 -171
3390a71J24k81M73l13K5Q7K44r8j44J03r0J7j09J68J11m43J47J7J61J93l71J74
$$ -171 -47 -328 145 -168 -143 -56 188 90 -54 49 -41 -24 -133 35 146 -297 -150 -133 28 221 -150 24
3412B4r4m5m9K70K5pk55m9L46J0%k99K6J02J72j75j43K48J34q9m15L17J13j96
$$ 24 -70 -115 -164 106 131 124 -131 -180 166 176 176 -123 -97 5 177 2 -141 107 241 152 -263 54 167 -29
3436b9N9M93p45m6O2k6M69l53O0K8K1k6m7J62K17l18kJ50j12q1l30K20O10k53
$$ -29 30 523 -222 -268 -206 -232 237 -116 -56 -28 -7 -33 -80 82 299 -19 -21 129 17 -64 -394 -174 436 183
3460A83n86L79J09l08o1L51j01j32K06L9Rk35j75L94j14O8l37L52j15L13l62K18
$$ 183 -403 -24 85 -223 -284 67 -34 -166 40 79 88 -147 -322 72 -42 26 -311 41 -74 239 -123 95
3482I5kJ05n67K27j98N74J53o21K60N7r4l58L0QN04j64Q5Q9j97p7K87k21r2N1
$$ 95 93 198 -369 -142 -340 234 387 -234 26 83 -11 -369 -339 -331 173 9 94 183 -14 -91 196 -25 -117 -66
3506f6L37j42K6q7q8J79k19j64K60j12p3k79M15J13k73J23L2K14o8j43%K40r7
$$ -66 271 129 155 68 -20 159 -60 -224 36 -76 -149 -428 -13 100 -173 -50 -18 196 128 -15 -15 225 128
3529A28l32L41O3j71j6j07j43L22l17J06J50J65j52P1n6J87j93q7L87j46j74l3
$$ 128 -204 137 200 29 13 -94 -237 85 -232 -126 24 189 37 108 52 239 46 -41 346 200 26 -7
3551gJ50j93R4m16K89K91m5m4q8P8J04k62J86p5o4P3k01L29j51J08j79J43k35
$$ -7 143 -50 44 -372 -83 208 163 119 31 109 213 -49 137 62 -2 71 -130 199 48 156 -23 120 -115
3574a15K38j89J40K47l92J68R9l3l29K02jJ01j31j16J05J33k58J65M06k60l21
$$ -115 123 -66 74 321 -71 97 196 163 -166 36 35 136 5 -111 -6 127 -131 34 440 180 -141
3595a41Q9j70M03m6r8k23K59M8k63J44j10k9j68L76o2rm8j75J77K47j80j86J95
$$ -141 -52 -222 181 135 37 -186 73 121 -142 2 -108 -137 -305 71 9 0 -48 -223 -46 201 21 -165 30
3618C0J26j81j07p4M26k65L40m5l20j22J49M6P4r4j93P0L77l37L19l45J27j24
$$ 30 156 -25 -132 -206 220 -45 295 250 -70 -192 -43 3 77 -17 -210 -140 237 -100 219 -126 1 -123
3640a23J05j22R1J73n7j08k8J79j82K27k4K71m28kR0j4j04J3J78J03k70p5K12
$$ -123 -18 -140 -49 124 67 -41 -69 110 -72 155 131 402 -26 -28 62 48 -56 -43 135 238 -32 -107 105
3663A05K53n26j7N6K08p2k23K45R1n4m82L16j9J82k64K08M4j07Q8k30K99o0k53
$$ 105 358 -168 -185 -129 79 7 -216 29 120 66 -416 -100 -119 63 -201 7 51 -56 32 -198 101 41 -212
3686b12K58M5M4j3L7p8j01r0K42M7l41L63l65J06j15M9j7M07q8n9k35J39J19k31
$$ -212 46 91 135 122 159 81 -20 -110 132 179 -162 201 -164 -58 -173 -124 -141 266 178 119 -116 23 142 -89
3710h9J72j11J62j00k71M73J02j50m59K63J7j20L9M7K39k22o9J63J01k52R4j94
$$ -89 83 -28 134 34 -237 236 338 188 -271 -8 9 -111 -72 -25 214 -8 -77 86 187 -65 29 -165
3732a65N2R6m5J46j53J9n2R3jJ21L6o4k42K56k27j72L76R1m57L89q9kp6m9LJ23
$$ -165 -113 -17 -62 84 -69 -50 -102 -9 -10 111 147 83 -159 97 -130 -302 74 165 -292 97 8 6 -70 -119 -116 7
3758Gm4j04K25j60J20k89M02l49N7K24k0P3j86K24o4q3m5J34k88j91M58q3m9K88
$$ 7 -37 -141 84 -76 44 -245 157 -192 -135 89 69 142 -44 180 116 33 -12 122 -166 -357 101 18 -31 257
3782B57j43l38O4Q3K01j64j72Q3J55j42K69q8N2o8j48j19L35j3m3o9k25L16J5
$$ 257 114 -224 -160 -77 124 -40 -212 -129 26 -116 153 65 117 49 -99 -218 117 104 61 -8 -233 83 98
3805I8j50O1K98m76M5K06l37Q2L47j54n3K4k21R6L27j72J7j07J19j17kn6J69k35
$$ 98 -52 9 307 -169 -124 82 -255 -173 174 20 -33 -9 -230 -134 193 21 38 -69 50 -67 -69 -125 44 -191
3829a91O5J50J31j3n3j94j5L22k74K79l61J85o2o2J50Ol27J68J17L33j94j89J60
$$ -191 -126 24 155 142 89 -105 -120 202 -72 207 -154 31 -31 -93 57 63 -264 -96 21 354 160 -29 131
3852A31j23J40j77oR6j05j00O3J37k22K26l52L91p7l64L52J8J12l12j09L53P3
$$ 131 8 148 -29 -35 61 -44 -144 -81 56 -166 60 -292 99 22 -342 10 28 140 -172 -281 72 145
3874A45m44K62k9J07j53K14l02K04J62r8J00j38Jn5O5j78J62j49M14j94j25k08
$$ 145 -299 -37 -66 41 -112 102 -200 4 166 68 168 30 31 -24 41 -137 25 -124 290 96 -29 -237
3896b37M45k39k96K4M63J85k33m23K34j77L1JmL38O8l31K4p9k48L42K58Mk83K74
$$ -237 208 -31 -327 -303 160 345 112 -311 -77 -254 -223 -222 -226 112 180 -151 -127 -206 -454 -112 146 150 -133 141
3920A41O3p46O13k6lJ74j38j55o9J0Q2m0k4N56k00k27ok07K26K76n54N66k16k89
$$ 141 204 -542 71 45 42 216 78 -77 -146 -136 -54 -94 -118 438 238 11 5 -202 24 300 -254 312 96 -193
3944a93j81k0K5M79j96N56J27l70l60N33k83L97o08J01l7j4m78K69Q99p58o22
$$ -193 -374 -394 -369 110 -86 470 597 227 -133 400 117 514 -94 7 -30 -44 -522 -253 646 -112 -734
3965g34M07M25J48L45q30j08q6P57p89O93q20L71O18r82O49o35L51q83J407m74
$$ -734 -327 98 246 591 -239 -347 -433 324 -465 228 -592 -221 397 -585 64 -571 -220 -1103 304 -170
3985a70l22N53P81r88m61K66K43j95N43k1k52L15m38k48P74q18M96j3M10m45j08
$$ -170 -492 61 842 -146 -607 -341 -98 -293 250 229 -23 292 -146 -394 380 -438 58 45 455 10 -98
4006i8m2L63P3l31j62N24k94l60N22K52n24j78l5P08k01k80l08R42o75l73N49
$$ -98 -140 223 296 -35 -197 327 33 -327 195 447 -77 -255 -290 418 217 -63 -371 571 -104 -477 72
4027G2m71M26k33j99J191P2j369J189r61O7J09m2N24N9q36N91k32j9k89K72M16
$$ 72 -399 27 -206 -405 786 858 -511 678 -283 -216 -107 -149 375 434 -402 189 -43 -62 -351 -79 337
4048C37o74m83Q98q74Q48l75L19QK66q39n24J585L14l62r80r9J004M39q89n08
$$ 337 -337 -820 78 -796 52 -323 -4 4 270 -569 -1093 492 806 444 -536 -635 369 808 -81 -589
4068e89K91M34n43L24Q25j041O8k87m51J098O9K45J62k45m45K56L47m37j09l7
$$ -589 -298 136 -407 -83 742 -299 -231 -518 -969 129 198 443 605 360 -85 171 518 81 -28 -65
4088f5n1K01m44P40o62M31p70l22J339j36l79J00P78n91q8J096j738L30L67J91
$$ -65 -116 85 -359 381 -281 150 -620 -942 397 261 -118 -18 760 169 81 1177 -561 -231 136 327
4108C27k61p35J52K07K16J33q6j54O08n09J91j87N5K1j63M90l42K91l85j60L82
$$ 327 66 -669 -517 -310 -94 39 -47 -201 407 -102 89 -98 -43 -22 -185 305 -37 254 -131 -291 91
4129I1K27l93j16P1Q4J42k52K1J07R6k53M01j8J2k98j35K3K70j42k99K86L6j3
$$ 91 318 -75 -191 -120 -36 106 -146 -125 -18 78 -175 226 208 220 -78 -213 -190 80 -62 -361 -75 -39 -52
4152e2k48J14l07L31M8J38K58m04J88K54k87p9K37k01J44j29j46K72K27m10j40
$$ -52 -300 -186 -493 -162 -114 24 282 -122 66 320 33 -46 191 -10 134 5 -141 131 358 -52 -192
4173a92J52Q9k1j11J71kk75r8L45K1j94NL3K70n5j19J60j33l21p4O23j89O3l89
$$ -192 -40 49 28 -83 88 86 -189 -287 58 79 -115 -110 -77 193 138 19 179 46 -275 -349 274 85 148 -241
4197b41M17j07p1o6P5Jl72J67j6M09k58K44j18N1k65L50k76K73j67n4K7K08j85
$$ -241 176 69 -2 -68 7 8 -364 -197 -213 196 -62 182 64 115 -150 200 -76 197 30 -24 3 211 26
4220B6j77J9N21l46j25O6J39j15j59J59j96K51oj87J61j86J19j69J33K68j23j88
$$ 26 -151 -132 389 43 -82 -16 123 8 -151 8 -188 63 57 -130 31 -155 -36 -205 -72 196 73 -115
4242a15l0j1K9j30M37J47m38K18O6j54J43k69QK87k14o5L75k98j55L20l35J08
$$ -115 -145 -156 -127 -257 180 327 -111 107 173 19 162 -107 -99 188 -26 -91 284 -14 -169 151 -184 -76
4264g6J60l81M67M7j53o86M72K54J31k0k2m87M61O9n29K96J19k81K30n8l92P2
$$ -76 84 -297 170 217 64 -622 -150 104 235 215 193 -294 167 236 -293 3 122 -159 71 13 -379 -307
4286c07J83N62r27k80P97P55q15k84M94m60M8K97o18N19o52M65O52n54r1J89k25
$$ -307 -124 438 -489 -769 28 783 -32 -316 178 -282 -234 63 -555 -36 -688 -223 429 -125 -216 -27 -252
4307b52K5L67N01k37j76o18J057p49Pr39R87M0L25n26L8k90J008n07p89o3J437
$$ -252 -227 140 641 404 228 -390 667 -82 -75 -1014 -27 13 338 -188 -150 -440 568 61 -728 -791 646
4328F46m14r53R02o45O32m87L22OP7l29q63J392M6j160K71M60K33o61m55R78R7
$$ 646 232 -721 181 -464 168 -319 3 9 86 -243 -1106 286 332 -828 -557 -97 136 -525 -980 -2 95
4349I5n01L09L43J1O81j070O87m93n70l6J89M63j349R40p5M78j057J218j49m52
$$ 95 -406 -97 246 257 938 -132 555 62 -508 -544 -355 108 -1241 -301 -376 102 -955 263 114 -338
4369c38O11j562J004P89J44p14k57P47j110o7R75k78J39o78k96J107k19q6o39
$$ -338 273 -1289 -285 504 648 -66 -323 424 -686 -753 222 -56 83 -595 -891 216 -3 -89 -728
4388g28J115j033L94K41N92j190N82j53J00J44j168O55M10J55m15Q4N04l43m14
$$ -728 387 -646 -252 -11 581 -609 -27 -180 -80 64 -1104 -449 -39 116 -299 -215 289 -54 -468
4407d68M8O44o98K29m1K01L5%K69j41J35K07o37p2K59j26j92K10K7L88j34l30
$$ -468 -420 224 -474 -245 -286 -85 -50 -50 219 78 213 420 -217 -289 -30 -156 -348 -138 -111 277 143 -187
4429a87j20N36k85o7J88m27L72K71j67l5p89M62K30R5l60O59j98l70L13k73K78
$$ -187 -307 229 -56 -123 65 -362 10 281 114 79 -710 -248 -18 77 -283 376 178 -192 121 -152 126
4450A26l73K61M1O8K17j60K62K7j01m94m2L99j40K98j15q5m13n51R43k52M0l94
$$ 126 -247 14 55 123 340 180 442 469 368 -126 -168 231 91 389 274 189 -224 -775 168 -84 -44 -438
4472d38n13Q35m20N72M91r88N31N1l4J30K32r04O23j65n0J96k84l19R89n90n7
$$ -438 -951 -116 -536 36 527 -461 70 121 87 217 449 -455 168 3 -47 149 -135 -454 535 -55 -112
4493a12N62p86R16m98j7l06R4Q1J27j60m51K04r3R92Jo97N1j5j13jj41k20J247
$$ -112 450 -336 580 82 65 -241 -147 -66 61 -99 -550 -346 -439 553 554 -143 -92 -107 -220 -221 -362 -582 665
4516F65j669J009p2r9n73P94r3k90k66J198o32k82Q0K75k78j65J73M96L48r47
$$ 665 -1004 5 -67 -166 -739 55 -38 -328 -594 604 -28 -310 -230 45 -233 -398 -225 271 619 -328
4536c28N64M89o82n64M99O6P0j022N51M19L5L43r52O55q2k37P00n88L08r78M88
$$ -328 236 725 43 -521 -22 44 114 -908 -357 62 97 440 -512 143 61 -176 524 -64 244 -734 -246
4557b46L85J98n03Q6J62M30o20j55q0Q38k8k63p7m43K15P07m55k85p3J011n04
$$ -246 139 337 -166 -80 82 512 -108 -263 -343 495 467 204 127 -316 -101 606 151 -134 -207 804 300
4578C00p32Q06n55L59n15M36r4j40J51j51q2J11J23k33J09N85p0o60M57j90K51
$$ 300 -432 374 -181 178 -337 99 5 -135 16 -135 -217 -106 17 -216 -107 478 408 -252 205 15 266
4599B66l56P1j04J60M8m12M24J65K18m30k32PL80l09J79j43K69R8m43J73nO5M33
$$ 266 -90 -19 -123 37 85 -327 97 262 480 50 -182 -175 205 -104 75 -68 201 299 -144 29 24 89 522
4622E22n02o4J27J22l48j76L91J27l59L48K59l38k56M33j14M88q46Nk82j36N42
$$ 522 20 -44 83 205 -143 -319 72 199 -160 188 447 109 -147 286 172 660 -186 -181 -463 -599 -57
4643e7J40K01m74O32k43j49l97J58L86k07J37j96K06p65P67M27k08l45Oj95L3
$$ -57 83 284 -190 442 199 50 -347 -189 197 -10 127 -69 137 -628 139 566 358 13 19 -176 -143
4664a43J95M46q18K92L17p86J02K61Q5N43j16r98P46J36n9j29M65m86p9k75M29
$$ -143 52 498 -320 -28 289 -497 -395 -134 -49 494 378 -620 126 262 203 74 539 53 -26 -301 128
4685A28l95M75k70k35M13k21K69p5k21k04M00J86k00J25k78Q6K58l79M87l26J35
$$ 128 -267 208 -62 -297 116 -105 164 89 -132 -336 64 250 50 175 -103 -17 241 -138 349 23 158
4706A58l33K05k68L21k40L55j73J09l99J51J82n7j17L25k6m38j78L12P5k07L18
$$ 158 -175 30 -238 83 -157 198 25 134 -265 -114 68 11 -106 219 193 -245 -423 -111 -36 -243 75
4727G5k84jjJ77L58j05q7j71k0RN9j5Q5J11j74n3L03m23K46k31J33O2k4oM6q6
$$ 75 -209 -210 -211 -34 324 219 132 -39 -59 -50 9 -6 79 190 16 -37 266 -157 89 -142 -9 53 29 23 69 -17
4753a7j38K88j51N7J37j88J87k9n4j6L0k2m5j50m8K02k0J54l41P2n0l1M70l30
$$ -17 -155 133 -18 39 176 -12 175 146 92 76 106 84 39 -111 -159 43 23 177 -164 -92 -142 -173 297 -33
4777c3j5K83k86o4k02J01K27q3J44m4N4p0r7N9NM4q5m2O6m3J14L9k44K3M03pl18
$$ -33 -48 235 -51 -115 -317 -216 11 -72 72 28 82 12 -85 -26 -21 23 -62 -104 -38 -81 33 72 -172 -149 254 247 -71
4804g1rl7J66J18l11Q3Q8n1R1p9R1j90M5J52k37J95j17p4K60k33J28L8k52K70
$$ -71 -80 -117 49 167 -144 -61 27 -24 67 -12 79 -111 -66 86 -151 44 -73 -147 113 -120 8 46 -206 64
4828F4n9m3K1Kpo0P2J79m27M4J79M5k32K79K76m44j81M18k40K24k5j86M0J73j68
$$ 64 5 -38 -17 -15 -22 -82 -10 169 -258 -214 -35 10 -222 57 333 -111 -292 126 -114 110 85 -101 -61 112 -56
4853e6K5J11j49J16Q1l2j3J41n3k72J48J17l9k35J2J13j86k0K43k3J02j50N9p4
$$ -56 -31 80 -69 47 128 96 83 224 171 -101 47 164 125 -110 -98 15 -171 -191 52 29 131 -19 40 -34
4877c4J15k44L78l9r2K1k31J85k5j52L61Pk25j53K17j66j59M05j45n2N9l06P5
$$ -34 81 -163 215 176 84 105 -126 59 34 -118 243 250 25 -128 89 -77 -236 169 24 -28 31 -275 -200
4900b00K04j11J69n2J63k15J23n7j00J80k49J52J39l43L20k23J46Q4n0M7M5j07
$$ -200 4 -107 62 10 173 -42 81 24 -76 104 -145 7 146 -197 123 -100 46 130 80 127 172 65
4922F5K8j26J13l16K90p6J18K23k81O5k92L53q0O6j32j17J24J5J24j0N9l03n4
$$ 65 93 -33 80 -236 54 -22 96 319 38 103 -189 164 84 150 18 -99 25 40 164 154 213 -90 -144
4945a44M2O6p6J2L2J38r6J97l32M4l2k1R5M6k2j18K94p1j05k7J44K2p9j08N6n
$$ -144 -102 -36 -112 -100 -68 70 -26 171 -161 -117 -149 -170 -75 -29 -51 -169 125 54 -51 -78 66 88 9 -99 -43 -48
4971d8O6k18L94k76mJ90L5P6l02M1K31k63Q3j19J53l16M1K60j45L78q1m38L35
$$ -48 18 -200 194 -82 -86 104 139 215 -87 -46 185 -78 5 -114 39 -277 -236 24 -121 257 176 -262 73
4994G3j47K26k04j2J30J00l32M71m43J85j59O8K04k87J75j46l3K92p4M4o7j64
$$ 73 -74 152 -52 -64 66 166 -166 305 -138 47 -112 -44 160 -127 48 -98 -131 161 87 131 64 -100
5016a00K57l16J66J28q2k79K23J3k9L3%k0j36K0J46J24q1k47K08K52l04L8l4j37
$$ -100 157 -159 7 135 53 -226 -3 10 -19 14 14 -6 -142 -122 24 148 67 -180 28 280 -24 14 -20 -157
5040a57K93p4k9k00K55O4Jj57j92L97k16M1j06o3R9K6M6J23k2J9p4j64rJ66n0
$$ -157 136 62 33 -167 88 152 153 -4 -196 201 -15 26 -80 -143 -44 -18 28 151 129 148 74 -90 -99 67 17
5065A7j46J45j39J81k66J65J39k70K59p0L7J69k1K1p09N41r3J87l97O17l64k13
$$ 17 -129 16 -123 58 -208 -43 96 -174 85 15 52 221 200 221 -488 53 -40 147 -250 367 3 -210
5087b10Q17p44l45L88K2l17J64l14R44m46r90J170K12q36J17M07l64K98K69k09
$$ -210 607 -137 -482 -94 -72 -389 -225 -539 405 -41 -1031 139 351 -485 -368 39 -325 -27 242 33
5107C3r6q9K23p1j39N0L76l04j80J37m2l6K0K27k82M9j5K25p4k04K82N9l2p0k70
$$ 33 -63 -152 71 0 -139 -89 287 -17 -197 -60 -102 -138 -118 109 -173 -124 -139 86 12 -192 90 149 117 47 -223
5132b23J10Q8K86j88j37n2J49q4k15L41j65J06j04J00k7j35p4R7K64j25j11n8
$$ -223 -113 -25 261 73 -64 -116 33 -51 -266 75 -90 16 -88 12 -15 -150 -224 -127 137 12 -99 -157
5154a57L00j71J36j78K12j28J64l94K73m4p7l9K24R4k56K87m06M44l61o6K03R7
$$ -157 143 -28 108 -70 142 14 178 -216 57 13 -64 -103 121 215 -41 246 -160 284 -77 -143 60 157
5176A57l45J50P0n4K49j2j76p1K2M0k09q0L33j55J45J19k05O9p5M7l80J79J79
$$ 157 -188 -38 32 -22 227 215 39 -32 -10 30 -179 -259 74 -81 64 183 -22 47 -28 19 -361 -182 -3
5199cN1l71K74J88k15P2j47P8J22l6j32K74j20l9j93K89k20K7J66m4J23k53J78
$$ -3 48 -323 -49 139 -76 -4 -151 -73 49 13 -119 155 35 -4 -197 92 -128 -101 65 21 144 -109 69
5222F9p5J56k73J77k4j04J15J24k69oK48j44j33n2L93k22N1l5p1o2J55J14j2j93
$$ 69 -6 150 -123 54 30 -74 41 165 -104 -110 138 -6 -139 -191 202 -20 31 -4 -75 -137 18 132 120 -73
5246g3J83M8J6k24Q8p3j9l7J42j99pMJ61j64Q4J41m2k04K77j03j17L18k91k3J24
$$ -73 110 158 174 -50 38 -35 -54 -91 51 -148 -155 -151 10 -154 -70 71 29 -175 102 -1 -118 200 -91 -114 10
5271A0Q7j41N2j20L29l92J80k02J97L6k99K37M4p0J91j94J48m0K5L14l20j09J6
$$ 10 97 -44 8 -112 217 -175 5 -197 0 36 -263 -26 18 -52 139 -55 93 53 78 392 72 -37 -21
5294b1R2j08J8J19lj27R3l8j13l8K09j8p0k11K15J65q7k61k69M08Ll0Q1J15j77
$$ -21 71 -37 -19 100 97 -30 63 25 -88 -126 83 65 -5 -216 -1 164 77 -184 -453 -45 -42 -72 9 124 -53
5319e3l4m0K90j00n1L0nj74J98j65J32M30k59m31L44J4l86J65n5J84j04j7R3J23
$$ -53 -87 -127 163 63 12 42 37 -137 61 -104 28 458 199 -232 112 126 -260 -95 -150 34 -70 -87 6 129
5343A29j74P7Kq5Q2J44l25J14K07l25O6O4j58K2J72J09m3k2O9q5N6N7j45k8P2
$$ 129 -45 32 34 -51 31 175 -150 -36 171 -154 -88 -24 -182 -160 12 121 78 56 125 40 96 153 8 -20 52
5368E2J85k63J56k03J7J98j93J17J1n0j01J33J92o6j70Q6j42q9L07J16l56N7p7
$$ 52 237 -26 130 -73 -56 142 -51 66 77 27 -74 59 251 185 15 101 -41 -130 177 293 -63 -6 -83
5391h3n4R1k2j86L24J15p0k47k61M30J7M24p94JQ2J57O2K7J10l86N39l45K46j35
$$ -83 -137 -46 -68 -254 70 185 115 -132 -393 37 54 478 -316 -315 -233 -76 -14 13 123 -263 276 -69 177 42
5415D2Q5J05n11K11J32k59k87J43J09N97k28n28L82m32Q73m71p7L6K52J53m3q62
$$ 42 127 232 -279 -68 64 -195 -482 -339 -230 367 139 -389 -7 -439 434 -37 -114 -78 174 327 284 -578
5437e78Q91m23P92p35j73L8K34O56p60Oo1M68r7m56L13N41j282O19m6rj00N74
$$ -578 313 -110 682 -53 -226 -188 46 702 -58 -52 -113 355 258 -198 115 656 -626 -7 -53 -62 -162 412
5459D12n34L69k00l51J40J38K75j63k04M05k16j81q1QK58P5j39j14M8L44l75N6
$$ 412 -122 247 47 -304 -164 -26 249 86 -118 287 71 -110 -191 -183 75 150 11 -103 -55 289 -86 -30
5481c0L40m06M6J00o8K97j13P0k71K46k60J27p1p3k0n4J28k1M0l0k04K14P2o3
$$ -30 310 -96 -50 50 -18 279 166 236 -35 211 -49 78 7 -66 -86 -140 -12 -33 7 -23 -227 -13 59 -4
5505dk00J83o0j4J63Q3l0J5l03J90J36J36n48M28o3l90P2J31N82m75j82L3K73
$$ -4 -204 -21 -81 -95 68 151 121 136 -167 23 159 295 -253 175 112 -278 -206 -75 507 32 -150 -117 156
5528A56K6k14J18Q7K74m72K75k03J09k52o3K65l54K88k2j21R5k80K86j63L27k31
$$ 156 182 -32 86 173 447 -25 250 47 156 -96 -159 106 -248 40 18 -103 -8 -288 -2 -165 162 -69
5550f9P0K60j46k78J03K40k03N0O9Kp6j04R7l82M87p3k48J18j06Q7K25o5K0R3
$$ -69 1 261 115 -163 -60 180 -23 27 96 98 22 -82 15 -367 120 47 -201 -83 -189 -102 123 58 78 171
5574A71k36J21l5N6M8j18r2J91j67J96rJ14n92J35J52L4k8J43Pl44K47p3J60l0
$$ 171 -65 56 21 77 125 7 -85 106 -61 135 126 240 -352 -217 -65 -31 -59 84 91 -253 -6 -79 81 51
5598E1K3j43k9J85J19n4l77R8K0K72j49Q6N4j99J46Q5j74J73K3j60k27K73m5j00
$$ 51 74 -69 -98 87 206 152 -225 -127 -107 165 16 102 156 -43 103 188 14 187 210 50 -177 96 51 -49
5622d9L68r2m91J40J85k31L88k92j79K59p2L7j08J44r9J33j64J86l13K53K0o5
$$ -49 319 227 -264 -124 61 -170 218 -74 -253 6 -66 -29 -137 7 -92 41 -123 63 -250 3 23 -42
5644d2L02m65L80j48j17pk3K53l24K34k11K82l37M10j09k62L38R9j65j00J07O0
$$ -42 260 -205 175 27 -90 -97 -120 133 -191 43 -168 114 -223 187 78 -184 154 253 88 -12 95 155
5666A55l6j57Q0mj37pK00l4l21L00K3K62l90n9K36l80N19n08J68j50L55n5j38
$$ 155 119 -38 42 38 -99 -106 94 60 -261 39 62 324 -66 -125 111 -269 250 -258 -90 -240 115 60 -78
5689g8jK43j92N9O0j41J42j73n4J56J75j92mk6L6o7n8L65k40j3J31k61L73k15
$$ -78 -79 164 -28 31 91 -50 92 -81 -135 21 196 4 0 -26 10 -57 -115 250 10 -3 128 -133 240 25
5713B5l92L53K74j90r5J44p4Q8k62J95j83M7k63M24J2j79N03o27N6K52m73N25
$$ 25 -367 -14 260 70 -25 119 45 133 -129 66 -117 -70 -333 91 103 -76 427 -200 -144 108 -365 160
5735A60j64j56k93j65L19K82l21Q72j89J1n49J75K3k89L70M0l64l9L91j97J01
$$ 160 -4 -160 -453 -618 -299 -17 -338 534 345 356 -193 -18 5 -284 86 126 -238 -277 114 -83 18
5756A8MJ11l06Q7l5K92j83l8J36o0j76K33k2Q2k63J69j7oO9k90j10R2K56k65L08
$$ 18 22 133 -173 -86 -121 171 -12 -50 86 26 -150 83 61 143 -120 49 32 26 95 -195 -305 -213 43 -222 86
5781H6j43p2J56l2j07M8J03L4Lk38K13l2j18K6P1L43m15K17l54m5L23m06J30J90
$$ 86 -57 -129 27 -5 -112 -64 39 73 76 -162 51 19 -99 -73 -2 341 -74 143 -211 -256 67 -339 -209 -19
5805a9j10J58J1P4k84Q5j42J93L81m31m7K01j24L2J36j12lm8M0Q1l22L27j92L0
$$ -19 -129 29 40 114 -170 -85 -227 -34 347 -84 -131 70 -54 -22 114 2 -1 -49 -9 72 -250 77 -115 -85
5829h5M20l78J87l71J88K10k45K37L4l2o2j04J04R3k83L%J78l43M18j31J56q3
$$ -85 335 -43 144 -227 -39 171 -74 163 197 165 103 -1 103 196 -87 -84 -84 94 -249 169 38 194 111
5852A11j23MQ5p1j09j9J27J85k38k8J59j14k1M6J16j03j23M8mK1J56k2j45kJ04
$$ 111 -12 -8 77 6 -103 -122 5 190 -48 -76 83 -31 -52 -6 110 7 -116 -68 -72 -51 105 83 -62 -64 40
5877D0k37O7J01M2l1j55L18j75J0M3P0j01jJ0%q7J01n0j46L80l32jO1J38k69J45
$$ 40 -197 -130 -29 13 -18 -173 145 -30 -20 23 93 -8 -9 1 1 -86 15 -35 -181 199 -133 -134 -73 65 -204 -59
5903e9L88l93J7J94j64Orj09K00j63j68L47o4l3P5JJ1j65l2Q7o3K99l38K79Kj89
$$ -59 329 -64 -47 147 -17 -11 -20 -129 71 -92 -260 87 23 -10 65 66 77 -88 -120 -33 -96 203 -135 144 146 -43
5929d3k2M2Kk9M6J84j31l88K47R6p9K25k08k5R2l2j14O0j28Q9M5J13k88K4L59
$$ -43 -65 -23 -21 -50 -4 180 49 -339 -92 4 -75 150 -58 -83 9 -23 -137 -77 -205 -116 -71 42 -246 -222 137
5954A37Qj9q2J21j63R8n5R3j44LR2k11M02m11K00k11J45K01m74J59M9KJ22m4j88
$$ 137 145 126 44 165 2 100 45 138 -6 -3 89 -122 280 -131 69 -142 3 204 -270 -111 -62 -60 62 18 -170
5979a70L05j02J38k62J50j45N9J72l77J11j12J69L5K55l75J02J34j28k06M45k23
$$ -170 135 33 171 -91 59 -86 -27 145 -232 -121 -233 -64 -29 226 -149 -47 87 -41 -247 198 -25
6000b5J32K8M8L8j57j70J27J21K7l1l05L33l35J56p2J50j93L60k10n7J50J9k93
$$ -25 107 135 183 221 64 -106 21 142 169 138 -167 166 -169 -13 -85 65 -128 232 22 -35 115 134 -159
6023a59J07MJ62l51L66q0k21K37n9k19Q2K52P9j7J5l20L06o6j29k13L55L9k79
$$ -159 -52 -48 114 -237 129 49 -172 65 6 -213 -131 121 200 183 198 -122 184 118 -11 -224 131 170 -109
6046a09PJ00J31k93l2K81j3O0j22j69K75o4r4j08K19j24j21J18m1M7J39l70K53
$$ -109 -102 -2 129 -164 -196 85 72 132 10 -159 116 52 -42 -150 69 -55 -176 -58 -99 -52 87 -283 -30
6069c0J53o9J05k04Q1j75J61j21m4n4k2J16K42k74K76j69J8oK1j02L15j57j26
$$ -30 123 54 159 -45 36 -139 22 -99 -143 -197 -219 -103 139 -135 141 -28 -10 -16 5 -97 218 61 -65
6092f5kK8r7L42j12j82K53l15P8R6J03k18J88j59L8r3J33O3k6L9p2Q7q8j54N4
$$ -65 -67 -39 -136 206 94 -88 165 -150 -72 24 127 -91 97 -62 -24 -117 16 79 53 92 20 107 19 -135 -81
6117h1J29O1K5j27N1J45j91J3j13K18q0j37K88j39m4l42N41j6n5j81K67l30j4
$$ -81 48 109 134 7 58 203 12 25 -88 130 50 -87 201 62 18 -324 217 201 146 -35 232 -98 -112
6140a12O9l8Q6j08k0J01J70q6n2k46J71L21m07K86J5J69m26K14j38J24J05j34
$$ -112 -43 -81 5 -103 -123 -22 148 62 10 -236 -65 256 -151 135 150 319 -107 107 -31 93 198 64
6162F4J94l72K00l1k1l2j2J56n4j95Pk9J79n0n8o0J47K46k00j82J84l70q1M75
$$ 64 258 -114 86 55 34 2 -10 146 92 -103 -96 -125 54 4 -54 -114 33 279 79 -103 81 -289 -370 105
6186A05M1k91R3k48K56J10j4P3m6J76l26M7lQ2Mj06K22o6j67j5K06k70J54K16
$$ 105 146 -145 -52 -300 -44 66 52 125 79 255 -71 -24 -27 55 59 -47 175 109 -58 -73 133 -137 17 233
6210B33k11J8M4j32RJ5J13k09q3L46p9j59J4l%Q7N0N9j66oJ65M0p7k10L06q9j19
$$ 233 22 40 84 -48 -39 -24 89 -120 -203 143 64 -95 -81 -84 -84 3 53 112 -54 -60 105 145 68 -142 164 75 -44
6237d4K24j71P1no2p8j5k3j90K63jN7J38k38P5j7j15K7Q0L29l11R5K8j8J29n29
$$ -44 180 9 80 75 13 -65 -80 -103 -293 -30 -31 26 164 -74 1 -16 -131 -104 -24 305 -6 89 117 99 228 -301
6263c01L19k40J18M15k74J75l11j59lM30k74k47L8M42j12l8p0J8L26o8j55j08
$$ -301 18 -222 -104 311 37 212 -99 -258 -261 169 -105 -352 -314 128 16 -22 -92 -74 252 184 29 -79
6285g9L4rj01K00O0k52K86l77L69n01J36J21L65n70r9O15k0K35j54k43K10n89
$$ -79 -45 -54 -155 45 105 -147 139 -238 131 -370 -234 -113 252 -318 -417 198 178 413 259 16 226 -363
6307c63N45j74L15n70M42n75Q19p53P2O76J57j010L21m49L83r7J87M7k56J75K
$$ -363 182 8 323 -247 195 -380 439 -314 -242 434 591 -419 -98 -547 -164 -261 -74 -27 -283 -108 -106
6328a06P8p9M73J6p5m86O53n63L35k35L10m24M49m07l72J216n13j73J69k62r5
$$ -106 -28 -107 366 382 307 -179 474 -89 246 11 321 -103 346 -61 -433 783 270 97 266 4 -91
6349i1n92O55n57O18j28O45p53N20p2k65j54P37o31k08M04o92J004j58m05k35
$$ -91 -683 -28 -585 33 -95 550 -203 317 245 -20 -174 563 -68 -276 128 -564 440 282 -123 -358
6369c58n72J272r44N86M93j010O86MK1k9L6o46J29j45J10K95q9N70K17j066Q06
$$ -358 -930 342 -602 -16 477 -533 153 157 178 149 185 -461 -332 -477 -367 -72 -161 409 626 -440 366
6390C66l00k70L12m05K32K16k92j34J44l17K24K12O0K36n34M72m15j9O1J93Q5
$$ 366 66 -204 108 -297 -65 151 -141 -275 -131 -448 -224 -12 48 284 -250 222 -193 -212 -151 42 127
6411A27J54k48M71J7j98p77P45m66L18K98k64n12N73o05K54j03J84J03k77o2Q
$$ 127 281 33 504 521 323 -454 291 -175 143 441 177 -335 238 -367 -113 -216 -32 71 -206 -268 -260
6432b60K17K0J50o83J017p27J07r5L52j58N6L15k55K20j05k10j01J68m09M8M15
$$ -260 -43 -23 127 -556 461 -266 -159 -254 98 -60 -4 311 56 276 171 -39 -140 28 -381 -333 82
6453H2J8K9n9J8k01j4J2o3KL25j28O8pj62j35K94N9k23N6M6j08K10o8k31K73N4
$$ 82 100 129 70 88 -113 -127 -115 -178 -176 149 21 89 82 -80 -215 79 138 -85 -29 17 -91 119 51 -180 93 147
6479A47k57K27k17n6K23k7j58J50K6n7K46l43K01j20l9J23j91J06rJ94m70L22
$$ 147 -110 117 -100 -156 67 40 -118 32 58 1 247 -96 105 -15 -54 69 -122 -16 -25 169 -301 21
6501B1k61K70k4P2l36k2J29J06Q0q4K57k85K25l88P5J31q0J98j77K66q8j29k4
$$ 21 -240 30 6 78 -258 -280 -151 -45 35 -49 208 -77 148 -240 -165 -34 -114 84 -93 173 85 -44 -68
6524f8J8k4N7J15j53L8k3n3K73k10L9Kk55L05J08j24k14J56J12j11j99JM1M6J45
$$ -68 -50 -74 -17 98 -55 -17 -40 -93 180 -30 9 11 -244 61 169 45 -169 -13 99 -12 -211 -210 -169 -123 22
6549B2k14J64j10L41k67o0N7J47N0j54j89L53l00J31kK45j65Kr4J62k76K6L09
$$ 22 -192 -28 -138 203 -64 -124 -67 80 130 -24 -213 140 -160 -29 -31 214 49 51 -43 119 -157 -131 178
6572A78l06J44l07N4J03R8R1q8Q7N9k53L43l88O0J88P0m7j84K06j03J12r8P6n5
$$ 178 -128 16 -291 -237 -134 -36 55 -33 54 113 -140 203 -185 -125 63 133 86 -98 108 5 117 19 95 40
6596D0j10R9M6n9n4j0j23K70o8K6km0k70J66J25rJ08j67K48k26J06k18r8P5l2
$$ 40 -70 29 75 16 -38 -48 -171 99 31 57 55 15 -255 -89 36 27 135 -32 216 -10 96 -122 -220 -145 -177
6621a77K61j56l05N57j06j77m5M7M6l5L7M7K8k18K85j95O5j24L1J97r6M5j46R7
$$ -177 84 -72 -377 180 74 -103 -148 -101 -55 -90 -53 -6 22 -196 89 -106 -41 -165 -134 63 -33 12 -134 -37
6645c7J24j38Lr2K53M7j10J81k61Q5L0l8j50N0L1q6K31J05l31j22L98o8R1j00
$$ -37 87 -51 -48 -140 113 160 50 231 -30 55 85 47 -103 -53 -22 -108 123 228 -103 -225 173 105 196 96
6669I6j38j01J58j32o0K67N4k38L73m98J56k2J78k11R8K2nj0%M4j05Q9L2j8k2
$$ 96 -42 -143 15 -117 -177 90 144 -94 279 -219 -63 -85 93 -118 -20 2 -3 -13 -13 31 -74 15 47 29 7
6694Gr9J18l08L73J8j7j16p0L06k73l6k32K83K76k73p9P8J9J91j61J13j17k43
$$ 7 -92 26 -282 91 109 92 -24 -94 212 -61 -97 -329 -46 230 -43 -122 -44 -25 166 5 118 1 -242
6717b42L81k85J27o5R0J91%j05J8k87K91k54R5k55L10K37m98K06j2J52j45L3K13
$$ -242 139 -146 -19 -84 6 197 197 92 110 -177 114 -140 -45 -300 10 247 -251 -45 -57 95 -50 -17 196
6740A96k68J59j39J65j01j89K66l0k10J20K48k43Mj6p2k59M69J05m03J88l2n9
$$ 196 -72 87 -52 113 12 -177 89 59 -151 -31 217 -26 -22 -38 -110 -369 100 205 -198 -10 -42 -101
6762a01K60j62J88j62K1J04j2j09j30L50j41q6J57l67M03l32j04J96j48oJ24J01
$$ -101 159 -3 185 23 44 148 136 27 -103 247 106 20 177 -190 213 -119 -223 -27 -175 -181 -57 44
6784D4j20J94L5n45J98L55l10j21M25j6j45J22l8n2k53J22J11k7J2J9k15LL93
$$ 44 -76 118 153 -392 -194 161 -149 -270 155 139 -6 116 78 26 -227 -105 6 -21 -9 10 -205 -202 191
6807A91k87P0J36j61J18m12K64l2J88j75nRk4J92j6m0J50j96j60J24p0L23j50
$$ 191 -96 -26 110 -51 67 -345 -81 -113 75 -100 -105 -96 -120 72 56 16 166 -30 -190 -66 -136 187 37
6830C7R1L3j39K39r6j64J96j57K0M2j43J22k4j97r9J30Q3K42k27M06k27l29O5
$$ 37 128 161 22 261 165 1 197 40 60 102 -41 81 57 -140 -239 -109 -26 216 -11 395 168 -161 -96
6853i6J10j64J45L7q8j10K9J10N8K22l15j56J35Q7P1k67J93k3J75k77J02p3K83
$$ -96 14 -150 -5 32 -56 -166 -137 -27 31 253 -62 -218 -83 4 75 -192 1 -22 153 -124 -22 -95 188
6876A88J9n40J84J71j70J21nK09k12q6M1P0K72m12K13q9q4j09J12j21L74J11l24
$$ 188 207 -333 -149 22 -148 -27 -32 177 -35 -121 -80 -10 262 -150 63 -26 -110 -219 -107 -228 146 257 -67
6899f7M3O2l1q5l0j02J44L60l27Q3L3j75L0J77o4k65J19J11o1O0R6k51K44N4n2
$$ -67 -24 38 7 -78 -108 -210 -66 294 -33 50 83 -92 -62 115 51 -214 -95 16 -45 15 111 -140 104 158 106
6924A06j20J86M6l00jk01K74o0L99k66j59m2lL15l01M6K6J26l5J50j87m6M0n2
$$ 106 -14 172 218 -82 -83 -284 -10 -70 329 63 -96 -138 -141 174 -127 -81 -55 71 36 186 -1 -47 -7 -59
6948e9K01k64M40l78n1R5j8j59J6N6m2J83j99L52n2j85J70q6q3K68l68N82n54
$$ -59 142 -122 318 -60 -111 -16 -34 -193 -177 -121 -163 20 -179 173 121 -64 106 20 -63 205 -163 419 -135
6971a35J05J18j77O7K46l93J36M2j57J52o2JP0J11l44K73j76K27J3j71K36k72
$$ -135 -30 88 -89 -22 224 -169 -33 9 -148 4 -58 -57 13 124 -220 53 -123 104 117 -54 182 -90
6993i0j3L51k18J17n6n8l2P4j36M1j5N8Q7J47o53L91j08J69j71Nrl1O5L0q0L2
$$ -90 -103 248 30 147 91 33 1 75 -61 -20 -35 23 110 257 -396 -5 -113 56 -115 -110 -119 -150 -85 -55 -135 -103
7019a03K00j52J94k11K47N1k39O3n2P6k37O5K5j16K95j07J17j36P3j64o0M84k44
$$ -103 97 -55 139 -72 175 226 -13 50 -2 74 -163 -98 -73 -189 106 -1 116 -20 53 -111 -171 313 69
7042F9k33J05M5R8N7q2k09J86J5m1J67n9L4k75L20j33m2j14n1L15k69L04k12l2
$$ 69 -164 -59 -14 84 141 59 -150 36 51 10 177 118 152 -123 197 64 22 -92 -143 172 -97 207 -5 -37
7066c7n2m7m4K25k28L18j42j52K43nj52J96j74J08K22q1l3k7j79J35j1k30Q4K
$$ -37 -89 -136 -180 45 -183 135 -7 -159 84 79 -73 123 -51 57 279 198 165 138 -41 94 83 -147 -63 -61
7090f1K08m3j17J0Q3P3l80K20K62m43K47n0K12k72J2j07OK02L0k42N3K79q3L0
$$ -61 147 104 -13 -3 80 153 -227 -7 255 -188 59 9 221 -51 -39 -146 -140 62 92 -150 -97 182 99 129
7114A29k17J01q7K5J12O2k71J55q2J03K16k71k6j0r5k5J00k1J30o2KQ6k50K01
$$ 129 -88 13 -74 -49 63 125 -146 9 -73 30 246 -25 -51 -61 -156 -181 -81 -102 28 -34 -32 54 -196 5
7138Ej05J81j24K80l49K15k57R8J10j22K87r4p5LJ97l89L04l16K14Q3j08j02j16
$$ 5 -100 81 -43 237 -112 103 -154 -56 54 -68 219 125 50 53 250 -139 165 -151 63 146 38 -64 -180
7161a80M63k92q4j42K43J11L7m02L56O2r8j2Q7k45J25K72k85O6j77K35k32j00
$$ -180 283 -9 -93 -235 8 119 156 -246 110 172 74 62 149 -96 29 301 16 82 -95 140 -92 -192
7183a92J04n8J67j13J82P4k71J56r8J36r2K7NN0J66k61j5J24j40p2m4L09j6j23
$$ -192 -88 -146 21 -92 90 164 -107 49 -49 87 -5 22 27 77 243 -18 -33 91 -49 -121 -165 144 128 5
7207Eo0L33l95K02r2Q9J50k33j39J07q0K36J2p7k85K03N1r6J57K6M7O3j31Rn4
$$ 5 -55 278 -117 85 -7 82 232 -1 -140 -33 -113 123 135 58 -227 -24 27 -69 88 114 161 224 93 102 48
7232D8M4j69j7J05J47j98J6J14k06k9K45J29o4j52lNj18K30l17O8K41j31k9j21
$$ 48 92 -77 -94 11 158 -40 -24 90 -116 -145 100 229 165 13 10 15 -103 127 -190 -122 119 -12 -41 -162
7256a62K64p6n2q8K25oK31m32j2p9P1J53p9O6q4J99j95J03k05K43j16j77J98J45
$$ -162 102 26 -26 -114 111 105 336 -96 -108 -187 -116 37 -42 24 -60 139 -56 47 -158 85 -31 -208 -10 135
7280A35NJ54q6k16J78j72n8r1J25K14k16Q3j24R9K35l51J52k57K58j4k00P0M7
$$ 135 140 294 208 -8 170 -2 -60 -151 -26 188 -28 55 -69 30 265 -86 66 -191 67 53 -147 -77 -30
7303c0M6k8K50j24j13j33L15k69r5m0J81K7q2J53j69Q8Q9K26k70j94P8K80j85
$$ -30 16 -12 238 114 1 -132 183 -86 -181 -221 -40 -13 -95 58 -111 -23 66 292 22 -172 -94 186 1
7326Ak26L60k9O2m0j46K5r0M1O7n4r0J4j08M77k01j64M8j25J3J96k1rq6J80j38
$$ 1 -225 135 106 168 128 -18 7 -83 -42 25 -29 -119 -105 -213 264 63 -101 -53 -178 -165 31 10 1 -85 95 -43
7352d3n3M2L8P2j22J88p6J69n0k08L38l02J0K02k15n5k7Q5J20k38J33J4q6k3K39
$$ -43 -96 -54 -16 56 -66 122 46 215 165 -43 295 -7 3 205 -10 -65 -92 -7 113 -125 8 22 -64 -87 152
7377A52n0P8j60L6R8m2O4k60jJ6p0L46k32J78k86K25J5Q7k35o0l5L11j20q9j6
$$ 152 102 180 20 56 154 112 176 -84 -85 -69 -139 207 -25 153 -133 92 107 194 -41 -101 -136 175 55 -34 -50
7402e0k4P6R7k0j91J90j04O4p6J73Q3j12j65J58j63O2j34J20J9l6J93l95J91N2
$$ -50 -74 2 99 79 -112 78 -26 38 -38 135 218 106 -59 99 -64 -2 -136 -16 3 -33 160 -235 -44 8
7426Hr2L2J62J64k61MRj00j0K7J4J75k04J9J06p1P5j18m5j21J29Q6r7K84k44K58
$$ 8 -84 -52 110 274 13 17 26 -74 -84 -57 -43 132 -72 -53 53 -18 57 -61 -106 -227 -98 -12 -109 175 -69 189
7452A89k81Ko5QJ82j51P4m9mN6k11J77J8J4Q6J27k91J76qk16K23k12Q2J88l9n3
$$ 189 -92 -90 -155 -147 35 -116 -42 -91 -95 -39 -250 -73 -55 -41 45 172 -119 57 49 -167 56 -156 -74 114 75 22
7478B2J7J59kq5J0k8R5k21M6L9M7L7n3k69J38j3l5J57r8j34K91k02J13j72J70
$$ 22 39 198 196 111 121 93 188 -33 13 52 99 136 83 -186 -48 -61 -96 61 -37 -171 120 -82 31 -141 29
7503B9R3j54l4K13Qp7Rk31L46J9o2k54j00K71k11M40l55Q5m5J88n6l58N15m62
$$ 29 122 -32 -66 147 155 78 87 -144 202 221 159 -95 -195 76 -135 305 -50 35 -10 178 122 -236 279 -183
7527a83K11q5J0J95j22k08P0K18L4k07J54l1J18l09N7L1k9J22j22P9q4Q5J1m2
$$ -183 28 -57 -47 148 26 -182 -112 106 140 -67 87 56 174 -135 -78 -47 -76 46 -76 3 -81 4 15 -27
7551b7J04l01K70r8nP8J5j59K18k58J08J81o5K7j43L27j32l08L68l00J01Q9J0
$$ -27 77 -224 46 -52 -57 21 36 -123 95 -163 -55 126 61 88 -55 272 140 -168 200 -100 1 90 100
7574A00j58J41q3j88K74j39P4m9N8N1oK15j57k50J20k37L53M6l20K30j33q1K70
$$ 100 -58 83 0 -188 86 -53 21 -28 30 81 75 290 133 -117 3 -234 119 165 -155 75 -58 -139 131
7597A31r0P1o9j67K99rq6j68J84k55M7M9K9j06P5K9J26j79K27n5l4k66L23p4M5
$$ 131 41 112 43 -124 175 166 80 -88 96 -159 -112 -63 -34 -140 -65 -36 90 -89 138 83 49 -217 106 32 77
7622G7n1l32L24M1k09J10l7j15K3K6J22K2K71q4k68J13J3r5L9K30n09M78j43N5
$$ 77 26 -306 18 59 -150 -40 -77 -192 -169 -143 -21 1 272 188 -80 33 46 -49 -10 220 -289 189 46 101
7646A01j74R9NP1k31qj6K15m1O1q9M9j07J85k46J79q1j03M2O9k58Q5K05k72PP7
$$ 101 -73 26 31 102 -129 -137 -153 62 21 82 -7 42 -65 120 -126 53 -28 -131 -89 -20 -278 -193 12 -260 -253 -176
7672a76Q9J08j5J98l3l9k87J24J47j48j77J57N2j97K21k01K45Q7k01nJ29l0k33
$$ -176 -87 21 6 204 171 132 -155 -31 116 -32 -209 -52 0 -197 24 -177 68 155 -46 -51 78 48 -185
7695a85K53n4l5J61j27R9j03K6j65j9K29Mj38J60Q2m65K36J2r6o0K57k6j15L1
$$ -185 68 14 -21 140 13 112 9 35 -130 -149 80 84 -54 106 188 -277 -41 -29 -125 -185 72 46 -69 -38
7719c8o1L5N6j00N1M2j11J40p3N6J30k03K45m96L00L39k10l21P8R6N0j87J39J06
$$ -38 -99 -64 -8 -108 -57 -15 -126 14 -59 -3 127 -76 169 -327 -27 312 102 -219 -141 -45 5 -182 -43 63
7743F3j7j37N3J04l88L98Q6k98J31K00m87L60J2O3j52j1J27k53K21M1l09K06O4
$$ 63 46 -91 -38 66 -322 76 162 -136 -5 195 -292 68 80 143 -9 -20 107 -146 75 116 -193 13 77
7766G7J34rj88N5j33j57J72J23j69J56j99J77m3kq1k1J09o1J73j83J42j69pj42
$$ 77 211 202 14 69 -64 -221 -49 74 -95 61 -138 39 -4 -6 -87 -108 1 -60 113 -70 72 -97 -104 -246
7790b46K12N0M9l03R3J20M1K2J93j94j98J95r5L59j51k10K07n4k35J1n2Q8N0j3
$$ -246 -34 16 65 -238 -145 -25 16 38 231 37 -161 34 -61 298 147 -63 144 90 -145 -134 -186 -98 -48 -61
7814f1j4Q9k4J37l4j45P9J56n11K36rJ26j23N3J09k80M8Q0K76k77j4J26Q3J30
$$ -61 -75 14 -10 127 93 -52 27 183 -328 -92 -101 25 -98 -45 64 -216 -168 -88 188 -89 -103 23 106 236
7838B36k91K34j89l3K69j30K43k80j93N1K65j88p3R5J11N3j82K38j92K6j32k0
$$ 236 -55 179 -10 -43 226 96 339 59 -134 -83 182 -6 -79 16 127 180 -2 236 44 70 -62 -82
7860h2P4K12j06j43q3J49n8L4j01j14K51k6j6m2J03J20l49k4J56J06o3K49k50
$$ -82 -8 204 98 -45 -128 21 -37 -3 -104 -218 33 7 -9 -51 52 172 -177 -201 -45 61 -2 247 -3
7883cQ6j4QRk68J88K04l40J36j8J55J28k01j81O9J4j52j0L23j05r6Jj30J76l2
$$ -3 83 69 77 86 -182 6 210 -130 6 -12 143 271 70 -111 -42 -28 -180 -190 133 28 -68 -67 -197 -21 -53
7908e3K33k84J98j14J17n2p3L3j90J46P1N5o1k91L24J34j77O4m07K96O4k2J62
$$ -53 180 -104 94 -20 97 45 -28 5 -185 -39 32 87 26 -265 59 193 16 80 -327 -31 33 11 173
7931A73k67r8J69j22k8K91l16P9O0k3j20K29R7l21J89J0J66k44J65j08R8Kk4o7
$$ 173 -94 -192 -23 -145 -173 118 -198 -119 -59 -82 -202 27 124 -197 -8 2 168 -76 89 -19 79 81 57 -10
7955a0K8M0L0k36L66j89jm3o0P7J8J96K2k75K71m68J27L6J42J44k33j79K83r8
$$ -10 18 58 88 -148 218 29 28 -15 -75 2 20 216 238 -37 234 -234 -107 -71 71 215 -18 -197 86 -12
7979a2J17j12n9J29O7l65K65l03L80r6J02o7m5ll6J67Qk26Nj85J70L94k92r8m6
$$ -12 105 -7 -66 63 130 -235 30 -273 107 11 113 46 1 -2 -38 129 137 -89 -84 -269 -99 295 3 -95 -141
8004a41K08n1K44m51l22R71k16k43K0k08p8J96K86j00O7j58l0k37K54N16o74K02
$$ -141 67 16 260 -191 -513 458 242 -1 19 -189 -267 -71 215 115 182 24 -6 -243 11 527 -147 55
8026E5k35J29k44K62J27o50K92N26m38L1l00M69l01N23o1K25j36n57j27L45k92
$$ 55 -180 -51 -295 -33 94 -556 -264 262 -176 -145 -445 24 -277 246 185 410 274 -283 -410 -65 -357
8047c57J78J92l61N04j84OMp0K83l00J85n65M75L65o55L79j60l51N63K66o39k46
$$ -357 -179 13 -348 156 -28 -22 -18 -88 195 -105 80 -485 -10 355 -300 79 -81 -432 131 397 -242 -488
8069d88O73n4n74M80P4l87j66J81Q2O68p62k89R07M0l75m3R6j39k81j34l5J10
$$ -488 185 131 -443 37 111 -276 -442 -261 -179 489 -273 -562 345 385 10 -33 63 -76 -357 -491 -526 -416
8091d16L31l27M57r2l09M12j51N49m77n90P23P18j002k8r4J15l74j07O66j46K80
$$ -416 -85 -412 45 -47 -356 56 -95 454 -23 -613 110 828 -174 -202 -296 -181 -555 -662 4 -142 138
8112A38o1p0p04J176q23j45R11p79N7K77J53j31M21l26M71n71k13R61j099R62
$$ 138 77 7 -697 479 -344 -489 422 -357 -300 -23 130 -1 420 94 565 -6 -219 742 -357 605
8132F05j281L37N29j69k48nJ205p30l61m0l51O13K8k25k09Q18q2M73j271l39J355
$$ 605 -676 -339 190 21 -227 -232 973 243 -118 -158 -509 104 132 -93 -302 516 434 907 -364 -703 652
8153F52p24J13k84P64o37J97m44J078j083N27M83p62P0M20o57O89J88q14L26k97
$$ 652 -72 41 -243 521 -116 81 -363 715 -368 159 642 -120 -50 370 -287 402 590 -224 102 -195
8173a95K11o32O73m07K64K57l0J46k1j42M10n33n5K66J56n96L00m55
$$ -195 16 -616 57 -350 -86 171 141 287 266 124 534 1 -54 212 368 -228 72 -383
8191c83
$$ Imaginary data points
##PAGE= N=2
##DATA TABLE= (X++(I..I)), XYDATA
0@%%%%%%%%%%%%pJ5j6J6j6K1k9L2l9M7n5O9q1R1j06J27j47J68j93K19k50K85l23
$$ 0 0 0 0 0 0 0 0 0 0 0 0 0 -7 8 -8 8 -8 13 -16 16 -23 24 -31 38 -43 48 -58 69 -78 90 -103 116 -134 151 -172
35a72L65m11M61n16N77o43P16p95Q80r75J079j192J316j451J600j761J938k137
$$ -172 193 -218 243 -273 304 -339 377 -418 462 -513 566 -626 690 -761 839 -922 1016 -1121
53a121K356k598K872l181L531l935M404m960N632o455P498q867J0752j3547J8164
$$ -1121 1235 -1363 1509 -1672 1859 -2076 2328 -2632 3000 -3455 4043 -4824 5928 -7619 10545
68A0545k7575Q3073j65767m4478J89340r1375L2698J44215m6400j50896k8699
$$ 10545 -17030 66043 -99724 -144202 45138 -46237 -13539 130676 84276 -66620 -95319
79i5319K5868R0935O1428k7682l1588m4020r8041N4405J32032O580k7971k9103
$$ -95319 -69451 21484 82912 55230 23642 -20378 -118419 -64014 68018 74598 46627 17524
91A7524r5010j4319P9697O1754L9515l6466j08197r385K2687L144J15802N1442
$$ 17524 -77486 -91805 -12108 49646 89161 52695 -55502 -64887 -42200 -39056 76746 128188
103A28188j52593n1159N2753l6174N1517J21741m9358r7700j7362j8767L6921
$$ 128188 -24405 -75564 -22811 -58985 -7468 114273 64915 -32785 -50147 -68914 -31993
114c1993R6729O049m0685l8332p8128K1120J00008J613J6707J8493j42777n0063
$$ -31993 64736 70785 30100 -8232 -86360 -65240 34768 36381 53088 71581 -71196 -121259
126a21259J41519K2070m1894P5858k8407j46856O730J08393M0532p305k7389l1442
$$ -121259 20260 42330 436 76294 47887 -98969 -92239 16154 56686 49381 21992 -9450
138i450l5174l3107O2712J07731k5661q5727j3323j1911n824O6013N2340j6020
$$ -9450 -44624 -77731 -15019 92712 67051 -18676 -31999 -43910 -49734 16279 68619 52599
150E2599m8178p2733Q37Q1356J4049N719L7110q6811q8250Q0649N4749k1624M8326
$$ 52599 4421 -68312 -67475 13881 27930 33649 70759 -16052 -104302 -23653 31096 9472 57798
163E7798k865j15059k2310P7292L0870J3658Q097m1934n0271j7935L7796P7000
$$ 57798 54933 -60126 -82436 -5144 25726 39384 47481 5547 -44724 -62659 -24863 52137
175E2137J0765n2861k2655k6770k2449O3831N9588k2758k3559l5141n0520L6881
$$ 52137 62902 10041 -12614 -39384 -61833 1998 61586 38828 15269 -19872 -70392 -33511
187c3511O9694P244p826k6582n5544p545M1781L9354L1655k0774p1689j7937L0243
$$ -33511 36183 43427 35601 9019 -46525 -54070 -12289 27065 58720 37946 -33743 -51680 -21437
200b1437J5006L5630L2939m3540n9907r952K5486M8943K4727k0828k0386l3717
$$ -21437 -6431 29199 62138 18598 -41309 -51261 -25775 23168 47895 27067 6681 -27036
212b7036l8909M7737P0779j2965k5790j2560m7914p455O5882L4656j3446j6711
$$ -27036 -65945 -18208 52571 39606 13816 1256 -46658 -54113 11769 46425 32979 16268
224A6268l7914l0689K2167M8752L0071j1666m5395k7821K986J1519M2452L9250
$$ 16268 -21646 -52335 -30168 18584 48655 36989 -8406 -36227 -33241 -21722 20730 59980
236E9980l5119n2589p991M046K5336M6915J815l3140l0685k5166J4586N4694K1288
$$ 59980 24861 -27728 -35719 -31673 -6337 40578 42393 9253 -21432 -46598 -32012 22682 43970
249D3970j7922k2475l5463j5917L6645M1305Q815j2689l7894l5255J4336L8323
$$ 43970 26048 3573 -31890 -47807 -11162 30143 38958 26269 -11625 -46880 -32544 5779
261E779K6350O842k6081l8868j2520J1905L6310L8531j6625m2799j4600o895J0789
$$ 5779 32129 38971 12890 -25978 -38498 -26593 9717 48248 31623 -11176 -25776 -32671 -21882
274b1882M7617K3278l0724l3769j8267L39L3086L5672N94k5587l1696j9691J7623
$$ -21882 25735 49013 18289 -15480 -33747 -33408 -322 35350 35944 10357 -21339 -41030 -23407
287b3407L7964K2412m786l3183l4684L270K4159K4399K2839j0628m5839k1461
$$ -23407 14557 36969 32183 -1000 -35684 -32414 -8255 16144 38983 28355 -17484 -38945
299c8945J3180K5826K8884P350k6711k9466j5522R477L8455K7728j4174k9887
$$ -38945 -25765 61 28945 36295 9584 -19882 -35404 -25927 12528 40256 26082 -3805
311c805k1079q936J9855L6471J4578j7502l0117k4213N693L2138K4408M406j9723
$$ -3805 -24884 -33820 -13965 22506 37084 19582 -10535 -34748 -29055 3083 27491 31897 12174
324A2174l3853j2737J5915K6071K5761j529l5765k6008K656J7030K5519J9658
$$ 12174 -21679 -34416 -18501 7570 33331 31802 -3963 -29971 -27315 -10285 15234 34892
336C4892j2104l4760k2160Q064K7402K6260K024k0466k5816j6499J0769L4560
$$ 34892 22788 -11972 -34132 -26068 1334 27594 29618 9152 -16664 -33163 -22394 12166
348A2166K0483q180k4315k6727l625K2429K5335J1772p640l1303k2725P614K6560
$$ 12166 32649 24469 154 -26573 -30198 -7769 17566 29338 21698 -9605 -32330 -24716 1844
361A844K3388L657j9444k7455j1882J2003K5620K1737k954k6751k6267j815K0319
$$ 1844 25232 28889 9445 -18010 -29892 -17889 7731 29468 26514 -237 -26504 -28319 -8000
374h000K5553J0486j2313k1707k1941K29K7646K7671n84k0774k3475q487R718
$$ -8000 17553 28039 15726 -5981 -27922 -27693 -47 27624 27040 6266 -17209 -25696 -15978
387a5978J9595K2767K824k8820k9441L349K2208J7098R971l151k5055k5538M628
$$ -15978 3617 26384 29208 388 -29053 -25704 -3496 13602 23573 20422 -4633 -30171 -25543
400b5543K8018K2171l1j8359j9758j1379N449K5721K2528o278k3740k0092m253
$$ -25543 2475 24646 24615 6256 -13502 -24881 -19432 6289 28817 22539 -1201 -21293 -25546
413b5546J7146K3865J1395j1474k2991j5971P95K0089K5300L798k0071k1618r069
$$ -25546 -8400 15465 26860 15386 -7605 -23576 -22781 -2692 22608 26406 6335 -15283 -24352
426b4352Q313K2690J8011l290k0893j9250o768J4788K7297J1218j5969k0487j1050
$$ -24352 -16039 6651 24662 21372 479 -18771 -25539 -10751 16546 27764 11795 -8692 -19742
439a9742p64J7171K3162O109j6409k5511j2025J6436K3284N871k397o220k5188
$$ -19742 -20506 -3335 19827 25936 9527 -15984 -28009 -11573 11711 17582 15185 8965 -16223
452a6223j7495K5818L2803m540j5733n434j4118j1155K0425L0200J646k3398j8840
$$ -16223 -33718 -7900 24903 20363 4630 -804 -14922 -26077 -5652 24548 26194 2796 -16044
465a6044k906P009J4797J7163K531j9687k5903l02K1327J4278M579K54j9372k4598
$$ -16044 -18950 -11941 2856 20019 22550 2863 -23040 -23342 -2015 12263 16842 17096 -2276 -26874
479b6874P272K5203J0171M5l181k2248j8801J4994K4296P887l404j3187j8099
$$ -26874 -19602 5601 15772 15817 12636 -9612 -28413 -13419 10877 18764 15360 2173 -15926
492a5926m624J2181J8059J5000r497k6286r991R480J0279J3250J0412j2253k3923
$$ -15926 -20550 -8369 9690 24690 15193 -11093 -21084 -11604 -1325 11925 22337 10084 -13839
505a3839q078J0063J8309J4695n196j8770j0542j483K399J9876J9436j2061k8922
$$ -13839 -21917 -11854 6455 21150 15954 -2816 -13358 -14841 -12442 7434 26870 14809 -14113
518a4113m682J0764M685J1329J6357j3064k7281n849J3097J5147J0502k526j3838
$$ -14113 -18795 -8031 -3346 7983 24340 11276 -16005 -21854 -8757 6390 16892 14366 528
531E28j1694q559P978K6440Q852j8954j0802l084r143J0440K9618L75k4717o840
$$ 528 -11166 -19725 -11747 14693 23545 4591 -6211 -9295 -18438 -7998 21620 21995 -2722 -9562
545i562j768l640J5267K1639l671k1478j3110J956R107J2166J0105k802j7584
$$ -9562 -11330 -14970 297 21936 18265 -3213 -16323 -14367 -5260 6906 17011 14209 -3375
558c375j6879L123K0735J2213l800p201r867j2379J551K2099J4467q925j4005
$$ -3375 -20254 -17131 3604 15817 12017 4816 -5051 -17430 -15879 6220 20687 11762 -2243
571b243q277m905P637J8108P021o946j3251j4505J900J7655J1236j07o271j5313
$$ -2243 -10520 -15425 -7788 10320 17341 10395 -2856 -17361 -15461 2194 13430 13323 7052 -8261
585h261j0375Q888J4459J0693j166j3774j4918k32J0485J0823R137k855j9034
$$ -8261 -18636 -9748 4711 15404 14238 464 -14454 -14686 -4201 6622 15759 12904 -6130
598f130j0971O672J0104R931P119q599j8686o783R724J2694N922J772q834j6636
$$ -6130 -17101 -10429 -325 9606 16725 8126 -10560 -17343 -7619 5075 10997 12769 3935 -12701
612a2701m684J3309J4413L064n135j1345j0254P93J0336J3736N585j2663j6215
$$ -12701 -17385 -4076 10337 13401 8266 -3079 -13333 -12540 -2204 11532 17117 4454 -11761
625a1761j417P031O286J1834M150j5438j5284J634R853R233P088l895j2510j0714
$$ -11761 -13178 -6147 139 11973 16123 685 -14599 -12965 -3112 6121 13209 9314 -3196 -13910
639a3910J713J2815J0842J997p534j2945q442O274J3834Q677k416r418j1716l257
$$ -13910 -12197 618 11460 13457 5923 -7022 -15464 -9190 4644 13321 10905 1487 -10229 -13486
653a3486Q469J2591P132n712j3700q064L105Q691R711M531o778j4370n998N947
$$ -13486 -5017 7574 14706 8994 -4706 -12770 -9665 -974 8737 13268 6490 -7880 -13878 -7931
667g931J1731Q119q27r558j1046l152P729J2472N739m825j1375r925J410J1661
$$ -7931 3800 11919 11092 1534 -9512 -12664 -4935 7537 13276 8451 -2924 -12849 -11439 222
681B22R332J895m834j1913q826N683J3687O287j719q614j0069l126O374J1862
$$ 222 9554 11449 6615 -5298 -14124 -8441 5246 11533 9814 1200 -8869 -11995 -5621 6241
695F241O508m576j1835p791J879R643R234R21n865r600p195M443J1495Q405k793
$$ 6241 12749 8173 -3662 -11453 -9574 69 9303 10224 4359 -5241 -12436 -7993 3502 11907 9114
710I114r021r136k270O998J0846M810l509r247j0520J295J1145Q653P48o766p241
$$ 9114 93 -9043 -11313 -4315 6531 11341 7832 -1415 -11935 -10640 505 9158 9906 3140 -4101
725d101p104K491J1379Q795k091r848p864k337O306R954N550m116q946q155K12
$$ -4101 -11205 -8714 2665 11460 9369 -479 -8343 -10680 -4374 5580 11130 7014 -1932 -10087 -9875
740i875Q912J0891J20o492q831m890L193R090P394n66p940j0363j057P405Q643
$$ -9875 -963 9928 10048 3556 -5275 -10165 -6972 2118 9512 8946 1006 -9357 -10414 -3009 5634
755E634M080l230p529q671m32R765J0122o1p273q020l361J475Q366R346p32q458
$$ 5634 9714 6484 -1045 -9716 -10148 -383 9739 9678 2405 -5615 -8976 -7501 865 10211 9479 1021
771A021q864k341O616R335M581m314p696o535o14P477Q873K823o722r913k771
$$ 1021 -7843 -10184 -3568 5767 10348 6034 -1662 -8197 -8811 -1334 7539 10362 3640 -6273 -9044
786i044L956O553O768J090p690r795k278O972Q273M349m555o801n894n12P035
$$ -9044 -5088 1465 8233 9323 1633 -8162 -10440 -3468 4805 9154 4599 -2202 -8096 -8608 -1573
801a573Q972K572o792q928l261K979Q019O342q30o339q446j712N222Q928M770
$$ -1573 7399 9971 3179 -5749 -9010 -6031 1988 8330 7500 1161 -7285 -8997 -3775 5153 9923
816I923m159q537n071J292M965P620M064n661j0403l263M227P386N645r60n818
$$ 9923 5764 -2773 -7844 -6552 -1587 6033 10097 4436 -5967 -9230 -5003 2383 8028 7068 1250
831A250o570l142K995R584N752m546q609m585J818N146N786L192l057r107n871
$$ 1250 -5320 -8462 -5467 4117 9869 5323 -3286 -7871 -6053 -907 4879 8071 5014 -4093 -9964
846i964M713Q678L384q06m068p186l891N174Q971M484l993q636l758R80L628Q037
$$ -9964 -5251 3427 6811 6005 1937 -5249 -9140 -3966 5005 9489 5496 -3140 -6898 -5918 -2290 5747
862E747L713o742o946l079J929O172P509j343o893o009r70M174O184M244j763
$$ 5747 9460 2718 -4228 -7307 -5378 794 8303 6960 67 -5942 -6912 -2738 3446 7690 5927
877E927o835p214J174P437N844o58k530n833n551J542Q271O822j705o990n141
$$ 5927 -908 -8122 -6948 489 6333 5675 3145 -2688 -8239 -6697 1574 8396 6691 -299 -5440
892e440k98K871N966M690k165o827n570o71P841O007j090l232l026n836j44Q472
$$ -5440 -5738 -2867 3099 7789 5624 -1203 -6773 -7444 397 6404 5314 2082 -944 -6780 -6924 1548
908A548O970l323m809n128k018L606O859K171K48p500o958K756O063L341K458
$$ 1548 8518 5195 386 -4742 -6760 -3154 3705 5876 6124 -1376 -8334 -5578 485 3826 6284
923F284j983q455m420M585O290L016L49l424p589l026N661Q244L48l077k819m635
$$ 6284 4301 -4154 -8574 -3989 2301 5317 5666 2242 -5347 -8373 -2712 5532 5880 2803 -16 -4651
939d651k798N489Q164J148n161o597j817L584K864L981L906n599j0792K065O546
$$ -4651 -7449 -1960 6204 7352 2191 -4406 -6223 -2639 225 4206 8112 2513 -8279 -6214 332
954C32J250M546k18p486m823J855L557N848K981n238o994o92J604L744N226K69
$$ 332 1582 6128 5910 -1576 -6399 -4544 -987 4861 7842 2604 -4390 -5082 -3478 266 5492 5761
970E761m883m848k692L556P375J968l077m223l815n58M802N143J974l704o523
$$ 5761 878 -3970 -6662 -3106 4269 6237 3160 -1063 -4878 -5436 -634 4509 6483 2779 -3744
985c744j910K117M268M946k23o073l470r8O06N001O850m726o757j028L5K244O006
$$ -3744 -5654 -3537 731 5677 5454 -619 -4089 -4187 -3581 1420 8270 3544 -3213 -4241 -4206 -1962 4044
1002D044J752k938m486n528K239Q506P16j691l61m625n424N468O594J595k185
$$ 4044 5796 2858 -1628 -7156 -4917 3589 4305 2614 2253 -2372 -7796 -2328 4266 5861 3676
1017C676m757m081N53M242L858K397l590n710j451J401L653N044m33n547k126
$$ 3676 -1081 -5162 -4609 -367 3491 5888 2298 -3412 -4863 -3462 191 5235 4802 -745 -2871
1032b871j816J390O093K835j332m940m845J23O194L054n95k38n037m871L132N689
$$ -2871 -4687 -3297 2796 5631 4299 -641 -5486 -5363 831 3885 3290 3052 -1985 -6856 -3724 1965
1048A965K146P97l358o677N52L350K122L679K91p037k639J505J921N169J597m736
$$ 1965 4111 4908 1550 -5127 -4575 -1225 897 4576 4867 -2170 -4809 -3304 -1383 3786 5383 647
1064F47l011j064p79M297O082k110m463k894j093K600L999K299j098l777n112
$$ 647 -2364 -3428 -4207 90 6172 4062 -401 -3295 -4388 -1788 2211 4510 3412 -365 -5477
1079e477R69N323K292R45j367n476k209K172K573M730J022n903l666q8J876M388
$$ -5477 -4508 815 3107 4052 2685 -2791 -5000 -2828 -255 4475 5497 -406 -4072 -4160 -2284 2104
1095B104L222k795l379k099k187L886O507j012l224k569k538M78M951K267m44
$$ 2104 5326 2531 -848 -2947 -5134 -1248 5259 4247 1023 -1546 -4084 -3606 1345 3612 3168
1110C168j732m813j841M686K514J341K94m568l422J799J686L829K749l825m930
$$ 3168 1436 -3377 -5218 -532 1982 3323 3617 -951 -4373 -2574 -888 2941 5690 1865 -3065
1125c065k52Q93K585L208P05l623l083k104K731M903J480l331j318k278k207M356
$$ -3065 -3317 -2424 161 3369 4074 451 -2632 -4736 -2005 2898 4378 1047 -271 -2549 -4756 -400
1141d00L679L17j200m689k446K662L042J486J439k561m726m45K573K651K885p69
$$ -400 3279 3596 2396 -2293 -4739 -2077 965 2451 3890 1329 -3397 -3842 -1269 1382 4267 3498
1157C498n249j540N88J360M082K014l254l187j541k01M153L114j522j446k896
$$ 3498 -1751 -3291 -2703 -1343 2739 4753 1499 -1688 -3229 -3430 723 3837 2315 869 -2027
1172b027k305K259M024J467k73l452l337K68L872R75K184J03n653k279K313K478
$$ -2027 -4332 -2073 1951 3418 3145 -307 -3644 -3376 496 1471 3655 3758 -1895 -4174 -1861 617
1188F17K401M04l428k222n2j85L911L277k203m014j536m4K035M059K80j570k283
$$ 617 3018 3422 -6 -2228 -2280 -2465 1446 4723 2520 -1494 -3030 -3074 -1039 3020 3300 1730 -553
1205e53l390N54N105J753r92j263l290j499K621J811K067N57l724l673Q39K579
$$ -553 -3943 -3389 1716 3469 2477 1214 -2076 -3575 -954 857 2924 3481 -243 -3916 -3077 -498
1221d98K816R96j704l152j169L54J878L896n5l425j667j211J188L843R89m67k502
$$ -498 2318 3314 1610 -1542 -2711 -2357 -479 3417 3362 -63 -1730 -2941 -1753 2090 3079 2612 110
1238A10l234k42L600J893L21j159k466k226J486K157K524O93l178l337R66J154
$$ 110 -3124 -3366 234 2127 2448 1289 -1177 -3403 -1917 240 2764 3457 279 -3058 -2092 -938
1254i38J723K377m43l195k155m04K076L257J169k681k792l35j82K563K962n7k366
$$ -938 785 3162 2719 -476 -2631 -3035 -959 2298 3467 786 -2006 -2341 -2523 40 3002 2945 579
1271E79k358j915K352L279K96k73j797k775o40K356L359R18k235k772n82R82J225
$$ 579 -1779 -3694 -1342 1937 2233 1960 163 -2612 -3252 -896 2463 3381 1146 -1626 -2208 -1226 -1
1288aK321P47k593k774o04J613K745J243j295j919j515j084K116L523P25k215
$$ -1 2320 3067 474 -2300 -2904 -1291 1454 2697 1402 -517 -2032 -3116 -1000 2523 3248 1033
1304A033k042j803M85K924J465K02j440k565j109J638K699J648j292k387j672
$$ 1033 -1009 -2812 -2327 597 2062 2264 824 -1741 -2850 -1212 1487 3135 1843 -544 -2216
1319b216J21J405K226J476j148l103k176J767K587J175j90j274j627j888R75L837
$$ -2216 -2095 -690 1536 3012 1864 -1239 -3415 -1648 939 2114 1924 650 -977 -2865 -1890 1947
1335A947J043j957j773j430o9J858J782J373q91l139j909J520K384J117K85j299
$$ 1947 2990 1033 -740 -2170 -2239 -381 1401 2774 1883 -1256 -3165 -1645 739 1856 2141 842
1351H42k419j122J548K097J435l36k375k101N41J863J529Q58q91k365j809P34
$$ 842 -1577 -2699 -1151 946 2381 2045 -330 -2431 -1890 -27 1502 2360 1469 -896 -2705 -1971
1367a971K846J332l04j496k173k38Q55J981J317K45k555k728R57K425J168J76
$$ -1971 875 2207 1903 407 -1766 -2004 -1149 832 2149 2394 -161 -2889 -1932 493 1661 1837
1383A837l89j992j925L87K475K069o1k355j927L92N59J289K176l4k894k181J195
$$ 1837 1448 -544 -2469 -2082 393 2462 2401 46 -1881 -1489 -930 359 2535 2501 -393 -2574 -1379
1400a379J594J118O46j092j937q91L13J685K250K10k521j916r0J037J864J283
$$ -1379 215 1333 1979 887 -1050 -1941 -1628 57 2307 2517 -4 -1920 -2010 -973 891 2174
1416B174o22j571j666k63J350K601M25j957j415m21k38J407K404M44k632j736
$$ 2174 1552 -19 -1685 -1948 -598 2003 2428 471 -944 -1365 -1603 -196 2208 2652 20 -1716
1432a716j33J094J477J058q05p18j656j001J720K539L17j884j021r85J29J622
$$ -1716 -1849 -755 722 1780 975 257 -1399 -2400 -680 1859 2176 292 -729 -1714 -1585 37
1448C7K038j41j639j477j204J266K430M68j158o98j249p25J321K353L75j074j961
$$ 37 2075 1934 295 -1182 -2386 -1120 1310 1778 620 -78 -1327 -2052 -731 1622 1997 923 -1038
1465a038o10M93J356Q60P89q10k307r73J102K322L03n92r32j494l13J600J448
$$ -1038 -1648 -1155 201 1061 1850 1040 -1267 -2240 -1138 1184 1487 895 -37 -1531 -1844 -244 1204
1482A204J141j099k234r26J011J704L84L23n43k260j125J712J823R24o55j853
$$ 1204 2345 1246 -988 -1914 -903 801 1185 1508 965 -1295 -2420 -708 1115 2039 1384 -469
1498d69q14J06L75J784J080q91k317j059J340Q95J414j27r42j559p07Q27J356
$$ -469 -1283 -1177 -802 982 2062 1171 -1146 -2205 -865 30 1444 1317 375 -1184 -1891 -1064 292
1515B92J807q88j902r22L83R30R37P73J87k273j559R94J655J390p95q17j129n16
$$ 292 2099 1211 -691 -1613 -1230 -300 637 1410 1597 -676 -2235 -1241 414 1804 1009 192 -937 -1453
1533a453M1J935J804r85k158n25K79Q42J055P24o78j201j304J7K040J583p58j021
$$ -1453 -1412 523 2327 1342 -816 -1341 -1062 -220 835 1559 881 -320 -1624 -1607 433 2016 1258 237
1551B37j113p40N45J782Q95m00j496j281K19J557Q05P3m94j340r20J04J439J977
$$ 237 -876 -1616 -1071 711 1606 1206 -290 -1571 -1352 205 1010 1083 589 -751 -1671 -1567 -128 1849
1569A849j59j997q37O05q7J045J183l30j345j237l22J724J482n13q75j93j366
$$ 1849 1690 -307 -1144 -539 -626 419 1602 1272 -73 -1310 -1632 92 1574 1061 186 -7 -1373
1586a373j63J469J389L93j513j423L3R11O97M84N19j513j471o5J625J118K33o03
$$ -1373 -1536 -67 1322 1715 202 -1221 -1188 -277 420 904 1423 -90 -1561 -1626 -1 1117 1350 747
1604G47j389m06j27J386P08Q03j091j570o34Q07J761M10o30p82q96m86Q28J850
$$ 747 -642 -1048 -1175 211 919 1722 631 -939 -1573 -766 995 1405 775 -7 -903 -1389 -561 1289
1622A289K00j004j433m61P60P08P14P94j042j783j43Q77J109R10o06j375k89m02
$$ 1289 1489 485 -948 -1409 -649 59 773 1567 525 -1258 -1401 -524 585 1495 889 -486 -775 -1177
1640a177M91J562N26r31j643j26O83L65J306R4m84j666k54M32J621M74n27j081
$$ -1177 -686 876 1402 471 -1172 -1298 -615 -250 1056 1150 666 -1000 -1254 -822 799 1273 746 -335
1658c35o13J13J4J281J051q70o78j688J484N11N68K18j099n26n27N94J198J187
$$ -335 -948 -835 -821 460 1511 641 -37 -1725 -241 270 838 1056 -43 -569 -1096 -502 696 1883
1676A883j193j280m11N84O20P33L69k95j060j375O27J330P78j065j74j77n74m26
$$ 1883 690 -590 -1001 -417 203 936 1305 1010 -50 -1425 -798 532 1310 245 71 -106 -680 -1106
1694a106J003J439o42j609l98O20R57N28K3o78m7j469M47J173R99o95p09j227
$$ -1106 -103 1336 694 -915 -1313 -693 264 792 815 137 90 -1379 -932 241 1240 545 -164 -1391
1712a391L69j64J151J244k57j157j012j82J911J54J6K58q34j191K70J537K06J08
$$ -1391 -1022 -1186 -35 1209 952 -205 -1217 -1399 512 666 682 940 106 -1085 -815 722 928 1036
1730A036j371n71M91K4L94J424j32j182j823J4J739J049k90k070J176n59n55J163
$$ 1036 -335 -906 -415 -391 3 1427 1295 113 -1710 -1696 43 1092 802 -1268 -92 -651 -1206 -43
1748d3J439l49r40j536J24Q18P72N85l00J9j614n65J254J473p43p94K25Q7p11
$$ -43 1396 1047 107 -1429 -1305 -487 285 870 570 589 -1025 -1590 -336 1137 394 -400 -175 -88 -799
1767g99K65N62J921j820j052j038J736J123j003L17K0j006j066K391L40R50l069
$$ -799 -534 28 1949 129 -923 -1961 -225 898 -105 212 232 -774 -1840 551 891 1841 -1228
1784a228J214k70R4L45j6R29k25j918o56K013M44m32M61r80L81m74m27J682M6
$$ -1228 -14 -284 -190 155 139 1068 843 -1075 -1731 282 726 294 755 -225 156 -318 -745 937 983
1803I83q68r63J135l83R18o22M73K09j678j270J021J739K15J36j158l0j104L03
$$ 983 115 -848 287 -96 822 200 673 882 -796 -2066 -1045 694 909 1045 -113 -143 -1247 -944
1821i44J170K086j800j401p39J637R79j528P21N76q23r26M25J622rj089j103R42
$$ -944 226 2312 512 -889 -1628 9 988 -540 181 757 -66 -992 -567 1055 1046 -43 -1146 -204
1839b04m38n11R30K289j165k247l0K096M3m52J039j152Oj475QQ91J525r33r73
$$ -204 -642 -1153 -223 2066 901 -1346 -1376 720 763 311 1350 198 204 -1271 -1263 -372 1153 220 -753
1858g53j19O88P18n53P21N34j191j493N23M6J717j440J138L04j310j40Q49P04
$$ -753 -872 -184 534 -19 702 1236 45 -1448 -925 -879 838 -602 536 840 -470 -610 239 943
1876I43r60o90q24J651j344J619n11J207q13k320J476J222K19j14K82j157o83
$$ 943 -17 -707 -1531 120 -1224 395 -116 1091 278 -2042 -566 656 875 761 1043 -114 -797
1893g97j04Q73P21M34j509j106L87O95R90l99J041j054j532M29J399K49k91r68
$$ -797 -901 -28 693 1127 -382 -1488 -1101 -406 584 185 1226 172 -1360 -931 468 717 426 -542
1911e42q7L46J322j259J045o5j167n83M37Q64Q39r71J100n56j736P37J017J332
$$ -542 -629 -283 1039 -220 825 760 -407 -990 -553 311 1150 179 1279 723 -1013 -276 741 2073
1929B073j978q62m61J091j9R70n4M67m12j762J46J315p53P17j440J656j172o42
$$ 2073 95 -767 -1228 -137 -156 814 760 1227 815 -947 -801 514 -239 478 -962 694 -478 -1120
1947a120L00R45P47j627k89M60J136j341R37N72m55q37n35J502O56q88M00l49
$$ -1120 -820 125 872 -755 -1044 -584 552 -789 148 720 265 -572 -1107 395 1051 163 563 214
1965B14n59r47J681Q51oq53j044j06P20N14j038J955q18n1j225J458j77j14l68
$$ 214 -345 -1292 389 1240 1234 381 -663 -769 -49 465 -573 1382 564 513 -712 746 569 455 87
1984H7q58P75k54j15R65L09r09n09r08J80J507k0m76J367j499k76J432L26q61
$$ 87 -771 4 -250 -365 600 909 0 -509 -1417 -1237 270 250 -226 1141 -358 -634 798 1124 263
2003B63n31J37N08j714P42J638K85j047j489L95J306l72j21J96O42j279k59L14
$$ 263 -268 -131 377 -1337 -595 1043 1328 281 -1208 -813 493 121 0 196 838 -441 -700 -386
2021c86J237m27j171M96K66p77L58MR09k3j143n97J210P40o23j29Q32j681n19
$$ -386 851 424 -747 -251 15 -762 -404 -400 509 486 -657 -1254 -44 696 73 -56 776 -905 -1424
2040a424N40J270J66p48M5k94L39j41K96J335j365j052L34J056L46k59p94L02
$$ -1424 -884 386 552 -196 -151 -445 -106 -247 49 1384 19 -1033 -699 357 703 444 -350 -48
2058d8K1p9l66J294j31j251k10R5M20L24l19J252l05j473j55O26M1N02m3j10k30
$$ -48 -27 -106 -472 822 691 -560 -770 -675 -255 69 -250 1002 697 -776 -931 -305 -264 238 195 85 -145
2079a45n80K00M55J253r77j288P99O00p23K5P77K80q59l09J78K002j589L59j40
$$ -145 -725 -525 -70 1183 206 -1082 -283 317 -406 -381 396 676 -183 -492 -314 1688 99 458 318
2098C18k95Q0M18p51J046m08l68r70J227j93L5N88q54L27m6o27M87J040r36m75
$$ 318 23 103 521 -230 816 408 40 -930 297 104 139 727 -127 200 154 -473 14 1054 118 -357
2118c57O05n89O56l66N27k33n00o85nJ393j03K45r3p66n86M63J118j31R2r89L19
$$ -357 248 -341 315 -51 476 243 -257 -942 -947 446 343 588 495 -271 -857 -394 724 593 685 -304 15
2139A5J78j63k20J413n24j636J44K76M09r1N53L28n2q38n67J456J16l35j911Q40
$$ 15 193 30 -190 1223 699 -937 -793 -517 -108 -199 354 682 630 -208 -775 681 797 462 -1449 -609
2159f09J29J99L03R2P38p06j019M90P86n65n11P81J14n79N04m16J650p12j453
$$ -609 -480 -281 22 114 852 146 -873 -383 403 -162 -673 108 222 -357 147 -269 1381 669 -784
2178g84n5J132q84R2Q61J79j3j271J038Q35J62j123m04r80R12k24K85J066k64
$$ -784 -839 293 -591 -499 362 541 528 -743 295 1130 1292 169 -235 -1215 -303 -527 -242 824 560
2197E60j130l94J20J316q46o03R90j11j86n36J799k00o59l17K25N24r76K16Q14
$$ 560 -570 -964 -844 472 -374 -977 13 -98 -284 -820 979 779 120 -197 28 552 -424 -208 606
2216F06N11j128j000L83J379p53o39R5Q77k65r73N24R07J62j336M40N10n55l76
$$ 606 1117 -11 -1011 -628 751 -2 -641 -546 331 66 -907 -383 524 686 -650 -210 300 -255 -631
2235f31M42J959j957j719J824J333m09o22k38K90j83j56M5J624j083o63n70J97
$$ -631 -189 1770 -187 -1906 -82 1251 842 220 -18 272 89 -67 -22 1602 519 -144 -714 -517
2253e17J974k664P27J334J73j623m26K110q82o34N85O27m86j63j071K224n11j668
$$ -517 1457 -1207 -480 854 1027 -596 -1022 1088 206 -428 157 784 298 135 -936 1288 777 -891
2271h91l48N00J559r51m12R05q2j266j56O95J095k98k08p04J043o47q0M8J309
$$ -891 -1239 -739 820 -131 -543 362 280 -986 -1142 -447 648 350 142 -562 481 -166 -246 -198 1111
2290A111j217p34q0J193M01r12K17M60n85p43j29J434K2j403O20M76K6r71R15
$$ 1111 -106 -840 -920 273 674 -238 -21 439 -146 -889 -1018 416 438 -965 -345 131 157 -814 101
2309A01R40m79j365J91N38Q12j365l17J128j59l55m94R16J173o82p24j17j51P24
$$ 101 1041 562 -803 -612 -74 738 -627 -944 184 25 -330 -824 92 1265 583 -141 -258 -409 315
2328C15l38N77J42n74q75J373j98l78o90Q62j62l5j142J668k20L84j213J07N78
$$ 315 -23 554 696 122 -753 620 422 44 -646 216 54 19 -1123 545 325 709 -504 -397 181
2347A81L23j062Q20K50o27j50l6P37n23Q61n00J43p44N95m90M23k55r13N8J063
$$ 181 504 -558 262 512 -115 -265 -301 436 -87 774 274 417 -327 268 -222 201 -54 -967 -909 154
2367A54N1j047Q4L44p2Q20j236O59P01k78k48j5j88P18n03L99j94r48P3O52L94
$$ 154 205 -842 -758 -414 -486 334 -902 -243 458 180 -68 -83 -271 447 -56 343 149 -799 -726 -74 320
2388C20j15J04j14L86r08p97J246O23q52o5j20o1R50n32k41P17o19r54J106j30
$$ 320 205 309 195 581 -327 -1124 122 745 -107 -172 -292 -353 597 65 -176 541 -78 -1032 74 -56
2408e6M20m74K98L43p76k2K19O86j49k21p39M97O8K51j21j65L91j291R5Q29J57
$$ -56 364 -110 188 531 -245 -267 -48 638 489 268 -471 26 94 345 224 59 450 -841 -746 83 240
2429B40l46L58o58M29j15J18L5L69o40o6J56L6L88m86L82j06n26K01K63L34m9
$$ 240 -106 252 -406 23 -92 26 61 430 -210 -276 -120 -84 304 -182 200 94 -432 -231 32 366 317
2450C17k22m05J86k86N02Q0k99J56k07M20k82o4L84j99j47l43m5M54J52J38m48
$$ 317 95 -310 -124 -410 92 172 -127 29 -178 242 -40 -104 280 81 -66 -409 -454 0 152 290 -158
2471a58M20p43M86L66j73j32J75m45L79k55k6N01n91K40j29J72Q5J88Ro49K91
$$ -158 262 -481 5 371 198 66 241 -204 175 -80 -106 395 -196 44 -85 87 172 360 369 -280 11
2492A1l19M43p1j02J95p0k66L89n37L73k41k40K17k3K83J14k59K42J77j35l17
$$ 11 -308 135 64 -38 157 87 -179 210 -327 46 -195 -435 -218 -241 42 156 -103 139 316 181 -136
2513a36PM4J75q7O1j67j99O9j3J54L64l26k16N0K73o0o4J72j98l85R5P33J4p3
$$ -136 -129 -85 90 3 64 -103 -302 -233 -246 -92 272 -54 -270 -220 53 -7 -71 101 -97 -482 -387 346 360 287
2537B87J18m85j79%k34O80m25K00m67K3M30N68p09L17l82K71m12j21Q08P6m35
$$ 287 405 -80 -259 -259 -493 187 -238 -38 -505 -482 -52 516 -193 124 -258 13 -399 -520 288 364 -71
2558g1l78K50L61Q8K40o63L42l36j18J89LL78k55j00J59J96l34O75l79K80o03
$$ -71 -449 -199 162 250 490 -173 169 -167 -285 -96 -93 285 30 -70 89 285 -49 626 247 527 -76
2579g6n87N87K55l48L95m98M01k36k04O37k2m43m70N20j63k42O16O9P00j289N07
$$ -76 -663 -76 179 -169 226 -272 129 -107 -311 326 304 -139 -609 -89 -252 -494 122 191 891 -398 109
2600A09l31L85m29Q21n38Lq6K27m6N57k07m22l7J079m40ro5r30j4r3M93r2L62
$$ 109 -222 163 -266 555 17 20 -66 161 115 672 465 43 6 1085 645 636 571 -359 -373 -466 27 -65 297
2623B97l97k50M20Q2q1j24K58K69n31l29R73k27J6k17K13k75m61K66M13k51j60
$$ 297 -100 -350 70 152 71 -53 205 474 -57 -386 587 360 376 159 372 97 -364 -98 315 64 -96
2644i6j33K29M23l69l76O23j78r0k78p3L83o2j85j03M60l81R8K43J04r0l12j39
$$ -96 -229 0 423 54 -322 301 123 33 -245 -318 65 3 -182 -285 175 -206 -108 135 239 149 -163 -302
2666c02Q5L66j1j06K67k66n39N92L34K0o58J58J2J88o14L47L12k0l26J06P9K14
$$ -302 -217 149 138 32 299 33 -506 86 420 440 -218 -60 -48 140 -474 -127 185 165 -161 -55 24 238
2688B38k48j28N14l03M6m39M84K40m96K11l2J83k44j66K35K74p1q22L72K63K35
$$ 238 -10 -138 376 73 119 -320 164 404 -92 119 87 270 26 -140 95 369 298 -524 -152 111 346
2709C46m02P4K84n53J10j98K99L27m83j59K89K23k97L26K12l67J58n67K86M70
$$ 346 -56 18 302 -251 -141 -339 -40 287 -196 -355 -66 157 -140 186 398 31 189 -378 -92 378
2729C78l68m26M43J10j86k86N73O7k47m61J1Q22m88j02O2K41p8l11N54J9l61K38
$$ 378 10 -416 27 137 -49 -335 238 305 58 -403 -392 430 -58 -160 -98 143 65 -246 308 327 -34 204
2751B04m70M84m1n88M76L23l15k97K48J56J54p82K35L85K3n57K22O17l28m89L88
$$ 204 -266 218 177 -411 65 388 73 -224 24 180 334 -448 -213 172 195 -362 -140 477 149 -340 48
2772D8K38n52J54K11r5K31m21J60J3J78k93J38j0L69q72R8J51O67j97q7n20O16
$$ 48 286 -266 -112 99 4 235 -186 -26 -13 165 -128 10 0 369 -503 -405 -254 413 216 129 -391 225
2794B25l37K6K54M47n83j57Q2q0P6k29N9K1J49p2L39Q2Jk11m15j63R04n80M18
$$ 225 -112 -86 168 615 32 -125 -43 -123 -47 -276 -217 -196 -47 -119 220 302 303 92 -323 -486 418 -162 256
2817B56k39K56k40k17O26O5q44j96P35r9j20K09n28N03k13j15L03l89R18p54J80
$$ 256 17 273 33 -184 442 507 -337 -533 202 103 -17 192 -336 167 -46 -161 142 -247 671 -83 97
2838I7L69O7l48l10K97j45J2m6q6j05J31q66Q40O72r34o9L69M83n36k98P51m57
$$ 97 466 533 185 -125 172 27 39 -7 -93 -198 -67 -933 -93 579 -355 -424 -55 428 -108 -406 345 -112
2860a12k76L46J77O33r03k58L57N19o50K25l41J16M82n76M24J91J54p14j32j02
$$ -112 -388 -42 135 768 -135 -393 -36 483 -167 58 -283 -167 315 -261 163 354 508 -206 -338 -440
2880d40O69m45l58J007n70j12N37k89J08L08p28J162j191K60n7J65O28m76k28
$$ -440 229 -216 -574 433 -137 -249 288 -1 107 415 -313 849 -342 -82 -139 26 654 178 -50
2899e0m15Q78p67L9M84j02l98K75k78j3N50o12M98J1k45K61n3j03J64J32K16J6
$$ -50 -465 413 -354 -315 169 67 -331 -56 -334 -347 203 -409 89 100 -145 116 63 -40 124 256 472 488
2921D88o42n6K21L12k00m15Q40q49O3P96o50j96M01l65j5K59o2%m88P28K65q18
$$ 488 -154 -210 11 323 123 -292 548 -301 -238 558 -92 -288 113 -252 -267 -8 -70 -70 -558 170 435 -383
2943c83L01kN2M0p59N29K52l89K23O9J02J53o63R49k49k44K28k3j9L79k24l80
$$ -383 -82 -84 -32 8 -751 -222 30 -359 -136 -67 35 188 -475 474 225 -19 209 186 167 546 322 -58
2965e8J92m01J46J19J58k01J96k80L07N65j292N09k65Q4J51R6j55P50p44o1J87
$$ -58 134 -267 -121 -2 156 -45 151 -129 178 743 -549 -40 -305 -221 -70 26 -129 621 -123 -184 3
2986CM58j44m06m0O26k11o44K38P44m46l36j10M11J35l67K02L3j48L72n17l6M03
$$ 3 461 317 -89 -129 497 286 -358 -120 624 178 -158 -268 143 278 -89 113 146 -2 370 -147 -183 220
3008B20p6j72J92l3K08l45L15r6l94M56j61K16l47K08M53n24q1n2O0K17j23J55
$$ 220 144 -28 164 131 339 -6 309 213 -181 275 114 330 -17 191 644 120 39 -13 47 264 141 296
3030B96k47J04k99J51K92L59q69k53N17j25P9m64P35J06p26K41K02L78k38j91
$$ 296 49 153 -146 5 297 656 -213 -466 51 -74 5 -459 276 382 -344 -103 99 477 239 48
3050D8K04M56m05o05L52P56p06J20l13R3J225j416n10P10J86n11P4j40L13M88
$$ 48 252 708 303 -302 50 806 100 220 -93 0 1225 -191 -701 9 195 -316 -242 -382 -69 419
3070D19r4K8M5k80K08m17P01p87M80k68P15o01l11j8O96m06o4J96n16O24M13n38
$$ 419 325 353 398 118 326 -91 610 -177 303 35 750 149 -162 -180 516 110 46 242 -274 350 763 225
3092B25mQ6l42J54n0N74r27o2K28k13P14m23J95j87P65p60L03R7j412Q17K42j67
$$ 225 221 307 -35 119 69 643 -284 -346 -118 -331 383 -40 155 -32 733 -27 276 373 -1039 -222 20 -147
3114a47j16L35m03M76q46N3J027J72l03n94L85k87L70m61M18j23P8j80J17L39
$$ -147 -263 72 -331 145 -701 -648 379 551 248 -346 39 -248 122 -339 79 -44 34 -146 -29 310
3134C10l4m99M28o30Q24m20j10J43K62j018L9K22Q13l22l5N36l59p01N37O75m5
$$ 310 276 -223 205 -425 399 -21 -131 12 274 -744 -705 -483 330 8 -27 509 150 -551 -14 661 616
3155F16l03L82j34p44o97R13N42k7k96o56M68M08o93J35m4r71J196j46O4N41m22
$$ 616 313 695 561 -183 -880 33 575 548 252 -404 64 472 -221 -86 -130 -1101 95 -51 13 554 132
3176A32o54L74N31l39k38P9j07N25j37J91L39q84N94n57Q77p49K4l79K78N47k87
$$ 132 -522 -148 383 44 -194 -115 -222 303 166 357 696 -188 406 -151 726 -23 1 -378 -100 447 160
3197A60k91M49j48k19k58J086j025M06k98M86k59j51K3m92M97q5k64M49K27J26
$$ 160 -131 318 170 -49 -307 779 -246 160 -138 348 89 -62 -39 -531 -34 -119 -383 66 293 419
3217D19k28l91N62m38J36k86M87j73j53J07P08j225O56l01j72L11K00o89L47P39
$$ 419 191 -200 362 -76 60 -226 261 88 -65 42 750 -475 181 -120 -292 19 219 -470 -123 616
3237F16p32L23j27j74M53k80j29k10K77r5K67Q5m90N1N02p72R08l07j87J80l44
$$ 616 -116 207 80 -94 359 79 -50 -260 17 -78 189 274 -216 -165 337 -435 473 166 -21 159 -185
3258a85J42j85N23n59K51L70m3n36N25m20N50m90J92l35M76q6K9k99J29q1n69
$$ -185 -43 -228 295 -264 -13 357 314 -222 303 -117 433 -57 135 -200 276 190 219 -80 49 -32 -601
3279f01MR88m26Q4J0K75nn35M49qO4k18k7j2j3m24J1N29m61j8K65N9N17l60Oo22
$$ -601 -597 391 -35 49 59 334 329 -206 243 235 299 81 54 42 29 -395 -384 145 -316 -334 -69 -10 507 147 153 -469
3305d69P92l29m80L38Q27l49m41k88N63k70l8L48o48N82q3M88k3k37m3l80QJ85
$$ -469 323 -6 -486 -148 679 330 -111 -399 164 -106 -144 204 -444 138 55 543 520 283 240 -140 -132 53
3327E3Jk74J70pJ96M2m06j47P57n37j18J28M8K52k03K5K58j93J4%J07p33O45o5
$$ 53 54 -220 -50 -57 139 181 -225 -372 385 -152 -270 -142 -94 158 -45 -20 238 45 59 59 166 -567 78 13
3351A3l99M92k94K74M24n65M74l17k41K95l02J49J48l81K62j22J76K26k94j9J95
$$ 13 -386 106 -188 86 510 -55 419 102 -139 156 -146 3 151 -230 32 -90 86 312 18 -1 194
3372A94k27J48q4K50l43L6j38J73j50N2K87j93k05j38K14mk89K23K47J89m05J07
$$ 194 -33 115 31 281 -62 -26 -164 9 -141 -89 198 5 -200 -338 -124 -128 -417 -194 53 242 -163 -56
3394e6j95K54L0k66L12l8n8m60K96M76l7m30N49j77j83m8l2J33J74j73l1K4Oj13
$$ -56 -251 3 33 -233 79 41 -17 -477 -181 295 258 -172 377 200 17 -31 -63 70 244 71 40 64 70 -43
3418d3MK26r5M1j54J54L9jk92K24J86j77j09j73K64o2k78M95j10l7k03j97L88
$$ -43 -39 187 92 133 -21 133 172 171 -121 103 289 112 3 -170 94 32 -246 249 139 102 -101 -298 90
3441I0j35J17J1j09J30l90M09M8r5k50j29N99j95L0J17l4j42Q5j34j45M04n60
$$ 90 -45 72 83 -26 104 -286 123 171 76 -174 -303 296 101 131 248 214 72 157 23 -122 282 -278
3463b78L09j78P8k49Q7J98L44n90O5L51k7k45k74N38l94J47M03r8L24m84J60j31
$$ -278 31 -147 -69 -318 -231 -33 311 -279 -214 137 110 -135 -409 129 -265 -118 285 187 511 27 187 56
3485E6K36M9j87l88O70m13j71L04pn36M31l71M00l5J30n1l21J75K18m02K01k86
$$ 56 292 341 154 -234 436 23 -148 156 149 -387 44 -327 73 38 168 117 -204 -29 189 -213 -12 -298
3507b98J27K50k93N1O6J13j80L43m0j22O8m2M9R3k86N9J35k90K41J18l02ML9J59
$$ -298 -171 79 -214 -163 -97 16 -164 179 139 17 85 43 92 185 -101 -42 93 -197 44 162 -140 -136 -97 62
3531F2J6j26N7J64J79n04j1J17K09j31j45K02J29o2k54J53J48j77j64J39J54k80
$$ 62 78 -48 9 173 352 -152 -163 -46 163 32 -113 89 218 156 -98 55 203 26 -138 1 155 -125
3553a25J78k8J24j87j42o7M67l07k7J7N37o21p8O1L66j19j85L90j41q0jj1mJM6
$$ -125 53 25 149 -38 -180 -247 220 -87 -114 -97 440 -181 -259 -198 168 49 -136 254 113 33 32 21 17 18 64
3578F4j59J72J60l3K4k99J23k67mP5L33o1j5k23J05q9K76k33Q8j87K08k67mM23
$$ 64 -95 77 237 204 228 -71 52 -215 -219 -144 189 128 113 -110 -5 -94 182 -51 37 -150 58 -209 -213 210
3602B10o02M71K54k71K4%J07j71P7k68J93j55R3k61M26j74l15N26k31j68J71j83
$$ 210 -392 79 333 62 86 86 193 22 99 -169 24 -131 -38 -299 127 -47 -362 164 -67 -235 -64 -247
3624b47M18O3l46R4pqP1p0rJ82k44m7K56K06k69j34j39J88K14k73J52j76J07l81
$$ -247 171 234 -112 -18 -25 -33 38 -32 -41 141 -103 -150 106 312 43 -91 -230 -42 172 -101 51 -125 -18 -399
3648c99L57K14j74N6k29J76N7j88m7Q5m0JN2K97j36r3l24K65K29j46J59J47k25
$$ -399 -42 172 -2 54 -175 1 58 -130 -177 -92 -132 -131 -79 218 82 -11 -335 -70 159 13 172 319 94
3671I4k13K1K62p8P2j78k01J30K07j91l3J27J36j56j23K99n5l97K37J81jr0JJ85
$$ 94 -119 -98 164 86 158 -20 -221 -91 116 -75 -108 19 155 -1 -124 175 120 -277 -40 141 140 50 51 236
3695B36j77j14j83J13J83k98K64J52l26J7J46K22kl0l66K39K08k62l22M44K19
$$ 236 59 -55 -238 -125 58 -240 24 176 -150 -133 13 235 233 203 -163 76 284 22 -300 144 363
3716C63o23J95R6J83l37J33O3j34o3O3j44K51J19k75J42j06j19J70J38NJ57j39
$$ 363 -260 -65 31 214 -123 10 73 -61 -124 -61 -205 46 165 -110 32 -74 -193 -23 115 120 277 138
3738A38j32Q5J6Q1j49N1N4j53j57K77pj04j1j6K32l45M5l7L47m09LR5Q6j57n7
$$ 138 6 91 107 188 39 90 144 -9 -166 111 104 0 -11 -27 205 -140 -95 -132 215 -194 -191 -96 -10 -167 -224
3763b24J85k6L7L6l5j56K31L7k3N0J4j22J67j68k05k8J5n6L99Q2l42J97P2m22
$$ -224 -39 -65 -28 8 -27 -183 48 85 62 112 126 4 171 3 -202 -230 -215 -271 128 210 -132 65 137 -285
3787b85L89j77K05k37p9J60%J7R8o7p8L6N3O8j9j75J7P3r5k3p0L46J01m6k17k15
$$ -285 104 -73 132 -105 -184 -24 -24 -7 91 24 -54 -18 35 103 84 -91 -74 -1 -96 -119 -189 157 258 212 -5 -220
3813b20K33j21P9n8J73j02J5R2k50J14Lm1j13o8L39K39l98R3o8K23j25N1k80L62
$$ -220 13 -108 -29 -87 86 -16 -1 91 -159 -45 -42 -83 -196 -264 75 314 -84 9 -59 164 39 90 -190 172
3837A72k32J62j88K9J50r1q3J50k82M27K61m45j27J96m4j68J68o1M2L09o86L12
$$ 172 -60 102 -86 -57 93 2 -81 69 -213 214 475 30 -97 99 55 -113 55 -6 36 345 -341 -29
3859b9J59j20q8K4K97k51n5j33M09k80k9ln4K36m4m6J91j28k6j65J86q5K83j35
$$ -29 130 10 -78 -54 243 -8 -63 -196 213 -67 -96 -99 -153 83 39 -7 184 56 30 -135 51 -34 249 114
3883A14r5L0J0k01K11J08p9j10J7jj55M8K13N6o6j26J32n9j22j04J44L4k01K62
$$ 114 19 49 59 -142 69 177 98 -12 5 4 -151 -103 110 166 100 -26 106 47 -75 -179 -35 -1 -202 60
3907F0k83L84l17L51k49J08j79q9j31L99K72l89R6k81L14n3K76k09j39K6p3M01
$$ 60 -223 161 -156 195 -54 54 -125 -214 -345 54 326 -63 33 -248 66 13 289 80 -59 -33 -106 295
3929B95j01q3L99o17J94p76M70k44L16N79p60M17J99o74j58Q86L92l12o50o8L27
$$ 295 194 111 510 -107 87 -689 -219 -463 -147 432 -328 89 288 -386 -544 342 734 422 -228 -296 31
3950C1J14o70O40m14N50k83Q3m26L29p00R53l86L18J20r25L44K13L98q17M49J84
$$ 31 145 -525 115 -299 251 -32 51 -375 -46 -746 207 -179 139 259 -666 -322 -109 289 -528 -79 105
3971A05l84M2j76q3N31N91j083P83K33j384P77k56j30P71K03o12j04O83m6l87
$$ 105 -279 -237 -413 -496 35 626 -457 326 559 -825 -48 -304 -434 337 540 -72 -176 507 461 74
3991G4L74o98J155j029p9N75m38K20J00n77J00M08j64P5K19k14n9J24r6r0O93
$$ 74 448 -250 905 -124 -203 372 -66 154 254 -323 -223 185 21 96 315 101 42 166 70 -20 673
4012F73q49P34l62j03k61K77J95K20k20M3n51n12R51j005J164o40J38P1L00m80
$$ 673 -176 558 196 93 -168 109 304 524 304 347 -204 -716 235 -770 394 -246 -108 -37 263 -217
4032b17N70m43N91p22l56P17PM95q47K21M34j5M1p67j99Q11J218j076Q8l45r0
$$ -217 353 -90 501 -221 -577 140 147 642 -205 16 450 435 476 -291 -490 321 1539 463 551 206 116
4053A16J33n7Rl2o74O97M15j258R57o78R67r01j245K111j16r08N54l02N58M5o87
$$ 116 249 192 201 169 -505 192 607 -651 306 -372 595 -306 -1551 560 444 -464 90 -212 346 391 -296
4074b96P10L32r33K37n7J426j440M1J54j55j48L40k61M24n46J86m03Q05k97L45
$$ -296 414 746 -187 50 -7 1419 -21 20 174 19 -129 211 -50 374 -172 14 -389 416 119 464
4094D64q05L57m7p33K69Q44l2n25n86K10P08o02K71L49Q01k32r66q5O84m19j35
$$ 464 -341 16 -31 -764 -495 349 317 -208 -794 -584 124 -478 -207 142 943 711 -255 -340 344 -75 -210
4115b10L71k14n1q8L43l26N38k33m18O67l49l00J51K29k6j12k45M35l30J89j44
$$ -210 161 -53 -104 -192 151 -175 363 130 -288 379 30 -270 -119 110 84 -28 -273 162 -168 21 -123
4136a23K1K02l65L01J19l2j92rL36k00Kk10L07k05K0O2K26j1j95J8J72k4j36j21
$$ -123 -102 100 -265 36 155 123 -69 -78 258 58 60 -150 157 -48 -28 34 260 249 54 72 244 220 84 -37
4160c7L05l16r9J55J97p7l96j08N29N3l69Q3J61N4l91R8J02L89m05j2Q4K77l17
$$ -37 268 -48 -147 8 205 128 -268 -376 153 206 -163 -80 81 135 -256 -158 -56 333 -72 -84 0 277 -40
4183d0l19M57L8k04lmml4j36L33J20k10M2K08k39n4J72j91J87k5l23K5L06k67
$$ -40 -359 98 136 -68 -71 -75 -79 -113 -249 84 204 -6 36 244 5 -49 123 -68 119 94 -229 -204 102 -165
4207a65M62j02l94QL66k28M42n14k19L48K51l63R8k06K62L3j69K06J9j17j69J6
$$ -165 297 195 -199 -191 175 -53 389 -125 -344 4 255 -108 -10 -216 46 79 -90 116 135 18 -151 -135
4229a35J56J44n50J86M56k58k49Q1M74l21J5QK22Q7l43Q7o1j11K46K04m34Q1m7
$$ -135 21 165 -385 -199 257 -1 -250 -169 305 -16 -1 7 229 316 -27 60 -1 -112 134 338 -96 -15 -62
4252f2K69m4j95M2m1j73L95k3n11N40J04j37m78K74p4J62l8l4J50l75M11k01L36
$$ -62 207 163 -32 10 -31 -204 191 168 -343 197 301 164 -314 -40 -114 48 10 -24 126 -249 162 -39 297
4275B97n77K72l07M14k48j57K71N4R6l65L34P5k46K32J07j09l96J22j29L96j85
$$ 297 -280 -8 -315 99 -149 -306 -35 19 115 -250 84 159 -87 145 252 143 -253 -131 -260 136 -49
4296d9k92N51qk09j43n9Q26r00n21R63p5k46J46K46J44m01p42J054Q17j481L15
$$ -49 -341 210 202 -7 -150 -209 617 -283 -804 159 84 -162 -16 230 374 -27 -769 285 1102 -379 -64
4317f4m52M18K97l71P44l09j8n89m3J134P3r44Q9K45K62K09m17L7j53l37L08q3
$$ -64 -516 -98 199 -172 572 263 245 -344 -387 747 820 -124 -35 210 472 681 264 301 148 -189 119 36
4339C6J80p30M09k39K56J02k21N63l08M5j040J396o74J28M92k13l10P1K33m46
$$ 36 216 -514 -105 -344 -88 14 -207 356 48 93 -947 449 -225 -97 395 182 -128 -57 176 -270
4359b70J523j234p99Q80O46j261O91j0L3n98j76J60K20M81k74O13j476P39J015
$$ -270 1253 19 -780 100 746 -515 176 166 199 -399 -575 -415 -195 286 12 625 -851 -112 903
4378I03j157J05l52P06r19M18P17r89J192j49n04L61k31N72r75M35R12l27j152
$$ 903 -254 -149 -501 205 -714 -296 421 -568 624 475 -29 332 101 673 -302 133 1045 718 -434
4397d34O8o70J441k5l72n43Q92l44R5l87N90j74l18J22Q19p09p3M21p54R1L62
$$ -434 -366 -1036 405 380 8 -535 357 13 108 -279 311 137 -181 -59 760 51 -22 399 -355 -264 98
4418I8k06q6Q82j166M88j04J57J61m67KM83j87L56r3l4l41Oj1O78q26l3l1K27
$$ 98 -108 -194 688 -478 10 -94 63 224 -243 -241 242 55 411 318 284 -57 -51 -62 616 -210 -243 -274 -47
4441d7k9l25M87L4j92r0J61K49n36k24Q20m2l51L05n5k83N08n72K70p39O53Q4
$$ -47 -76 -401 86 120 -72 -162 -1 248 -288 -512 308 266 -85 220 165 -118 390 -182 88 -651 2 86
4463H6l25J65N26K97p53M86l57l84J17j09N68l19P44l66N37r63k79L86o2m94L41
$$ 86 -239 -74 452 749 -4 482 125 -259 -142 -251 317 -2 742 376 913 -50 -329 57 -5 -499 -158
4484a58J52J282j694N45p85J528j130Q92p85L08q22O81J046q58J4N95l0j433Q03
$$ -158 -6 1276 -418 127 -658 870 -260 632 -153 155 -667 14 1060 202 216 811 781 -652 151
4503A51L8k11l70Q4M82k44P35m07r50J001j94K74o12L76M69l81p55L40Q72m07
$$ 151 189 -22 -392 -308 174 -70 665 258 -692 309 115 389 -223 153 622 241 -514 -174 698 291
4523B91k34m5l09O37l15O7q2k75L45k05M61n30K99M09l85l71m00Q63q34J394n72
$$ 291 57 12 -297 340 25 92 10 -265 80 -125 336 -194 105 514 129 -242 -642 221 -613 781 209
4544B09l39L53k59K47K41j006L81q19J035J05o02K62j56J38O37N86j153l02P37
$$ 209 -130 223 -36 211 452 -554 -173 -992 43 148 -454 -192 -348 -210 427 1013 -140 -442 295
4563B95p10J015p80L55j49J10k89L41j82k65K36j5J67j83j57K26j61q6Q1n4n8
$$ 295 -415 600 -180 175 26 136 -153 188 6 -259 -23 -38 129 -54 -211 15 -146 -232 -151 -205 -263
4584b63Q6J73J53k75J47j7k77M69n34P12o35P20m70M56m99J3L20k39j84P9K30
$$ -263 -177 -4 149 -126 21 4 -273 196 -338 374 -261 459 -11 445 -54 -41 279 40 -144 -65 165
4605A65K57o38P01o19M4M10m4k13j77l00N31n2J06m9l04L80q89J299m70J37n49
$$ 165 422 -216 485 -134 -90 320 276 63 -114 -414 117 65 171 122 -182 198 -691 608 138 275 -274
4626b74M22l06k40P42k66K81o13L79J71j88r7j35K88l51K96k9n06P82k43j93k53
$$ -274 148 -158 -398 344 78 359 -254 125 296 108 11 -124 164 -187 109 80 -426 356 113 -80 -333
4647c33Q54o46K59j16l20N50j86l14M2O19o81R5k15O59j16j24J24m63P1K35M99
$$ -333 521 -125 134 18 -302 248 62 -252 -210 409 -272 -177 -392 267 151 27 151 -312 -241 -6 493
4668D93m54j78M43n01K04k61K31J41K09n28K51k33J16L71k21K22n82K28M9o7J
$$ 493 39 -139 304 -197 7 -254 -23 118 327 -201 50 -183 -67 304 83 305 -277 -49 0 -67 -66
4689f6N2K73n49O0L52j05j56K36k69L14nq2l43J54J48k9q0L58l72J1j0M71k77
$$ -66 -14 259 -290 -230 122 17 -139 97 -172 142 137 55 -288 -134 14 -15 -95 263 -109 -98 -108 363 86
4712H6m8j7k32K75j72M6O6L03m61J23MJ80m4k91L83J47j88j69q5j32J69J54k45
$$ 86 38 21 -211 64 -108 -62 4 307 -154 -31 -27 153 109 -182 201 348 160 -9 -94 -226 -57 97 -148
4735a48O1J13j59j01K83k9k9j44K5lJ89q5j5q8R1J24R9j58p5P3M5L0j03l01J91
$$ -148 -87 26 -133 -234 49 20 -9 -153 -128 -131 58 -27 -42 -130 -39 85 184 26 -49 24 69 99 -4 -305 -114
4760a14J21R2j01P6J06m22K90J45j54m5L8o5J41j75J35o6R8j08k91L35o2k57N21
$$ -114 7 99 -2 74 180 -242 48 193 39 -6 32 -33 108 -67 68 2 100 -8 -299 36 -26 -283 238
4783B38l75J22o1J38l0J23q9j88J13K5J75J09J3k57m9K52k58J56k00R1j59J40
$$ 238 -137 -15 -76 62 32 155 66 -122 -9 16 191 300 313 56 7 259 1 157 -43 48 -111 29
4805B9r1K5O4p9K62k48n9J7l9J63j31l9J99k4j49J41o9l8On2J15j37J98J94l53
$$ 29 -62 -37 27 -52 210 -38 -97 -80 -119 44 -87 -126 73 49 -100 41 -28 -66 -60 -112 3 -134 64 258 -95
4830i5N4j3J60j62K53m67J65j10L36m16J33k1J51K98l86M2%m8M4K01R1k98J62
$$ -95 -41 -54 106 -56 197 -270 -105 -215 121 -295 -162 -183 -32 266 -120 -78 -78 -126 -82 119 210 -88 74
4853G4j12J61m6P6k41K34k07p6M1J19R1m46N61j76N1o3m5J31n9j99J61j92L61
$$ 74 -38 123 77 153 -88 146 -61 -137 -96 23 114 -332 229 53 104 41 -4 127 68 -131 30 -162 199
4876A99q8L1j34j16k33K60J86N3k31N0J02j66q7J39r5J08K50M4j47k5l21K23k8
$$ 199 111 142 8 -108 -341 -81 105 158 -73 -23 79 -87 -174 -35 -130 -22 228 272 125 100 -221 2 -26
4899b6J29l36J43L36n08L30r1J16k48M26k31l2K0k33L37m38M07j39J4j5K98l16
$$ -26 103 -233 -90 246 -262 68 -23 93 -155 271 40 8 28 -205 132 -306 101 -38 -24 -39 259 -57
4921e7J40L5j31M6m7O2M9j07K01k96m6J80k20J52N1J3q9J39p1M2p2M7j3J03J9
$$ -57 83 118 -13 33 -14 48 97 -10 191 -105 -151 29 -191 -39 12 25 -64 75 4 46 -26 21 8 111 130
4946A30j22n9J69J00k96J86j99p7J56qk0J07M3k32K56j06J8Mk3n7j30J44J39j36
$$ 130 8 -51 118 218 -78 108 -91 -168 -12 -20 -40 67 110 -122 134 28 46 50 27 -30 -160 -16 123 -13
4970a3j27j9L24l46J26k28L54p9j00P7J17J21k95L6J45j27Q5k23J29J40J8K7k96
$$ -13 -140 -159 165 -181 -55 -283 71 -8 -108 -31 86 207 -88 -52 93 -34 51 -172 -43 97 115 142 -154
4993a54QJ85O0R5j82k4R0j47J86j70J7nP5q2J11q2k6K0m9m1J13k1J2r6R4J25j31
$$ -154 -146 39 99 194 12 -12 78 -69 117 -53 -36 -41 34 -48 63 -19 -45 -25 -74 -115 -2 -23 -11 -107 -13 112 -19
5020a9J5J44J4l49K41l7k3O3l6J5J3JJ71k81K63j21N8n0pNj92j04J48J36j54o6
$$ -19 -4 140 154 -195 46 9 -14 49 13 28 41 42 213 -68 195 74 132 82 75 80 -112 -216 -68 68 -86 -152
5046a52J88oj68K71j44K83m65L93j12n0k41J55K8K53m44J67Ql2N4J08k40K52j44
$$ -152 36 30 -138 133 -11 272 -193 200 88 38 -203 -48 -20 233 -211 -44 -36 -68 -14 94 -146 106 -38
5069c8K3O7j48j32l7N30m40R8J21n2K4k4k22L87R2M27m59q3j7K60N52j088J26
$$ -38 -15 52 -96 -228 -265 265 -175 -77 44 -8 16 -8 -230 157 249 676 217 134 117 377 929 -159 -33
5092c3O46m18m3N43j42r6k04k79j17l3L83m34o4J11M97q3J57m15l17L17J24k42
$$ -33 613 195 152 695 553 457 253 -26 -143 -176 207 -227 -291 -180 317 234 391 -24 -341 -24 100 -142
5114a42J39k66K86k5K2P0l7k6l2N3n6k75P7L13q1k6p3K1K8J80kJ1k75l7j35J90
$$ -142 -3 -269 17 -8 14 84 47 21 -11 42 -14 -289 -212 101 20 -6 -79 -58 -30 150 148 159 -116 -153 -288 -98
5140i8J29p8j22R5m1K00k14J03mJ72q1j59j3J03K08m54K25J09K60k96j01l9J97
$$ -98 31 -47 -169 -74 -115 85 -129 -26 -30 142 61 -98 -111 -8 200 -254 -29 80 340 44 -57 -96 101
5163A01k61p4L47j05k70J93L42k67l23L39j8r0P8j55J8K36m5M1k16K33pj04K46
$$ 101 -160 -234 113 8 -262 -69 273 6 -317 22 4 -86 -8 -163 -145 91 46 87 -129 104 97 -7 239
5186B39r5p4j33J20o2j65j29M14r0j16K1j43M38j13k62j3K02Q7r5M3j68j12J47
$$ 239 144 70 -63 57 -5 -170 -299 115 25 -91 -70 -213 225 112 -150 -163 39 126 31 74 -94 -206 -59
5209e9k0K60k54p6P3R8N6p3k30L20l3%j53M7k9r3O9J47O7j44j25K56Oo0j21J20
$$ -59 -79 181 -73 -149 -76 22 78 5 -225 95 62 62 -91 -44 -73 -166 -97 50 117 -27 -152 104 110 50 -71 49
5235D9J28q3k7k11M40k66k14J31p9J43o9M3J14J16l10L3l3M3K86j67k19J90j77
$$ 49 177 94 67 -144 296 30 -184 -53 -132 11 -58 -15 99 215 -95 -62 -95 -52 234 67 -152 38 -139
5258a39J69J48j62j44J66P0j02r5J30Mj78RO2j0J56n8q5n4J38k21K85j33K46j93
$$ -139 30 178 16 -128 38 108 6 -89 41 45 -133 -124 -62 -72 84 26 -59 -113 25 -196 89 -44 202 9
5282IR8N7o3j6j00n8R0j14m6j2K77l7j93K43J8p4j88K88j19j19J80j36O1J76k07
$$ 9 107 164 101 85 -15 -73 17 -97 -143 -155 122 85 -108 135 153 79 -109 179 60 -59 121 -15 46 222 15
5307A5n0j7l8m1J24J19N0j69n2J37J73k91K36l16K99l65L28J01k65N6J99n0j03
$$ 15 -35 -52 -90 -131 -7 112 162 -7 -59 78 251 -40 196 -120 179 -186 142 243 -22 34 233 183 80
5330H0m8J05P1l16j46Q5PK47J44j83k1P2j71Pm2L1p8k6L74k73Q0J2m1k02M33j64
$$ 80 32 137 208 -108 -254 -169 -162 85 229 46 25 97 -74 -67 -109 -78 -156 -182 192 -81 -1 11 -30 -232 201 37
5356C7P4j61N6P6j94K02m3j83K14m9j81K73l25M94r3k62L4O2m5K9k74K53n4L5
$$ 37 111 -50 6 82 -112 90 47 -136 78 29 -152 121 -204 290 197 -65 -31 31 -14 15 -259 -6 -60 -25
5380b5J7M1P5j96O8K5J08k08m1L9L17m8j26k29M7M24m89K40M4j82L24K40n21k38
$$ -25 -8 33 108 -88 -20 5 113 -95 -136 -97 220 172 46 -183 -136 288 -201 39 83 -99 225 465 -56 -294
5404b94J73l58N57j88N1K00M59q54J44M14l07J56ll13pO4j57R82q99J70j0ok87
$$ -294 -121 -479 78 -110 -59 141 600 -254 -110 304 -3 153 150 -163 -170 -106 -263 719 -180 -10 -20 -26 -313
5427c13N62p2k19k59L52j02m75M46k07M29o37P52p08N77n14J50L24o3K86j94N01
$$ -313 249 177 -42 -301 51 -51 -526 -80 -287 142 -495 257 -451 126 -388 -238 86 23 309 115 616
5448F16p76l79N39n04O54J16J00k31L55k29j3k35l72N76l14J51j64K89L4pk97
$$ 616 -160 -539 0 -504 150 266 366 135 490 261 248 13 -359 217 -97 54 -110 179 213 206 -91
5469i1lr3j35J98J16J10j95J05or2k16M29n49P99l71j10K21j41n3K05j28M0Qn
$$ -91 -94 -187 -322 -124 -8 102 -93 12 6 -86 -302 127 -422 377 6 -104 117 -24 -77 128 0 40 48 43
5493D3p0mM9j86K73M0m21J25K18j65J59j22K95m4m9j09r3J2n4r8nL68l41L28M00
$$ 43 -27 -31 18 -168 105 145 -276 -151 67 -98 61 -61 234 190 141 32 -61 -49 -103 -201 -206 162 -179 149 549
$$ [...]
8191e6
##END NTUPLES=NMR FID
##END=
