##TITLE=1H_Pr Am-ost
 CDCl3, 8 sc, 
 14.3.2019
##JCAMPDX= 6.0         $$ Bruker NMR JCAMP-DX V2.0
##DATA TYPE= NMR FID
##DATA CLASS= NTUPLES
##ORIGIN= UXNMR, Bruker Analytische Messtechnik GmbH
##OWNER= root
$$ XWIN-NMR		Version 3.5
$$ Thu Mar 14 16:38:12 2019 Russian Standard Time (UT+4h)  she@DPX200
##.OBSERVE FREQUENCY= 200.1315
##.OBSERVE NUCLEUS= ^1H
##.DELAY= (6, 6)
##.ACQUISITION MODE= SIMULTANEOUS
##.ACQUISITION SCHEME= undefined
##.AVERAGES= 8
##.DIGITISER RES= 18
##SPECTROMETER/DATA SYSTEM= spect
##.PULSE SEQUENCE= zg30
##.SOLVENT NAME= CDCl3
##.SHIFT REFERENCE= (INTERNAL, CDCl3, 0, 15.7039)
##AUDIT TRAIL= $$ (NUMBER, WHEN, WHO, WHERE, WHAT)
$$ ##TITLE= Audit trail, XWIN-NMR		Version 3.5
$$ ##JCAMPDX= 5.01
$$ ##ORIGIN= Bruker BioSpin GmbH
$$ ##OWNER= she
$$ F:/spectra/data/she/nmr/H-F/1/audita.txt
$$ ##AUDIT TRAIL=  $$ (NUMBER, WHEN, WHO, WHERE, WHAT)
(   1,<2019-03-14 16:37:11.04 +0400>,<she>,<DPX200>,
      <created by zg, POWCHK disabled, PULCHK disabled
       configuration hash MD5:
       00 E9 B6 7A A2 85 ED C7 34 08 36 98 17 FE 4E 26
       data hash MD5: 16K
       93 82 7E DD 2B A4 58 59 9E 52 89 9C CA F9 0D BB>)
$$ ##END=
$$ 
$$ hash MD5
$$ 9E B7 69 22 D8 56 9F CC 15 B4 99 57 4E 6F F9 A2
##$RELAX= 
##$RELAX= 
##$RELAX= 
##$RELAX= 
##$RELAX= 
##$RELAX= 
$$ Bruker specific parameters
$$ --------------------------
##$DU= <F:/spectra>
##$EXPNO= 1
##$NAME= <H-F>
##$PROCNO= 1
##$TYPE= <nmr>
##$USER= <she>
##$AMP= (0..31)
100 100 100 100 100 100 100 100 100 100 100 100 100 100 100 100 100 100 
100 100 100 100 100 100 100 100 100 100 100 100 100 100 
##$AQSEQ= 0
##$AQ_mod= 1
##$AUNM= <au_zg>
##$AUTOPOS= <>
##$BF1= 200.13
##$BF2= 200.13
##$BF3= 200.13
##$BF4= 200.13
##$BF5= 200.13
##$BF6= 200.13
##$BF7= 200.13
##$BF8= 200.13
##$BYTORDA= 1
##$CFDGTYP= 0
##$CFRGTYP= 5
##$CHEMSTR= <none>
##$CNST= (0..31)
1 1 145 1 1 1 1 1 1 1 1 1 1 1 1 1 1 1 1 1 1 1 1 1 1 1 1 1 1 1 1 1 
##$CPDPRG= <>
##$CPDPRG1= <>
##$CPDPRG2= <>
##$CPDPRG3= <>
##$CPDPRG4= <mlev>
##$CPDPRG5= <mlev>
##$CPDPRG6= <mlev>
##$CPDPRG7= <mlev>
##$CPDPRG8= <mlev>
##$CPDPRGB= <>
##$CPDPRGT= <>
##$D= (0..31)
0 1.2 0 0 0 0 0 0 0 0 0 0.03 0 0 0 0 0 0 0 0 0 0 0 0 0 0 0 0 0 0 0 0 
##$DATE= 1552567030
##$DBL= (0..7)
120 120 120 120 120 120 120 120 
##$DBP= (0..7)
150 150 150 150 150 150 150 150 
##$DBP07= 0
##$DBPNAM0= <>
##$DBPNAM1= <>
##$DBPNAM2= <>
##$DBPNAM3= <>
##$DBPNAM4= <>
##$DBPNAM5= <>
##$DBPNAM6= <>
##$DBPNAM7= <>
##$DBPOAL= (0..7)
0.5 0.5 0.5 0.5 0.5 0.5 0.5 0.5 
##$DBPOFFS= (0..7)
0 0 0 0 0 0 0 0 
##$DE= 6
##$DECBNUC= <off>
##$DECIM= 24
##$DECNUC= <off>
##$DECSTAT= 4
##$DIGMOD= 1
##$DIGTYP= 9
##$DL= (0..7)
0 120 120 120 120 120 120 120 
##$DP= (0..7)
150 150 150 150 150 150 150 150 
##$DP07= 0
##$DPNAME0= <>
##$DPNAME1= <>
##$DPNAME2= <>
##$DPNAME3= <>
##$DPNAME4= <>
##$DPNAME5= <>
##$DPNAME6= <>
##$DPNAME7= <>
##$DPOAL= (0..7)
0.5 0.5 0.5 0.5 0.5 0.5 0.5 0.5 
##$DPOFFS= (0..7)
0 0 0 0 0 0 0 0 
##$DQDMODE= 0
##$DR= 18
##$DS= 0
##$DSLIST= <SSSSSSSSSSSSSSS>
##$DSPFIRM= 0
$$ [...]
##$SUBNAM2= <"">
##$SUBNAM3= <"">
##$SUBNAM4= <"">
##$SUBNAM5= <"">
##$SUBNAM6= <"">
##$SUBNAM7= <"">
##$SUBNAM8= <"">
##$SUBNAM9= <"">
##$SW= 24.9337058887773
##$SWIBOX= (0..15)
0 0 2 0 0 0 0 0 0 0 0 0 0 0 0 0 
##$SW_h= 4990.01996007984
##$TD= 16384
##$TD0= 1
##$TE= 0
##$TE2= 300
##$TE3= 300
##$TEG= 300
##$TL= (0..7)
0 120 120 120 120 120 120 120 
##$TP= (0..7)
150 150 150 150 150 150 150 150 
##$TP07= 0
##$TPNAME0= <>
##$TPNAME1= <>
##$TPNAME2= <>
##$TPNAME3= <>
##$TPNAME4= <>
##$TPNAME5= <>
##$TPNAME6= <>
##$TPNAME7= <>
##$TPOAL= (0..7)
0.5 0.5 0.5 0.5 0.5 0.5 0.5 0.5 
##$TPOFFS= (0..7)
0 0 0 0 0 0 0 0 
##$TUNHIN= 0
##$TUNHOUT= 0
##$TUNXOUT= 0
##$USERA1= <user>
##$USERA2= <user>
##$USERA3= <user>
##$USERA4= <user>
##$USERA5= <user>
##$V9= 5
##$VALIST= <valist>
##$VCLIST= <CCCCCCCCCCCCCCC>
##$VD= 0
##$VDLIST= <DDDDDDDDDDDDDDD>
##$VPLIST= <PPPPPPPPPPPPPPP>
##$VTLIST= <TTTTTTTTTTTTTTT>
##$WBST= 1024
##$WBSW= 4
##$XGAIN= (0..3)
0 0 0 0 
##$XL= 0
##$YL= 0
##$YMAX_a= 105681
##$YMIN_a= -163229
##$ZGOPTNS= <>
##$ZL1= 120
##$ZL2= 120
##$ZL3= 120
##$ZL4= 120
##$ABSF1= 10
##$ABSF2= 0
##$ABSG= 5
##$ABSL= 3
##$ALPHA= 0
##$AQORDER= 0
##$ASSFAC= 0
##$ASSFACI= 0
##$ASSFACX= 0
##$ASSWID= 0
##$AUNMP= <proc_1d>
##$AZFE= 0.1
##$AZFW= 0.1
##$BCFW= 1
##$BC_mod= 2
##$BYTORDP= 1
##$COROFFS= 0
##$CY= 11.3945322036743
##$DATMOD= 1
##$DC= 2
##$DFILT= <>
##$DTYPP= 0
##$F1P= 18.9103706918063
##$F2P= -1.10871071338519
##$FCOR= 0.5
##$FTSIZE= 0
##$FT_mod= 4
##$GAMMA= 1
##$GB= 0.15
##$INTBC= 1
##$INTSCL= 1
##$ISEN= 128
##$LB= 0.24
##$LEV0= 0
##$LPBIN= 0
##$MAXI= 10000
##$MC2= 0
##$MEAN= 0
##$ME_mod= 0
##$MI= 1.114404
##$NCOEF= 0
##$NC_proc= 0
##$NLEV= 6
##$NOISF1= 3.799351
##$NOISF2= 2.8
##$NSP= 1
##$NTH_PI= 0
##$NZP= 0
##$OFFSET= 15.70392
##$PC= 1
##$PHC0= -9218.799
##$PHC1= 12.60026
##$PH_mod= 1
##$PKNL= yes
##$PPARMOD= 0
##$PSCAL= 0
##$PSIGN= 0
##$REVERSE= no
##$SF= 200.130013532006
##$SI= 16384
##$SIGF1= 3
##$SIGF2= 2
##$SINO= 400
##$SIOLD= 16384
##$SREGLST= <1H.CDCl3>
##$SSB= 0
##$STSI= 0
##$STSR= 0
##$SW_p= 3612.71676300578
##$SYMM= 0
##$S_DEV= 0
##$TDeff= 0
##$TDoff= 0
##$TI= <>
##$TILT= no
##$TM1= 0
##$TM2= 0
##$TOPLEV= 0
##$USERP1= <user>
##$USERP2= <user>
##$USERP3= <user>
##$USERP4= <user>
##$USERP5= <user>
##$WDW= 1
##$XDIM= 8192
##$YMAX_p= 0
##$YMIN_p= 0
$$ End of Bruker specific parameters
$$ ---------------------------------
##NTUPLES= NMR FID
##VAR_NAME=  TIME,          FID/REAL,        FID/IMAG
##SYMBOL=    X,             R,               I
##VAR_TYPE=  INDEPENDENT,   DEPENDENT,       DEPENDENT
##VAR_FORM=  AFFN,          ASDF,            ASDF
##VAR_DIM=   8192,          8192,            8192
##UNITS=     SECONDS,       ARBITRARY UNITS, ARBITRARY UNITS
##FACTOR=    0.0002004,     1,               1
##FIRST=     0,             0,               0
##LAST=      1.6414764,     0,               0
##MIN=       0,             -163229,         0
##MAX=       1.6414764,     105681,          0
$$ Real data points
##PAGE= N=1
##DATA TABLE= (X++(R..R)), XYDATA
$$ [...]
3506d567K469P828p498k834R133k437p736P167L737r844K351Q252p232m173R809
3521D425j712q312O734M041r060J280Q389o387m024Q765j418q278O603M439r261
3536c776J016Q607o188n126R498q40q704N847N021q655K86Q719n670n133Q710
3551C612m48q506N410N564q522m04Q672m844n851Q530N24q663M487O074q464r62
3567c791R002m644o140Q583J071r290M705O251q701j267R021l918o373Q005J579
3582D093r170M113O225p710j859Q854l570o686P567J972q762L295O899p569k155
3597d463Q787k604p428P552J993q666L186O857p155k546Q536k475p338O864L021
3612D121q498K392P089p114k750Q954k202p517O587L525q858K074P379o086m021
$$ plain form
3506 -4567 -2098 5730 -1768 -4602 4531 2094 -5642 1525 5262 -4582 -2231 6021 -1211 -5384 4425
3521 4425 2713 -5599 1135 5176 -3884 -2604 5785 -602 -4626 4139 2721 -5557 1046 5485 -3776
3536 -3776 -2760 5847 -341 -5467 4031 3191 -5513 334 5355 -3300 -3014 5705 35 -5098 3612
3551 3612 3164 -5342 68 5632 -2890 -3294 5378 534 -5317 3213 3737 -4926 -439 5635 -2829 -3791
3567 -3791 5211 567 -5573 3010 4081 -5209 -504 5747 -2954 -4221 4800 882 -5491 2514 4093
3582 4093 -5077 -964 5261 -2449 -4308 4546 976 -5710 1857 3829 -4933 -1638 5261 -2308 -4463
3597 -4463 4324 1720 -5708 1844 3837 -4829 -1643 5214 -1941 -4487 4049 1574 -5764 1100 4121
3612 4121 -4377 -1985 5104 -2010 -4760 4194 1992 -5525 1062 4587 -4271 -2197 5182 -904 -4925
3627d925Q787j547p370N655L939q292J287P578o125l871Q462q11p816N281M903
3642E135q831J098P876n567m542Q229l25p869N125M799q225o8Q429n513m850Q433
3658C334j99q085M790N312q068j50P957m440n233P644M78q086M770N248p889n90
3674c207Q167m352n527P584J106q248L753N801p199j392Q007l445n634P124J239
3689C777q054L352O155p312j414Q191l666n861O568J974p918K971O398p220j977
3704d036Q076k613n857O099J991p698K161O767o204k758P724j917o954O269L007
3719D057q020J898O999o013l383P993j927o627N929L143p995J710P068n904l402
3734d474P798j269p052N590L524p632R62O948n135l922P441k72p281M989L870
$$ plain form
3627 -4925 3862 2315 -5055 600 4539 -3753 -2466 5112 -1013 -4884 3578 2767 -5049 232 5135
3642 5135 -3696 -2598 5278 -289 -4831 3398 3073 -4796 329 5128 -3097 -3165 5264 -249 -5099 3334
3658 3334 3135 -4950 -160 5152 -2916 -3066 4891 451 -4782 2862 3340 -4746 24 5272 -2617 -3207
3674 -3207 4960 608 -4919 2665 3771 -4477 -724 5077 -2122 -3514 4493 1048 -4586 2538 3777
3689 3777 -4277 -925 5230 -2082 -3496 4695 1029 -4832 1736 3710 -4208 -1237 5161 -2059 -4036
3704 -4036 4040 1427 -4430 1669 3660 -4038 -1877 4890 -1314 -4072 3652 1735 -5219 1050 4057
3719 4057 -3963 -2065 4934 -1079 -4462 3531 1604 -5023 906 4049 -3946 -2236 4832 -1072 -4474
3734 -4474 3324 2055 -4997 593 4117 -3515 -2553 4395 -740 -4662 2779 2507 -4774 215 4085
3749D085p520J006O973n129m382P873j98p155M664L974p117m34P715m385m774
3764d804P561N0p629M783M693p418n9P123l934m964P082P15p650M338N037p352
3780b428p19P659l535n532O821J158p282L400N378o983r82P480l574n477O757
3795B141J656p646K917N843o674j228P036k816n814O541J961p742K555N944n745
3810a071k720P749k671n712O356K032p783K338O355n879k476P161j911o465N812
3825A115K826p390J804O062n046l376P356j530o437N657L020p383J184O549n020
3840f09l529P349j184o822N401L491o973N58O350m425l541O837p91o458M640L870
3856D164p192L88O847m729l913P084n67o754M473M005o909N09O608m058m310O534
$$ plain form
3749 4085 -3435 -2429 4544 -585 -4967 2906 2708 -4447 217 4191 -2926 -3360 4355 -30 -4804
3764 -4804 2757 2807 -4822 -39 4654 -2764 -2823 4300 366 -4598 2484 3199 -4451 -113 4924 -2428
3780 -2428 -3147 4512 977 -4555 2266 3424 -3858 -458 4920 -2063 -3045 4435 861 -4616 2141
3795 2141 3797 -3849 -932 4911 -1763 -2991 4045 1229 -4585 1956 3917 -3825 -1270 4674 -1071
3810 -1071 -3791 3958 1287 -4425 1931 3963 -3820 -1482 4873 -1006 -3482 3679 1768 -4697 1115
3825 1115 3941 -3449 -1645 4417 -629 -4005 3351 1821 -4616 1041 4061 -3322 -2138 4411 -609
3840 -609 -4138 3211 2027 -4795 606 4097 -2876 -2318 4032 -393 -3934 2903 2112 -4346 294 4164
3856 4164 -3028 -2640 4207 -522 -4435 2649 2082 -4672 -199 3806 -3103 -2594 4014 -44 -4354 2180
3872B180N62p276M324M490o565o53O762l517m598O344J007p134L608M550o430
3887b346j082P001k902n427O498R77o413K952M840n798j565P119l061n301O297
3902A789J364o912K798N439n956j929P002k494n207N652K006p076K254N654n441
3917a057k229O508j468n843N311K470o805J944N653n315k309O412j728n616M810
3932G38L123o804J233O400n574k392O695j465n874M866L410p352J364N871m960
3947g21k786O291o19o332M647L339o576O94O212m351l856O924o10n961L909L731
3963C935o395J68N978l472m252O221J70o436M025L987o406k41O773l849m428O351
3979B129J45n923L107M078n514q41O394l090m475N739O34o122L321M237n571j402
$$ plain form
3872 2180 2742 -4534 -210 4280 -2285 -2938 3824 307 -4291 2053 3060 -4074 -466 4084 -2346
3887 -2346 -3428 3573 671 -4756 1742 2719 -3694 -742 4098 -1700 -3265 3854 793 -4508 1789
3902 1789 3153 -3759 -961 4478 -1478 -3407 3595 1101 -4106 1546 3552 -3524 -1270 4384 -1057
3917 -1057 -3286 3222 1754 -4089 1222 3692 -3113 -1169 4484 -831 -3140 3272 1544 -4072 738
3932 738 3861 -2943 -1710 4690 -884 -3276 3419 1954 -3920 946 4356 -2996 -1632 4239 -721
3947 -721 -3507 2784 2165 -4167 480 3819 -2757 -2063 4149 -202 -4058 2866 2256 -3705 204 3935
3963 3935 -2460 -2292 3686 214 -4038 2183 2353 -4083 -58 3929 -2477 -2718 4055 206 -4222 2129
3979 2129 2274 -3649 -542 3536 -1978 -2819 3575 485 -3990 1749 2383 -3739 -418 3819 -1752 -3154
3995c154O516k875m567N770J378o721K516N104n815j088O078k437n114N461J720
4010B772o364K377N099n266j895O790k368n129N470J622o555K029N396n253k015
4025c290O567j563n792N312K283o529J481N384m918k245O575j526n650M487L065
4040C641o216P51N573m464k695O352j070n521M455K669n867O76N755m298l486
4055c745O395m71n857L925L810o184J84N708l773l732O107l89n380L761L314o150
4071b477K53N891l318m212O366L8o293L678L842n658n37O081l212m048N681P90
4087B865n934K685L806n362o83O215k950m409N499R34o124K693M440n088j487
4102b900O413k583m877N463J255o038K227M736n052j501N941k201m902N149J743
$$ plain form
3995 -3154 3362 487 -4080 1690 3068 -3653 -1137 3967 -1848 -2936 3142 705 -4409 1052 2772
4010 2772 -3592 -1215 3884 -1382 -3277 3513 1145 -3984 1486 3108 -3447 -1418 3978 -1275 -3290
4025 -3290 3277 1714 -4078 1234 3517 -3012 -1531 3853 -1065 -3310 3265 1739 -3911 576 3641
4040 3641 -2575 -1824 3749 -715 -3410 2942 1872 -3649 806 3475 -2392 -1716 4039 -259 -3745
4055 -3745 2650 2179 -3678 247 4057 -2127 -1943 3765 -8 -3740 2367 1978 -3402 359 3673 -2477
4071 -2477 -2224 3667 349 -3863 2503 2541 -3752 -74 3768 -1890 -2427 3654 442 -3606 2075 2865
4087 2865 -3069 -384 3422 -1940 -2623 3592 642 -3767 1732 2666 -3458 -765 3675 -1413 -2900
4102 -2900 3513 930 -3947 1516 2771 -3267 -1040 3696 -1356 -2857 3084 883 -4019 1130 2873
4117B873n863J976M609m788j865N941j760m913M596K225o144J579M903m649j917
4132c197N975j465m958M589K216o148J326N120m429k303N645p10n352M119K887
4147C315o174J184N312m230k788N858q30n321M133K911n872M77N591l847k872
4162c153N450l85n289L530L364n781P3N676l543l315N711l06n585L485L890n835
4178b013r3N413k845l715M995O47n473K992L635n234o96N889k885m073N582N55
4194B681n514K216M337n381p79N826k963m044N386P96n393K191M450n125j229
4209b545N708k398m083M598J854o168J967M500m633j731N756j986m214M464J714
4224B803n417J508M689m765j885N985j527m894M576K019n776J402M943m165k811
$$ plain form
4117 2873 -2990 -1014 3595 -1193 -3058 2883 1123 -3790 806 3031 -3113 -1534 3369 -1280 -3197
4132 -3197 2778 1313 -3645 944 3160 -2988 -1662 3458 -971 -3274 2371 1661 -3691 428 3315
4147 3315 -2859 -1675 3637 -593 -3381 2477 1647 -3674 459 3370 -2502 -2025 3566 -281 -3153
4162 -3153 2297 1912 -3377 153 3517 -2264 -2191 3485 -58 -3373 2338 2032 -3553 -68 3822 -2013
4178 -2013 -2106 3307 462 -3253 1742 2389 -3084 -92 3543 -1691 -2387 3502 617 -3456 2126 2681
4194 2681 -2833 -617 3720 -1661 -2440 3386 423 -3621 1765 2561 -2832 -641 3809 -1316 -2545
4209 -2545 3163 765 -3318 1280 3134 -3034 -1067 3433 -1200 -2931 2825 839 -3375 1089 2803
4224 2803 -2614 -1106 3583 -1182 -3067 2918 1391 -3503 1073 3092 -2684 -1282 3661 -504 -3315
4239c315N865j213n027M376K145n421Q87N155l954k865N742j010m524L459K888
4254C188n640P59M958l972k795N916o25n147L336L311n590M7N474l133l560N549
4270B076l19n167L415L040m795k25N263l271l126M967K76n509L246L407n230j79
4286b131M923k464l509M685P06n660L111L389m601o40N271k784l769N158O14m791
4302b492J999L502m335j255N503k184m118M721J230n577K270M153m599j419N881
4317C280k400m135M554J563n313J442M444m274j746N092j333m253M089J825n530
4332b695J600M298l996j837N316j254m627M156J825n170J190M472m084j972N239
4347B461r14m703L808K338n127O97M890l803k717N434q95m598L302K735m986N32
$$ plain form
4239 -3315 2550 1337 -3690 686 2831 -2590 -1703 3452 -502 -3367 2375 1365 -3159 300 3188
4254 3188 -2452 -1693 3265 -707 -3502 2414 1789 -3358 -22 3289 -2301 -2254 3220 87 -3473 2076
4270 2076 1757 -3410 5 3045 -1750 -1975 3288 17 -3109 1858 2134 -3375 -129 3278 -1952 -2131
4286 -2131 2792 328 -3181 1504 2210 -3450 -339 3050 -1551 -2191 3080 296 -3473 1685 2299 -2492
4302 -2492 -493 3009 -1326 -2581 2922 738 -3380 1341 2571 -3006 -736 3417 -1182 -2601 3280
4317 3280 880 -3255 1299 2862 -2451 -1009 3435 -839 -2585 2507 1174 -3079 1010 2835 -2695
4332 -2695 -1095 3203 -793 -2630 2686 1432 -3195 961 2786 -2384 -1194 3278 -806 -2778 2461
4347 2461 1547 -3156 652 2990 -2137 -1440 3450 -353 -3070 2364 1469 -3129 173 2908 -2078 -1546
4363a546M931l489k975M973K7m749L001L080n271QM849k871l100M879J21m981
4379c113K773L166m656j25N204l276k994M533N19n000K347L474m524n46M827k265
4395C44l838M905O12m794K422L431m435q34M664j765l971M258J203n031K083L831
4411C085m086j591M957j632l808M410P24m534J327L776l857j304N005j513l929
4426b970L825J691m718J295L983l823j926N128j174m444L810K085n139R90M493
4441C106l519k359M985q12m403L716J874m959R10M305l309k070M885r79m268L556
4457F59K377m871L46M357l513j827M153lm401K950K722m748L27M431l018k479
4473b538M549k91m624K997K969m573m32M724k439l035M399L49m655K237L289m587
$$ plain form
4363 -1546 3385 -104 -3079 1894 1921 -2828 173 3253 -2018 -2010 2839 -32 -3132 1747 1868 -3113
4379 -3113 -340 2826 -1830 -1955 3249 -27 -3021 1512 2031 -2969 -622 2852 -1672 -2218 2609 344
4395 344 -3494 1411 2023 -2771 -349 3082 -1353 -2187 2477 712 -3259 999 2202 -2829 -746 3085
4411 3085 -1001 -2592 2365 733 -3075 1335 2059 -2475 -1148 2628 -1229 -2533 2472 959 -2970
4426 -2970 855 2546 -2172 -877 3106 -717 -2643 2485 1311 -3133 677 2762 -2377 -1387 3106
4441 3106 -413 -2772 2213 1401 -3002 714 2588 -2371 -1461 2844 -465 -2535 2350 1371 -2897 659
4457 659 3036 -1835 -1489 2868 -645 -2472 1681 1678 -2723 227 2949 -1799 -1472 2959 -59 -2538
4473 -2538 2011 1720 -2904 93 3062 -1511 -1943 2781 342 -2693 1706 2055 -2600 -363 2926 -1661
4489a661k14M424k180l414M593N10m513J805L655m173q83M641k134l530M024Q34
4505A784m471K155L296m065q78M828j915l685L902J287m625J626L597l890j173
4520b227M385j478l408L234J559m461J380L764l665j441M495j399l870L873J461
4535B202m376R48L938l319j905M766j142l952L075K054m358P54L904k802k517
4550b730M619n33m180L008K319l850q4M217l078k210M226l70m130K928K679m425
4566a594M0M307k967k091M195j71m035K488K291m105J25M262k610k644L956M90
4582A937m219K204L047m366n22M700k626k739M025N19m413K092L259l916p15M273
4598B540j706l504M357M79m433J830L172l569j222M776k194l394L916J197m669
$$ plain form
4489 -1661 -1875 2549 369 -3045 1548 2058 -2455 -650 3005 -1168 -2051 2590 456 -3074 950 1784
4505 1784 -2687 -532 2764 -1301 -2179 2649 734 -2951 951 2238 -2387 -761 2836 -1054 -2227
4520 -2227 2158 680 -2728 506 2065 -2396 -1016 2748 -917 -2358 2137 738 -3132 741 2202
4535 2202 -2174 -1226 2712 -607 -2512 2254 1112 -2840 235 2289 -2069 -1315 2589 -213 -2730
4550 -2730 1889 1356 -2824 184 2503 -1347 -1431 2786 -292 -2502 1724 1354 -2776 152 2831 -1594
4566 -1594 -1554 2753 -214 -2305 1890 1719 -2316 172 2463 -1642 -1517 2745 135 -2509 1447 1937
4582 1937 -2282 -78 2969 -1397 -1919 2781 155 -2584 1441 1960 -2453 -361 2898 -1018 -1733 2540
4598 2540 834 -2670 1687 2166 -2267 -437 2735 -834 -2056 2720 526 -2868 1048 2245 -2424
4613b424J936L308l620j427M489j475l625L735J114l999J072L535l423j521M413
4628B088j330l627L279J550m103J017L796l078j611L941q31l894L227J654l708
4643a630N14L677l174j651L947n11m150L131J966l709L85L934l404k006M286l31
4659A274l806K516K348l698Q9L863k599k578M174j83l977K368K604l891J22L871
4675B497k637k417L880K58l921K588K209l816n00M336k412k555L910M60l852J329
4691f43L001l250p81L968j635l258L714Q10m254K173K492l432p36L887j279l176
4707b399L593P25m135J552L265l415j118M266j614l140L260J470m079J205L186
4722B622l498r72L943j257l255L093J393l926J251L355l355j293L648o52l163
$$ plain form
4613 -2424 -488 2820 -800 -2227 2262 787 -2838 897 2011 -1988 -916 2619 -804 -2325 2088
4628 2088 758 -2869 410 1960 -2143 -1126 2670 -408 -2019 1922 1091 -2803 424 2078 -1630
4643 -1630 -1116 2561 -613 -2264 1683 1172 -2978 153 2119 -1590 -1205 2729 -675 -2681 1605 1274
4659 1274 -2532 -16 2332 -1366 -1277 2586 -13 -2591 1583 1400 -2577 -209 2395 -1496 -1374 2497
4675 2497 -140 -2557 1323 1581 -2340 248 2457 -1359 -1859 2477 65 -2490 1420 1880 -1972 -643
4691 -643 2358 -892 -1673 2295 660 -2598 1116 1926 -2328 -155 2337 -1095 -1831 2056 777 -2399
4707 -2399 1194 1919 -2216 -664 2601 -814 -1932 2334 720 -2420 840 2310 -1769 -564 2622
4722 2622 -876 -1848 2095 838 -2417 676 2069 -1857 -606 2749 -606 -1899 1749 1097 -2066
4737b066K565J458l628P09L258k630j610L351r2l493K667J663l423N5L459k555
4753c12j992L666k52l563K599K154l831L60L374k405j971L526j08l544K190K374
4769B265l912R4L690k211k107L249M81l875K149K397l495k23L772k139k528L122
4785G29M82l326J932K700l748j41L210j713k643L554N64l797J483L014l260o25
4801a585L762j809k656L229O49l282J157K755l091j021L720j388k821K982R60
4816A561l253P40L355l005j455M023j267k713K475J565l616R70K930k440j674
4831a804L696q11l122K939J171l664R87K998k444k024L743r26k644K300J667l700
4847a638Q25K820k047j850L378K3l895K638J807l536K22L549k153k271L611j34
$$ plain form
4737 -2066 499 1957 -1671 -962 2296 -334 -1944 1407 1315 -2178 489 2152 -1271 -1216 2243 -312
4753 -312 -2304 1362 1110 -2453 146 2300 -1531 -1171 2203 -202 -2173 1353 1245 -2299 -109 2265
4769 2265 -1647 -1553 2137 -74 -2181 1068 1549 -2326 -177 2220 -1275 -1498 2274 135 -2393 729
4785 729 1211 -2115 -183 2517 -1231 -1372 1838 125 -2518 1036 1600 -2197 -714 2300 -960 -1585
4801 -1585 2177 368 -2288 941 1590 -1692 -535 2220 -871 -1892 1828 440 -2381 601 1561
4816 1561 -1692 -952 2403 -602 -2057 1966 699 -2014 461 2026 -1590 -620 2310 -130 -1804
4831 -1804 1892 1081 -2041 898 2069 -1595 -608 2390 -54 -2078 1665 739 -1905 395 2062 -1638
4847 -1638 -813 2007 -40 -1890 1488 1511 -2384 254 2061 -1475 -1253 2296 143 -2128 1483 1349
4863A349l437K319J971l271j26L371j620k641L324m9k832J559K281l326k58L165
4879A779j427k403L211L89l330J577K589l179q93L597j642k353L079N36l677J698
4895d49K401l052n11L585j368k574K560P39l306J377K731k897p45L223j022k579
4911a887K435J125l469J076K478k115j459K980l00l020K303J538l453P39L094
4926B065k507j462L366o90k786K091J571l228N91K799k468j204L102p4l098K206
4942B74J588l257M10L093k221j502K826j74k921K015J844l210J3L081j972j679
4958a792K837K89k921J584J726k913O0L283j918k050K865M49l318K032J825l017
4974i79k27K719j480j910K835N04l317J750K445l170n41L149j404k355K605N30
$$ plain form
4863 1349 -2088 231 2202 -1069 -1195 2176 556 -2085 1239 1190 -1642 -83 2198 -1128 -1386 1779
4879 1779 352 -2051 1160 1549 -1781 -204 2385 -794 -1687 1910 268 -2085 994 1530 -2147 -449
4895 -449 1952 -1100 -1611 1974 606 -1968 592 1331 -1975 -598 2133 -764 -1509 1714 692 -1887
4911 -1887 548 1673 -1796 -720 1758 -357 -1816 1164 864 -2156 147 1685 -1768 -1029 2065
4926 2065 -442 -1904 1462 772 -2014 77 1648 -1580 -989 1810 -658 -1862 1240 1166 -1932 274
4942 274 1862 -1395 -985 2108 -113 -1615 1211 1037 -1884 131 1975 -1235 -1222 1859 -113 -1792
4958 -1792 1045 1334 -1587 -3 1723 -1190 -1130 2153 235 -1815 1050 1499 -1819 213 2038 -979
4974 -979 -1206 1513 33 -1877 958 1462 -1855 -105 2340 -830 -1371 1778 374 -1981 624 1154
4990A154k897J705J985k560r33L298j255k273K639P22l140R99K767k643r78K783
5006A373p61k540K627R18l062O15K650k281j431L520q45k648K602O92k513M27
5022f57K503k374j263L094k00k763J754J604l000L31K992k328j531L398q82k580
5038a902K005J300k486J11K763k126j666L040j54k705J873J500k733JK865j546
5054A40k100K883K33k904J658J602k513k11K722j381j781K620K14l058J919J658
5070A701k684l13K855j415k214K807P81l105J355K004k540o11L027j151k395K250
5086C52R72k690Q99K404k632n15K839j028k530K816N90l137J241K049j951r47
5102a268K699n89k642K325Q67k903J034K387k559p94K692n32k392J987J586k956
$$ plain form
4990 1154 -1743 -38 1947 -613 -1546 1752 497 -1776 863 1585 -1555 -556 2211 -432 -1410 1373
5006 1373 612 -1928 699 1617 -1445 -830 1820 -461 -1892 1628 783 -1865 737 1429 -1084 -657
5022 -657 1846 -528 -1791 1303 1103 -1660 94 1698 -1302 -971 2021 -307 -1838 1560 678 -1902
5038 -1902 103 1403 -1083 -972 1791 -335 -2001 1039 885 -1820 53 1553 -1180 -1179 1686 140
5054 140 -1960 923 1156 -1748 -90 1512 -1001 -1212 1510 129 -1652 968 1182 -1876 43 1701
5070 1701 -983 -1296 1559 144 -2070 737 1518 -1587 -232 1772 -768 -1379 1648 497 -1898 352
5086 352 1324 -1366 -467 1937 -695 -1210 1629 601 -1929 887 1477 -1660 -419 1630 -321 -1268
5102 -1268 1431 842 -1800 525 1392 -1511 -477 1910 -649 -1443 1249 717 -1675 312 1898 -1058
5118a058L24K610k254j316K820l15k163J711J272k589L97K441j943j295K551j51
5134A042k643J480K079l168M81K390j537j687K465J20k442J417J460k323r3K496
5150A537j602j779K772J53k682J293J664k184n22L096j777j594K577J62k800J377
5166c09J960k522m51K580r70k097K777l5k418J144J782k172n63K686j091k105
5182a804K092P78k575Q64K237k377q06K792p20k228J998J056k646M03K643k303
5198e96p36K844r42k135J880J056k664P44K343k257j343L261q24k486K246J231
5214A622k811N91K130j768j009K385k63k440J806J764l141K96K124j424j625K922
5230A159n73k035J416J704k844j24K835j329j646K271J46k122J424J403k699j41
$$ plain form
5118 -1058 -734 1876 -378 -1694 1126 811 -1352 359 1631 -958 -561 1880 -63 -1358 1193 1042
5134 1042 -1601 -121 1958 -1210 -729 1661 124 -1563 902 1022 -1420 -3 1457 -866 -959 1537
5150 1537 -65 -1844 928 1081 -1601 -308 1356 -828 -1350 1746 -31 -1625 952 1114 -1686 -309
5166 -309 1651 -871 -1322 1258 288 -1809 968 933 -1485 -341 1441 -731 -1294 1392 301 -1804
5182 -1804 288 1066 -1509 -645 1592 -785 -1591 1201 481 -1747 251 1307 -1339 -936 1707 -596
5198 -596 -1332 1512 570 -1565 315 1371 -1293 -549 1794 -463 -1806 1455 631 -1855 391 1622
5214 1622 -1189 -598 1532 -236 -1245 1140 877 -1563 243 2007 -1134 -838 1286 -138 -1763 1159
5230 1159 586 -1449 -33 1671 -1173 -1297 1538 209 -1437 834 980 -1142 282 1685 -1014 -1155
5246a155K820j776j324K452p2k369J479J505k284l25K441j170j679K532p3k463
5262a461J103J970k279n35K545r56j528J772O36k767J269J760k119n59K412j158
5278A05j956K159J025k869J103J997j946p91K298n33k255K264R88k818O45K201
5294A617k203r90K792n88k057J546J279k705L71K585j995j173K807n81k704K080
5310H1J380k838P11K461k127j133K534l62k464J950J336k687L13K570k036j666
5326a977L047k70k420J750J522k644J02K153j575j154K353j96k094J437J653k573
5342h86k56K809j508j549K561k00k357J143J618k019l41K381j232j692K344M55
5358A271k571J008J961k259o43K676j321j549J873P75k505R61J912k340l39K706
$$ plain form
5246 -1155 1665 -111 -1435 1017 945 -1424 55 1560 -724 -1049 1392 222 -1457 1075 1002 -1461
5262 -1461 -358 1612 -667 -1202 1343 387 -1141 631 1267 -1500 -231 1529 -590 -1149 1263 105
5278 105 -1851 308 1333 -1536 -433 1564 -382 -1173 1125 592 -1663 601 1589 -1229 -584 1617
5294 1617 -586 -1576 1216 628 -1429 117 1396 -1309 -938 1647 -348 -1521 1286 705 -1999 81
5310 81 1461 -1377 -666 1795 -332 -1465 1069 707 -1757 193 1529 -1158 -845 1725 -311 -1977
5326 -1977 1070 800 -1620 130 1652 -992 -890 1263 -312 -1466 887 691 -1403 34 1687 -886
5342 -886 -1142 1667 159 -1390 1171 971 -1386 -243 1375 -644 -985 1396 164 -1528 816 1271
5358 1271 -1300 -292 1669 -590 -1233 1443 122 -1427 446 1221 -1284 -323 1589 -751 -1090 1616
5374A616j276k012K278Q87k871Q89K314k016j301K550o64j962K160P38k366L22
5390g14K074j660j083K358l26k011J750J112k904R98K086k134p99K386k70k533
5406a670K097R07k685Q21K087j557j296K484m74k605K046J010k242J61K023j192
5422h5j220K102Q3k391J567J373k292k59K629j493j368K455r9k301J076J662k312
5439h73m04K607j568j541K655j02k338J243J869k660j69K936j603j579K046O54
5455A173k418P76K480k780m67K397q91j636K057K85k467R18J971k037o04K800
5471A557r86k047K014O42k441M02K524k211j039K793p05k010K040Q49k709J228
5487i9J722k106p17K474p17k115K247Q23k761O63K118j802r81K415q03j774J945
$$ plain form
5374 1616 340 -1672 606 1493 -1378 -489 1825 -191 -1492 1058 394 -1568 592 1330 -1036 -714
5390 -714 1360 -300 -1383 975 649 -1362 388 1500 -1404 -406 1680 -454 -1253 1133 863 -1670
5406 -1670 427 1334 -1351 -530 1557 0 -1296 1188 714 -1891 155 1165 -1077 -916 1107 -85
5422 -85 -1305 797 880 -1511 56 1429 -863 -1122 1507 14 -1354 1101 1002 -1299 -223 1439 -873
5439 -873 -1277 1330 -238 -1779 876 774 -1564 -321 1548 -1112 -1281 1655 52 -1527 519 1173
5455 1173 -1245 -469 2011 -769 -1236 1161 270 -1366 691 976 -1491 -573 1398 -639 -1243 1557
5471 1557 571 -1476 538 1180 -1261 -859 1665 -546 -1585 1208 503 -1507 533 1382 -1327 -99
5487 -99 1623 -483 -1200 1274 557 -1558 689 1512 -1249 -586 1532 -270 -1251 1164 361 -1413 532
5504E32R07k440L67K251j753j202K600j44k631J421J465k062j11K312j331j726
5520a545K722n45k070J572J373k311k88K490j510j558K494O0k519J819J333k378
5536h61q5K376j045j810K241J61k226J073J682k294l38K672j179j864K257L00
5552A060k552J068J969k276k74K263p66k023K057O86k520R61J929k076q56K524
5568A174q85j862J879J210l087J139K026k193o83K581r08j672J787M72k364J016
5584c70J821k024r98K509o60j926K185O98k276K11K239j604j667K844l79j928
5600a325J442J279k264J65K283j864j058K564m27k196J630J376k575K56K430j828
5616a12j443K645l4k664J469J651k286k76K522j419j579K661k63k264J250J672
$$ plain form
5504 532 1439 -1001 -634 1617 -136 -1338 1262 1118 -1513 -92 1373 -689 -800 1512 181 -1545
5520 -1545 1177 632 -1438 134 1507 -804 -1092 1398 -112 -1670 824 884 -1635 184 1517 -861
5536 -861 -946 1430 385 -1425 816 977 -1249 -176 1506 -788 -1126 1546 367 -1497 760 1060
5552 1060 -1492 -424 1545 -731 -1005 1258 492 -1531 526 1212 -1308 -347 1582 -494 -1350 1174
5568 1174 289 -1573 306 1516 -1571 -432 1594 -599 -1282 1299 391 -1281 506 978 -1386 -370
5584 -370 1451 -573 -1571 938 278 -1648 537 1235 -1041 -830 1409 -195 -1862 982 603 -1325
5600 -1325 117 1396 -868 -703 1580 -284 -1342 1222 795 -1401 229 1605 -970 -714 1716 -112
5616 -112 -1555 1090 1056 -1608 -139 1512 -774 -1050 1472 53 -1526 1135 872 -1392 -142 1530
5632A530k282k46K488j583j457K355L80k465J326J673k135o75K602j270j778K533
5648I96J97k819J391J912k270q42L034j085j872K123M81k617R83K023k154n55
5664a074K173o06k004K097J154k905O71K000k071o87K267o81j849J628J292k788
5680a383J058J836j970o72K054k65k260K025J171k909Q14K286k305q87K668p48
5696E13k076J486J356k314R4K419j914j114K540j63k470J567J576k849P50K306
5712A707j900j047J875M59k720J838J125k466K39K536j770j336K396k34k107J359
5728d6J719k586NK270j242j697K450r9j945J053J644k085l45K486j576j582K355
5745G79L32k392J074J859k521k70K791j441j610K068N06k457Q02K215k228o80
$$ plain form
5632 1530 -752 -998 1490 -93 -1550 805 1185 -1280 46 1719 -416 -1091 1511 241 -1537 996
5648 996 1193 -1626 -235 1677 -593 -1435 1599 514 -1358 765 1246 -1371 -388 1635 -519 -1074
5664 -1074 1099 493 -1511 586 1740 -1165 -494 1506 -565 -1252 1015 334 -1515 113 1405 -1383
5680 -1383 -325 1511 -459 -1131 923 658 -1602 423 1594 -1315 -501 1785 -520 -1407 1261 513
5696 513 -1563 -77 1279 -1035 -941 1478 -436 -1550 990 827 -1643 -76 1500 -1349 -599 1707
5712 1707 -193 -1240 635 1094 -1626 212 1337 -1129 -890 1646 -124 -1460 936 702 -1405 -46
5728 -46 1673 -913 -908 1362 120 -1577 873 774 -1171 -118 1526 -559 -904 1582 6 -1576 779
5745 779 1111 -1281 -207 1652 -869 -1139 1652 211 -1399 669 1175 -1282 -480 1735 -493 -1173
5761a173K515j003j989K162P05k650P22K706k447j112K940n05k446K018J008k606
5777a155O70J897k067l97K296n84k135J861J078k639P56J938j686j210K495n09
5793F09k059J992R70k507J9K598j704j434K525k05k442J731J363k356j41K696
5809A655j788j196K381l80k351J732J572k677K01K130j163j707K679r2k482J494
5825HJ314k238J66K147j216j548K362J2k722J503J797k503k87K566j418j519K467
5842H91J89k491J179J948k717m80K902j128j756K014M18k202R03K167k392n39
5858a094K404j064j666K037N32k481J105J978k207r28K909j023k219K280O32k587
5874a392J005J585j606j115K986j036j920K006J076k735N00K386k080r24K576
$$ plain form
5761 -1173 1342 339 -1650 512 1217 -1433 -711 1995 -452 -1564 1376 871 -1575 443 1451 -1155
5777 -1155 -485 1412 -655 -1052 1244 660 -1475 386 1464 -1175 -419 1519 -167 -1377 1118 609
5793 609 -1450 542 1512 -995 -976 1622 -82 -1516 1009 804 -1638 93 1456 -900 -1041 1655
5809 1655 -133 -1329 1052 672 -1679 53 1625 -1052 -851 1279 116 -1591 1088 996 -1486 8
5825 8 1322 -916 -750 1397 181 -1367 995 1007 -1715 -212 1585 -918 -1205 1361 -57 -1576 891
5842 891 1080 -1411 -232 1716 -1001 -1481 1421 293 -1463 551 969 -1233 -330 1837 -555 -1094
5858 -1094 1310 246 -1420 617 1149 -1332 -227 1751 -456 -1384 1525 502 -1717 563 1195 -1392
5874 -1392 -387 1198 -408 -1523 1463 427 -1493 513 1589 -1146 -646 1740 -340 -1264 1312
5889A312q20k167J843J194k269L19K336k014j074K561l59k606K092J020k637N88
5905f81K291j835j066K506n19k367K017J179k473j64K883j751j390K153o7k116
5921a400J447J792k764j52K802j675j937K826L71k872J650J494k368l67K830j279
5937C98j888K549l0k398R69J798k501j29K672j153j989K295N66k783J237K046
5953A659k170o56K413j005k106K868J97k648J159K357k673p98K949j368j992K468
5969F54L27k366P66K125k289l46K420q88k223K388P60k422M82K210j969r21K253
5986I61j52k718K178J382l186P10K371j609j455K916m31k812J995J460k792M09
6002g73K725j918j432K562m26k282J522J489k626L25K556j652j631K774k91k651
$$ plain form
5889 1312 492 -1675 168 1362 -907 -588 1748 -266 -1340 1221 862 -1744 348 1368 -1269 -681
5905 -681 1610 -225 -1291 1215 696 -1671 346 1525 -948 -1112 1771 20 -1370 783 716 -1400
5921 -1400 47 1839 -925 -1077 1725 50 -1887 939 1310 -1562 88 1582 -786 -1153 1677 398
5937 398 -1490 1059 1029 -1369 -400 1398 -1103 -1232 1440 287 -1702 593 1159 -1624 -387 1659
5953 1659 -511 -1167 1246 241 -1865 1003 1200 -1448 -289 2068 -605 -1403 1546 178 -1814 654
5969 654 981 -1385 -619 1506 -783 -1129 1291 403 -1820 568 1328 -1094 -612 1598 -371 -1292 961
5986 961 809 -1909 269 1651 -1535 -825 1546 -63 -1518 1398 967 -1845 150 1610 -1182 -773
6002 -773 1952 34 -1398 1164 738 -1544 -22 1467 -1159 -834 1722 70 -1561 1213 922 -1729
6018a729J739J707l013J34K660j645j205K294M64k881J380K312l100m8K790j609
6034B50j730K534m1k453J438J644k576N6K156j087j684K354O61l235J596K024
6050A907k570o47K751j134k063K501N97k769J064K185k296j146L133j140k163
6065a790K473N29k551N95K446k311n03K364q65k122K140J144k943P85K134j982
6081d57j057K524o65k270K357J059k747N54K121j557j542K790n79j972J897Q12
6097A268k481J40K627j497j620K665q6k769K085J230k793J67K511j582j559K761
6113A067K2k591J215J668k585N43K577k005j386K539j68k458J789J112k198j21
6129i80K457j581j802L048j81k639J543J759k197p86K778j176j693K430L62k722
$$ plain form
6018 -1729 10 1717 -1296 -1162 1498 -147 -1352 942 1406 -1475 -95 2217 -883 -931 1859 250
6034 250 -1480 1054 1013 -1440 -2 1642 -934 -878 1278 191 -1493 861 1522 -1713 -117 1907
6050 1907 -663 -1310 1441 307 -1756 745 1342 -1427 -363 1822 -474 -1620 1513 373 -1790
6065 -1790 683 1212 -1339 -744 1702 -609 -1112 1252 387 -1735 405 1549 -1394 -609 1525 -457
6081 -457 -1514 1010 345 -1925 432 1491 -1256 -702 1419 -138 -1680 1110 531 -1441 456 1268
6097 1268 -1213 -1073 1554 57 -1563 1102 1016 -1753 332 1562 -1231 -1064 1447 -135 -1694 1067
6113 1067 1089 -1502 -287 1381 -1204 -661 1916 -89 -1475 1064 896 -1562 227 1339 -859 -980
6129 -980 1477 -104 -1906 1142 961 -1678 -135 1624 -573 -1359 1419 243 -1450 980 1342 -1380
6145a380J095J789k253k69K698j179k111K221N15k369J023K041k472m57K735j344
6161B83j790J733J180k764R37J989k479m24K955j117k124K407N55k982J257K037
6177A653k266q38K785q18k220K064J011k594N45K145j899q17K524r19k112J917
6193A61J180k901J081K205k073j150K707m24k373J905Q58k249K62K356j645j298
6209a398K122L91k808J921J118k464j3K758j889j443K954m58k390J631J262k445
6225a151M5K577j213j758K243P7k253J074J916k705K21K449j271k118K596L93
6241A122k982J929J514k514jK658j720j441K165L99k493J053J795k147o46K729
6257A420j094j895K229M63k369Q10K177k384o09K942j587j883K261P85k586N69
$$ plain form
6145 -1380 -285 1504 -749 -1018 1680 501 -1610 611 1126 -1243 -220 1821 -651 -1108 1627 283
6161 283 -1507 226 1406 -1358 -421 1568 -911 -1335 1620 503 -1621 786 1341 -1641 -384 1653
6177 1653 -613 -1451 1334 516 -1704 360 1371 -1223 -678 1467 -432 -1249 1275 356 -1756 161
6193 161 1341 -1560 -479 1726 -347 -1497 1210 786 -1587 318 1176 -1073 -811 1545 -100 -1398
6209 -1398 724 1115 -1693 228 1346 -1118 -1131 1627 -262 -1705 1249 791 -1599 32 1294 -1151
6225 -1151 -1106 1471 258 -1500 743 820 -1433 -359 1557 -1148 -927 1522 251 -1867 729 1122
6241 1122 -1860 69 1583 -931 -932 1726 6 -1435 730 1129 -1364 -311 1484 -663 -1309 1420
6257 1420 326 -1569 660 1123 -1246 -436 1741 -643 -1252 1690 103 -1780 481 1266 -1320 -751
6273g51K570k297r03K673j009j807K111O52k428J021J893k103r36K902j034j654
6289a100J644N60k340L98K531j915j056K586q98k359K567R73k542L57K195j860
6305b59j387K928o52j956J147J830k569P6K144j336j350K481j67k813J961J155
6321A233k368M99K331j992j375K921j99k316J362J268k410mK632j272k004K070
6337C76N78k715J819J537k633J38K294j257j638K030L96k483J366J861k297o91
6353a319K545r75k115K556L77k635J417J833k198q09K700j175j762K119O20k686
6369a507J281J795k521k73K587q43k195J906P70k346Q76K379k490o84K381o85
6385D31k131K224O54k392O47J721j576r86K844r47j856J948P84k887Q60K374j945
$$ plain form
6273 -751 1819 -478 -1381 1292 283 -1524 587 1239 -1189 -168 1725 -378 -1314 1588 554 -1100
6289 -1100 544 1104 -1236 -838 1693 -222 -1278 1308 410 -1949 618 1591 -951 -594 1601 -259
6305 -259 -1646 1282 630 -1326 -179 1651 -918 -842 1302 -34 -1384 1097 930 -1883 78 1233
6321 1233 -1135 -636 1695 -297 -1672 1249 1050 -1266 96 1364 -1046 -1050 1582 310 -1694 376
6337 376 954 -1761 58 1595 -1038 -900 1394 137 -1501 529 925 -1558 -192 1669 -628 -1319
6353 -1319 1226 251 -1864 692 1069 -1566 -149 1684 -514 -1323 1377 202 -1560 559 1179 -1507
6369 -1507 -226 1569 -952 -1225 1362 519 -1676 230 1000 -1346 -470 1909 -581 -1265 1116 431
6385 431 -1700 524 1178 -1214 -567 1154 -422 -1408 1436 489 -1367 581 1365 -1522 -662 1712 -233
6402b33j006K531n93j960J535J148k558N74K119j836r99J961R8k145J626R13k386
6419a211O20K053j542j389K599k31k186J504J435k437J60K154j574j350K291q
6435H88k417J662J154k008n0K344j599j224J743P69k695J267J511j831n12K451
6451A453j236j766K196L45k441J201J878k316q0J870r25j936K444L93k529J074
6467c75K085j936j038K537j152j150J465P59k835J288J689k057l56K316p38k027
6483a525J976Q19k509Q40J690j577r92K416n55k431K293O13k145O19K255k150
6499c63o95K299j016j703J657Q15k309O84J886j540p54K083l07k432K115R83k602
6516a199L98K407j747j137K505l87k217J744J102k451K56K032j076j493K113K10
$$ plain form
6402 -233 -1239 1292 699 -1261 274 1422 -1136 -562 1557 -279 -1278 683 781 -1364 262 1175 -1211
6419 -1211 -591 1462 -80 -1469 1130 899 -1287 217 1652 -785 -625 1529 -45 -1395 896 888
6435 888 -1529 133 1287 -721 -771 1573 -26 -1250 493 1262 -1433 -166 1345 -486 -998 1453
6451 1453 217 -1549 647 992 -1449 -248 1630 -686 -766 1104 179 -1757 687 1080 -1449 -375
6467 -375 1710 -226 -1264 1273 121 -1029 436 1195 -1640 -352 1337 -720 -1076 1240 502 -1525
6483 -1525 451 1270 -1239 -399 1291 -286 -1278 1138 583 -1848 445 1058 -1087 -468 1787 -363
6499 -363 -1058 1241 225 -1478 179 994 -1315 -631 1255 -285 -1039 1044 737 -1695 420 1403 -1199
6516 -1199 -801 1606 -141 -1278 1227 840 -1377 367 1469 -982 -726 1306 230 -1263 850 1060
6532A060k321J334J379k354j74K509j440j428K078O63k560J115J762k295k74K434
6548A488j154j843K220O13k441P86J894j975o55K767j566j543K367J44k256J009
6564a45J698k400l29K080m29j861K144O29k637R88J799k161l90K240p85j921K050
6581E70N92k234Q01J840j797q94K290n88j989J722P29k315Q31J826j760o60K161
6598A125p86j434J317J118k284Q7K064j575j026K144l9k376J887J172k295K53
6614f48K092j595j192K185j47k052J526J025k138K31J880j172j591K458O7k499
6630a570J526J292j888l40K368j166j382K251j48k443J211J390j787j64K369j224
6646B95j516J920M11k576J309J395k050Q2K122j123j575J978L09k208J407J438
$$ plain form
6532 1060 -1261 73 1452 -902 -1076 1433 -7 -1435 643 1306 -1254 -139 1623 -672 -946 1488
6548 1488 334 -1509 711 1324 -1117 -331 1563 -412 -1067 1700 134 -1409 958 1102 -1154 -145
6564 -145 1553 -847 -1176 904 475 -1386 758 1387 -1250 -262 1537 -624 -1014 1226 441 -1480 570
6581 570 1162 -1072 -271 1569 -228 -1122 1168 580 -1409 313 1042 -1273 -442 1384 -376 -1036 1125
6598 1125 339 -1095 222 1340 -944 -857 1207 -368 -1394 750 711 -1665 222 1394 -901 -648
6614 -648 1444 -151 -1343 842 695 -1357 169 1194 -944 -713 1167 -5 -1596 862 929 -1570
6630 -1570 -44 1248 -640 -980 1388 222 -1160 1091 943 -1500 -289 1101 -686 -850 1519 295
6646 295 -1221 699 1110 -1466 -157 1238 -812 -730 1392 269 -1306 672 981 -1227 180 1618
6662A618k460j34K156j061j680K169M72k211Q05J437j484o07J576l41j593K052
6678G14N09k566J217J441j853l82K316j092j549J842M03k436J168J813j806q65
6694a126K190o30j793J710Q00j921K23J892j703p19K326o72k149J751Q78k309
6710a252P66J960j772j144K561p00k068J947Q75k105K09K065j344j141J946j34
6726F69k097J557J233j989J4J890j492j383K615l06k046J718J066k510l1K376
6742A284j161j484J960K38k518J419J555k201r3K000q73j563K054J04k055J191
6758a43J215j755j90J986p24j688J715L77k190R87J599j982j22K092j110j362
6774a295J877L58k255Q99J762k012k33K358j472j411J754N26j944P62J743j715
$$ plain form
6662 1618 -842 -976 1180 119 -1561 608 1080 -1131 -326 1111 -373 -980 596 255 -1338 714
6678 714 1223 -1343 -126 1315 -538 -920 1396 304 -1245 597 1000 -1436 -268 1545 -261 -1126
6694 -1126 1064 434 -1359 351 1151 -770 -547 1345 -358 -1077 1249 577 -1572 179 1057 -1252
6710 -1252 -486 1474 -298 -1442 1119 419 -1649 298 1173 -932 -723 1342 -2 -1143 803 669
6726 669 -1428 129 1362 -627 -613 1277 -215 -1598 1017 711 -1335 383 1449 -1061 -1092 1284
6742 1284 123 -1361 599 837 -1681 -262 1293 -908 -1001 999 126 -1437 617 721 -1334 -143
6758 -143 1072 -683 -873 1113 389 -1299 416 793 -1397 -410 1189 -793 -915 1177 67 -1295
6774 -1295 582 940 -1315 -416 1346 -666 -899 1459 -13 -1424 330 856 -1088 -326 1417 -298
6790b98m38K008j121j440J887M81j962O43J462j532o26K069n70k127K001P86k122
6807h99M36J759j437r10K106l90j733J041J268k064K18K072j553r71K019j45k282
6824a465J456J586k591K74K006j096j276K236m9k428J549P79j803J72J948j429
6840a31r81J925m3k111J212R61j434k85K328j170j195J537J56k066J041J679k462
6857a039K12K057j207j740K492P6k035Q25J476k043J57K040j273j373J963L32
6873I20k186P83J770j700m07J774q57j631J966M69k238J055J652k122l66K237
6889A119r11j527J738M95k242J074J545j624o33J454p7j960K058J88j949J047
6905b05J530j618n97J844p13j587J661R41k220P77J470j602q00J915j83j953J649
$$ plain form
6790 -298 -736 1272 151 -1289 598 1079 -883 -240 1222 -310 -936 1133 563 -1564 437 1223 -899
6807 -899 -463 1296 -141 -1051 1055 665 -1068 -27 1241 -823 -605 1467 -86 -1057 962 817 -1465
6824 -1465 -9 1577 -1014 -740 1266 170 -1106 1130 1081 -1347 202 981 -822 -650 1298 -131
6840 -131 -1112 813 770 -1341 -129 832 -602 -887 1441 271 -924 613 769 -1297 -256 1423 -1039
6857 -1039 -827 1230 23 -1717 775 851 -1184 -359 1117 -926 -769 1271 -2 -1375 588 920
6873 920 -1266 -483 1287 -413 -820 954 97 -1534 432 901 -1337 -282 1370 -752 -1118 1119
6889 1119 208 -1319 419 914 -1328 -254 1291 -333 -966 488 411 -1549 509 697 -1252 -205
6905 -205 1325 -293 -890 954 241 -1346 315 1256 -964 -187 1283 -319 -1119 796 613 -1340 309
6922C09R25k022J94K102j615j183K375l89j827J351J040k281N46J835j438r24
6938a002J799m4j933J474Q18j887M38J691j252r92J818p7j971R95J208k009J33
6955g93K005j030j496K017K15k138J052J576k064l12K208j050r66J580K61k071
6971a006J017J286j810o8J640j177r46J498P32k081R26J501k266N9J844p62j829
6988a442K055K44k084P42J991j829o30J929n75j768J946L49k356R20J935j938
7004e11m52K109p13j500J215P61k014P00J871j699r09K238o88j838J587Q29k045
7021a059K16K162j712r03K080k96j660J482J016k482M77J747j307p82K136q01
7037C14j317J133Q41j748J40K023j763n85J847R4k170J245J171k248K73J880r37
$$ plain form
6922 309 1234 -788 -594 1508 -107 -1290 1085 696 -1131 220 1260 -1021 -475 1360 -78 -1002
6938 -1002 797 753 -1180 294 1112 -775 -337 1354 102 -890 928 851 -1120 -125 1083 -926 -793
6955 -793 1212 182 -1314 703 918 -1220 -168 1408 -656 -968 1240 190 -776 804 1065 -1006
6971 -1006 11 1297 -513 -581 1059 -118 -1064 434 1166 -915 11 1512 -754 -695 1149 387 -1442
6988 -1442 613 857 -1227 -485 1506 -323 -953 976 401 -1367 579 928 -1428 -508 1427 -511
7004 -511 -963 1146 433 -1067 148 909 -1105 -405 1466 -233 -1142 1096 408 -1430 157 986 -1059
7021 -1059 -843 1319 -393 -1296 784 488 -1172 310 1326 -1156 -679 1068 -239 -1021 1115 314
7037 314 -1003 130 971 -777 -637 1386 -377 -962 885 979 -1191 54 1225 -1023 -750 1130 193
7054A93j189J693O9j666Q18J395k227J38J784q81j145J751j40j912J292J261j908
7071f74q5K259j607j275K241j67k028J378J334k062q6J953p75j540J857J12k039
7088a204J225J255j563q78K262o03j428J283M93j884Q06J573j707o43K162q97
7104B52j366J093Q76k103O75J837j681n93K108o94j730J694O46j757M07J705j638
7121b69j023K219m45j928J645Q68j821J2K069j702p64K203m97j774J528P37k013
7138i55J64J955j302j036K163k57j843J068J124j862J41J841j285q73J817k14
7154F46j656R09J192j841K12J618r63j378J978k4j876R50J424j891j05K136j369
7171c8j190J891J93k346J437J544k380N36J596j009j326J703N35k367J035J565
$$ plain form
7054 193 -996 697 766 -900 -82 1313 -914 -776 1008 127 -1018 733 593 -1319 -27 1234 -674
7071 -674 -759 1500 -107 -1382 859 692 -1336 42 1376 -686 -772 1181 406 -1134 723 835 -1204
7088 -1204 21 1276 -287 -1165 1097 494 -934 349 842 -1042 -236 1337 -370 -1013 1149 252
7104 252 -1114 -21 855 -1248 -573 1264 -417 -1010 1098 404 -1326 368 1014 -743 -336 1369 -269
7121 -269 -1292 927 482 -1446 199 1067 -754 -742 1327 -375 -1139 1064 567 -1207 321 1058 -955
7138 -955 -791 1164 -138 -1174 989 732 -1111 -43 1081 -781 -640 1201 -84 -957 860 646
7154 646 -1010 -101 1091 -750 -538 1080 117 -1261 717 693 -1183 -233 1191 -700 -805 1331 -38
7171 -38 -1228 663 856 -1490 -53 1491 -889 -353 1243 234 -1092 611 1146 -1221 -186 1379
7187A379j908m71K126p80j512J869J69k159J057J302j483k81J880q96j528J806
7203E70O43k189L64K226j815p30K186q63j742J847N32j941O12J503j519q86K188
7220I86p12j519J668M27j872N38K149j883q35K136n35j822J608N45k004O39J372
7237H86r00j072K076m42j659J226Q86j974N17J992j547j320K279l1k284J629P85
7254A047j778N6J956j707r65K247l00j907J215J219j938K25J673j172j342K183
7270G12o3j825J113J436j911m86J834q30j083K012j35j834J094J094j882jJ723
7287I68q83j420J761L42k070J431J223j857m48K144j181j277K013L78k250O93
7303d33J839j686p70K425r47j709J861K16j624K59J779j691p31K432r94j244J328
$$ plain form
7187 1379 -529 -1000 1126 346 -1166 703 872 -1287 -230 1072 -411 -692 1188 292 -1236 570
7203 570 1213 -976 -612 1614 -201 -931 1255 392 -1350 497 1029 -912 -300 1203 -316 -1202 986
7220 986 274 -1245 423 850 -1022 -484 1665 -218 -1053 1083 548 -1274 334 879 -1125 -486 886
7237 886 -14 -1086 990 548 -1111 115 1001 -973 -456 1536 -11 -1331 948 917 -1367 262 1047
7254 1047 -731 -675 1281 -426 -1391 856 556 -1351 -136 1083 -855 -630 1043 -129 -1471 712
7270 712 649 -1176 -63 1373 -538 -1024 810 -20 -1103 909 774 -1060 34 1128 -754 -755 968
7287 968 85 -1335 426 768 -1302 129 1352 -505 -953 1191 10 -1267 746 1124 -1126 -433
7303 -433 1406 -280 -1050 1375 428 -1281 580 796 -828 -569 1210 -481 -1212 1220 226 -1018 310
7320C10Q10k202N48J936j815m68J869l37j924J666L85j734Q55J254j402p03J941
7337I89m00j692J737L77j862M19J703j580p28K039k66j908J337J130k112L15J637
7354A135j473j179K335j64j970J475Q23j634R0J677j270r41J877j22j817J165
7370GJ254j836k68J977q59j637K130J38k200J518Q49j692l83J972r38j422J991
7387F01M63k585J251J200j476n51K062q43j518J755P14k312Q66J587j922k73J982
7404A001q65j348J894P7j878O07J745j987k10J945o42j659J612M61j679M02J683
7421A159j644o96K152n52j708J571P07j991P31J542j722o02K082n96j686J565
7437C12P57j948N01J671j508p20K029m63k321K177P07k108K17K119j560r73J971
$$ plain form
7320 310 1120 -1082 -534 1402 -413 -881 988 651 -1273 393 778 -956 -101 1153 -249 -952 989
7337 989 589 -1103 634 1011 -851 -432 1271 -309 -1037 1002 736 -1172 165 1295 -817 -502 1135
7354 1135 -338 -1517 818 654 -1316 159 982 -652 -562 1115 -155 -1096 781 659 -1158 7
7370 7 1261 -575 -843 1134 275 -1362 768 906 -1294 224 1073 -619 -1002 970 32 -1390 601
7387 601 1064 -1521 -270 930 -546 -1097 965 122 -1396 359 1073 -1239 -373 1214 -708 -981 1001
7404 1001 136 -1212 682 759 -1119 -512 1233 -754 -964 981 339 -1320 292 753 -926 -524 1159
7421 1159 -485 -1181 971 419 -1289 282 989 -1002 -271 1271 -451 -1053 1029 433 -1253 312
7437 312 1069 -879 -378 1293 -215 -935 1094 631 -1690 487 1194 -914 -697 1422 -138 -1111 860
7454H60m58j625J477R40j980L80J482j043j191J830K41k320J674J275j998j41
7470e97J790j329j237K193M1j975R98R98j300m45J938j035j037J768j24j835J120
7487f8J202j690o1J831j189j536K018M70k168R50J382j728p2J896p89j484J414
7504C78N17k166J102J207j774L7J626m82j903K074M84k316J130J334j681o73K210
7521A104q42j418J781L89j679M71J537k000p03K411p36j778K065M32j973K37J602
7538I00j395m53J747k53j876J305J075k170R41Q28q47r07J990m28j700J298J266
7555A321k247L24J883j548r47K104k1j963J345J034j984J57J598j287p78J871
7571H62kj994J251R68j932M02J570j069j235J949l6j828J096J468k091k36J832
$$ plain form
7454 860 402 -1223 254 1194 -786 -406 1076 33 -1158 672 913 -1407 267 1542 -456 -597
7470 -597 1193 -136 -1373 820 861 -1114 -116 882 -418 -863 1075 40 -997 771 647 -1188 -68
7487 -68 1134 -556 -617 1214 25 -1511 507 977 -1191 -241 1141 -587 -659 1237 448 -1036 378
7504 378 895 -1271 -169 1038 -736 -699 927 445 -1458 616 1100 -1216 -86 1248 -433 -1106 1104
7521 1104 262 -1156 625 1014 -665 -194 1343 -657 -1360 1051 315 -1463 602 1034 -939 -702 900
7538 900 -495 -948 799 546 -1330 -25 1050 -1120 -179 649 -198 -1105 885 457 -1243 55 1321
7555 1321 -926 -602 1281 -267 -1214 890 869 -1094 251 1285 -699 -542 1056 -231 -1009 862
7571 862 860 -1134 117 1085 -847 -445 1125 56 -1179 770 734 -1094 2 1470 -621 -857 975
7588I75p86j386J967L39k109R85J218j744m28K301j160j468K087k0j814J146J271
7605A374j819n36J966j200r86J886L49k469J128J835j929m68K170p12k143K004
7621D50L92k054Q73J759j977m85K153j232j302J814O38k003P26J479j614o60J840
7638G97n29j480J642N85k110O66J815j494j185K186p05j453J627M78j915L82J668
7655I75j099r80J858n49j531J547Q17k018L53J657j814n25J960k77j647J533Q06
7672A066j789M8J863j237r59J615K51k152J283J251k069J43J981j324j251J797
7688E17O3j605J159J141j839j14J847j104j331J872J96j833O03J664k078j25K234
7705A267j205j363K030J0j839P74J544j765n97K005n61j655K109M38k323Q36J588
$$ plain form
7588 975 189 -1197 770 1109 -1000 -15 1203 -541 -969 1332 172 -1296 791 771 -1043 103 1374
7605 1374 -445 -981 985 -215 -1201 685 1034 -1435 -307 1528 -401 -869 1301 589 -1554 450
7621 450 842 -1212 -339 1420 -557 -1042 1111 -121 -1423 391 1029 -974 -248 1231 -383 -1043 797
7638 797 268 -1212 430 1015 -1095 -429 1386 -108 -1293 893 188 -1265 362 840 -1075 -693 975
7655 975 -124 -1104 754 205 -1326 221 1038 -980 -627 1030 -784 -1309 651 374 -1273 260 1066
7672 1066 -723 -675 1188 -49 -1008 607 858 -1294 -11 1240 -829 -686 1295 -29 -1280 517
7688 517 580 -1025 134 1275 -564 -678 1169 65 -1266 606 802 -1031 -428 1236 -842 -967 1267
7705 1267 62 -1301 729 739 -1100 -326 1218 -547 -1144 861 300 -1355 754 1192 -1131 -295 1293
7722A293j707p00K237o00j526J487Q15k081O24J491j647o89K100n36j939K016
7738F38N10j902M71J552j799l28J695k22j541J037R83j952L46J783j590n88J739
7755H32l47j479Q77J393k092N64J131j102r88J865j53j672J422P22k047M67K017
7772A410j503j159K043j4k061Q87J396k063L07J912j246j157J786K36j952R59
7788b19J253j879K68J510j172p93J607Pj743R39J200j471k58J650q59j196K040
7805H84j69j835Q51J189j478l58J840o87j556K087M5j877R15J336k047qJ732o39
7823B25j617J886L68j680L05J567j403l03J651o80j601J831L79j967O81J656j603
7840c05r65K074o39j051Q33J235k098N53J614j111j011J642m16j445J187O68j599
$$ plain form
7722 1293 -414 -1114 1123 523 -1003 484 1299 -782 -158 1333 -314 -1003 1097 561 -1378 638
7738 638 1148 -754 -283 1269 -530 -858 837 615 -926 111 1094 -858 -512 1271 -319 -907 832
7755 832 485 -994 -117 1276 -816 -252 879 -223 -1211 654 501 -1171 251 973 -1074 -607 1410
7772 1410 -93 -1252 791 777 -1284 -397 999 -1064 -757 1155 -91 -1248 538 774 -1178 -219
7788 -219 1034 -845 -577 933 -239 -1032 575 582 -1161 -222 978 -493 -751 899 40 -1156 884
7805 884 715 -1120 -269 920 -558 -916 924 237 -1319 768 813 -1064 -149 1187 -860 -868 864 225
7823 225 -1392 494 862 -818 -513 1054 -349 -652 999 319 -1282 549 928 -1039 -358 1298 -305
7840 -305 -1270 804 165 -886 -53 1182 -916 -363 1251 140 -871 771 355 -1090 97 765 -834
7857h34M78J564j411p29J900l26j659J414M72j705J83J774j412j030K057L0j802
7874a036J240P08j474P0J750j397j113K081J6j873J259J029j994J16J652j084
7890e0j055J787J7j629R13R20j576k08K193j167j247J663J79j692P87J550j706
7907c21o34J845q18j085J622L6j719J204O89j562l25K050p56j295J412K34j685
7924a108R26J433j789l39J553k39j507J324N92j824N34J373j699l16K226n79j617
7941a056J463Q59k333O51J428j278n25J742l36j824J461P24j589P8J542j104j065
7958a162J988l55j519J415N74j636K22J399j245q56J866j85j608J282O96j666
7974g90N34J554j613n70J892m00j654J357O84j690K33J665j148j027J723o4j817
$$ plain form
7857 -834 -356 1208 -203 -932 968 642 -1017 397 869 -836 -653 1121 -291 -1321 736 766 -1036
7874 -1036 204 912 -562 -492 1258 -139 -1252 829 845 -1028 231 1260 -734 -618 1034 -50
7890 -50 -1105 682 699 -930 -17 903 -673 -881 1312 145 -1102 561 740 -952 -165 1385 -321
7907 -321 -955 890 72 -1013 609 645 -1074 130 819 -743 -1068 982 226 -1069 343 577 -1108
7924 -1108 -182 1251 -538 -877 676 437 -1070 254 846 -978 -444 929 -770 -1086 1140 561 -1056
7941 -1056 407 1266 -1067 -416 1012 -266 -791 951 615 -1209 252 976 -613 -535 1007 -97 -1162
7958 -1162 826 471 -1048 367 941 -695 -473 926 -319 -1175 691 506 -1102 180 876 -790
7974 -790 -256 1298 -315 -885 1007 607 -1047 310 994 -696 -463 1202 54 -973 750 686 -1131
7991a131J025J207k063L91J708j168j090J807nj662R34J205j685J5J763j130j055
8008i34J301L62j839J275R47j622k75J846j055j011J733o2j725J038J044j490
8024d67l22J861q50j411J774Q6j571P11J281j207n32J617o62j409J413M98k003
8041a193Q47J415j512l47J998j173j175J523N6j094o0J878j196o32J791r13j182
8058i69J145O17j643K38J824j206q91J863m28j668J349K15j193N33J161j583k68
8075i04J799l96j552J448O56j730L95J295j103j151J766o9j476J083P88j312l48
8092h11J688j043o02J445L2j808J074J315j990K3J743j083q57J811k01j796J340
8109B80O04j335k85J659j250q33J796L44j939J133O14j434k74J816p51j326J622
$$ plain form
7991 -1131 -106 1101 -962 -571 1137 -31 -1121 686 681 -981 -47 1158 -527 -512 1251 121 -934
8008 -934 367 729 -1110 165 1112 -510 -785 1061 6 -1005 728 666 -1059 -21 1023 -467
8024 -467 -789 1072 222 -1189 585 671 -900 -189 1092 -115 -647 970 308 -1101 312 810 -1193
8041 -1193 -346 1069 -443 -790 1208 35 -1140 383 439 -655 -715 1163 -33 -665 1126 213 -969
8058 -969 176 793 -850 -612 1212 6 -885 978 550 -1118 231 446 -747 -214 947 -636 -904
8075 -904 895 499 -1053 395 1051 -679 -284 1011 -92 -1243 523 454 -1022 61 849 -463 -811
8092 -811 877 -166 -768 677 709 -1099 -25 1290 -700 -677 1066 -17 -874 937 736 -1060 280
8109 280 884 -451 -736 923 -327 -1160 636 980 -959 174 788 -646 -920 896 145 -1181 441
8126D41M32j894O69J593j412n60J338k37j305J585J42j552M24J324j416o34J743
8143F81l93j156J245M64j749L98J700j488o29J894l33j239Q52P47j837M78J265
8160I00r82j100J949l40j637J412P82j652K86J648j668o74J685o1j559J273Q14
8177A076j829K6J569j027q18J827k74j510J042J130j989J27J583j336
$$ plain form
8126 441 873 -1021 -352 1241 -171 -731 607 370 -935 650 792 -760 -336 988 -428 -1062 681
8143 681 288 -868 377 841 -908 -510 1190 -298 -927 967 634 -605 247 994 -843 -365 900
8160 900 -82 -1182 767 427 -1210 202 984 -668 -382 1266 -402 -1076 609 548 -1011 262 1076
8177 1076 -753 -727 842 -185 -1003 824 550 -960 82 1212 -777 -650 933 -403
8191d03
$$ Imaginary data points
##PAGE= N=2
##DATA TABLE= (X++(I..I)), XYDATA
0@%%%%%%%%pJ5j6J6j6J7k5L2l3M1n0N8o9P8r0J06j22J39j58J79k05K34k62K93
32A55l27L67m11M56n06N62o25O91p64Q46r36J038j151J276j417J579j768J987
50A052k245K556k939L427m069M948o239Q319j2189K1652q4094r3408K53974n413
64H5332j76103P0654Q5310j11333K5076Q1888r9340j2605J31107q4305j02098
75a06417J58299L4385j86885N4052J51073j26240o9207J63025l1385j44474J07140
86C366P8422j36398J5135J09310r8234l7156J41409n2661j26683J27364O1487
97H5361j64633L1287J50696j13035r0003J53365L910j35783P8367P2076j26281
108e4673J3359J19102q8779n7833J29242l3165j19442J21450O5028j72870J6092
$$ plain form
0 0 0 0 0 0 0 0 0 0 -7 8 -8 8 -8 9 -16 16 -17 24 -26 32 -37 41 -49 57 -65 74 -84 95 -110 124 -138 155
32 155 -172 195 -216 240 -266 296 -329 362 -402 444 -492 546 -605 671 -746 833 -935 1052
50 1052 -1193 1363 -1576 1851 -2218 2730 -3509 4810 -7379 14273 -69821 -163229 90745 85332
64 85332 -90771 -20117 65193 -46140 -21064 60824 -38516 -51121 79986 -4319 -106417
75 -106417 51882 86267 -100618 -46566 104507 -21733 -90940 72085 40700 -103774 3366
86 3366 81788 -54610 -39475 69835 -28399 -65555 75854 23193 -103490 23874 85361
97 85361 -79272 -47985 102711 -10324 -100327 53038 56948 -78835 -468 71608 -54673
108 -54673 -41314 77788 -10991 -68824 60418 27253 -92189 29261 94289 -78581 -62489
119f2489J68170r5287j09836J44124K3761j43367N9767R0963j09084l600J08934
130G2056q4270o1454J41260j5090j45536R3005R5308j42887j0205J47910p6360
141A3737j02470J31787K1689j37811O5638R4287j27554j7755J40020o2214r8018
152g8664J18722J7816j31475O8650R5804j30070k4060J42327n9261j03007J23128
163C9910L0051j44196N0780J11570j09557m0398J24659m3629r2376J07843K3741
174E8398j29100N7338R8301j22454k9207J47830n2319j26321J14635O3777j36761
185e5883J6782J10933q4050m8075J11654l0701r0036R5075K6567j24429N3818
196a8345J08167j20318n1674J47575k6076j27707R4817O7917j29218R216J16432
$$ plain form
119 -62489 105681 10394 -99442 44682 68443 -74924 -15157 75806 -33278 -36878 72056
130 72056 -12214 -73668 67592 52502 -93034 -29 95279 -47608 -57813 90097 13737
141 13737 -88733 43054 64743 -73068 -7430 86857 -40697 -58452 81568 19354 -78664
152 -78664 40058 57874 -73601 -4951 90853 -39217 -63277 79050 19789 -83218 39910
163 39910 69961 -74235 -23455 88115 -21442 -61840 62819 19190 -73186 34657 58398
174 58398 -70702 -13364 84937 -37517 -66724 81106 28787 -97534 17101 80878 -55883
185 -55883 -39101 71832 -12218 -60293 51361 20660 -69376 25699 52266 -72163 -18345
196 -18345 89822 -30496 -82170 65405 39329 -88378 6439 74356 -54862 -45646 70786
207G0786p7037n9972J10849j8894r9471Q9309M7088j24336K7360J12388r8523
218b0453n8091J39100j7370j33315Q6191Q4233j22715q834J13621o2558o3639
229f3830J04880j0460j00675Q2910N2616j25963K1083J25805r1320q2863J33364
240D5547J2730j31932N9517Q7984j04156j7925J06790n2499o5207R8568m044j02901
252f7528P5181O5783j21413k07J26815o8823q8841J16626K3379j25130M6993R0364
264G3199r5800k5835J06080m3972p4076R5025J2945j07462N4872P6955j05533
275c3602j5317J19788n3888r1736J04908L2740j20345L6271R4171q9957l6227
286e3194J07258l2602q2221Q5990K4948j06055M4135Q3982r9143k8619J19243
$$ plain form
207 70786 -6251 -66223 44626 25732 -73739 15570 62658 -61678 -34318 78070 -20453
218 -20453 -78544 60556 43186 -90129 -3938 80295 -42420 -51254 62367 -191 -63830
229 -63830 41050 30590 -70085 12825 65441 -60522 -39439 86366 -4954 -87817 45547
240 45547 58277 -73655 -14138 73846 -30310 -48235 58555 6056 -59151 39417 35373 -67528
252 -67528 7653 73436 -47977 -48184 78631 9808 -79033 37593 60972 -64158 -17165 73199
264 73199 -22601 -48436 57644 13672 -60404 34621 47566 -59896 -5024 71931 -33602
275 -33602 -48919 70869 16981 -74755 30153 62893 -57452 -21181 72990 -16967 -53194
286 -53194 54064 21462 -60759 25231 50179 -55876 -11741 72241 -26902 -55521 63722
297F3722l9359r9489R4906M5556j17672K1746R8510p8369m5414J03028k3678q6001
309f2514Q0118L4458j05803L2007R0401q9644m0402J16912k6646j04112Q4659
320I434N4944j12387R992J01443o9101n5208R9753j0213q9860O8373M4460r9395
332d7765J9081R2001p8374m8763J10159j3810j03873P2788O2162j06545o09J02927
344E9379n8145o3229R2487K447q9390N6161N1373r1379Q469R1157o8145n4866
356f3681J05180k733j06548O0817P3411r8227j5219J00078m3388o6913Q3501R111
368C5389q7741N0777N6883r1175j310R7665n7698o6789R8440J1864j05324M7747
380a1272P7568r0626k3254J00230l6507p2503P9931J9291q9871M0178O4508q4905
$$ plain form
297 63722 24363 -75126 19780 65336 -52336 -30590 67920 -10449 -55863 47165 23487 -62514
309 -62514 17604 52062 -53741 -21734 68667 -20977 -61379 55533 28887 -75225 9434
320 9434 64378 -48009 -38017 63426 -5675 -60883 38870 28657 -61203 7170 51630 -47765
332 -47765 -28684 63317 -15057 -63820 46339 32529 -71344 1444 63606 -42939 -43548 59379
344 59379 1234 -61995 30492 32939 -56451 -290 51083 -40296 -31827 59330 -8815 -63681
356 -63681 41499 38766 -67782 -6965 66446 -31781 -47000 53078 9690 -57223 26278 35389
368 35389 -52352 -1575 55308 -35867 -37177 60488 2790 -63999 34441 46305 -59019 -11272
380 -11272 66296 -24330 -47584 52646 16139 -56364 23567 42858 -47013 -6835 57673 -27232
392b7232j1987R7441m7697p3191R2530K2428j06303L7597Q3933q3506l3692R8008
404D8329k5145p7199P1416K8600q8376L0425O9122p7658k1411R5554l7181p8131
416f1655Q4267L2762j03953K4647Q7870p2374m3519R2991j4091p8209O1768L4783
428D5287q4429K1483P2358p0454l0995R3993k5550q3088P4202M2198r7543J1440
440c1098Q8497o1369m9387Q6979n462p9373N4922M1446q2257J2609P5959o2587
452a1121l9769R0560j4195q5865O4681N0801r4134J521R1041n2600n6672Q3098
464B7346L990q1955M7582M9072p9134L230P8968n5021m6944Q7322m301q8811N6050
477b606N8450q9190p722R2225m4578o3544P9655J3418q3280L9291N4622p3834
$$ plain form
392 -27232 -39219 58222 10525 -62666 29864 52292 -54011 -16414 67519 -15987 -49679 48329
404 48329 23184 -54015 17401 46001 -42375 -11950 57172 -20486 -41897 53657 16476 -61655
416 -61655 22612 55374 -48579 -23932 63938 -8436 -51955 41036 26945 -51264 10504 45287
428 45287 -39142 -17659 54699 -15755 -46750 47243 21693 -61395 12807 55005 -42538 -31098
440 -31098 57399 -3970 -53357 33622 28160 -51213 3709 45155 -37102 -24493 51466 -11121
452 -11121 -50890 39670 25475 -60390 4291 55092 -39042 -37521 53520 920 -55752 27346
464 27346 31336 -50619 -3037 46035 -33099 -29869 49099 -5922 -52866 34456 30155 -58656 -2606
477 -2606 55844 -33346 -41068 51157 6579 -56965 22690 36108 -47172 -7881 46741 -27093
489b7093n326P9814m6739n3727Q2943O225q9498M5576O5037q2256j7735R0482
501D7703l3920o6858P1346K1166q1180L1330N9699o8909j4953P9591l6443n8756
513e0184P5395J5256q7811L6053O9089p4972k6715Q8528k3819p1086O3650L0506
525D3890p8091J9527O1637o0379k0477P6841k9475o2868P0117K3558q7234K6634
537a6320P4790o9409l6598Q7573j2366p5836N5210L7389p5209J2407O4875n5318
549h812k8948P6055k1018o7386O5376L2718q8745J6001Q0492n9796m5691Q2651
561C2897l291p6856M8061M3633p2242M573O5728n0628l2779P6637j4346p4189
573e2802N8985M3087q5211M214Q2677m9665n3652P6437P703p4712L7508M5357
$$ plain form
489 -27093 -32419 47395 656 -53071 29872 36097 -53401 -7825 57212 -25044 -42779 47703
501 47703 13783 -53075 18271 39437 -41743 -10413 49286 -19623 -34576 45015 8572 -50184
513 -50184 25211 40467 -47344 -11291 57798 -17174 -43889 44639 20820 -50266 13384 43890
525 43890 -34201 -14674 46963 -13416 -33893 42948 13473 -49395 20722 44280 -42954 -16320
537 -16320 58470 -10939 -47537 40036 27670 -48166 7044 44433 -30776 -18369 46506 -8812
549 -8812 -37760 38295 17277 -50109 15267 47985 -40760 -24759 55733 -4063 -49754 32897
561 32897 29606 -47250 811 44444 -27798 -23225 42503 -8125 -40904 35733 21387 -52802
573 -52802 6183 49270 -35941 -31727 50950 1285 -52367 24070 31773 -42939 -5431 39926
585C9926o6647Q51O7793m6231m1383P4148k992p5693M9702N0008p9979p398Q3113
598D5218l7992n7130O8086J3317p2781L2701N0324o4077q098O8646l7470m6949
610d6205P1100O728p8761L7520N7421o9228j5486P7378l0875n8274O4792J9403
622C5513p3426K6284N4239o1336j4543P3811k9854n7538O4149J8144p5146K9104
634a0599N9831o5588k3282P8387k1698o2112N9049K3506p3792K2177O2052n8024
646a0093k6902P2116j9523n8330N8533K3736p5568K0513O3975n8137k7922P5953
658C8351j8258o7424N7463L5537p5137Q496O4980m8248l2279O9024j0730o1939
670d0164M7630L0067o7603J5518O2262n6712l4018P7809p616p1675M6911M1976
$$ plain form
585 39926 -26721 -25870 41923 -4308 -45691 28457 25465 -50228 -526 49482 -30497 -37895 45218
598 45218 7226 -49904 18182 31499 -41282 -8581 41743 -22334 -30432 38214 744 -46205
610 -46205 24895 31623 -47138 -9618 47803 -21425 -36911 40467 9592 -48682 16110 35513
622 35513 -37913 -11629 42610 -18726 -33269 40542 10688 -46850 17299 35443 -39703 -10599
634 -10599 49232 -16356 -39638 38749 17051 -45061 13988 37494 -36298 -14121 47931 -10093
646 -10093 -36995 35121 15598 -42732 15801 39537 -36031 -15518 48457 -9680 -37602 38351
658 38351 20093 -47331 10132 45669 -29468 -20972 44008 -4240 -36519 32505 21775 -40164
670 -40164 7466 37533 -30070 -14552 47710 -9002 -43020 34789 27173 -44502 2409 44385
682D4385p1132P35O9176l9345m2540O0314o26n7620M3472L1346o9251Q120O8143
695D5177m7553m1747P2328M97p4536L9896N1629o4192j1914O3154l0107l9000
707c6368N8947o72o2212M0139L8771o7472J584P2392m3715n3511P1924J6692p5281
720c8782K4254N3191n5117j4664O3648k6559m4423N4657N682o1724L8296M4799
732D3258o9795r669P7400l0674n9277O1999K2382p2370J9836N7666n0605k2334
744c2183N9668k1101m4115N5955J1248o8883K8443N4957n9927k0463P2985k1062
756A5522o1774N4597K9910o5742J0535N3272m5955k0446O1898j8094n2812N0837
768A1748K1942o6603J9534N9284n4634l0859P0480p624o1489M2797L1755o1690
$$ plain form
682 44385 -26747 -26012 43164 3819 -38721 21593 20967 -36653 6819 38165 -31086 -22966 45177
695 45177 -2376 -44123 28205 28702 -45834 -5938 45691 -18501 -30415 32739 2632 -36368
707 -36368 22579 21907 -40305 -166 38605 -28867 -27283 45109 1394 -52117 19807 36499 -38782
720 -38782 -14528 38663 -16454 -31118 32530 5971 -38452 16205 21887 -39837 -1541 43258
732 43258 -26537 -36206 41194 10520 -48757 13242 35624 -36746 -16910 40756 -9849 -32183
744 -32183 27485 6384 -37731 18224 29472 -39411 -10968 43989 -15938 -36401 36584 15522
756 15522 -46252 8345 38255 -27487 -16952 36320 -9635 -30081 31817 13723 -39089 11748
768 11748 33690 -32913 -13379 45905 -8729 -39588 30892 23268 -38221 4576 36331 -25359
780b5359Q081N6771m2324k9786N9692r495n4886M7189K8857o6678P577O2327m3199
793a233l4852O3952m875o2006M1659L8000o2699M94N9807l8686l5815O2917r38
806B5725o2900L6562L8376n8819LN9330l7938l8647O2169J818o2762L5966M0066
819C8949o1845l606O5577l3354m5688N7370Q755o0693K9925M2142n6659p575O0553
832C3851l0699m1138N7923N926o4980L1138M9089n7201j6260O3150k2538m6950
844c8689N1015J4686n8729K1789M2940m9702r952N9736k8853m6543N7569J5930
856C1197o6845K0931N4045n1291k3580O2776j2513n1037M1811K0575n3836J7699
868a0068M3348m7887j5327O1192k1221n1200N2215K2640o6425J3806N8810m4766
$$ plain form
780 -25359 -17278 39493 -2831 -32617 27075 17580 -37306 9883 38740 -27938 -20361 41966 -1233
793 -1233 -36085 27867 22992 -39014 2645 40645 -22054 -21560 38247 -439 -36254 26663 25725
806 25725 -37175 -613 37763 -21056 -21053 38277 339 -38308 23861 25679 -37083 -1117 38949
819 38949 -22896 -26502 39075 5721 -39967 17403 26158 -34535 -4610 37532 -19127 -26702 33851
832 33851 3152 -37986 19937 25863 -39117 -7979 41110 -16091 -32351 30799 8261 -38689
844 -38689 12326 27012 -31717 -9928 33012 -16690 -26642 33094 4241 -42302 15267 31197
856 31197 -35648 -14717 39328 -11963 -35543 27233 14720 -36317 5494 26069 -27767 -10068
868 -10068 33280 -14607 -29934 31258 10037 -41163 11052 33692 -32733 -18927 39883 -4883
880d883l0201N8044o726n0462M0237K3720n5542J2292M8945m4785k2091O1791
892C0339j4118n7107M6789L2368o2963L269N8452l7316l3424N6199j901n2200
904c1613L5611K7432n4712Q694N2714m2615l0297O2651m930o0403L8980L8091
916C9603o0191k943N9257l0269l8251N1542L725n2068L0887L2272n2963P94N4310
929C5705l4939l4903N7246K051o0167L1751M2069n4735r554N7929k5659m0305
941c3511M9718R021n4451K5027L7891m9929p205N5926k7559m1136N2597J0491
953B6880n8412K3479M4010n0194j3536N7127j9901m4472M6211J4366n4804K0215
965i031M2618m7627j3843N6519k0699m4999M8833J6100n9212J8644M8701m6789
$$ plain form
880 -4883 -35084 22960 16234 -34228 6009 29729 -25813 -13521 35424 -9361 -31452 30339
892 30339 16221 -40886 5903 38271 -24692 -21423 37029 -287 -33711 22488 20587 -31613
904 -31613 3998 31430 -23282 -14588 38126 -4489 -34786 27865 22935 -37468 1512 39603
916 39603 -20588 -23531 35726 5457 -32794 18748 22473 -29595 1292 33564 -19399 -18605 35705
929 35705 766 -34137 23109 25160 -35007 -3256 38813 -15922 -25476 32453 6794 -33511
941 -33511 16207 25228 -29223 -4196 33695 -16234 -23439 32487 4928 -36208 16389 26880
953 26880 -31532 -8053 35957 -14237 -27773 29354 9453 -35019 11192 25558 -29246 -9031
965 -9031 33587 -14040 -27883 28636 7937 -37062 11771 27871 -31341 -12697 36004 -10785
977a0785k1190N8220j4224m8047M2354K1242n4700J3875M4941m2312j8485N5342
989B6231j6091m7053M5354K1305n9269J3376N1782m2963k6638N7381o835n1308
1001c4728L7321K6607n2410P005M7438l7338k4010N4225r520m9532M0064K6931
1013C2053n6674N892N3472l6513l1320N4062o85n1987L2181L0579n0116J765M9037
1026C1746l3412k8436N2214l190n1444L4506L2453n4079j592N5254l0239l6505
1038c2724N0362N661n1990K6359L4150m6965l895N0099k8420l2900N0374K242
1050B2353n3488K9984L6783n2230p182N6667k5134m1054M8130J1638n3341K0867
1062f007L8245m4554r367N0902k3483l7318M7748Q488n4313K3626M1438m8596
$$ plain form
977 -10785 -31975 26245 12021 -36026 6328 27570 -27130 -13255 31686 -10626 -29111 26231
989 26231 10140 -36913 8441 29746 -29523 -16147 35635 -7328 -33966 23415 16580 -34728
1001 -34728 2593 29200 -23210 -16205 31233 -6105 -30115 24110 14590 -34942 5122 32053
1013 32053 -24621 -18729 34743 -1770 -33090 20972 20287 -31700 481 31060 -19056 -17291 31746
1026 31746 -1666 -30102 22112 18922 -32522 1984 34437 -19642 -21234 34020 3781 -32724
1038 -32724 17638 23299 -28691 -2332 31818 -15147 -19042 31057 2637 -30263 20111 22353
1050 22353 -31135 -1151 35632 -16598 -23780 32887 7753 -33301 14829 26467 -26874 -6007
1062 -6007 32238 -12316 -21683 29219 5736 -31582 16166 24654 -29659 -6033 35405 -13191
1074a3191j3758N6347j9194m4357M4586J6768n3225J6012M1632m1824j5013N1156
1086B5939j7387m1485M4183J4980n4837J7651M5076m4365j9651N4970j2219m6687
1098c3832L9084K1827n1256R930M3633l6995j9611M9803j1750m3594L9141K0734
1110B7114n3505J1021M7791l8651k5385N3034n672m8906L4495K6431m8983M024
1122a7192M5698l2648k4596M8773o437m5536L5225K5306n1855N385M9794l4205
1134b288l0215N2091l02n0822L0179L1691m8266q64M7447k8406k9595M7914o40
1147A7924m8438L0877L0666m9630j587N2019k9472l4498M9757N209n1728K5193
1159c708L5719m5954o547M9072k4130l3393M4913N325m8935K5910L4444m7594
$$ plain form
1074 -13191 -26949 29398 10204 -34153 10433 27201 -26024 -10012 31620 -10204 -25217 25939
1086 25939 8552 -32933 11250 26230 -28607 -10956 34120 -10245 -29896 25074 12855 -33832
1098 -33832 5252 27079 -24177 -14247 29386 -7609 -27220 22583 10833 -32761 6380 27114
1110 27114 -26391 -15370 32421 -6230 -31615 21419 15747 -33159 1336 27767 -21216 -17192
1122 -17192 28506 -4142 -28738 20035 13598 -31938 3287 28593 -23262 -17877 31917 -2288
1134 -2288 -32503 19588 19286 -31536 -1357 30334 -17932 -18796 28651 245 -29350 18564 17924
1147 17924 -30514 363 31029 -18601 -20188 31831 2359 -32139 17618 22827 -28901 -3708
1159 -3708 32011 -13943 -20490 28582 4452 -28941 15972 21297 -27638 -1728 32716 -14878
1171a4878o902N2150k2935l9051M5728J1971n2213J9128L9353m2096j2472M8620
1183B6403j8103l6127M0826J0285m8791K0255L7823m4064j2257N2249j8521m2309
1195c2331M2675J7661n1524J2360M2001l7245j7631M7079j2516l9255L7585J5268
1207B4127m8516J4931M1125m0931j8280N2750j2038m5801L7781K2825m9975P039
1219a4963M3460l3064k1860M6078q042m0754L4637J9669m8975R789M4763l6880
1231f142k4047N1289n784m7866L3259K7970m8347J359M4973k9433k4858M5438
1243A7811m277m3620L2028K4594m7857L684M7643l2395k9352M9473J085m8899
1255c0082K7003L1132m4858k816M6000k5454k9166M3308K203m5366K7055K9429
$$ plain form
1171 -14878 -21780 30370 7435 -31616 14112 26083 -26130 -7002 32351 -9745 -22217 26403
1183 26403 8300 -27827 12999 23284 -25507 -5252 32571 -11493 -23750 28499 9978 -32331
1195 -32331 10344 28005 -23519 -11159 30842 -6403 -24034 23045 10529 -28726 8859 24127
1207 24127 -24389 -9458 31667 -9264 -27544 25206 13168 -32633 5148 27973 -22002 -14963
1219 -14963 28497 -4567 -26427 19651 11609 -29145 5492 25161 -23814 -14025 30738 -6142
1231 -6142 -30189 21100 15316 -32550 709 28679 -19668 -18309 26664 -2769 -27627 17811
1243 17811 13534 -30086 1942 26536 -21321 -17637 30006 -2389 -31741 17732 18817 -30082
1255 -30082 -3079 28053 -16805 -19621 26379 925 -28241 15067 17270 -28096 -1041 28388
1267B8388m6284j909M8153k5601l3193M5140O177m8057K2314L4547m2032q420
1279b0777M6259k0838l2128M1458O839m7042K1625L4805m2271q850M7630k0182
1291F528l5939M1767J1657m7847J7265L6403l9486j1768M7440j6582l7624L8358
1303A0172J3679m6523J5886L6662l9012j3612M7889j4525l9355L8726J5194m8354
1315b3173J3718M1022l8025j8680M7787r932m0531L5135J7731m5827J0138L9750
1327B9113l5110j7236M5952j2017m0905L7035K1218m9287O723M4008l2952k3741
1339b7199M6542m023m2960K9349K2966m2657N330L9086l1509k1375M6430n970
1351A4010m3682L1702K5395m7370J516M6362k7409k9181M2045K507m1300K4718
$$ plain form
1267 28388 -17896 -19805 28348 2747 -30446 14694 20871 -27186 -4872 29675 -12357 -20777
1279 -20777 25482 4644 -27484 13974 20813 -26229 -4604 30201 -12070 -20920 26710 6528
1291 6528 -29411 12356 24013 -23834 -6569 29834 -9652 -21420 26020 9438 -28186 10172
1303 10172 23851 -22672 -6786 29876 -9136 -22748 25141 10616 -28739 9987 25181 -23173
1315 -23173 -9455 31567 -6458 -25138 22649 12717 -27814 7321 25052 -20775 -10637 29113
1327 29113 -5997 -23233 22719 10702 -30203 6832 28050 -21237 -14514 29494 -3458 -27199
1339 -27199 19343 15320 -27640 1709 24675 -17982 -12652 26434 -5075 -26450 19980 14010
1351 14010 -29672 2030 27425 -19945 -18429 27933 524 -28657 13388 15895 -25405 -687
1363f87K4778m1646J379M1877k7562k5339M4031r20m6133K7703L1813m4180p041
1376b1927M5625k0051l0891L8732N716m1593K0850K7830l9262k274M3072k5632
1388A95l0682M4945O960m8022J9852L5525m0505j0889M6194j6292l4096L5743
1400H928J0116m1297J8059L0500l9324p774M6563j9344l5212M0025J1906m7571
1412b4425J5571L8792l6455j6157M3776j2335l3987L4908J2203m4028J4684L5649
1424B8196l5747j4067M5488j3663l8886L6469J8239m5531Q168L8803l1570j8313
1436b2414M2886q316l7300L1155J7969m2565R169L7703l3163j9639M4947n787
1448A4645m0589K9641K1517m3022N064L9640k7992k2933M1343l454l9304K8528
$$ plain form
1363 -687 24091 -17555 -16176 25701 -1861 -27200 16831 15911 -30222 -2519 29294 -14886 -21927
1376 -21927 23698 3647 -27244 11488 17204 -24389 -3539 24291 -14971 -17245 25827 195
1388 195 -30487 14458 21418 -26604 -6752 28773 -11732 -22621 23573 7281 -26815 8928
1400 8928 19044 -22253 -4194 26306 -13018 -20792 25771 6427 -28785 11240 23146 -24425
1412 -24425 -8854 29938 -6517 -22674 21102 8767 -25220 9688 21891 -22137 -7453 28196
1424 28196 -7551 -21618 23870 10207 -28679 7790 26029 -19502 -11334 27469 -4101 -22414
1436 -22414 20472 12156 -25144 6011 23980 -18585 -9416 28287 -4876 -24515 20432 14645
1448 14645 -25944 3697 25214 -17808 -12744 26896 -1096 -24029 17314 13860 -25444 3084
1460C084K2178m2644K670M0709k6245k3887M0429j951m0480K6816K4584m0993
1472a5730O3M0758k5780k5670M2214Q08m2909K3541K7914l9268l163M0374k2271
1485H81k7137L9367K880m0418K2322K6868m0705k819M3707k2029l1316L9253P436
1498A8290m2178J8150L0634l6972p627M0731j7649k8699L6710N350m1857K0106
1510e011L1888l8968r897M4576j6269l4133L5652J2840m1981J2468L2359l1492
1522g968j0875L8546j4448l0844L4934J0660m1979J4596L4005l5377j4388M4637
1534B1499j0174l7556L0728J7642l9445P806L3354k9152j4492L8794j0166l3214
1546b4376L1691J5029m2389R663L7920l0879k0006M1511m655l7235K7259J9523
$$ plain form
1460 3084 25262 -17382 -14712 25997 -248 -24135 16294 14343 -26137 679 25263 -15730
1472 -15730 -15667 25091 -689 -26359 15855 16663 -26246 -2705 25209 -14059 -17222 23152 881
1485 881 -26256 13111 15991 -24427 -2105 24763 -15942 -18761 24946 2917 -28399 10854 18290
1498 18290 -23888 -5738 24896 -12076 -19703 21028 3379 -25320 11390 16740 -25117 -5011
1510 -5011 26877 -12091 -21988 22588 6319 -27814 7838 20678 -21303 -8835 23524 -7968
1522 -7968 -18843 19703 5255 -25589 9345 20005 -21974 -7378 26627 -8750 -23138 21499
1534 21499 11325 -26231 4497 22139 -17306 -9500 23854 -5298 -19790 19004 8838 -24376
1546 -24376 7315 22344 -20045 -10382 27538 -3341 -23347 18164 13509 -23726 3533 23056
1558B3056l8180M291L4704k6561j7177L8618p071l6190K9154K0293m1631L636
1570a3058L9385k6546k3686L9782j66l8173K2838K2689l6277J085L5786k4392
1582g33k1691L8906j851l8458K4775K3950m0003q77M0404k1990k6908L6909M068
1595A6501l8473J9603K5586l5410l564L7516j9999k4893L5577L181l8629J9671
1607c333K7367l5859o018L9276j7673k8534L4497P247l8780J5970K8754l2771
1619i857q443L8167j5583k8636L2968Q692l8359J4450K9643l2631j0153L8938
1631A9196j2577l1486L1379J1945l8184J1374L0839l0118j2290L7630j0822l0495
1643b3609K9902J1854l7787J1284L1896l0579j4062L9225r023l3621K8954J6178
$$ plain form
1558 23056 -15124 -10833 23871 -2690 -19867 18751 11680 -24510 4644 24937 -16694 -13058
1570 -13058 26327 -219 -23905 15877 15711 -22462 376 23065 -13212 -12127 23659 -733
1582 -733 -22424 16482 14631 -23827 948 24898 -15105 -15982 24422 2432 -24476 12433 16501
1595 16501 -21972 -2369 23217 -12193 -15757 21759 1760 -23133 12444 15625 -23004 -3333
1607 -3333 24034 -11825 -17843 21433 3760 -24774 9723 16970 -21810 -5840 22914 -9857
1619 -9857 -18300 19867 4284 -24352 8616 17308 -21051 -6601 23042 -9589 -19742 19196
1631 19196 6619 -24867 6512 18457 -19727 -8353 22486 -7632 -19922 17708 6886 -23609
1643 -23609 6293 18147 -19640 -8356 23540 -7039 -21101 18124 9101 -24520 4434 20612
1655B0612l8077O932L3326k6699j6464L6605o799l2134K7237J5571l7009P313
1667i586L3225k7765j6911L8384m954l5302K5252J9853l6561K360L4459k3129
1679f75j9466L5086k456l3378K3362J9127l5504K467L4829k3862k1009L6465k54
1692A4732l6263K1450K2838l4166k049L4809j9375k2190L2740J642l3879K0127
1704D16K1791l4187j523L5960k0004k4463L3986M781l6260J6380K5707l1657o313
1717a5386L4804j5331k5012L0983M988l4363J6592K4390l1917n586L6114j6145
1729D131k6802L1712Q077l6527J3247K8187l0070r529L5024j2259k7011K9123
1741G303Q585l4930J3152K7354l0173r671L6312j1868k9278K9244J2159l6482
$$ plain form
1655 20612 -17465 -10533 22793 -3906 -20370 16235 9436 -22698 4539 20110 -16899 -9586
1667 -9586 23639 -4126 -21037 17347 12393 -22909 2343 22196 -14365 -12005 22454 -675
1679 -675 -20141 14945 12489 -20889 2473 21600 -13904 -11437 23392 -470 -21479 14986 14732
1692 14732 -21531 -81 22757 -11409 -13458 21351 1976 -20214 12526 14168 -19711 416
1704 416 22207 -11980 -13503 22457 2453 -22010 11976 16757 -19503 -3123 22584 -9073 -15386
1717 -15386 19418 4087 -20925 10058 15046 -19317 -2725 21665 -10252 -15838 20276 4131
1729 4131 -22671 9041 17118 -19409 -6162 22025 -8045 -17574 17450 5191 -21820 7303
1741 7303 15888 -19042 -5890 21464 -8709 -18380 17932 6064 -23214 6030 18189 -18293
1753a8293R521K9809k7143j2425L3740q124k8823K6315J2258l4325Q914K9147
1765B0571k6466j3768L5542p456l1048K5839J5676l4872N082L1020k2920j6607
1777a9407L2708l808k9771K2641J5610l2453M404L0277k2997j6883L3780k977
1789A1124l2045K1911J9320l3113N62L2167j9731j9524L1372M6l0898J9199J8936
1802A9326l1058M97L1358j9837j9709L2422J95l3060J9315K1976l1569k957L2768
1815A9667j6601k2131K9585L560l1671J6269K1652k9883k974L1929j6541k2581
1827a9720L0230M569l3194J5117K4726k9900o586L3072j3276k4590K7908O765
1839A5121l1346J2757K3253k7639o556L2408j3527k4552K8179Q340l3330J1225
$$ plain form
1753 -18293 -8772 21037 -6106 -18531 15209 7085 -21738 4577 16835 -17490 -8576 20571
1765 20571 -5895 -19663 15879 8423 -22625 3214 18890 -15982 -10900 20120 -2800 -19407
1777 -19407 13301 9493 -20278 2363 17973 -14480 -10076 20201 -2796 -19679 14101 11124
1789 11124 -20921 990 20310 -12803 -12241 19926 195 -19329 12043 12089 -18809 390 19326
1802 19326 -11732 -11235 20123 286 -19423 12999 13194 -19866 -551 21425 -10144 -13101 19667
1815 19667 3066 -19065 10520 14080 -17591 -1322 20330 -9553 -12527 19402 2861 -19720
1827 -19720 10510 15079 -18115 -2998 21728 -8172 -14758 18314 5038 -19552 8356 15121
1839 15121 -16225 -3468 19785 -7854 -14410 17998 4471 -20081 8098 16438 -16892 -5667
1851e667K6432k6927j0339L2266r093k5876K4555J0180l1023R003K5431k5257
1863f315r646L1509r631k6567K5742J1601l2732P341K8299k3524j4191L1677n486
1876H077k7267K1606J3539k9872N262K6663k2260j3324L1262n604k8533K2404
1888A953J5564l2031L284K9727k0527j6627K9863j687k8060J9244J5716k9288
1900a2869K866K7858k0359j5946L0518j627l0241J9998J8291l0365l59K9823j6864
1913G24j9213K8308J332k8452J6477J8256k8092l98K8678j7324j8680K9142K043
1926A2801l0660J5834K1120k7964l963L0452j4508k1170K6462N152k9268J3341
1938b371K0794k6322m627K9497j3188k1412K6077N662k9468J1980K2710k5662
$$ plain form
1851 -5667 20765 -6162 -16501 15765 6672 -19204 5351 15531 -15492 -6489 18942 -6315
1863 -6315 -15961 15548 5917 -20650 5092 16693 -16039 -8698 19601 -3923 -18114 13563 8077
1876 8077 -19190 2416 15955 -13917 -8655 18008 -4252 -17576 13686 8082 -20451 1953
1888 1953 17517 -14514 -11230 18497 -2030 -18657 11206 9519 -18541 703 16419 -12869
1900 -12869 -10003 17855 -2504 -18450 12068 10441 -19800 198 18489 -11876 -12235 17588 724
1913 724 -18489 9819 11151 -17301 -824 17432 -10660 -11058 17620 296 -18384 10758 12801
1926 12801 -17859 -2025 19095 -8869 -12832 17620 3112 -18058 8404 13556 -15712 -2371
1938 -2371 18423 -7899 -12526 16971 3783 -17629 8448 14110 -15358 -3378 19332 -6330
1950f330p629L0054j0740k2599K4502P707k9371R952K3224k3891q190K8678r297
1963F070k3718K4040Q946k9049Q276K3874k3059r981K9447p969k4508K1894J1419
1976A5682k8357O430K3919k1061j1538K8351o097k4645K1344J1270k8686O207
1988g181K5402k1536j3377K9451m385k6226J9852J3998k8275K934K5512j8032
2000a863j3332K6089l457k4970J9170J3983k8314K914K6883j8784j5785K8035
2012A0569l13k7721J5947J7262k5519q19K5534j5973j5237K5581l85k5878J6502
2025d50J6311k6638m20K7569j5355j9255K6057L596k6653J2396J8544k3923l320
2038a1541K5790j2832j7333K4094K317k6714J3934J9629k5387n154K8389j1296
$$ plain form
1950 -6330 -13959 16095 5355 -17244 7258 14965 -14406 -4454 18770 -5121 -13311 15367 6070
1963 6070 -17648 6392 15338 -13711 -5435 18439 -4620 -14601 14846 6877 -17631 4263 15682
1976 15682 -12675 -6245 17674 -3387 -14925 13426 7329 -17316 4028 15298 -13388 -7181
1988 -7181 18221 -3315 -16692 12759 8374 -17852 2000 15998 -12277 -9343 16169 -1863
2000 -1863 -15195 10894 7437 -17533 1637 15620 -12694 -9780 17103 -1681 -17466 10569
2012 10569 10256 -17465 -1518 15744 -9775 -10594 14940 -1033 -16270 9311 8926 -16952 -450
2025 -450 15861 -10777 -11197 16372 1017 -18238 7819 11415 -15238 -2842 15702 -8221 -11541
2038 -11541 14249 1417 -15916 8178 10495 -16219 -2285 17344 -8043 -13197 15192 3896
2050C896k1153K3609O566k6628R460J9836k1069n592K4809j0510j8975K2959N880
2063A3088k7234J0295K1158k2598q005K7825q463k2292K0638R506k5523P044K0927
2076A6366k0940q066K6201p801k1328K0954Q850k7082P241K3453k0707j1336K6429
2089A2234m572k2647J8805J0483k5572M981K2576j8587j0993K5613n293k3109
2101a6081J9065J2306k6260L168K3710j7247j2977K5441k692k3724J6036J3994
2113A4739k4042J202K3487j6743j3556K4207l02k3847J5075J4200k3841K77K3950
2126A4806j5092j5161K3873N80k3956J4083J5703k3941j689K4499j2705j6343
2138a5343K2258K213k3694J2673J6283k2312k730K4138j2739j6403K3148K615
$$ plain form
2050 3896 -17257 6352 12918 -13710 -4250 15586 -5483 -11075 13734 3224 -15751 7208 13088
2063 13088 -14146 -3851 17307 -5291 -13296 14529 6066 -16226 4412 13918 -11605 -4561 16366
2076 16366 -4574 -12640 13561 5760 -15568 5386 14236 -12846 -5605 17848 -2859 -14195 12234
2089 12234 7662 -14985 3820 14303 -11269 -6288 16288 -2299 -13292 12321 7028 -16081
2101 -16081 2984 15290 -10970 -7802 15908 -1339 -14316 11125 8433 -15291 745 14739
2113 14739 -9303 -8101 15386 -1357 -14913 9294 8992 -14855 220 14420 -9421 -9144 14806
2126 14806 -286 -15447 8426 9006 -14950 -867 14836 -9105 -10794 13705 1000 -15343
2138 -15343 6915 9128 -14566 -1893 14390 -7922 -10652 13486 747 -15656 7492 10107
2150A0107k5116J1250J8862k2196m932K4718j0581j7694K0967M994k3559J0116
2162c064J7306k1441m217K4905j0811j8954K1626O592k4931Q285K0087k0059p784
2175a2460K3948p091j8561J8860O608k3502Q217J9197k0322p142K5016p498k0681
2188a5411J9707R350k5028N111K1660j7190j0393K2950m531j9867J7049R040k2712
2201a0265N222K0206j8263r629K4494m157k2464J6827J2392k3315J782K1589j4963
2214e44j2054K1734j482k0489J4996J1274k2975K695K1779j5428j3259K3422n32
2227I137k2612J3800J3876k1931r14K1887j2245j3379K0596m4k1318J3554J3109
2240A3516k1520o96K2885j3626j4910K2229J981k3047J1158J5906k0661k917K1987
$$ plain form
2150 10107 -15009 -3759 15103 -7093 -12025 12693 2112 -15582 5385 10379 -13180 -3064
2162 -3064 14242 -7199 -11416 13489 2678 -16276 5350 11942 -12989 -4704 15383 -4676 -12460
2175 -12460 11488 4397 -14164 4696 11304 -12198 -3981 15216 -5106 -12248 12768 5270 -15411
2188 -15411 4296 13646 -11382 -6271 15389 -1801 -12194 10756 6225 -13642 3407 12447 -10265
2201 -10265 -5043 15163 -3100 -12729 11765 7608 -14856 1971 14363 -8952 -7170 14419 -544
2214 -544 -12598 9136 7654 -12835 2161 13435 -9540 -6845 14934 -494 -13753 9669 9137
2227 9137 -13475 325 14201 -7730 -8644 13243 998 -12381 8215 8171 -13147 407 13516
2240 13516 -8004 -8700 14185 559 -14351 7878 9859 -13188 -2030 13876 -6785 -9702 12285
2253A2285j1112j4954K0207K607k1957J0882J5634k0673l597K3168j0248j7071
2265a4829K0369M445k2495Q879J7121j9403n425K2340q413j7007J9068N685k2635
2278a2300P908J7595j8350o345K2091o925j8024J8073P127k2107N994J8327j7337
2291d273p281K1897n920j8450J7153Q029k1604N126J8528j6669q075K1979n464
2304D976j8961J6637R425k2072L941J9423j5473j0151K1648k601j9801J4615J0260
2317A1866k0553K876J8896j4669j0078K1250k830k0050J5042J1245k1359J210
2329g154K0967j3591j2376K0556l25j9867J2483J1878j9807M4K0185j2835j2283
2342a2125K0401R5k0666J2634J3109k0656r03K0964j1275j3882J9349K096k0414
$$ plain form
2253 12285 1173 -13781 6426 9033 -12924 -2042 13592 -7081 -10678 12490 2242 -14829
2265 -14829 5540 9985 -12510 -3631 13490 -5913 -11338 11002 2589 -14418 4650 10335 -12300
2278 -12300 -4392 13203 -5147 -11492 10599 3674 -14350 3723 10850 -11257 -5263 13064 -4273
2291 -4273 -11554 10343 4423 -14027 3126 11155 -10449 -5323 13205 -3464 -11539 10440 4976
2304 4976 -13985 2652 12077 -9995 -6054 13369 -2104 -12255 9393 6792 -13009 1606 11866
2317 11866 -8687 -5811 13085 -1584 -11662 9588 6758 -13292 1750 12995 -8364 -7154
2329 -7154 13813 222 -12154 8402 8077 -11790 693 12571 -7236 -7192 12993 158 -12125
2342 -12125 8276 8371 -12295 339 13448 -7208 -8111 12853 1578 -12304 7045 9141 -11273
2355a1273J0411J3757j8776k245K0333j0509j4184J9423K633k1448R829J5089
2367A3040j8460m497K1332q542j5422J7711M422k0226Q077J4927j7666m191K0392
2380A0897q372j5844J8053N097k0988P328J6729j7215o621K0904o075j7110J6612
2393C395O644k0282N850J6173j6126o265K0332o181j6736J6544P207k1088N055
2406e478J8016j6035q320K0844m055j7819J4815Q400j9898L613J7711j4350q812
2419a1368J9819l564j8030J4590R659k0397K995J8602j3817j0418J9952j753j8474
2432a2204J2832J0389j8866J292J8410j2693j0711J9419r82j9126J2983J1462
2444A2205j9836L46J9438j2012j1851J8593Q28j9274J1117J2480j8069j260J8653
$$ plain form
2355 -11273 -862 12895 -5881 -8126 12207 1698 -12486 6937 9570 -11878 -2049 13040
2367 13040 -5420 -9917 11415 2873 -12549 5162 9584 -10642 -2565 12362 -5304 -9495 10897
2380 10897 2525 -13319 4734 9831 -11157 -3829 12900 -4315 -10936 9968 3893 -13217 3395
2393 3395 10039 -10243 -4393 11780 -4346 -10611 9721 3540 -13196 3348 10555 -10533 -5478
2406 -5478 12538 -3497 -11817 9027 4972 -12847 1968 10368 -9530 -5917 11794 -2556 -11368
2419 -11368 8451 4887 -13143 1447 11106 -9291 -6296 12306 -1511 -11929 8023 6270 -12204
2432 -12204 628 11017 -7849 -6557 11853 -840 -11551 7868 6886 -12240 743 12205
2444 12205 -7631 -7285 12153 141 -11710 6883 7711 -11563 -446 12034 -6035 -7295 11358
2457A1358j0198j2299J7947J260j9094J0530J3191j8549k162J9659r671j3732
2469a1760J7597L739j9828Q439J4198j7244l181J9234q657j4000J7209L198j9014
2482a0070Q167J4615j7644m080J9837p455j5241J6142N295j9554O773J5066j5729
2495c878n188J9111o853j5115J6272N327j9705O606J5870j6215o423J9980n202
2508D587j6764J4876P692j9752M722J6349j4676p040J8659m404j6532J4759P780
2521A0256j9570L876J7502j4663q473J9083k903j7131J2984R520j8855J820J7249
2534A0695j2273r608J8354j948j6945J2535R306j8930K053J8181j2545j0835J8726
2547F766k80j8212J1162J1223j7766R7J7259j0461j0869J7269N0j7275J0190J1883
$$ plain form
2457 11358 1160 -11139 6808 8068 -11026 -496 12695 -5854 -8016 11643 1972 -11760
2469 -11760 5837 9576 -10252 -1813 12385 -4859 -8040 11194 2537 -11463 5746 8944 -10070
2482 -10070 -1903 12712 -4932 -9012 10825 3370 -11871 4271 9566 -9988 -3215 11851 -3878
2495 -3878 -9066 10045 3192 -11923 4349 9676 -10029 -3423 12447 -3768 -10191 9789 4587
2508 4587 -12177 2699 10391 -9361 -4639 11710 -2966 -10006 8653 4249 -12283 2476 10256
2521 10256 -9314 -5438 12064 -2599 -11072 8011 5108 -12023 961 10481 -8374 -6554 10695
2534 10695 -1578 -11186 7168 5220 -11725 810 10116 -8814 -6761 11420 -1125 -11960 6766
2547 6766 6486 -11726 -564 10659 -7107 -7010 10249 -212 -11081 6188 6238 -11037 -847 11036
2561A1036j7935o33J8609j0265j2521J7387K231j8801R633J2453j7083j683J7946
2574A0374r396j1951J6521K189j8075R320J2880j7017l208J8857p951j3878J6113
2587D778M149j8616P278J4253j5839m346J8293p285j3441J5484M684j8917O920
2600b605J4445j5706m608J8716o498j4762J5035N681j8058M931J5301j4586o159
2613h873J8364m980j5422J3863O817j8113M373J5292j3513p482J8338l928j5792
2626a1056J3203P588j7792L390J5928j2879q288J7612k735j5750J2244Q322j7405
2639g618K021J6465j1933r149J7672j997j6522J1471R878j7630Q46J6973j1328
2652h51j0317J7451k34j6734J0513R940j6511J71J6663j0808j0502J7317O5j7424
$$ plain form
2561 11036 -6899 -7532 11077 812 -11709 5678 7909 -10892 -1259 11194 -5889 -7572 10374
2574 10374 978 -10973 5548 7737 -10338 -1018 11862 -5155 -8363 10494 2543 -11335 4778
2587 4778 8927 -9689 -2411 11842 -3997 -8343 9950 2665 -10776 4708 9392 -9525 -2605
2600 -2605 11840 -3866 -8474 10242 3744 -11018 4017 9698 -8360 -3429 11872 -2714 -8873
2613 -8873 9491 4511 -10911 2952 9769 -8344 -3971 11321 -2192 -9674 8664 4736 -11056
2626 -11056 2147 9735 -8057 -4667 11261 -1618 -9906 7706 4971 -10779 1465 9787 -7618
2639 -7618 -5597 10868 -1065 -10214 7458 5461 -11061 410 10288 -7342 -6496 10477 -851
2652 -851 -11168 6283 6049 -10685 -172 9768 -6743 -6572 10091 -717 -11219 6098 6163 -11261
2666a1261J0529J0929j6734j136J7393r195j1312J5583J627j6595Q838J1587j6117
2679e864j390J6811r269j1604J6749K192j8062Q488J2856j5730l397J7179o808
2692B151j3016J5027L658j6893P062J2558j4973l500J7683p244j3625J5179M786
2705H853j7939N911J4443j4150n692J7274n164j3253J3347M696j6557N302J3813
2718A0884j3734o062J7836m734j4732J3965O495j7816L688J5007j2307p074J6579
2731G995l270j4402J2466O537j6731L300J4920j2358p443J7339k897j5776J1677
2744A357Q420j6316J280J5755j1114q681J6247j408j5554J1177Q292j6423J610
2757e358J5915j0881r514J6390n58j6142J0411R826j6077m12J6165r706r928J5870
$$ plain form
2666 -11261 -732 10197 -6537 -7673 9720 525 -10787 4796 6423 -10172 -1334 10253 -5864
2679 -5864 -7254 9557 288 -11316 5433 7625 -10437 -1949 10907 -4823 -8220 8959 2151
2692 2151 -10865 4162 7820 -9073 -2011 10547 -4426 -7926 9757 2513 -11112 4067 8853
2705 8853 -9086 -3175 11268 -2882 -8574 8700 3536 -9717 3630 8326 -8231 -2929 10884
2718 10884 -2850 -8912 8924 4190 -10542 3423 9918 -7898 -4210 10797 -1510 -8584 7995
2731 7995 4725 -9677 2789 9326 -7405 -4105 10815 -1543 -8986 8353 5456 -10320 1357
2744 1357 9777 -6539 -5259 10496 -618 -9299 6948 5540 -10014 1163 9455 -6968 -5358
2757 -5358 10557 -324 -9838 6552 5994 -10148 263 10089 -5988 -6400 9765 59 -9869 6001
2771F001Q7j6326R905J0253j5942r98J6185q615j0885J5631J123j5931P835J1322
2785I645j5015k126J6757q209j2002J5298K814j6633P162J1751j4023k779J6129
2798H769p357j1966J4302L273j6024O476J2313j3870m215J6742n751j3496J3602
2811B798N154j6667N710J3041j3253n107J6301n404j2687J3393M727j6447N174
2824c267J3539j2973n661J6200l938j3979J2104O737j6270L201J4033j2082n822
2837h178J6069l713j4245J2482O548j6451L159J4822j1724p745J6746k103j5228
2850i561J0855P590j5355J685J4614j0808p610J5723j947j4854J0990Q551j6038
2863f165N37J5802j0264r244J5535j06j5309R421R293j4991J48J4665r247q995
$$ plain form
2771 6001 6088 -10238 -333 9920 -6022 -7020 9165 550 -10335 5296 6419 -9512 -1677 9645
2785 9645 -5370 -7496 9261 1052 -10950 4348 7162 -9471 -2309 9442 -4581 -7360 8769
2798 8769 1412 -10554 3748 7021 -9003 -2527 9786 -4084 -8299 8443 2692 -10804 2798
2811 2798 7952 -8715 -3005 10036 -3217 -8324 7977 2573 -10114 3279 8006 -8441 -3267
2824 -3267 10272 -2701 -8362 7838 3900 -10079 2025 8762 -7508 -4307 9726 -2356 -8178
2837 -8178 7891 4178 -10067 2415 8963 -7488 -4329 10493 -1231 -8976 7770 5667 -9561
2850 -9561 1294 8884 -6471 -4786 9828 -980 -8590 7133 5186 -9668 1322 9873 -6165
2863 -6165 -5628 10174 -90 -9334 6201 6095 -9214 207 9500 -5491 -5343 9322 75 -8920
2877h920J4977M55j5737Q924R867j5141o04J5390q156j0522J4295J739j5342P981
2891g94J0099j4193j751J5632p824j0850J3813K655j5368O707J1485j3802l180
2904g371J5397o330j1569J3643L257j5512O423J1511j3304l561J5051n627j1772
2917i764J2915M193j5824N413J2164j2803m253J5341m807j2499J2321N148j5557
2930h012M156J3100j2156n410J5508m095j2923J1659N798j5129L445J3540j1623
2943b142o336J5346l145j3535J1397O489j5148K678J3649j0317p470J4802k218
2956D050j3315J0398P452j4616J502J3703j0263p197J4526j302j3723R240Q806
2969I261j4604M81J3621q970p990J3753J31j3976Q483R065j4663L27J4480r035
$$ plain form
2877 -8920 6057 6512 -9225 -301 9566 -5575 -6179 9211 1055 -9467 4828 6567 -8775 -794
2891 -794 9305 -4888 -6639 8993 1169 -9681 4132 6787 -8581 -1874 9611 -4191 -7371
2904 -7371 8026 1696 -9873 3770 7027 -8485 -2062 9449 -3855 -7416 7635 2008 -9764
2917 -9764 3151 7344 -8480 -3067 9097 -3706 -7959 7382 2575 -9924 2397 7545 -8012
2930 -8012 -3856 9244 -2912 -8322 7186 3091 -9832 1827 7625 -7504 -4059 9481 -2142
2943 -2142 -8478 6868 3723 -9812 1585 8074 -7074 -4396 9253 -1064 -8534 6268 4050
2956 4050 -9265 1133 8585 -6031 -4529 9174 -1089 -8286 6240 4938 -8785 455 9261
2969 9261 -5343 -4862 8759 -211 -8201 5552 5683 -8293 190 9255 -5408 -5081 9399 364
2983C64q955J4181O82j4551P966R415j3597j305J4346p114r829J3445J102j4041
2997g891P555R247j3248j815J4694p095j0314J3357K373j4604O506J0726j2974
3010c483k822J4241n970j0485J2238L107j4397N704J0841j2508l498J5087n917
3023B138j1377J2442M071j4314M329J1678j1629m701J4350m566j1388J1322M477
3036F832j4180M212J2142j1652n212J4708l502j2521J0640N910j4175K725J2450
3049H377j0282o134J3991k755j2228J0167O017j3679K291J2625j0401o267J3951
3062E673j494j3074R383P601j4140R88J3235r121p317J3682j076j2838Q617P854
3076G973j3576O05J3777r043q209J3850m30j3589Q423Q194j2775m84J3514q258
$$ plain form
2983 364 -8591 5590 6272 -8279 -313 9102 -4495 -5800 8546 1432 -8397 5048 6150 -7891
2997 -7891 -336 8911 -4337 -6152 8542 1447 -8867 4490 6863 -7741 -1235 9491 -3483
3010 -3483 -6305 7936 1966 -8519 3719 6826 -7571 -1867 8974 -3534 -7032 8055 2138
3023 2138 -9239 3203 7274 -7040 -2711 8967 -2662 -7363 6987 2421 -8967 2355 6832
3036 6832 -7348 -3136 9006 -2646 -7858 6850 3348 -9173 1467 7377 -6798 -4073 8377
3049 8377 -1905 -8039 5952 3197 -9031 1136 7153 -6526 -4235 8390 -2011 -8278 5673
3062 5673 4179 -8895 488 8089 -6051 -5063 8172 -949 -8266 5416 4340 -8498 119 7973
3076 7973 -5603 -4998 8779 -264 -8473 5377 4947 -8642 -219 7975 -4800 -5284 8230 -28
3090b8q096J3127K00j3056P835Q464j3040r01J3626p270r117J2853J521j3563
3104g445O605R497j2238k197J3473o297r407J1980K401j3538N845R632j1792k345
3118e826J3495n660j0470J2165L088j3758N156J0594j1399l558J3439m605j0575
3131g914J0773L964j3361M392J0626j0859m006J3485m181j1185J0942M045j3160
3144f439L356J1257r947n084J2772k581j1375R883N114j3033K755J1389r876n131
3158f940J2890k376j1656R072O484j3456J926J1979q986o471J2819j388j1819
3171g922Q381O693j2756J259J1819q325o622J2459j016j2055Q268P245j2495J25
3185d942J2417p711p466J1855L35j2281P816P255j2140k60J2312p237q078J2377
$$ plain form
3090 -28 -8124 5003 5203 -7853 -18 8446 -4594 -5495 8131 861 -8256 4597 6118 -7445
3104 -7445 -840 8657 -3581 -5778 7695 1398 -8009 3971 6372 -7166 -1321 8311 -3481 -5826
3118 -5826 7669 2009 -8461 3704 6792 -6966 -1810 8784 -2615 -6173 7266 2661 -7914
3131 -7914 2859 6823 -6538 -2146 8480 -2379 -6385 7100 2919 -8266 2676 6721 -6439
3144 -6439 -3083 8174 -1773 -6857 5915 3334 -8041 1842 6956 -6077 -3322 8067 -1809 -6940
3158 -6940 5950 3574 -8082 990 7474 -5982 -4056 7923 -1063 -7534 5285 3897 -7922
3171 -7922 459 7152 -5604 -4345 7474 -851 -7473 4986 3970 -8085 183 7428 -5067 -4942
3185 -4942 7475 -236 -7702 4153 4488 -7793 23 7278 -4862 -5122 7190 -47 -8125 4252
3199D252P79j2815O658Q619j1655j114J2314o218q549J1306J778j2608O226Q855
3213G828j1308k127J2761n820r441J1582K424j2737M911R921j1066k447J2063
3226F544m615r497J0609K570j2080M887R326j0259l221J2309m513r688J0444L649
3240F465j2212L653R798r607m315J2422l391j0073R391M452j2252L031J0354r566
3254a850m260J1968k750j0533R306M795j2087K398J0857q930n512J2082k004j0768
3268g288Q821N379j2137J984J0402q158n619J1726j466j1044Q255N849j1690J112
3282c874J1121p884o287J1602n92j1238P205O782j1029l47J1328p082o724J1198
3296D179J79j1329O647P153j1188l86J1325o048q008J1074J062j1589O009P688
$$ plain form
3199 4252 5031 -7784 -1126 7493 -4162 -5276 7038 820 -7729 3577 5355 -7253 -1027 7828
3213 7828 -3480 -5607 7154 1334 -8107 3475 5899 -6838 -1927 7994 -3072 -5519 6544
3226 6544 1929 -7568 3041 5611 -6469 -1582 7744 -2515 -5736 6573 2060 -7628 2816 6465
3240 6465 -5747 -2094 7704 -1903 -6218 6204 2813 -7260 2131 6583 -5669 -2638 7716 -1850
3254 -1850 -6110 5858 3108 -7425 1881 6676 -5411 -3013 7844 -1086 -6598 5484 3480 -7288
3268 -7288 1533 6912 -5225 -3241 7161 -997 -6616 5110 3644 -7400 855 6704 -4986 -3874
3282 -3874 7247 -637 -6924 4678 4086 -7152 53 6835 -4194 -4541 6787 -295 -7019 4179
3296 4179 4358 -6971 -324 6829 -4359 -4745 6580 532 -7476 3598 4660 -6929 -920 6768
3310F768j0175j582J1337n784p820J0364J515j1171N161Q221j0867j588J1671
3323F050m768q905J0238K640j1671M281Q613r338k614J1222m075q763R626K616
3337E152j1353M277Q644r299l055J1376l887q982R001L778j0889K882R073q580
3351a862l931J1435l338r061Q922L839j1308K677R822q541m650J1243k410r565
3365f728Q009N015j0855J460J0132q258m284J0591j930r739P698N412j1035J274
3379c238J0655p816n737J0837p40r844O448N584r930J79J0305o828o061J0647
3393D461q04r567O198O322j0136k81J0393o281o428R813N49j0211N556O829r821
3408c408p20J0149n520p160J0268P55j0291N159O894r298j482J0556n160p273
$$ plain form
3310 6768 -3407 -4989 6348 564 -7256 3108 4623 -6548 -1387 6834 -4033 -5621 6050
3323 6050 1282 -7623 2615 5255 -6416 -2135 6478 -2860 -5474 5748 1673 -7090 2536 5152
3337 5152 -6201 -1924 6720 -2579 -5634 5742 1855 -7127 1874 5652 -5237 -2355 6718 -1862
3351 -1862 -5793 5642 2304 -6757 2165 6004 -5304 -2627 7195 -1346 -5996 5247 2837 -6728
3365 -6728 1281 6296 -4559 -3099 7033 -1225 -5509 5082 3152 -6587 1111 6523 -4512 -3238
3379 -3238 7417 -399 -6136 4701 3961 -5883 565 6149 -3781 -3602 6703 -125 -6186 4461
3393 4461 3657 -5910 288 6610 -3526 -3807 6586 305 -6123 3690 4239 -5972 -416 6413 -3408
3408 -3408 -4128 6021 501 -6659 3609 4364 -5927 -768 6126 -3172 -4654 5902 742 -6531
3422f531R490J923j0922M745P528r299j646J0262m431p731R038K000j0091M037
3436a628P840q885k424J0262l570p954Q009L262j0464L638Q269q537l375J0361
3450D804l086q422Q496L376j0382K826Q273p629l593R886k430q665P784M062j0242
3465d942K172Q815p462m089R965j452r271O960M897r878J319R167p198m583R972
3480D392j372r180O820N171r997Q70R339n973n593R277m28q885O016N283r418
3495c678O01R075n925n653R528j85r336N539O318r394m47R478n444n954R065J37
3511C725q918N490N838r017o60R374n141o398Q982J284r898M521O875q627j271
3526c841R099m333o327Q034J618r266M209O766q317j696R369m093o951Q176K069
$$ plain form
3422 -6531 2959 4882 -6040 -1295 6233 -3066 -4712 5550 1119 -6612 2426 4426 -5665 -1628
3436 -1628 6212 -2673 -5097 5165 1595 -6359 1650 4912 -5552 -1914 6355 -2182 -5557 4804
3450 4804 1718 -6704 1792 5168 -5214 -2388 5885 -1744 -5337 4549 2119 -6546 1238 5300 -4942
3465 -4942 -2770 6045 -1417 -5506 4459 3007 -6264 696 5593 -4285 -2966 6201 -997 -5580 4392
3480 4392 3020 -6160 660 5831 -4166 -3296 6043 70 -5523 3754 3326 -5559 457 5740 -3678
3495 -3678 -3077 5998 73 -5580 3948 3763 -5573 -34 6284 -3110 -3557 5921 477 -5477 3588 3725
3511 3725 -5193 297 6135 -2882 -3542 5832 691 -5707 3275 4559 -5339 -818 6057 -2570 -3841
3526 -3841 5258 925 -5402 2632 4250 -5016 -807 5959 -2358 -4054 5315 1222 -5729 2447 4516
3541D516r208L132P307p687k759R219k737p622P552K610q900K587P596p458k844
3556d696R441l035p746P404L609r543J848Q483p121l622R150k056p780O725L649
3571D710r354J904P945n993m324R106j914p691O344M234r253J259Q286o149m344
3586e234Q946j209p987N831M522q951J086Q209n996m652Q852n90q379N865M573
3601D886q104N0Q454n231n129Q361Pq299M709N526q152j96Q238n007n437Q345
3617C021M59q508M595O057q169p86Q386m396n951P917J291q437M036N858p379
3632b006j318Q273m082n974P497J706q590L492O564p532j973Q821l382o703P260
3647B053K258q449L110O197o998j916Q412k978o902P267K245q321K409P147o883
$$ plain form
3541 4516 -4692 -1560 5747 -1940 -4699 4520 1783 -5839 1713 4323 -4577 -1990 5606 -1852 -4696
3556 -4696 4745 1710 -6036 1368 4977 -4566 -2718 5765 -1356 -4978 4172 2116 -5664 1061 4710
3571 4710 -4644 -2740 5205 -788 -5112 3994 2080 -5611 733 4967 -4286 -3027 5259 -890 -5234
3586 -5234 3712 2503 -5484 347 4869 -4082 -2996 5213 -783 -5435 3417 2827 -5552 313 4886
3601 4886 -3218 -3168 5286 55 -5074 3287 3294 -5005 -296 5230 -2922 -3118 5120 113 -5324 3021
3617 3021 3480 -5028 -433 5624 -2545 -3331 5055 659 -5292 2625 3916 -4521 -485 5373 -2006
3632 -2006 -3324 4949 867 -5107 2390 4096 -4494 -1002 5562 -1970 -3943 4878 1496 -5207 2053
3647 2053 4311 -4138 -1028 5169 -1829 -3745 4667 1689 -5213 2054 4299 -4022 -1613 5534 -1349
3662a349k894Q534k294p233O368L022q190K148O832o484k888Q473j900p477O152
3677H20L521q309J897P348n975m113Q417j221p533N775L471p791Q62P436n522
3692i17l769P962p50p642N296M407p805J95P684m687m717P702n97p172M661M325
3708D176p174K03P385m688m715P500L9p717M815M603p653k89P823m116m956P188
3724B424O33p520L627N431p048j026P814l919n568P348J028p414L637N192o886
3739b247j045P747l380o055O827J752p508K708O181o750j927Q043k851o222O525
3754A798J930p596K617O191o296k363P849k534o066O246K115p547K412O188n732
3769g88k832P650k210o340O089K559p629J983O545n917k851P467j649o853N744
$$ plain form
3662 -1349 -4243 4291 1997 -5236 1132 4154 -4036 -1888 4944 -1540 -4428 4045 2145 -5332 820
3677 820 4341 -3968 -2071 5277 -698 -4811 3606 2385 -5148 627 4098 -3693 -2831 4605 -917
3692 -917 -4686 3276 2526 -5116 180 4587 -3218 -3023 4661 -26 -4743 2959 2362 -4810 -149 4176
3708 4176 -2998 -2795 4590 -98 -4813 2687 2726 -4991 -176 4427 -3226 -3515 4308 192 -4764 2424
3724 2424 3057 -4463 -836 4595 -2453 -3479 4335 416 -5152 2196 3224 -4190 -553 4639 -2247
3739 -2247 -3292 4455 1075 -4980 1847 3599 -3909 -1201 4980 -1770 -3697 4346 1495 -4727 1798
3754 1798 3728 -3868 -1251 4940 -1356 -3719 4130 1596 -4470 1776 3891 -3656 -1244 4944 -788
3769 -788 -3620 4030 1820 -4520 1569 4128 -3501 -1518 5027 -890 -3741 3726 2077 -4776 968
3784I68L203p216J297O593n159l988P801j486o413N086L717p573J342O451n051
3799d28l629O979m07o871M418M037p064M15O880m657l979P097m65o765M349M257
3815D167o862m9P346m746m277O896J94p069L942M992p115n59P318l752n147O970
3831B249Q29p374L599M872o529r07P197l337n161O112J613p328L197N347o627
3846b248r87O822k807n362O280J681p322K991N563o294j856P007k455n271N651
3861A393K273p099K217N804n988k208P041j892n849N641K344p046J952N901n676
3876a192k391P232j894o397N744L021p452J622O110m994k944P027j589o239N253
3891I17L194p185J238O193m741l424P006q77o211M569L538o797M68O238m406l504
$$ plain form
3784 968 4171 -3045 -1748 4845 -314 -4302 3499 2013 -4400 686 4403 -3170 -1828 4623 -428
3799 -428 -4057 2922 2515 -4356 62 4099 -2965 -2550 4330 -327 -4306 2791 2326 -4439 -90 4167
3815 4167 -2695 -2744 4602 -144 -4421 2475 2669 -4400 -458 4534 -2581 -3140 4178 426 -4721 2249
3831 2249 3078 -4296 -697 4175 -2354 -3261 3936 599 -4562 1550 3163 -4165 -968 4379 -2248
3846 -2248 -3235 3587 780 -4582 1698 3379 -3943 -952 4611 -1683 -3539 3468 1013 -4258 1393
3861 1393 3666 -3433 -1216 4588 -1400 -3608 3433 1541 -4308 1333 3677 -3369 -1417 4484 -1192
3876 -1192 -3583 3649 1755 -4642 1102 4123 -3329 -1707 4403 -591 -3535 3492 1903 -4336 917
3891 917 4111 -3074 -1836 4357 -384 -3808 3198 2321 -3890 679 4217 -2580 -2112 4126 -280 -3784
3907c784O876m40o730M351L721o599K35O630l992m157O605K41o879M045M279o582
$$ plain form
3907 -3784 3092 2652 -4078 273 3994 -2605 -2370 4260 268 -3889 2716 2957 -3922 123 4402 -2180
$$ [...]
8191i60
##END NTUPLES=NMR FID
##END=
