##TITLE=1H_Pr Am-l
 CDCl3, 8 sc, 
 6.08.2021
##JCAMPDX= 6.0         $$ Bruker NMR JCAMP-DX V2.0
##DATA TYPE= NMR FID
##DATA CLASS= NTUPLES
##ORIGIN= UXNMR, Bruker Analytische Messtechnik GmbH
##OWNER= root
$$ XWIN-NMR		Version 3.5
$$ Fri Aug  6 11:30:13 2021 Russian Standard Time (UT+4h)  she@DPX200
##.OBSERVE FREQUENCY= 200.131506
##.OBSERVE NUCLEUS= ^1H
##.DELAY= (6, 6)
##.ACQUISITION MODE= SIMULTANEOUS
##.ACQUISITION SCHEME= undefined
##.AVERAGES= 8
##.DIGITISER RES= 18
##SPECTROMETER/DATA SYSTEM= spect
##.PULSE SEQUENCE= zg30
##.SOLVENT NAME= CDCl3
##.SHIFT REFERENCE= (INTERNAL, CDCl3, 0, 15.7039)
##AUDIT TRAIL= $$ (NUMBER, WHEN, WHO, WHERE, WHAT)
$$ ##TITLE= Audit trail, XWIN-NMR		Version 3.5
$$ ##JCAMPDX= 5.01
$$ ##ORIGIN= Bruker BioSpin GmbH
$$ ##OWNER= she
$$ F:/spectra/data/she/nmr/H-F/1/audita.txt
$$ ##AUDIT TRAIL=  $$ (NUMBER, WHEN, WHO, WHERE, WHAT)
(   1,<2021-08-06 11:28:42.32 +0400>,<she>,<DPX200>,
      <created by zg, POWCHK disabled, PULCHK disabled
       configuration hash MD5:
       00 E9 B6 7A A2 85 ED C7 34 08 36 98 17 FE 4E 26
       data hash MD5: 16K
       9E 67 36 63 16 03 4F 61 DD 8D 44 9D BE 19 C8 D2>)
$$ ##END=
$$ 
$$ hash MD5
$$ 02 AE E4 5E 05 A1 D8 C7 B5 28 18 18 CA D7 12 27
##$RELAX= 
##$RELAX= 
##$RELAX= 
##$RELAX= 
##$RELAX= 
##$RELAX= 
$$ Bruker specific parameters
$$ --------------------------
##$DU= <F:/spectra>
##$EXPNO= 1
##$NAME= <H-F>
##$PROCNO= 1
##$TYPE= <nmr>
##$USER= <she>
##$AMP= (0..31)
100 100 100 100 100 100 100 100 100 100 100 100 100 100 100 100 100 100 
100 100 100 100 100 100 100 100 100 100 100 100 100 100 
##$AQSEQ= 0
##$AQ_mod= 1
##$AUNM= <au_zg>
##$AUTOPOS= <>
##$BF1= 200.13
##$BF2= 200.13
##$BF3= 200.13
##$BF4= 200.13
##$BF5= 200.13
##$BF6= 200.13
##$BF7= 200.13
##$BF8= 200.13
##$BYTORDA= 1
##$CFDGTYP= 0
##$CFRGTYP= 5
##$CHEMSTR= <none>
##$CNST= (0..31)
1 1 145 1 1 1 1 1 1 1 1 1 1 1 1 1 1 1 1 1 1 1 1 1 1 1 1 1 1 1 1 1 
##$CPDPRG= <>
##$CPDPRG1= <>
##$CPDPRG2= <>
##$CPDPRG3= <>
##$CPDPRG4= <mlev>
##$CPDPRG5= <mlev>
##$CPDPRG6= <mlev>
##$CPDPRG7= <mlev>
##$CPDPRG8= <mlev>
##$CPDPRGB= <>
##$CPDPRGT= <>
##$D= (0..31)
0 1.2 0 0 0 0 0 0 0 0.06 0 0.03 0 0 0 0 0.0002 0 0 0 0 0 0 0 0 0 0 0 0 
0 0 0 
##$DATE= 1628234921
##$DBL= (0..7)
120 120 120 120 120 120 120 120 
##$DBP= (0..7)
150 150 150 150 150 150 150 150 
##$DBP07= 0
##$DBPNAM0= <>
##$DBPNAM1= <>
##$DBPNAM2= <>
##$DBPNAM3= <>
##$DBPNAM4= <>
##$DBPNAM5= <>
##$DBPNAM6= <>
##$DBPNAM7= <>
##$DBPOAL= (0..7)
0.5 0.5 0.5 0.5 0.5 0.5 0.5 0.5 
##$DBPOFFS= (0..7)
0 0 0 0 0 0 0 0 
##$DE= 6
##$DECBNUC= <off>
##$DECIM= 32
##$DECNUC= <off>
##$DECSTAT= 4
##$DIGMOD= 1
##$DIGTYP= 9
##$DL= (0..7)
0 120 120 120 120 120 120 120 
##$DP= (0..7)
150 150 150 150 150 150 150 150 
##$DP07= 0
##$DPNAME0= <>
##$DPNAME1= <>
##$DPNAME2= <>
##$DPNAME3= <>
##$DPNAME4= <>
##$DPNAME5= <>
##$DPNAME6= <>
##$DPNAME7= <>
##$DPOAL= (0..7)
0.5 0.5 0.5 0.5 0.5 0.5 0.5 0.5 
##$DPOFFS= (0..7)
0 0 0 0 0 0 0 0 
##$DQDMODE= 0
##$DR= 18
##$DS= 0
##$DSLIST= <SSSSSSSSSSSSSSS>
$$ [...]
##$SUBNAM2= <"">
##$SUBNAM3= <"">
##$SUBNAM4= <"">
##$SUBNAM5= <"">
##$SUBNAM6= <"">
##$SUBNAM7= <"">
##$SUBNAM8= <"">
##$SUBNAM9= <"">
##$SW= 20.0188882624521
##$SWIBOX= (0..15)
0 0 2 0 0 0 0 0 0 0 0 0 0 0 0 0 
##$SW_h= 4006.41025641026
##$TD= 16384
##$TD0= 1
##$TE= 0
##$TE2= 300
##$TE3= 300
##$TEG= 300
##$TL= (0..7)
0 120 120 120 120 120 120 120 
##$TP= (0..7)
150 150 150 150 150 150 150 150 
##$TP07= 0
##$TPNAME0= <>
##$TPNAME1= <>
##$TPNAME2= <>
##$TPNAME3= <>
##$TPNAME4= <>
##$TPNAME5= <>
##$TPNAME6= <>
##$TPNAME7= <>
##$TPOAL= (0..7)
0.5 0.5 0.5 0.5 0.5 0.5 0.5 0.5 
##$TPOFFS= (0..7)
0 0 0 0 0 0 0 0 
##$TUNHIN= 0
##$TUNHOUT= 0
##$TUNXOUT= 0
##$USERA1= <user>
##$USERA2= <user>
##$USERA3= <user>
##$USERA4= <user>
##$USERA5= <user>
##$V9= 5
##$VALIST= <valist>
##$VCLIST= <CCCCCCCCCCCCCCC>
##$VD= 0
##$VDLIST= <DDDDDDDDDDDDDDD>
##$VPLIST= <PPPPPPPPPPPPPPP>
##$VTLIST= <TTTTTTTTTTTTTTT>
##$WBST= 1024
##$WBSW= 4
##$XGAIN= (0..3)
0 0 0 0 
##$XL= 0
##$YL= 0
##$YMAX_a= 122050
##$YMIN_a= -205684
##$ZGOPTNS= <>
##$ZL1= 120
##$ZL2= 120
##$ZL3= 120
##$ZL4= 120
##$ABSF1= 10
##$ABSF2= 0
##$ABSG= 5
##$ABSL= 3
##$ALPHA= 0
##$AQORDER= 0
##$ASSFAC= 0
##$ASSFACI= 0
##$ASSFACX= 0
##$ASSWID= 0
##$AUNMP= <proc_1d>
##$AZFE= 0.1
##$AZFW= 0.1
##$BCFW= 1
##$BC_mod= 2
##$BYTORDP= 1
##$COROFFS= 0
##$CY= 11.3945322036743
##$DATMOD= 1
##$DC= 2
##$DFILT= <>
##$DTYPP= 0
##$F1P= 2.36226072786647
##$F2P= -0.459571619588291
##$FCOR= 0.5
##$FTSIZE= 0
##$FT_mod= 4
##$GAMMA= 1
##$GB= 0.15
##$INTBC= 1
##$INTSCL= 1
##$ISEN= 128
##$LB= 0.24
##$LEV0= 0
##$LPBIN= 0
##$MAXI= 10000
##$MC2= 0
##$MEAN= 0
##$ME_mod= 0
##$MI= 1.114404
##$NCOEF= 0
##$NC_proc= 0
##$NLEV= 6
##$NOISF1= 3.799351
##$NOISF2= 2.8
##$NSP= 1
##$NTH_PI= 0
##$NZP= 0
##$OFFSET= 15.70392
##$PC= 1
##$PHC0= -13355.46
##$PHC1= 13.60099
##$PH_mod= 1
##$PKNL= yes
##$PPARMOD= 0
##$PSCAL= 0
##$PSIGN= 0
##$REVERSE= no
##$SF= 200.130013532006
##$SI= 16384
##$SIGF1= 3
##$SIGF2= 2
##$SINO= 400
##$SIOLD= 16384
##$SREGLST= <1H.CDCl3>
##$SSB= 0
##$STSI= 0
##$STSR= 0
##$SW_p= 3612.71676300578
##$SYMM= 0
##$S_DEV= 0
##$TDeff= 0
##$TDoff= 0
##$TI= <>
##$TILT= no
##$TM1= 0
##$TM2= 0
##$TOPLEV= 0
##$USERP1= <user>
##$USERP2= <user>
##$USERP3= <user>
##$USERP4= <user>
##$USERP5= <user>
##$WDW= 1
##$XDIM= 8192
##$YMAX_p= 0
##$YMIN_p= 0
$$ End of Bruker specific parameters
$$ ---------------------------------
##NTUPLES= NMR FID
##VAR_NAME=  TIME,          FID/REAL,        FID/IMAG
##SYMBOL=    X,             R,               I
##VAR_TYPE=  INDEPENDENT,   DEPENDENT,       DEPENDENT
##VAR_FORM=  AFFN,          ASDF,            ASDF
##VAR_DIM=   8192,          8192,            8192
##UNITS=     SECONDS,       ARBITRARY UNITS, ARBITRARY UNITS
##FACTOR=    0.0002496,     1,               1
##FIRST=     0,             0,               0
##LAST=      2.0444736,     0,               0
##MIN=       0,             -205684,         0
##MAX=       2.0444736,     122050,          0
$$ Real data points
##PAGE= N=1
##DATA TABLE= (X++(R..R)), XYDATA
$$ [...]
1883e22M53M77l53q57O78k48K5P25l49j084Q57L37o57N15Q0j038P38M79k11o84
$$ -522 -69 408 55 -802 -124 -372 -347 378 29 -1055 -198 139 -518 -3 77 -961 -223 256 45 -639
1903f39N32j41O7N39p00m89Q31Nm54M92J02q38J64Q24n52k88N74J31n50L66N7
$$ -639 -107 -248 -181 358 -342 -831 0 5 -449 43 145 -693 -529 295 -257 -545 29 160 -390 -24 33
1924C3m73N97J35o27O56j86n03M55O81p08j10M04k33P7L72j23m91L93o1J39m6
$$ 33 -440 157 292 -335 321 135 -368 87 768 60 -50 354 121 198 570 447 -44 349 288 427 381
1945C81k40q8K17M29q14K90M72m31k86N54On85M25K23m06J81l86k61N42J06n16
$$ 381 141 53 270 699 -115 175 647 216 -70 484 490 -95 330 553 147 328 -58 -319 223 329 -187
1966a87L30j17k5j71N02j99n44M58l2k04J07o0MJ56k24j17O8L51k48k65L71k1
$$ -187 143 26 1 -170 332 133 -411 47 15 -189 -82 -142 -138 18 -206 -323 -255 96 -152 -417 -46 -67
1988f7k42L37L5j59j92K04j89k8K28k91K86q9l5j3J59P3o6J18N4n89L94j71J53
$$ -67 -309 28 63 -96 -288 -84 -273 -301 -73 -364 -78 -167 -202 -215 -56 17 -49 69 123 -466 -72 -243 -90
2011i0J52k87R5j8K48L9j58k3L79l93K73n0k74J96Q4Jr6J14K5j26k93J86J77J82
$$ -90 62 -225 -130 -148 100 139 -19 -42 337 -56 217 167 -107 89 173 174 78 192 217 91 -202 -16 161 343
2035C43k86J28L27j00k54K47j06L0K69m99K22M9K9l81O9j30K07j28L08k46j76
$$ 343 57 185 512 412 158 405 299 329 598 99 321 370 399 18 87 -43 164 36 344 98 -78
2056g8K63l68P9J37j20j37J99lkk69J33j1o8k7MJ59K6j18j29K42J29l21Q4K1P8
$$ -78 185 -183 -104 33 -87 -224 -25 -28 -30 -299 -166 -177 -245 -272 -268 -109 -83 -201 -330 -88 41 -280 -196 -175 -97
2081i7l11J55M1R4m2k02K21J21M1l00M6LO2LK0P9o6lq2M09k27k0L19J9n1j67O1
$$ -97 -408 -253 -212 -118 -160 -362 -141 -20 21 -279 -233 -230 -168 -165 -145 -66 -132 -135 -217 192 -35 -55 264 283 232 65 126
2108A26j12o6J07j17J56q5q2L05m8K17J10m29J04M7j59J47p5k26M12m6j98j10
$$ 126 14 -52 55 -62 94 9 -73 232 184 401 511 82 186 233 74 221 146 -80 332 286 88 -22
2130b2N5L03k03j5J64k98J86j32j57j35M53k16RJ34rm66N30n0k30r5K60l88Q5
$$ -22 33 336 133 118 282 -16 170 38 -119 -254 199 -17 -8 126 117 -349 181 131 -99 -194 66 -322 -237
2153b37J17J32Mp3k2o1p1R1K69k12K5k21M5J98m78J39L48q6l37R3J02J07N7K0
$$ -237 -120 12 16 -57 -79 -140 -211 -120 149 -63 -38 -259 -214 -16 -494 -355 -7 -93 -430 -337 -235 -128 -71 -51
2177e1m70L77J0k7j03J59j76K77l8k91J68L91k01o1J31k23K7M03j96l67L62L15
$$ -51 -521 -144 -134 -161 -264 -105 -281 -4 -42 -333 -165 226 25 -36 95 -128 -101 302 106 -261 101 416
2199D16l34J77M56q04j29M86K29l51M6j39N2K56r8l35K91m3J53L2N9p71L30L84
$$ 416 82 259 715 -89 -218 268 497 146 192 53 105 361 263 -72 219 176 329 361 420 -351 -21 363
2221C63j25l6N3k56j38O98r0p37L07J80k71M96l87n83O38N07q30K14Lm2l66R69
$$ 363 238 202 255 -1 -139 559 469 -268 39 219 -52 444 57 -526 112 619 -211 3 6 -36 -402 567
2243E67n52m34K62L08l94J43J68p22L46O60n16p9J21O1m43J092n66n90N55J65
$$ 567 15 -419 -157 151 -243 -100 68 -654 -308 352 -164 -243 -122 -61 -504 588 22 -568 -13 152
2263A52n20K45J96q28L83Q04n37l30M04l40j10O90n3j134Q56N65o02N19p1o70
$$ 152 -368 -123 73 -755 -372 432 -105 -435 -31 -371 -481 209 156 -978 -122 443 -159 360 289 -381
2283c81L36N27k99n11K03J8K61M18l4q81L84M30l54J53m4q36L16J045o53q6K54
$$ -381 -45 482 183 -328 -125 -107 154 572 538 -343 41 471 117 270 226 -610 -294 751 98 12 266
2304B66k91L1Q85l47j066N23P55p44K28J87r92N01R25n18q43O98k65J11P19k91
$$ 266 -25 6 891 544 -522 1 756 12 240 427 -565 -64 861 343 -500 198 -67 44 763 472
2324D72j338R05L64n46J97p8n95N40J031p80o93O50n70R1Q73l93j091P26P37r90
$$ 472 -866 39 403 -143 54 -24 -619 -79 952 172 -521 129 -441 -350 523 130 -961 -235 502 -488
2344d88N12K64r75L23J012r09l22L63j46P5O02k10j007Q86K59k65r1R7q42L91
$$ -488 24 288 -687 -364 648 -261 -583 -220 -366 -291 311 101 -906 -20 239 -26 -117 -20 -862 -471
2364d71R42n90p34Q20Kk33O85j77p88N67L91n00K22K16q47N13Q34p94m60L77l0
$$ -471 471 -119 -853 -33 -31 -264 421 244 -544 23 414 -86 136 352 -495 18 852 58 -402 -25 -55
2385e5n3N38Kp04L81O12r66N19l1n73M14P53r34j02M29k7j41N09l92n71P93K69
$$ -55 -108 430 432 -272 109 721 -245 274 243 -330 84 837 -97 -199 230 203 62 571 179 -392 401 670
2407F70q85M87O1o51J90Q24r52j77O03M9l67j4K44l50M0P64n80rr6m33L28O23
$$ 670 -215 272 333 -318 -128 696 -256 -433 170 219 -148 -162 82 -268 -228 536 -44 -53 -149 -582 -254 369
2429C69m74n97O07O8l55P13k67o20N58J74n36lN38o00N08J17l70n12M77K21n63
$$ 369 -105 -702 -95 -27 -382 331 64 -556 2 176 -360 -363 175 -425 83 200 -170 -682 -205 16 -547
2450e47K89Q8m51L58O21p93J15L34j43J07M55o73n2J95K81l17J57J94m08N50J78
$$ -547 -258 -170 -621 -263 358 -435 -320 14 -129 -22 433 -240 -292 -97 184 -133 24 218 -190 360 538
2471E38n46P2K35l05R1M88l57k97M54k43k91M36j42m02N45J54l67J29j28j32J19
$$ 538 -8 64 299 -6 85 573 216 -81 373 130 -161 275 133 -269 276 430 63 192 64 -68 51
2492E1L60m49k9L58k91L86p4l33j00K55p2k45K84K12l82Q7J45j01k03J00M21l58
$$ 51 411 -38 -67 291 0 386 312 -21 -121 134 62 -183 101 313 -69 18 163 62 -141 -41 380 22
2514B2M1k99M2J66J98m63J08J12k42P4L36k29%K72j98j63J64k41K93q0J33k77
$$ 22 63 -236 -194 -28 170 -293 -185 -73 -315 -241 95 -134 -134 138 -60 -223 -59 -300 -7 -87 46 -231
2536b31O6j49n5K06L29k74p9K34k64N3J55j29q6J32J33q6j13K12j93J11K21j97
$$ -231 -165 -314 -369 -163 166 -108 -187 47 -217 -164 -9 -138 -224 -92 41 -45 -158 54 -139 -28 193 -4
2558dk64M18k9Q1J29k84n5O5j27K87r1mO8l0J32j84J2K06k40j32L5J39J9k4m4
$$ -4 -268 150 121 202 331 47 -8 57 -70 217 126 122 190 160 292 108 120 326 86 -46 -11 128 147 123 79
2583G9L10l66N7j32L04k95k54M59L03m59L8J4O3k91K36l1l18J28p5O8J45J07l59
$$ 79 389 23 80 -52 252 -43 -297 162 465 6 44 58 121 -170 66 35 -283 -155 -230 -162 -17 90 -269
2606b69k5L92o9l4q9J21j6l13K42j67j9K3J44j97J87j53J2J92l45L38j03j34J06
$$ -269 -294 98 29 -5 -94 27 11 -302 -60 -227 -246 -223 -79 -276 -89 -242 -230 -38 -383 -45 -148 -282 -176
2629a76J70l41M01k93pM25l34o5J19L15j34j81Q5j75J7J84j96K51L8n6J92o6J7
$$ -176 -6 -347 54 -239 -246 179 -155 -220 -101 214 80 -101 -16 -191 -174 10 -186 65 103 47 239 173 190
2652A90j90J45r6J31j37J5L21j36j51K85m85J30J09l20L55J03j07j98K32j33j25
$$ 190 0 145 49 180 43 58 379 243 92 377 -108 22 131 -189 166 269 162 -36 196 63 -62
2673f2J36J14n4L0j41J21j0l21L86p0m81K90n5M5j9J23j16L3O8K45l25M3Ok3J19
$$ -62 74 188 134 164 23 144 134 -187 199 129 -352 -62 -117 -72 -91 32 -84 -51 17 262 -63 -20 -14 -37 82
2698H2m2j83J74j28q3J35J00k39j67M45k44j86J70j8Rj4J97j62M2J03m08J53L02
$$ 82 40 -143 31 -97 -180 -45 55 -184 -351 94 -150 -336 -166 -184 -175 -189 8 -154 -112 -9 -417 -264 38
2721C8J7Qj80K15j49K1L62j71j38p5Q8J14l70L08k2M24m66J09j81J01J35l29K44
$$ 38 55 63 -117 98 -51 -30 332 161 23 -52 36 150 -220 88 66 490 24 133 -48 53 188 -141 103
2744A03q2L42p2m77O22r1k15J12j48j8O0K43l46n6L45j70J43j99m2n4N85k24n13
$$ 103 21 363 291 -186 436 345 130 242 94 76 136 379 33 -23 322 152 295 96 54 0 585 361 -152
2767a52K43J24j11o3N2l27K00Q6j39K33N3k34l11M19J56n31P1J58j57L14p1l09
$$ -152 91 215 104 41 93 -234 -34 52 -87 146 199 -35 -346 73 229 -302 -231 -73 -230 84 13 -296
2789b96P4L24m29J47K19l44j87O12l66j2K93j52r1J03m5j77P8L68j81n4J58l51
$$ -296 -222 102 -327 -180 39 -305 -492 120 -246 -258 35 -117 -208 -105 -150 -327 -249 119 -62 -116 42 -309
2811c09K02L70k17m08K21l8J55L40j41n30M29K61m28J97k40K1K33J14j17m07M33
$$ -309 -107 263 46 -362 -141 -179 -24 316 175 -355 74 335 -93 104 -136 -115 118 232 115 -292 141
2832A41J13j22J18j25k15Q9M76l96m60P22l89K20M59o69m66N53L44l19R4qm00
$$ 141 254 132 250 125 -90 -1 475 79 -381 341 -48 172 631 -38 -504 49 393 74 168 160 -240
2853b40L99M65o22m8M3r8Q3M21k63n76O32J34o08M41J71n15J84J69l07k8L51l59
$$ -240 159 624 2 -46 -3 -101 -18 403 140 -436 196 330 -278 163 334 -181 3 172 -135 -163 188 -171
2875a71k49O71n1q43O41J86n83L12J41m49M12K02o21q1M29m00L87J00j95l11N98
$$ -171 -420 251 200 -643 -2 184 -399 -87 54 -395 17 219 -402 -483 -54 -454 -67 33 -162 -473 125
2896A25jk06K11r2o86M90N56p86n5M21m16R3N61m54j08L69r2j36J33J65o40Q83
$$ 125 124 -82 129 37 -649 -159 397 -389 -444 -23 -439 -346 215 -239 -347 22 -70 -206 -73 92 -548 335
2918C35J14n54j38N09l98K41K64k27p04N33J63k93M31l31l52N34N57p41PJ86j89
$$ 335 449 -105 -243 266 -132 109 373 146 -558 -25 138 -155 276 -55 -407 127 684 -57 -50 136 -53
2939e3K89K90k38n06R2L38j63r1K12m88M65M78n16l28L44J80j93j39R3l27M41
$$ -53 236 526 288 -218 -126 212 49 -42 170 -318 147 625 109 -219 125 305 112 -27 66 -261 180
2960A80O9j61P6k31k29J91M90l09m01M66N3n60O58o40j99N92J8k40J08j39j64
$$ 180 249 88 164 -67 -296 -105 385 76 -325 141 194 -366 292 -348 -547 45 63 -177 -69 -208 -372
2981c72J94N71n07m73L38R7k1J24m8j77M51j08j43J5L8k95M02L66n47k72O06m04
$$ -372 -178 393 -114 -587 -249 -152 -173 -49 -97 -274 177 69 -74 -59 -21 -316 86 452 -95 -367 239 -165
3003a65K78L30n10k66O10O9n24K70K3L0j37L77m28j75O93k62j34K38m07K12R1
$$ -165 113 443 -67 -333 277 346 -178 92 115 145 8 385 -43 -218 475 213 79 317 -90 122 213
3024B13J25m54L14Mk09L86j79Kj57o7M48l47L51k24j61K83j0l29J47O1k64k0J67
$$ 213 338 -116 198 202 -7 379 200 202 45 -22 426 79 430 206 45 328 318 -11 136 197 -67 -87 80
3047H0q9RJ67j97k68K68Kl88O09K21n11P8l4j11J00J2M3n09N26j09k01M78m60
$$ 80 -9 0 167 -30 -298 -30 -28 -416 193 414 -97 -19 -53 -164 -64 -52 -9 -518 8 -101 -302 176 -284
3070b84p2M77j42l60K84K41l37J74J61l60J69O7P2l54K74j89M6L36P0n26J31M46
$$ -284 -356 121 -21 -381 -97 144 -193 -19 142 -218 -49 18 90 -264 10 -179 -133 203 273 -253 -122 324
3092C24l72m4K27m5j65L19l76K05P5K32l31m0R4J36j83mJ90l22K11q3J43k10K72
$$ 324 -48 -92 135 90 -75 244 -132 73 148 380 49 9 103 239 56 52 242 -80 131 48 191 -19 253
3115B53l11L22m4j33m0R3k77M20k89k3J20Q9k23J04j1J7J6j52K00l87K06J83l0
$$ 253 -58 264 220 87 47 140 -137 283 -6 -29 91 180 -43 61 50 67 83 -69 131 -256 -50 133 103
3138A03l02K91j41K40o1o2Mp2k48K15j18J12J11j40O1Mj63P1l0O5k26K04l4J43
$$ 103 -199 92 -49 191 130 68 72 0 -248 -33 -151 -39 72 -68 -7 -3 -166 -95 -125 -60 -286 -82 -116 27
3162B7p3k18Q0J07K07j39M6o2R8m17M11q9m6k11L76R5k63J33j03l7K76j65K68
$$ 27 -46 -264 -184 -77 130 -9 37 -25 73 -344 67 -22 -68 -279 97 192 -71 62 -41 -78 198 33 301
3185C01m61J58j2KK48K6j61J69m75J54M3M0J84j91n5K1K7Q8l1P9J39l61K46o1
$$ 301 -160 -2 -14 -12 236 262 101 270 -205 -51 -8 32 216 25 -30 -9 18 106 75 154 293 -68 178 117
3209A17j58n1K16lk63L77l80L45nJ14k44l22N15k70j21J68n4J13k19J17n9p8M7
$$ 117 -41 -92 124 121 -142 235 -145 200 195 309 65 -257 258 -12 -133 35 -19 94 -125 -8 -67 -145 -98
3232i8RK7n3K81k44r9R4J31j87o9L63j73k13N8K61k68R2J11J40j55j50l8J61l16
$$ -98 -89 -62 -115 166 -78 -177 -83 48 -139 -208 155 -18 -231 -173 88 -180 -88 23 163 8 -142 -180 -19 -335
3256c35p9L05R4J11j57K4j36j69M22j51M5P0j72K08N0j15qKJ43k49M7K82j62N4
$$ -335 -414 -109 -15 96 -61 -37 -173 -342 80 -71 -26 44 -128 80 130 15 7 9 152 -97 -50 232 70 124
3280A24P0j63m4L24m82J66K35p1J1q4J32l35K35j14K59n1m05j86M60J9K23n15
$$ 124 194 31 -13 311 -171 -5 230 159 170 86 218 -117 118 4 263 212 -193 -379 81 100 323 -192
3302a92K78K3j2R6k96nJ70m5J3K84m4m96R0M44j83j13M3j0O0k14R1j34K11k93
$$ -192 86 109 97 193 -103 -108 62 17 30 314 270 -226 -136 308 125 12 55 45 105 -109 -18 -152 59 -234
3326b34N9J30J21k3On3k37K09K30k84j83K91k01J74q9J78k05j19J95J67k48M04
$$ -234 -175 -45 76 53 59 6 -231 -22 208 -76 -259 32 -169 5 -84 94 -111 -230 -35 132 -116 288
3348B88m05q7K61O8k89K98k68OJ10j2k61K92l1K2Q2q5q1O8Q8jk4j70J37L55ok22
$$ 288 -117 -204 57 125 -164 134 -134 -128 -18 -30 -291 1 -30 -8 74 -11 -92 -24 64 63 39 -131 6 361 355 133
3374A33k95L22L8j72J24l1j78l6L14j37o5K64k84q6L28j33m04J29L01j92K38J01
$$ 133 -162 160 198 26 150 119 -59 -95 219 82 17 281 -3 -89 239 106 -298 -169 132 -60 178 279
3396B79m35J33L56n03Q7M06n01K55K39k08k94P8L55n21L79k01k5l8L87k14r5k4
$$ 279 -156 -23 333 -170 -83 323 -178 77 316 108 -186 -108 247 -274 105 -96 -121 -159 228 14 -81 -105
3418a05M0j00J00R1m77M65M09m83l4j77K8J15K58j33k93L55n4m06K47K93o94N80
$$ -105 -65 -165 -65 26 -451 14 423 -60 -94 -271 -243 -128 130 -3 -296 59 5 -401 -154 139 -555 25
3440B5K69k00k27J79j22O8K18l58j89M01J50j08J69l22r1N6K59l00L48J5m72J93
$$ 25 294 94 -133 46 -76 -8 210 -148 -337 64 214 106 275 -47 -138 -82 177 -123 225 240 -232 -39
3462c9M86l00m18M83k4k78K68J24l95K83K01k77l75O34l90M6L40l49l14L51p5
$$ -39 447 147 -271 212 188 -90 178 302 -93 190 391 114 -261 373 -17 29 369 20 -294 57 -18
3483a8Q7J07m9o61P21J08n32J84J16j12K0J70j45r0J2M57k25N9l75R8O6J13k05
$$ -18 69 176 127 -534 187 295 -237 -53 63 -49 -29 141 -4 -94 -82 375 150 209 -166 -68 -2 111 -94
3506i4j35L66j63J28l4k83j23L56J5j47K41k44O0K6J86K3l09R7O7k7M9j33j34
$$ -94 -229 137 -26 102 68 -215 -338 18 33 -114 127 -117 -57 -31 155 178 -131 -34 33 6 55 -78 -212
3529b12J16O4M6J24Om24J92K54l08j1J23k85N65J18m60p3K29N4j50K95j09k47
$$ -212 -96 -32 14 138 144 -280 -88 166 -142 -153 -30 -315 250 368 -92 -165 64 118 -32 263 154 -93
3551i3J91K83m68k6L54k77J57J97j81k36J04L74m23L11j75n5J96R2m67M03j21
$$ -93 98 381 -87 -113 241 -36 121 318 137 -99 5 379 -44 267 92 37 233 325 -142 261 140
3572A40k81M00R0n62J03L93k32l27J63L8r5J56J68m8j54m3K38k58K84j75m8Q9
$$ 140 -141 259 349 -213 -110 283 51 -276 -113 -75 -170 -14 154 106 -48 -91 147 -111 173 -2 -50 39
3594C9O3k21j83K82l13K31M2L2k59J51K27k16L8j22l6L32j69k61L21k02K53k27
$$ 39 102 -119 -302 -20 -333 -102 -60 -28 -287 -136 91 -125 -87 -209 -245 87 -82 -343 -22 -224 29 -198
3616a98L23l05J61L29l06Oj92J26L1J12M2j42j94J07J36r5J95m61J42J88J45j82
$$ -198 125 -180 -19 310 4 10 -182 -56 -25 87 129 -13 -207 -100 36 -59 136 -325 -183 5 150 -32
3638c2J1M8l03N31r3L3q5J9l20L0O05m87Q0j2Q6K4k90Q3O2K26j07k81K99j73M19
$$ -32 -21 27 -276 255 162 195 110 129 -191 -161 444 -43 37 25 111 135 -155 -72 -10 216 109 -172 127 -46 373
3663C73k05j41k12L70m7j03P7p8mj55L53k97j07K70r3K5j59J90K20k92l8K28k91
$$ 373 168 27 -185 185 138 35 112 34 30 -125 228 -69 -176 94 1 26 -133 57 277 -15 -53 175 -116
3686a16L5P0k16j22L28k38P6Q6r9j69K98K35l59O1l4Jn9O6j14K91j80J67l51K03
$$ -116 -81 -11 -227 -349 -21 -259 -183 -97 -196 -365 -67 168 -191 -130 -164 -163 -222 -156 -270 21 -159 8 -343 -140
3710a40K62j62P1M3p3l7K52l08p9L10j91J46O4k18N0l2M1J27j10mj97kK63Q0k38
$$ -140 122 -40 31 74 1 -36 216 -92 -171 139 -52 94 158 -60 -10 -42 -1 126 16 12 -185 -187 76 156 -82
3735h2%K15o2j29J05J20j40J7K95m34p1J99j68k03M06k5q3J11l7J4k27M07l03
$$ -82 -82 133 71 -58 47 167 27 44 339 -95 -166 33 -135 -338 68 43 -40 71 34 48 -179 228 -75
3758g5K92j35m5Ql1K9J0o1j67M94j93j10k26lM19k45R1J49m16J06J27j83N8p6
$$ -75 217 82 37 45 14 43 53 -8 -175 319 126 16 -210 -213 206 -39 52 201 -215 -109 18 -165 -107 -183
3782a83K04j57L04l98K84j74q7M71l87k6n2J47K22m56M99k19R4j46J58K5j80q
$$ -183 21 -136 168 -230 54 -120 -207 264 -123 -149 -201 -54 168 -288 211 -8 86 -60 98 123 -57 -65
3804f5R2k39K13R3l84P9MJ76L0j8o8J24k18L94N9l42K36L6j00k83L35N2j75j74
$$ -65 27 -212 1 94 -290 -211 -207 -31 -1 -19 -87 37 -181 213 272 -70 166 202 102 -181 154 206 31 -143
3828a43L06l25J71j05L7l7K84k02K03k19L01l42K25m9q0j03l1K41k74K47j14j32
$$ -143 163 -162 9 -96 -59 -96 188 -14 189 -30 271 -71 154 105 25 -78 -109 132 -142 105 -9 -141
3850a41J68J72j06j7N5j20J98k57j54L30k51LJ18O7J7k19K89j79J06m1Q1k78M1
$$ -141 27 199 93 76 131 11 209 -48 -202 128 -123 -120 -2 65 82 -137 152 -27 79 38 119 -159 -118
3873a18oJ04m2k10K54J6K3j03L5L1j98M2L86m70L15q5J18j80r1J48l3p1K79j73
$$ -118 -124 -20 -62 -272 -18 -2 21 -82 -47 -16 -214 -172 214 -256 59 -26 92 -88 -179 -31 -64 -135 144 -29
3897b9j40lRK46J09l64J67j64J67k5j86J68K9P9r1J52J22m34K18P7j85j20L22
$$ -29 -169 -172 -163 83 192 -172 -5 -169 -2 -27 -213 -45 -16 63 -28 124 246 -188 30 107 -78 -198 124
3920A24O7j86n0L3K62j13j92P0M01k81K73k44j34Lq2J22r7J10j77J54j33l8J88
$$ 124 191 5 -45 -12 250 137 -55 15 416 135 408 164 30 33 -49 73 -24 86 -91 63 -70 -108 80
3943H0j57M0K33j10k79J12K0j15J39J26q3k4Q5q2J98j9k63k20N21q0l46J02J60
$$ 80 -77 -37 196 86 -193 -81 -61 -176 -37 89 6 -18 67 -15 183 164 -99 -319 202 122 -224 -122 38
3966C8j87K77J0j23k29K56l0m0N6j88k4J77k5Po0J56k55J76J56j77k05J10l82
$$ 38 -149 128 138 15 -214 42 12 -28 28 -160 -184 -7 -32 -25 -85 71 -184 -8 148 -29 -234 -124 -506
3989e06O02J85l18k62J96pJ52q5K75l11K81l0k82K6J28k14R5L78l35j58L01M4
$$ -506 96 281 -37 -299 -103 -110 42 -43 232 -79 202 172 -110 -84 44 -170 -75 303 -32 -190 111 155
4011A55j35J27k53L5K7M00k10j00o2J88j34M27l07k56j16L27k68K86j7r4k6N5
$$ 155 20 147 -106 -71 -44 356 146 46 -16 172 38 465 158 -98 -214 113 -155 131 114 20 -6 49
4033D9J22k72J28o1q5L41j29n92L51L47m06%m9O6K00K04l34l28P10l4k80J64j53
$$ 49 171 -101 27 -34 -119 222 93 -499 -148 199 -207 -207 -256 -190 10 214 -120 -448 262 228 -52 112 -41
4056d1j12j24M15k29P2K5l62L40j40N9j26J60L1nK11k97r7L29J7j89M2J09j0N4
$$ -41 -153 -277 138 -91 -19 6 -356 -16 -156 -97 -223 -63 -32 -37 174 -123 -220 109 126 -63 -21 88 78 132
4080A32o3O4l97M07j35mQj78k81N80J3k63P8K20n1k36Q4j40J61R1j17N4P7O4j30
$$ 132 69 133 -264 143 8 4 12 -166 -447 133 146 -117 -39 181 130 -106 -22 -162 -1 90 -27 27 104 168 38
4105C8j50K28r2K2K72l32J58J76l83NJ02J10q8j92Q1j2L33n7l45rL97m09K60K64
$$ 38 -112 116 24 46 318 -14 144 320 -63 -58 44 154 66 -126 -45 -57 276 219 -126 -135 262 -147 113 377
4129C77m47k76M84J6k59j0O6l2L27m8j25j10m7J31n2k0j22K41o1j7p5J97p1k04
$$ 377 -70 -346 138 154 -105 -115 -49 -81 246 198 73 -37 -84 47 -5 -25 -147 94 33 16 -59 138 67 -137
4153a37K0M0N7j6l9K4j72M71m23J73K37r9k58K38l25R6O41l95m0k62K45Pj03J17
$$ -137 -117 -77 -20 -36 -75 -51 -223 248 -175 -2 235 136 -122 116 -209 -113 528 133 93 -169 76 83 -20 97
4177I7m12K93J20N1j94P0K73l02pP0k56J51M67m88K05M6j87nL91rk66NR1k02K72
$$ 97 -315 -22 98 149 -45 25 298 -4 -11 59 -197 -46 421 -67 138 184 -3 -8 383 374 108 113 204 2 274
4202B74p7j6k35M56m47o2J22K4mJ83q4j48K93L2k80K0O0j95OK78j84m2P6n0K11
$$ 274 197 181 -54 402 -45 -107 15 39 35 218 134 -14 279 311 31 51 111 -84 -78 200 16 -26 50 0 211
4227B11k61J7K32k93K44j60k1m8O6J33j78l1j03M25k14j37k9L38n9l5j96K02k71
$$ 211 -50 -33 199 -94 150 -10 -31 -79 -13 120 -58 -89 -192 233 19 -118 -147 191 132 97 -99 103 -168
4250a68K63j56J86l61R3K56j37J8K3R3l2J58k42J97j64LL01m21N4J63j25J2N1
$$ -168 95 -61 125 -236 -143 113 -24 -6 17 110 78 236 -6 191 27 30 331 -90 -36 127 2 14 65
4273F5j21n0j47J11J1MK57p9K55m15K01q6J38j4k41J91j77K64r1n8j93M23j76
$$ 65 -56 -106 -253 -142 -131 -127 130 51 306 -109 92 6 144 130 -111 80 -97 167 76 18 -175 248 72
4296G2K52m31L3K03l65L06j7N0j28Q6l00L07O7j00j04M3J82J17r0j67k0j50K20
$$ 72 324 -107 -74 129 -236 70 53 103 -25 61 -239 68 135 35 -69 -26 156 273 183 16 -4 -154 66
4319F6Q1m00J61j45K01r7J03L6P8j76o4j50L29n7K99l74J00Lj59PK60J0j19j42
$$ 66 147 -253 -92 -237 -36 -133 -30 6 84 -92 -156 -306 23 -34 265 -109 -9 -6 -165 -158 102 112 -7 -149
4343a49M10m80J5L52k25j09K34k51m0L17q4J42j99L17j94m0j9k33Q4K41K07j14
$$ -149 261 -219 -204 148 -77 -186 48 -203 -243 74 -10 132 -67 250 56 16 -3 -236 -152 89 296 182
4365A82p9j01K31k27j37K34n1P4q6j99K82J1k2k29K22j49j16M38pJm03J42j76
$$ 182 103 2 233 6 -131 103 52 126 40 -159 123 134 112 -117 105 -44 -160 278 271 272 -131 11 -165
4388a65J03K77k17j33Q1M5k2jJ55j95n6R5L71k54l27L01k42K16j77L92j32l01
$$ -165 -62 215 -2 -135 -54 -9 -31 -32 123 -72 -128 -33 338 84 -243 58 -184 32 -145 247 115 -186
4410a86K78j35r3k6n3L43n0K17l58J80nk57J83k64J46p4J74J3OJ54p9l8o2j2J89
$$ -186 92 -43 -136 -162 -215 128 78 295 -63 117 112 -145 38 -226 -80 -154 20 33 39 193 114 76 14 2 191
4435A91m07M13l47k4J62Q9Q6j52qQ5j99K58k51L1J67j57J06R9l3o1Q5j18p9J96
$$ 191 -216 197 -150 -174 -12 77 163 11 3 88 -111 147 -104 -73 94 -63 43 142 109 48 133 15 -64 132
4459A32L7j07J90k16q4j81L51l64K21K00O9l89J82LL6P5k37J2R2K52k04l9q5l9
$$ 132 169 62 252 36 -48 -229 122 -242 -21 179 248 -141 41 44 80 155 -82 -70 22 274 70 31 -54 -93
4483i3j26J46K12J4j38j19J3K21J21j49k28M23k76Q5Nq3k2O0Q6K1k40K62j97J60
$$ -93 -219 -73 139 153 15 -104 -91 130 251 102 -126 297 21 106 111 28 6 66 152 173 -67 195 -2 158
4507A58j13k75K91J01l00J5p7J16j8k0J04K88l18j48P6M67l79mL45o28J10L56
$$ 158 45 -230 61 162 -138 -123 -200 -84 -102 -122 -18 270 -48 -196 -120 347 -32 -36 309 -319 -209 147
4529A47j91l07J64K35p9j11L20j34l02K83o7P2m6j45K79M8r3J07o2j11j0J75j29
$$ 147 -44 -351 -187 48 -31 -142 178 44 -258 25 -42 30 -16 -161 118 166 73 180 118 7 -3 172 43
4552D3LM05k48q7j14J04j24K5Q0o5j85Q0K41l02K17l3o7j69O58k78k18J29p0j02
$$ 43 46 451 203 116 2 106 -18 7 87 22 -163 -83 158 -144 73 40 -27 -196 462 184 -34 95 25 -77
4576g7L14l63m4M5K07j50J7J43n8j18J78k43K43J42j12l36R8j78J52L09J10m77
$$ -77 237 -126 -170 -125 82 -68 -51 92 34 -84 94 -149 94 236 124 -212 -114 -292 -140 169 279 -198
4598a98P1L83n07M07j65j14L28Jl07K8R6K36k81J67o6K62m67K55k76J20K05j93
$$ -198 -127 256 -251 156 -9 -123 205 206 -101 -73 23 259 -22 145 79 341 -126 129 -147 -27 178 -15
4620a5j02K71Q6k81L75o20L11J01j54O6R5k28l46M39K22k73k4OQ3k26kL35k33
$$ -15 -117 154 240 -41 334 -286 25 126 -28 38 133 -95 -441 -2 220 -53 -77 -71 12 -214 -216 119 -114
4643a14K91k8k32J90J05l1k6j6m47L82N9j03J2J09j6Mr0l69M31j54K24J60J78
$$ -114 177 149 -83 107 212 181 155 139 -308 74 133 30 42 151 135 139 49 -320 111 -43 181 341 519
4666E19l42l74n2N69r8j88O0j83m99M10M05l55L4K47k26N4q8Q2mK2R3m50J46K73
$$ 519 177 -197 -249 320 222 34 94 -89 -588 -178 227 -128 -94 153 -73 -19 -107 -25 -29 -7 86 -364 -218 55
4690E5j65L27j29k1k45J81J90R5o3l33J68j4J52j63p8kl1J24K03k09R7k29P4k25
$$ 55 -110 217 88 67 -178 3 193 288 225 -108 60 46 198 35 -43 -45 -76 48 251 42 139 -90 -16 -241
4714b41J13J56o6p5J97j61Q2k1k16N52j98j5j44j05Q3j84J15K3j94J99J86m11
$$ -241 -128 28 -38 -113 84 -77 5 -16 -232 320 122 107 -37 -142 -59 -243 -128 -105 -299 -100 86 -325
4736c25K21n4Q7RJ35q1J10m7J41J8o7k26K02k96L83l13n1K95k20j23L71j99j59
$$ -325 -104 -158 -71 -62 73 -8 102 55 196 214 147 -79 123 -173 210 -103 -154 141 -79 -202 169 -30 -189
4759a89J50N6N7p5r3J5N5J88l9j51r5J62K6M2j68M0j67l4J0M52j87k96K45jJ37
$$ -189 -39 17 74 -1 -94 -79 -24 164 125 -26 -121 41 67 109 -59 -19 -186 -220 -210 242 55 -241 4 3 140
4784A40j0k58qN68l59k61O5j7K40j14R5j64jJ44Nj29L25j53n21L62K87m00j01
$$ 140 130 -128 -136 432 73 -188 -123 -140 100 -14 81 -83 -84 60 65 -64 261 108 -413 -51 236 -164 -265
4807b65K09L9k85N9L4J08J2j20K07K72k75L2L66l00J36k98J16J35k55j06Q4R8
$$ -265 -56 -17 -302 -243 -209 -101 -89 -209 -2 270 -5 27 393 93 229 -69 47 182 -73 -179 -95 3
4829Cr2N6R9j92o4L02l4M3J85l58L46j61o3o0L31m68K16j99L6K78j62j15m5K84
$$ 3 -89 -33 66 -126 -190 112 78 121 306 -52 294 133 70 10 341 -127 89 -110 -74 204 42 -73 -118 166
4853A66j51L7j06J76Q4m26R0L33l06n7o8K62k13Q0R6l2lN8l14M30Km03K44M7J49
$$ 166 15 52 -54 122 206 -220 -130 203 -103 -160 -228 34 -179 -99 -3 -35 -38 20 -294 136 138 -265 -21 26 175
4878A75l55J78L9j50j0J98j29J58q3q3j7L2J0n5p7L5K20m2j66K68j30K17m8k1
$$ 175 -180 -2 37 -113 -123 75 -54 104 21 -62 -79 -47 -37 -92 -169 -134 86 44 -122 146 16 233 185 164
4902A64j93o3J07P8p8j76L51l5l2J28j21j04k30M12k60k63L30k8L3p9PJ88J8l3
$$ 164 -29 -92 15 93 15 -161 190 155 123 251 130 26 -204 208 -52 -315 15 -13 20 -59 -52 136 154 121
4926A21j18J43k77L63n8j21L5j97J7K55O4k20l33L98j58J30J29l28K01l38L75
$$ 121 3 146 -131 232 174 53 88 -109 -92 163 227 7 -326 72 -86 44 173 -155 46 -292 83
4947H3j56k1Kj15K81oj29Ojj59K71Q0l93K52j88J59j04K33k74J6J46n7R5j6j06
$$ 83 -73 -94 -92 -207 74 68 -61 -55 -56 -215 56 136 -257 -5 -193 -34 -138 95 -179 -163 -17 -74 21 5 -101
4972a01K8J54k89J99j98p0K27Q3k05L44l3k66Q1P0J68l2j21j44K90j16k87K59
$$ -101 -73 81 -208 -9 -207 -277 -50 33 -172 172 139 -127 -46 24 192 160 39 -105 185 69 -218 41
4994D1m6L7J77k89k09K27J75J33k70l1Q7j99J4K23k39p0N01j86m4o4J59j60M7
$$ 41 -5 32 209 -80 -289 -62 113 246 -24 -55 32 -167 -153 70 -169 -239 262 76 32 -32 127 -33 14
5017A4n4M5LN0p8P9K14j10k55J32q2o9PK01k79p9J96K66k73l4J55m1m2j56M76
$$ 14 -40 5 8 58 -20 59 273 163 -92 40 -42 -111 -104 97 -182 -261 -65 201 -72 -106 49 8 -34 -190 286
5042B86l34M1j05J4k17N09l62J15j03j69J28q4P5N2M1J96m30M15K30j26j27j01
$$ 286 -48 -7 -112 -98 -315 194 -168 -53 -156 -325 -197 -281 -206 -154 -113 83 -347 68 298 172 45 -56
5064e6j77J4L86m06J41j03o5K72J60r0r8j19L03m6l08L49m3J14j79j35K04k85
$$ -56 -233 -219 167 -239 -98 -201 -266 6 166 76 -22 -141 162 116 -192 157 114 228 49 -86 118 -167
5086a67K18k49K47J77l16j08K76o0K3J66l09K40k56L88m03K12P3l85J05K32K43
$$ -167 51 -198 49 226 -90 -198 78 18 41 207 -102 138 -118 270 -133 79 152 -233 -128 104 347
5107C47j28J8l99P3J91j94J53j09j02N1L85l31J28O7j63j97J66J8k20M29j93j63
$$ 347 219 237 -162 -89 102 -92 61 -48 -150 -99 286 -45 83 150 -13 -210 -44 -26 -246 183 -10 -173
5129a73q7Q1J56j36J57k52K37j13J9K10l09J70J41l32J38L13m60J69k5J06m5J86
$$ -173 -260 -179 -23 -159 -2 -254 -17 -130 -111 99 -210 -40 101 -231 -93 220 -240 -71 -96 10 -35 151
5151A51m64L71Pj71L83k48j71PK84r3M5p4r2n2K03k28K02O2j37j00J11j13L1L00
$$ 151 -313 58 65 -106 277 29 -142 -135 149 56 101 27 -65 -117 86 -142 60 122 -15 -115 -4 -117 -86 214
5175B14K7m75K56l8J14o1k30J63L6N8J03l19J74m0o0j90J11L52j88J21j05pK86
$$ 214 241 -234 22 -16 98 37 -193 -30 6 64 167 -152 22 -18 -78 -268 -157 195 7 128 23 16 302
5198C02l46j64L49M4k54M9J78j34M3j78K94k88K38J86m17N0p1K08L5r7p2L9k3
$$ 302 -44 -208 141 185 -69 -20 158 24 67 -111 183 -105 133 319 -98 -48 -119 89 124 27 -45 -6 -29
5221b9k21N9N8L65o64N06O9p2r8P4n7J71j53OK8l82J73K9J90O4l66L46j9j19p5
$$ -29 -250 -191 -133 232 -432 74 143 71 -27 47 -10 161 8 14 42 -340 -167 -138 52 116 -250 96 77 -42 -117
5246a17K6J81l55K41l3j31J92p6j47r1M43j47m8J07q6J75M7n20L73m7j13K75r7
$$ -117 -91 90 -265 -24 -57 -188 4 -72 -219 -310 133 -14 -62 45 -41 134 181 -339 34 -13 -126 149 52
5269E2M5j60K05J71k69J42p6l02N09k37n4K9L5m3n5n6J2J63k19J11o8j09M31j92
$$ 52 97 -63 142 313 44 186 110 -192 317 80 26 55 90 47 -8 -64 -52 111 -108 3 -65 -174 257 65
5293F5J14j28R4k7Pj10k48M52p3k81J74J27Rj48kJ06j70J27j73O1OJ67k23Q3q
$$ 65 179 51 145 118 125 15 -233 219 146 -135 39 166 175 27 25 131 -39 88 -85 -24 -18 149 -74 9 1
5318Ak6Q9k69K52k2j87J43j32L8O5K15k08K12j00J30q6k65K15J21p1R4l30K10
$$ 1 -25 64 -205 47 25 -162 -19 -151 -113 -48 167 -41 171 71 201 115 -150 65 186 115 209 -121 89
5341H9l08L56k26r2J34L9qm1J28O5M2n81L44j1k15L11K4n1L6R0n36L85J15j12
$$ 89 -219 137 -89 -181 -47 -8 -16 -57 71 136 178 -403 -59 -70 -285 26 50 -1 35 125 -411 -26 89 -23
5365b3J32K27m06J59j60M29n03r3K99k01L21m26L36R2K68m84j21j83J89L5J02
$$ -23 109 336 -70 89 -71 358 -145 -238 61 -140 181 -245 91 183 451 -33 -154 -337 -148 -113 -11
5386a1J23K44n60J82q5P4q1M3r9L70l5m1k17L3p8N54n27j64J55j02L82j10j21
$$ -11 112 356 -204 -22 -107 -33 -114 -71 -170 200 165 124 -93 -60 -138 416 -111 -275 -120 -222 160 50 -71
5409g1J15K93n13N9l7J05J04J21j53j71J75J40j19j39K35l88M6N14l87Rp8L03
$$ -71 44 337 -176 -117 -154 -49 55 176 23 -148 27 167 48 -91 144 -244 -198 316 -71 -62 -140 163
5431A63m61J19J58J93l27J25j09J46Ml37L99p9J25k13J55j96J81j65J67j09P6
$$ 163 -298 -179 -21 172 -155 -30 -139 7 11 -326 73 -6 119 -94 61 -135 46 -119 48 -61 15
5452A5R1l76K86j18J88RJ13j74k8L18l98p0J58j09M71j34r3k28J93j87J73Jn9
$$ 15 106 -270 16 -102 86 95 208 34 6 324 -74 -144 14 -95 376 242 149 -79 114 -73 100 101 42
5475D2K3j23rK4k2O3K6Jl3m6k01L55j81j7jJ24j85J70n4k52L70j11L1j59K46k6
$$ 42 65 -58 -67 -43 -65 -2 24 25 -8 -54 -255 100 -81 -98 -99 25 -160 10 -44 -296 74 -37 -6 -165 81 55
5501E5P6j1j1l27K26k53P0L26j03j30J21l58L13J16Jk79j9K28Q3j21o7J50j69
$$ 55 131 120 109 -218 8 -245 -175 151 48 -82 39 -319 -6 110 111 -168 -187 41 124 3 -64 86 -83
5524h3J8r6J87j8k36L85l51K22qM5J48k03n3j37K37m2O8j4J54j06m77L78O7r7
$$ -83 -65 -161 26 8 -228 157 -194 28 20 65 213 10 -43 -180 57 15 83 69 223 117 -360 18 85 -12
5548a2R7m4J4K61o00M69l1l6j3l59m0J61M9K45k03m2L22l90M10l76K47k65K39
$$ -12 85 41 55 316 -284 185 154 118 105 -254 -294 -133 -84 161 -42 -84 238 -152 258 -118 129 -136 103
5571A03j40J13r3n9K0J61j19p4J21L7m6k1k56K20R1j03q7K22j70j8j24L8O3M0
$$ 103 -37 76 -17 -76 -56 105 -14 -88 33 70 24 3 -253 -33 58 -45 -132 90 -80 -98 -222 -184 -121 -81
5595h1M1P6N0R4j69J92k87K23j62J82k23j26J81J5j75J54N9mL4L2k26pQ8o4J4
$$ -81 -40 36 86 180 11 203 -84 139 -23 159 -64 -190 -9 6 -169 -15 44 40 74 106 -120 -127 -39 -103 -89
5620h9K05j64j76K55l20J0Q3K61l03L68k13mO5J59p2k0Q2k37J4K01p9q8J22P0
$$ -89 116 -48 -224 31 -289 -279 -196 65 -238 130 -83 -87 -22 137 65 45 127 -110 -96 105 26 -62 60 130
5644A30k22K65j84k13L25j09K3P9J8j83M5m4m4J78j22K08q1N3k41N8J58j97J56
$$ 130 -92 173 -11 -224 101 -8 15 94 112 -71 -26 -70 -114 64 -58 150 69 122 -119 -61 97 -100 56
5667E6j6L17m81J20N4J44l01K39k89m6J78R4j19J68j33p6J0kJ63m5K11k85j86
$$ 56 40 357 -124 -4 50 194 -107 132 -157 -203 -25 69 -50 118 -15 -91 -81 -83 80 35 246 -39 -225
5690b25L84j66r0P3K29l18j30K02r2J08m6j03J23L14k50J25J04k65m26L48J7L3
$$ -225 159 -7 -97 -24 205 -113 -243 -41 -133 -25 -71 -174 -51 263 13 138 242 -23 -449 -101 -84 -51
5712e1J93j86k26K65Q1R0J09k9m38o0L07J62m52K64k34L01j79Q2L3k16L54k15
$$ -51 142 -44 -270 -5 76 166 275 246 -192 -252 55 217 -235 29 -205 96 -83 -1 32 -184 170 -45
5734d5j48K79k12p0J66J66M0j73M3Q5N7k96J68K0j5j41k51K12J09R3n0p1p4K60
$$ -45 -193 86 -126 -196 -30 136 176 3 46 131 188 -108 60 80 65 -76 -327 -115 -6 87 37 -34 -108 152
5758A52k4m6J05q3j52NK33m74M77j21Kj57J72q7j66L1K51P8k51j43J74k90L06
$$ 152 128 82 187 104 -48 -43 190 -284 193 72 74 -83 89 2 -164 -133 118 196 -55 -198 -24 -314 -8
5781hj18K31q0r0J54k67n5M31l49K86p7j80K59k32l8J68N8k70pM7r2K39L2P5m10
$$ -8 -126 105 25 -65 89 -178 -233 198 -151 135 58 -122 137 -95 -133 35 93 -177 -184 -137 -229 10 42 117 -293
5806b93J79k12K39J82j03Q4p7M4k60L72J37j66j8m0m0q3J57n8J98K05o44OK98
$$ -293 -114 -326 -87 95 -8 76 -1 43 -217 155 292 126 108 68 28 -55 102 44 242 447 -197 -191 107
5829A07O3j89j22L65j62J66l22J96j75J4oR4j20K23j80J01J0J12Lj35j99K12j19
$$ 107 170 -19 -141 224 62 228 -94 102 -73 -59 -65 29 -91 132 -48 53 63 175 178 43 -156 56 -63
5852f3k29K51K82l60J86j97n9r4L49m7M9M2j42J55j21L90n33L93k09n8J29j69
$$ -63 -292 -41 241 -119 67 -130 -189 -283 66 19 68 110 -32 123 2 392 -141 252 43 -15 114 -55
5874e5j7K20r2j7k6K5k2K6l6l12K05L1J93MK74m49k0R0J55M0k50L7M7k53K44m1
$$ -55 -72 148 56 39 13 38 16 42 6 -306 -101 -70 123 127 401 -48 -68 22 177 217 -33 4 51 -202 42 1
5900AN7m5J16p1J43k86M6p6K31Qj41J61l17J72j08k11N26l62L9J82Mj25j02J91
$$ 1 58 13 129 58 201 -85 -39 -115 116 124 -17 144 -173 -1 -109 -320 206 -156 -117 65 69 -56 -158 33
5924C3o9r7K28k63J89j34%K18l48J03N7K7R6J95j24k18o1o3K77j3J16l4j45N5
$$ 33 -36 -133 95 -168 21 -113 -113 105 -243 -140 -83 -56 40 235 111 -107 -168 -231 46 33 149 115 -30 25
5948B5m1l5k4ML01j02N8k22j18j06K75q8L33k35k22p1O4JJ13J09j73J01J21n5
$$ 25 -16 -51 -75 -71 230 128 186 -36 -154 -260 15 -73 260 25 -197 -268 -204 -203 -90 19 -154 -53 68 13
5972A3j67K72m33N06j92K0J5j35M9O0k36M34q8k52J85k9j14J16q9K76j63j16J59
$$ 13 -154 118 -315 191 -1 19 34 -101 -52 8 -228 206 118 -134 51 22 -92 24 -65 211 48 -68 91
5995I1j62K79j06m34K20R2j66K05K65m23PJ04l4j60J71K91k30J07k82J19n8j81
$$ 91 -71 208 102 -332 -112 -20 -186 19 284 -139 -132 -28 -62 -222 -51 240 10 117 -165 -46 -104 -285
6017b85O65l99J8K53k90l18M41r8n8Q9j73L09L3j84p0R0K02k01n1K19k79L22l37
$$ -285 380 -19 -1 252 -38 -356 85 -13 -71 18 -155 154 187 3 -67 23 225 24 -27 192 -87 235 -102
6040a02M31j55r9j42K13j68L4N6j87K50k26M47l38k1j05J90J56m03j9J98m5j21
$$ -102 329 174 75 -67 146 -22 12 68 -119 131 -95 352 14 -7 -112 78 234 -169 -188 10 -35 -156
6062a56J51p4J10J82l38J7j2K92j31J32m3q2j42R3R2l2k7j78K01O1J03l75j30
$$ -156 -5 -79 31 213 -125 -108 -120 172 41 173 130 48 -94 -1 91 59 32 -146 55 116 219 -156 -286
6085b86K67M4r9J64j10K24k01l2J78k12j00L9L57j23rl7M2R3Nm94M19j81P7O5
$$ -286 -19 25 -74 90 -20 204 3 -29 149 -63 -163 -124 233 110 101 64 106 199 204 -290 129 -52 25 90
6109I0p4J86J56k37k91J26n9L25J0j22n0J6o6k42J56J60k78J36K02j23l2j42j47
$$ 90 16 202 358 121 -170 -44 -103 222 232 110 60 76 10 -232 -76 84 -194 -58 144 21 -11 -153 -300
6132c00L74j16J0j30K13k20J08M4j9j04K96q2J40k86J07jR9l88K37j45J13kj7
$$ -300 74 -42 -32 -162 51 -169 -61 -17 -36 -140 156 74 214 -72 35 34 133 -255 -18 -163 -50 -52 -69
6155f9J17J40J9k42K43l92L09j39q0NJ1K43k13KK69k35J06p1J30j97m6M3J76j75
$$ -69 48 188 207 -35 208 -184 125 -14 -94 -89 -78 165 -48 -46 223 -12 94 23 153 -44 -90 -47 129 -46
6179d6q2K51n3J52J06j99l16K48q5J70r1p5L0J40r9k2K86l27n0Q6k20J88%j08
$$ -46 -128 123 70 222 328 129 -187 61 -24 146 55 -20 10 150 51 29 315 -12 -62 24 -196 -8 -8 -116
6203a16J60J82n7j89R0j31PL42m52N3q8l6M8L71l15J18k58J24K79r4J17k38J42
$$ -116 44 226 169 -20 70 -61 -54 288 -164 -111 -199 -235 -187 184 -131 -13 -271 -147 132 38 155 -83 59
6226E9J05k61J03J56k86k39K40R9J02N1L0r7k46L73k44J77j29k65K87J00j54k8
$$ 59 164 -97 6 162 -124 -363 -123 -24 78 129 159 62 -184 189 -55 122 -7 -272 15 115 -39 -67
6248f7j26K77m42M22k2o5q3N1jj70K18j29n8J44P5j96J79O2k00O0J46N0l22j32
$$ -67 -193 84 -358 64 42 -23 -106 -55 -56 -226 -8 -137 -195 -51 24 -172 7 69 -131 -71 75 125 -197 -329
6272c29M39k38J33j47L86j12j65o0M56l08j32j43J27L51Q4k63ok29K47J28k26
$$ -329 110 -128 5 -142 244 132 -33 -93 363 55 -77 -220 -93 258 342 79 73 -156 91 219 -7
6293gKj36NJ54R8j85J64j31k4J5oj8J32o6r7R9L25l36j58J21k03J20o4J22J50
$$ -7 -5 -141 -136 18 116 -69 95 -36 -60 -45 -51 -69 63 -3 -100 -1 324 -12 -170 -49 -252 -132 -196 -74 76
6318G6j89J68j98L40j66j16L32l53N1J5K46k12J40j05l26N70k56k10J17q1Q2q7
$$ 76 -113 55 -143 197 31 -85 247 -106 -55 -40 206 -6 134 29 -297 273 17 -193 -76 -157 -75 -162
6340a62o6J53j69L67mj3k56J01P8j0n6J01M9Lj62jN1o4j00P6O2J57j64M3l83M80
$$ -162 -228 -75 -244 123 119 106 -150 -49 29 19 -37 64 113 116 -46 -47 4 -60 -160 -84 -22 135 -29 14 -369 111
6366A11q5m12J69O6P4K89k93K84j97K63l20j84M87j58k99J77M1j03M1J53r3k51
$$ 111 26 -386 -217 -151 -77 212 -81 203 6 269 -51 -235 252 94 -205 -28 13 -90 -49 104 11 -240
6388b40O21m60j07J10J05j52J15N0J77l97N25m82m8J78m1j71J81Kr8K26o7q4o5
$$ -240 381 -79 -186 -76 29 -123 -8 42 219 -178 347 -135 -183 -5 -46 -217 -36 -34 -132 94 27 -57 -122
6411a22J18j3M1j15N9L0o7J86k47K30p0j04K40J4k44j45L38n2k31J49J23p4J30
$$ -122 -4 -17 24 -91 -32 -2 -69 117 -130 100 30 -74 166 180 -64 -209 129 77 -154 -5 118 44 174
6434A74j07j08j39K23k0K53r5J00k20J70o3k12J56L8J79m58J69o8J6mK4l1K2j9
$$ 174 67 -41 -180 43 23 276 181 281 61 231 168 -44 112 150 329 -129 40 -28 -12 -16 8 -23 -1 -20
6458b0Q0k5j25m4K05J08m02M65l06K30k09J83j53O1K50k01j81J41m0L9o5J8n9
$$ -20 60 35 -90 -134 71 179 -223 242 -64 166 -43 140 -13 48 298 97 -84 57 17 56 -9 9 -50
6481e0J85J23m04J68M6J01j72m9k6j75K80j77J95K20l43J48l25P6nJ56n2J18j07
$$ -50 135 258 -146 22 68 169 -3 -52 -78 -253 27 -150 45 265 -78 70 -255 -179 -184 -28 -80 38 -69
6504f9P8k67o2J00K54k14K14r3M47l46nk94J58L8O0j48L36j73J27Jk10Q4Q7j6
$$ -69 9 -258 -320 -220 34 -180 34 -59 388 42 37 -257 -99 -61 -1 -149 187 14 141 142 -68 16 103 87
6528H7k66K52N6l18M5K25j66K34l17K49k49kL14r6j50P6K97l80K83k01j17j0J79
$$ 87 -179 73 129 -189 -144 81 -85 149 -168 81 -168 -170 144 48 -102 -26 271 -109 174 -27 -144 -154 25
6551B5N7l5k07L7J07j23P7K31j67J51j4K6lj39J9K57n54M33j61k07K4J32k4j17
$$ 25 82 47 -160 -123 -16 -139 -62 169 2 153 139 165 162 23 42 299 -255 178 17 -190 -166 -34 -58 -175
6575a75J07j29L4J39n5M7Q4j90K88k57K19j62Rk01K89k77J57J90J39k70N7j16
$$ -175 -68 -197 -163 -24 -79 -32 52 -138 150 -107 112 -50 -41 -242 47 -230 -73 117 256 -14 43 -73
6597g3NM5j54n0K26O5J37k38j78K0J31N5K39l56O8m6K22j90L2J58k26k9K58k14
$$ -73 -68 -23 -177 -227 -1 64 201 -37 -215 -195 -64 -9 230 -126 -58 -104 118 -72 -40 118 -108 -137 121 -93
6621i3K18j29J22j88K62j20Q4j35l18M21k14J92k60N9n9kK92m17J85J51m7J10
$$ -93 125 -4 118 -70 192 72 156 21 -297 124 -90 102 -158 -99 -158 -160 132 -285 -100 51 4 114
6643A14p6K4l69N87n04K57J39l99K85J73k56J39j62j05K12MP5L3r9j94L48n15
$$ 114 38 62 -307 280 -224 33 172 -227 58 231 -25 114 -48 -153 59 63 138 171 72 -122 226 -289
6665b89P8K22J58j08k42j5J81j11J09L0O7K4j26j08J18K3k02j79O88j31j62J20
$$ -289 -211 11 169 61 -181 -196 -15 -126 -17 13 80 104 -22 -130 -12 11 -191 -370 318 187 25 145
6687A45j58l5q5k2K3J56P0k07R5l03K38J31j06J0m8qP9j12r5J52R0k84K94Oj2
$$ 145 -13 -48 -133 -155 -132 24 94 -113 -18 -321 -83 48 -58 -48 -96 -104 -25 -137 -232 -80 10 -274 20 26 14
6712A4Jj36O3j62L11l22L32j2j06q0J50N4j12j01q6N7K09j68j6Q8k76K9K52j0
$$ 14 15 -121 -58 -220 91 -231 101 89 -17 -97 53 107 -5 -106 -192 -135 74 -94 -110 -22 -298 -269 -17 -27
6736b7K05k40j6J04j20k2J25K6k32L72K7k44O9J01j6N2k20N6Q3j40M9R1m6%kj12
$$ -27 178 -62 -78 26 -94 -116 9 35 -197 175 202 -42 27 128 112 164 -56 0 83 -57 -8 83 37 37 35 -77
6762g7J99k75j34M20P4Kk33j48q1l4L88Ok29J51k2p3M6O2p0K66k67r5j78K45L6
$$ -77 122 -153 -287 133 207 209 -24 -172 -253 -287 101 107 -122 29 7 -66 -20 42 -28 238 -29 -124 -302 -57 -21
6787b1M9Q7q1j3%Q6j15N5J2j7L8k6M2r2N5k2m4J74k44j0J44J44k3j90K4j8J61
$$ -21 28 115 34 21 21 107 -8 47 59 42 80 54 96 4 59 37 -7 167 -77 -87 57 201 178 -12 12 -6 155
6814A55j52M1j91J69M5l47L71J47n3j2l18K46k79J31k14K00q1k9pK66j75J7K79
$$ 155 3 44 -147 22 67 -280 91 238 185 173 -145 101 -178 -47 -261 -61 -142 -171 -178 88 -87 -70 209
6837B09J52k80j41J21j51K43l15K72J0J64m88J05pP6K54m83J46L72l97J03j63
$$ 209 361 81 -60 61 -90 153 -162 110 120 284 -204 -99 -106 -30 224 -259 -113 259 -138 -35 -198
6858a98J03n9L57j98l9L33l75J15K27k26m3j01P4n2r0K02l62O62k53k02J7J05
$$ -198 -95 -154 203 5 -34 299 -76 39 266 40 -3 -104 -30 -82 -172 30 -332 330 77 -125 -108 -3
6880cn3K50k79n2N6n6J36o9K30k15P1K99k51j5m0M3n2N4k52M29q9k08L7j87M16
$$ -3 -56 194 -85 -137 -81 -137 -1 -70 160 -55 16 315 64 49 9 52 0 54 -198 231 142 -66 -29 -216 200
6905B00j29j02N4j38K78R6m61J89J25j71j64L67q9o5k36L07j48K32j92J87j81
$$ 200 71 -31 23 -115 163 259 -202 -13 112 -59 -223 144 55 -10 -246 61 -87 145 -47 140 -41
6926d1J71j45P4P3K04m07p0L78k19l9j70R5m5L10k81J00Jj07L9R3M0l20J49K26
$$ -41 130 -15 59 132 336 -71 -141 237 18 -21 -191 -96 -141 169 -112 -12 -11 -118 -79 14 54 -266 -117 109
6950A09k06r1J26k05N27k34k0O7k16J20K9j73L96r3l43o6Q8l6M16j08r2j6K20
$$ 109 -97 -188 -62 -267 260 26 6 73 -143 -23 6 -167 229 136 -207 -273 -185 -221 195 87 -5 -21 199
6973A99j40r3j8L4K7q2J30J10j37J3j88L04k29MJ08k96K64m3K90m06J27K67j58
$$ 199 59 -34 -52 -18 9 -73 57 167 30 43 -145 159 -70 -66 42 -254 10 -33 257 -149 -22 245 87
6996H7j46r4J84j13R7P2kk70K31r6K70j24J2l04J92K0Kj08Rn9L76m5k81L99l16
$$ 87 -59 -153 31 -82 15 87 85 -185 46 -50 220 96 108 -196 -4 16 18 -90 -81 -140 236 191 -90 309 -7
7021gj50J92N7k19M12n78L03N0j38J7J56p6j5p9K09m29J76L74j81qj62K43k88
$$ -7 -157 35 92 -127 285 -293 10 60 -78 -61 95 19 4 -75 134 -295 -119 255 74 66 -96 147 -141
7044a41J61j19J09n5n9L89l93J34j12k02N81k34j27M25l26M3r8J83j41j26j5l7
$$ -141 20 -99 10 -45 -104 285 -108 26 -86 -288 293 59 -68 357 31 74 -24 159 18 -108 -123 -160
7066a60J90L3n00N35l18J79k1j57L40j96K78j72q1M5j27K66k47P6n9J83j66K54
$$ -160 30 63 -437 98 -220 -41 -62 -219 121 -75 203 31 -50 -5 -132 134 -113 -37 -96 87 -79 175
7088A75K08k88k12m8K15k57L06J35j16j36o2J19j95K10o9m5m4q3R0J64Po3R1O0
$$ 175 383 95 -117 -165 50 -207 99 234 118 -18 -80 39 -156 54 -15 -60 -104 -187 -97 67 74 11 102 162
7112A62j67J61k44kP1j69P0J59J32k22M3N9K6R5j10p1M00l03j18J18j73lK04m8
$$ 162 -5 156 -88 -90 -19 -188 -118 41 173 -49 -6 53 79 174 64 -7 393 90 -28 90 -83 -86 118 70
7136G0J38n21L26K03j75J22j24j18m3R1L79k69J3K3o5r0m6o6N72k21k58r1K17
$$ 70 208 -313 13 216 41 163 39 -79 -122 -31 348 79 92 115 50 -40 -86 -152 420 199 -59 -150 67
7159F7k02K11L3k36J02J69n0k29n2K3L74k06j60J29N7L4J36l28j7R9O1O1j02j24
$$ 67 -135 76 109 -127 -25 144 94 -135 -187 -164 210 4 -156 -27 30 64 200 -128 -145 -46 15 76 -26 -150
7183a50Q8K60j06m8l03L00P1q7J2Q6j11k78L04j11O9N1j82J35J87o9J12k77J09
$$ -150 -62 198 92 44 -259 41 112 25 37 123 12 -266 38 -73 -4 47 -135 0 187 118 230 -47 62
7206F2o6j90K26j71K87j90k4J16j82L28k88K73l30jM24k73J42M3j82M9k24J13
$$ 62 -4 -194 32 -139 148 -42 -66 50 -132 196 -92 181 -149 -150 274 1 143 186 4 53 -171 -58
7228e8K25k28R4q9L61j24l47N7L41k02k74Q3K63j70K26j00J9m38K05J25l5J30
$$ -58 167 -61 33 -56 305 181 -166 -109 232 30 -244 -161 102 -68 158 58 77 -361 -156 -31 -66 64
7250F4q9M5R3l99J60j13K43L00m16J17j30K38J02p8k2M0j32n9m1N3J43k12OJ04
$$ 64 -25 20 113 -286 -126 -239 4 304 -112 5 -125 113 215 137 115 155 23 -36 -77 -24 119 -93 -87 17
7274A7k68J29L26k69L95k99J14J86q5j85k1Q6q2N4M2j4P4j04m31K86j31L58k4
$$ 17 -251 -122 204 -65 330 31 145 331 246 61 40 126 44 98 140 126 200 96 -335 -49 -180 178 154
7297A54l16m7K43p2k46L84k25J53R4j07j32M6M5j81J96k87N3K4N4P3J18J64j98
$$ 154 -162 -209 34 -38 -284 100 -125 28 122 15 -117 -71 -26 -207 -11 -298 -245 -221 -167 -94 24 188 -10
7320a0P8RL4l6k90L48k29K25P7k1m78PO4L42k83o7J57j1j55R7O4nQ9p8j32M45
$$ -10 68 77 111 75 -215 133 -96 129 206 185 -293 -286 -222 120 -163 -230 -73 -84 -239 -142 -78 -83 6 -72 -204 241
7346B41N2l15J88L7k68J37j49p4K8q6R9k7M13Q6m61M61j84p4L4j40j95K20j23
$$ 241 293 -22 166 203 -65 72 -77 -151 -123 -209 -110 -137 276 362 -99 362 178 104 138 -2 -197 23 -100
7369a00n9K88q8jP4M0j95J1K2K54l51J21o0J7K53l89L9N8R1k09J35J35o4k54L08
$$ -100 -159 129 41 40 114 154 -41 -30 -8 246 -105 16 -44 -27 226 -163 -124 -66 25 -184 -49 86 22 -232 76
7394G6o7ok6J1K63j50k85K42k39l1M10j70l0J24R0k93j7n8p0J75J03r6N0L9ML
$$ 76 9 3 -23 -12 251 101 -184 58 -181 -212 198 28 -2 122 212 -81 -98 -156 -226 -51 52 -44 6 45 49 52
7420E2J47j82j6j86J06J36j29j42M36k39l12K92k2J08k75L05J07k14K06n4l4J
$$ 52 199 17 1 -185 -79 57 -72 -214 222 -17 -329 -37 -59 49 -226 79 186 -28 178 124 90 91
7442I1k93L51po5Q7j62j85J67k05M20k18m3J07l0Q5Q9j42j76Q8J98k18J43j18
$$ 91 -202 149 142 77 164 2 -183 -16 -221 199 -19 -62 45 15 100 189 47 -129 -41 157 -61 82 -36
7465c6m5n4O0N6J4n7K04J62n94K20K74j58k50P3J5q5K34O1j12q4O5R0k22RJ15
$$ -36 -81 -135 -75 -19 -5 -62 142 304 -290 -70 204 46 -204 -131 -116 -201 33 94 -18 -102 -37 53 -169 -160 -45
7490d5O5Kk5j40N8K07J03l02qR5J20k7j81q8J91r7J38p2P8j46O4J05l12K60J78
$$ -45 20 22 -3 -143 -85 122 225 -77 -85 10 130 103 -78 -166 25 -72 66 -6 72 -74 -10 95 -217 43 221
7515B21l60K07q9K47k27l31L35J6MK2J86j87M6N8k54J05L12m84k6J76J23j32P1
$$ 221 -139 68 -21 226 -1 -332 3 19 23 45 231 44 90 148 -106 -1 311 -173 -199 -23 100 -32 39
7538C9p1K43k51n6K14j14J2o9J68n2J8N7Ql20J24P9l73M04j52j83K51o7K6K07
$$ 39 -32 211 -40 -96 118 4 16 -53 115 63 81 138 146 -174 -50 29 -344 60 -92 -275 -24 -91 -65 142
7562A42O1k00J24j02o9K44l87N7K6N6k16J85q5L6K60l6J77k24r0J40j78P6PJ24
$$ 142 203 3 127 25 -44 200 -187 -130 -104 -48 -264 -79 -164 -128 132 96 273 49 -41 99 -79 -3 4 128
7586A28j54K9j95K4J77J52p4k14O3K06o5j78J05k8K02k25K48l88J17l5K13j8P1
$$ 128 -26 3 -192 -168 9 161 87 -127 -64 142 77 -101 4 -24 178 -47 201 -187 -70 -105 108 90 161
7609A61k33J32k31K77j67N6K78k94J83m12K53j51J88j04J9M4k3P6r2O1j81j4L68
$$ 161 -72 60 -171 106 -61 -5 273 -21 162 -250 3 -148 40 -64 -45 -1 -24 52 -40 21 -160 -174 194
7632A94J52k75k38M23k78K63j05l26L63k33L77k44n1l6O7pk72N54k89J15l46J77
$$ 194 346 71 -167 256 -22 241 136 -190 173 -60 317 73 22 -14 53 46 -226 328 39 154 -192 -15
7654a5J38j68j8L5J48m6j49J05L6O7J09L3l25J09j89O2j59KJ32J46J43j7j63j48
$$ -15 123 -45 -63 -28 120 74 -75 30 66 133 242 275 -50 59 -130 -68 -227 -225 -93 53 196 179 16 -132
7678a32L06j60O1p7j76N6K21j71J68j28J55P5k53n7Q8j00L5J58j62J08m3J47Q
$$ -132 174 14 75 -2 -178 -122 99 -72 96 -32 123 198 -55 -112 -24 -124 -89 69 -93 15 -28 119 127
7701A27k44M0o7J97L6j5O0k28J36J33j40N0L4J15K4j36P2n2k50J84n7Q6r7k46
$$ 127 -117 -77 -144 53 89 74 134 -94 42 175 35 85 119 234 258 122 194 142 -108 76 19 105 8 -238
7725b38L75k20k3J57K3p9k20M23j70q6M1j53J80j75J33k2K6j93L4N92l18J09j7
$$ -238 137 -83 -106 51 74 -5 -225 198 28 -58 -17 -170 10 -165 -32 -54 -28 -221 -187 405 87 196 179
7748A79j64J25j96J22m2J6J74k75j83K2L89l18L8L30j78k80r9J92L51j13j85L3
$$ 179 15 140 -56 66 24 40 214 -61 -244 -222 167 -151 -113 217 39 -241 -340 -148 203 90 -95 -62
7770f2J06p1J50j52qJ31M9n4j75n1o0K92j07k37M16r4J32k6l5k36NK24l18J56
$$ -62 44 -27 123 -29 -37 94 143 89 -86 -137 -197 95 -12 -249 167 73 205 179 144 -92 -87 137 -181 -25
7794b5Q4j52K37j99K57k59O4p2J24rm60M14J15p3J98k35j27J69J5l06L9K92j61
$$ -25 59 -93 144 -55 202 -57 7 -65 59 50 -410 4 119 46 244 9 -118 51 66 -240 -201 91 -70
7817g0k12M32l91K89N3k80L81j39k51J39K33j0m06K43n9P1R0l66N94m39K08l7
$$ -70 -282 150 -241 48 101 -179 202 63 -188 -49 184 174 -232 11 -48 23 113 -253 341 -98 110 73
7839G3R4j43J26k03p4M3O7K7j56K10k1n9K66j85k45O1K68J1l13L7N9j0K6J08j10
$$ 73 167 24 150 -53 -127 -84 -17 10 -146 64 43 -16 250 65 -180 -119 149 160 -153 -116 -57 -67 -41 67 -43
7864d3K3p6l13L06m0J76j62N3K7J67j40K25j99N1J50j83K16k29m6L05l05K33L1
$$ -43 -20 -96 -409 -103 -143 33 -129 -76 -49 118 -22 203 4 55 205 22 238 9 -37 268 -37 196 227
7887B27l76J43N2k19K88m8J50J04n95K78m9K93l41J97q9K54j18j22j11P7O7k0
$$ 227 -149 -6 46 -173 115 67 217 321 -274 4 -45 248 -93 104 15 269 151 29 -82 -5 62 42
7909D2N3j87r2N90n14N9j31J31%o0K84j94M89m79J36j98J2p3K18j16J89O1n09
$$ 42 95 -92 -184 406 -108 -49 -180 -49 -49 -109 175 -19 470 -9 127 -71 -59 -132 86 -30 159 220 -289
7932b89J93r7n3J97n4l2L04r2m9m9L25j64j00R4K6j57K1N0k52N7J3K1K31P5k92
$$ -289 -96 -193 -246 -49 -103 -135 169 77 28 -21 304 140 40 134 160 3 24 74 -178 -121 -108 -87 144 219 -73
7957g3j23L21k79J35j77K23J05P3m05J14mN1J54Nk20P6J68j27J27j67L87o33K50
$$ -73 -196 125 -154 -19 -196 27 132 205 -200 -86 -90 -39 115 120 -100 -24 144 17 144 -23 364 -269 -19
7980a9l5K90l46j47K60J62n52K40K42p0n2o2O6n7J80J37l24K73k23J02J90k48
$$ -19 -54 236 -110 -257 3 165 -387 -147 95 25 -27 -89 -23 -80 100 237 -87 186 -37 65 255 7
8002Gj65L07j85K9PJ87k69K58k82J19L9k84K25j42J86K8L9k17K66M1l00L54J73
$$ 7 -158 149 -36 -7 0 187 -82 176 -106 13 52 -232 -7 -149 37 65 104 -113 153 194 -106 248 421
8025D21r6m48K57M6k35J14N0k84L02k32R1J51o5n9j45J55R4J6k56J1J16n7K00
$$ 421 325 -123 134 180 -55 59 109 -175 127 -105 -14 137 72 13 -132 23 117 133 -123 -112 4 -53 147
8048A47M9k7j96q6L21k48J9R5j79N3n9K42j68M8M2j20J87j46n8K5p3L95k22j94
$$ 147 196 169 -27 -113 208 -40 -21 74 -105 -52 -111 131 -37 11 53 -67 120 -26 -84 -59 -132 263 41 -153
8072a53K09j40nJ34K5J43j40mn6r1J78k98L5J53n6Q3K26k06k16j36L57j75j48
$$ -153 56 -84 -89 45 70 213 73 69 13 -78 100 -198 -163 -10 -66 17 243 37 -179 -315 42 -133 -281
8095b81K10o4O0K78j37j65K54n1l74K40JR5J6K4o2j03kR0k10J75N3K27p6p3j22
$$ -281 -71 -135 -75 203 66 -99 155 104 -270 -30 -29 66 82 106 44 -59 -61 29 -181 -6 47 274 198 125 3
8120CJ73l27QJ82K07m76L20j09j33N7j90K65r0L75m28K5M0Q6M7j07L36k19K0J48
$$ 3 176 -151 -143 39 246 -230 90 -19 -152 -95 -285 -20 -110 265 -163 -138 -98 -12 35 -72 264 45 65 213
8144B13j12k3J55m11rJ78J14k41N8k8K27l03J98j32J57J1k95M26j05j80J82k09
$$ 213 101 78 233 -178 -187 -9 105 -136 -78 -106 121 -182 16 -116 41 52 -243 183 78 -102 80 -129
8166a29J30J32j02L17l42M4n5M4q6J4r9L30l01M25k39J10k54J14j59R1J03n2j89
$$ -129 1 133 31 348 6 50 -5 39 -47 -33 -132 198 -103 322 83 193 -61 53 -106 -15 88 36 -153
8189a53R1m8
$$ -153 -62 -110
8191a10
$$ Imaginary data points
##PAGE= N=2
##DATA TABLE= (X++(I..I)), XYDATA
0@%%%%%%%%%%%%%%Qj6J6j6J6j7K5l2L5m3M9n7O9p8Q9j04J20j36J53j74J96k20
$$ 0 0 0 0 0 0 0 0 0 0 0 0 0 0 0 8 -8 8 -8 8 -9 16 -16 19 -24 25 -32 37 -41 48 -56 64 -72 81 -93 103 -117
36a17K47k75L08l45L82m22M69n20N74o34O99p70Q50r37J031j136J253j383J529
$$ -117 130 -145 163 -182 200 -222 247 -273 301 -333 366 -404 446 -491 540 -596 657 -726 803
55H03j695J883k099K353k654L017l465M033m782N815p334R787j4364K5618j01493
$$ 803 -892 991 -1108 1245 -1409 1608 -1857 2176 -2606 3209 -4125 5662 -8702 16916 -84577
70h4577j21107K94326M073k08699P3919J36609j15668m5424R0177k1665o0393
$$ -84577 -205684 88642 92715 -115984 -42065 94544 -21124 -66548 23629 1964 -58429
81e8429N0177Q567l4438L7278K8930n5802k4263M0394K0588l1773j6249L3933
$$ -58429 -8252 315 -34123 3155 32085 -23717 -47980 -7586 13002 -18771 -35020 -1087
93a087K4468k9231j2518K3637j0397k3531L5174J4151m4334J6568N0408m1188
$$ -1087 23381 -5850 -18368 5269 -5128 -28659 6515 20666 -23668 -7100 43308 2120
105B120l4352N0995L476n0948K6821M3429l4719k0441L1143k288j4650J2445j0650
$$ 2120 -32232 18763 22239 -28709 -1888 41541 6822 -13619 17524 15236 586 13031 2381
118B381j2538K7387R955k2479l294O653n823J894O618m363l962o41K439J2005
$$ 2381 -10157 17230 27185 4706 1412 8065 2242 4136 10754 6391 2429 1788 4227 16232
132A6232n837k4569J0390J9251k1235k135K8688j7110k8372K9021J8404l5682
$$ 16232 10395 -14174 -3784 15467 -5768 -7903 20785 3675 -24697 4324 22728 -12954
144a2954r484L0893m99j6986P259J910p780M109J382k956L336k753l176R835J533
$$ -12954 -22438 8455 7956 -9030 -1771 139 -7641 -3532 -2150 -5106 -1770 -4523 -7699 2136 3669
159C669j2225K6P591k238J369L857q190j89J0602m869m357O164p214k196J7055
$$ 3669 -8556 -8530 -939 -3177 -1808 2049 -6141 -6330 4272 -597 -4954 1210 -6004 -8200 8855
174H855j689j9334P389J4504j2688m582J4517n888j0938J1465N987p395k766j250
$$ 8855 7166 -12168 -4779 9725 -2963 -7545 6972 1084 -9854 1611 7598 203 -2563 -3813
188c813K181P513m321q131P055N670r488R86R047p969n937R718J639m282P28l406
$$ -3813 -1632 5881 1560 -6571 484 6154 -3334 -2348 6699 -1270 -7207 2511 4150 -132 596 -2810
204b810J024Q614m856j0041Q740P265j0592p32J1405o126q556R447L091o892J125
$$ -2810 -1786 6828 1972 -8069 671 7936 -2656 -3388 8017 1891 -6665 2782 5873 -1019 106
219A06K946j482Q25K17k670J184J957k700K436K460p298Q52R554n254q349P470
$$ 106 3052 1570 2395 2612 -58 1126 3083 383 2819 5279 -2019 -1167 8387 3133 -5216 2254
235B254L642n803J80L309k611o36J123j955J730K616o847r31R561k595q924L589
$$ 2254 5896 93 273 3582 971 335 1458 -497 1233 3849 -2998 -3929 5632 3037 -5887 -2298
251b298N240m446j329L095l77k786K46J717L48j272l281K523L603m071k075N453
$$ -2298 2942 -1504 -2833 262 -115 -2901 -2655 -938 -590 -1862 -5143 -2620 983 -3088 -5163 290
267B90j268n571L837L938m223k759M532J485k939l86J091Q09P48k773K15M780
$$ 290 -978 -6549 -2712 1226 -2997 -5756 -1224 261 -2678 -3064 -1973 -1164 -416 -3189 -2974 1806
283A806j323m343K566M286k956l701M466K570l818j047K731J894j962k496K907
$$ 1806 483 -3860 -1294 2992 36 -3665 801 3371 -447 -1494 1237 3131 1169 -1327 1580
298A580L089l671j702M656k02m004L92N077j380m474K167L341k663j575J482J606
$$ 1580 4669 998 -704 3952 3750 -254 138 5215 3835 -639 1528 4869 2206 631 2113 3719
314C719j099k597J450K968j758l115J180L012j754l946L003L023l870k308L046
$$ 3719 2620 23 1473 4441 2683 -432 748 3760 2006 -1940 1063 4086 216 -2092 954
329I54K066k974l324L130K517l496j762K786J733l803j908M713R1m717O65L721
$$ 954 3020 46 -3278 -148 2369 -1127 -2889 -103 1630 -2173 -4081 632 723 -3994 -3329 392
345C92j136k438N30K468q09k715J213K307r55k188L61L010k36l774J857K770k053
$$ 392 -744 -3182 -2652 -184 -993 -3708 -2495 -188 -1143 -3331 -2970 40 -196 -3970 -2113 657 -1396
362a396k135K199K599k404k428K876K398k548j668K368K073k682k012M070J539
$$ -1396 -3531 -1332 1267 -1137 -3565 -689 1709 -839 -2507 -139 1934 -748 -2760 1310 2849
377B849m083l98L803M08l178j62L435m36k787Q47K654o15k491j15L506m56l479
$$ 2849 -1234 -1632 2171 2579 -599 -761 2674 2238 -549 298 2952 2337 -154 -269 3237 2781 -698
394f98J426K779j534k317J710K031j903k205K066J652j709j840J641K277k682
$$ -698 728 3507 1973 -344 1366 3397 1494 -711 1355 3007 1298 -542 1099 3376 694
409F94k338L630J099m157l47L261N27l751k56K968k34k485j67K076R79l161r66
$$ 694 -1644 1986 3085 -1072 -1419 1842 2369 -1382 -1638 1330 1096 -1389 -1556 520 1499 -1662 -2628
426b628L913m52l744R14L411j551k660J195K027j565r09O43J023L2k248L55L715
$$ -2628 1285 833 -2911 -1997 1414 -137 -2797 -1602 425 -1140 -2049 -1406 -383 -351 -2599 -2244 1471
443A471k284l286L882K328m236j158L735O3k677N81K223j174o83l03J267K259
$$ 1471 -813 -4099 -217 2111 -2125 -3283 452 515 -2162 -1581 642 -532 -1215 -1518 -251 2008
459B008l051k265M231J838m843K93L919j996k465L559P99l383P14J577R4k36j514
$$ 2008 -1043 -3308 923 2761 -2082 -1789 2130 134 -2331 1228 2027 -1356 -642 935 1029 793 -721
476g21o32L581L06m321J962L114l975j548O028o01n978K283M029j525j358n95
$$ -721 -1353 2228 2534 -1787 175 3289 -686 -2234 3794 3193 -2785 -502 3527 2002 644 49
492D9p4K809k08l500J219L053l278j049N262j510n373K927L439l214K45O5j598
$$ 49 -25 2784 2576 -924 295 3348 70 -979 4283 2773 -2600 327 3766 552 797 862 -736
509g36J582J932k720j82J438k389R07M218l780n176N598K881n589k7L080k609
$$ -736 846 2778 58 -124 1314 -1075 -168 4050 270 -4906 692 3573 -2016 -2043 1037 -1572
525a572K2K023j374m99P5j723K310L104n350l667P127J657n823N81K842l231O05
$$ -1572 -1550 473 -901 -1400 -1325 -3048 -738 2366 -2984 -6651 476 2133 -3690 -3109 -267 -3498 -2893
542b893M004j994k481L12O67K583J122m997j634O643K19n358L313J909n082K413
$$ -2893 1111 -883 -3364 -3052 -2385 198 1320 -3677 -5311 1332 1551 -3807 -494 1415 -3667 -1254
558a254M915k906l368J914J563J427J109m562j266O157J41m078K715J80m465M652
$$ -1254 3661 755 -2613 -699 864 2291 3400 -1162 -2428 3729 3870 -208 2507 2687 -1778 2874
574B874L743n850j924M583m09q76K132k952k416M671N97l320K070j517m007O218
$$ 2874 6617 767 -1157 3426 3017 2141 4273 1321 -1095 3576 4173 853 2923 1406 -2601 3617
590C617L533q634k178O108j12j843J560l102j993M444j63l130K848k153m904O522
$$ 3617 7150 -1484 -3662 2446 2334 491 2051 -1051 -3044 1400 1237 -1893 955 -1198 -6102 420
606D20M354q654k441O679o47k783K543j604l253M578J010l401J761j568k751O736
$$ 420 4774 -3880 -6321 358 -289 -3072 -529 -2133 -5386 -808 202 -3199 -1438 -3006 -5757 979
622I79K296q778K73P256k388k910M583k067m379N777K595n075M03Q56j154M475
$$ 979 3275 -5503 -5230 2026 -362 -3272 1311 -756 -5135 642 3237 -1838 -1435 -579 -1733 2742
638B742R69p075J245O710l559j603N042m158m637P671L476p231r61L235r56K286
$$ 2742 3711 -3364 -2119 4591 1032 -571 4471 313 -4324 3347 6823 -408 -1369 1866 910 3196
654C196Q15n595R82M039k631k02L812l896m773P110K703o768n59L188j378J617
$$ 3196 4011 -1584 -602 3437 806 604 4416 520 -4253 2857 5560 -1208 -1767 1421 43 1660
670A660Q28n114Q37M377k534j028L003l468k936O328J672o606K67L819k398J193
$$ 1660 2488 -2626 -1789 2588 54 -974 2029 -1439 -4375 1953 3625 -2981 -2714 1105 -1293 -100
686a00J786l875q51L738o25o61J300l201j160O378L54p296J928L803k816Q74K559
$$ -100 1686 -2189 -3040 698 73 -588 712 -2489 -3649 2729 3083 -4213 -2285 1518 -1298 -424 2135
703B135l673j221L558Q5n92L37k735m11N841r82n721K558L125m032J100L469l972
$$ 2135 -1538 -2759 799 884 292 629 -2106 -2517 3324 2342 -3379 -821 2304 -1728 -628 2841 -1131
720a131j453L769O49k035n06q85O86L500j740l915L059J481l488K023K283m025
$$ -1131 -2584 1185 1834 -201 -707 -1592 -906 2594 854 -3061 -2 1479 -2009 14 2297 -1728
736a728j528M562N57k587jk38L53K400j143k885K339Q44k455K379J608m226m43
$$ -1728 -3256 1306 1863 -724 -725 -963 -610 1790 647 -2238 101 945 -1510 869 2477 -1749 -2192
753b192M726o37k795R66O18p66J350j30j658J105M75j757K268J092m383Q94M056
$$ -2192 2534 1897 -898 68 686 -80 1270 1140 -518 587 1062 -695 1573 2665 -1718 -824 3232
770C232j419k921J808R01j450M24Q00j004o0L21l90J510o1l593J320L288j824
$$ 3232 1813 -1108 700 1601 151 575 1375 371 311 632 242 1752 1691 -1902 -582 2706 882
787H82k651K070P08k098O02J298j668l04P84p3R30o11j902J423J670k401o44J924
$$ 882 -1769 301 1009 -1089 -487 811 -857 -1161 -377 -450 480 -131 -2033 -610 1060 -1341 -1985 -61
805f1J57k237J335J529k099n25J228K71K29j200m72J701M42j684J6J660j000j243
$$ -61 96 -2141 -806 723 -1376 -1901 -673 -402 -173 -1373 -1845 -144 298 -1386 -1370 290 -710 -1953
823a953J558J278k097j66J912J09q76O6o1O75K52j174O57R94q14r28J686N35k180
$$ -1953 -395 883 -1214 -1380 532 641 -235 -169 -230 445 697 -477 180 1174 360 -568 1118 1653 -527
842e27L86J903p45p89M19M52L4p15K33R62l49j158K79J126j07j696Q29J512j219
$$ -527 -141 1762 1017 228 647 1099 1133 418 651 1613 1264 106 385 1511 1404 -292 537 2049 830
861H30j140J119M48r93l12P76L35j431j49R50N40j052q56J037L22j171l50J385
$$ 830 -310 809 1257 264 -48 728 1063 -368 -517 433 973 -79 -935 102 424 -747 -1097 288
879B88k23j096J40P87K66j696M47J330n90o10l12J107j87j182L46J563j227p74
$$ 288 65 -1031 -891 -104 162 -1534 -1087 243 -347 -957 -1269 -162 -349 -1531 -1185 378 -849 -1623
897a623P62J036p98r38P32J000j222m46J046N38j018k97J153M90j496J28J239
$$ -1623 -861 175 -623 -1561 -829 171 -1051 -1497 -451 87 -931 -1228 -75 415 -1081 -953 286
914B86o1o24j61J159K99j407J71J205m36o91K40J098k72j039M97J062n72p61J49
$$ 286 225 -399 -560 599 898 -509 -338 867 431 -260 -20 1078 806 -233 264 1326 754 -7 142
933A42J226n26j384J025J103r70o50P35O10q72o17J119L75j403K00O31M19r80
$$ 142 1368 842 -542 483 1586 616 -34 701 1311 439 -178 941 1316 -87 113 744 1163 183
951A83n66J335P5j318J4J068l56n12k59J218m01j098L46J108q08p40M87R88p02
$$ 183 -383 952 1027 -291 -277 791 435 -77 -336 882 481 -617 -271 837 29 -711 -224 764 62
970F2j077O17R96p65o10K32P21n60q17J040P50j627l68J358L74j672J37R00P5
$$ 62 -1015 -398 598 -167 -777 -545 176 -384 -1201 -161 589 -1038 -1406 -48 326 -1346 -1209 -309 -234
989b34p62L16M46k38n54J7R33L1j193L79J015k62r67N35J179j061q09J287L34
$$ -234 -996 -680 -234 -472 -1026 -1009 -76 -45 -1238 -859 156 -106 -1073 -538 641 -420 -1229 58 392
1008C92p90N9L66P04l38j010K70J565n97j415J112J015j376k29J815n84r64M22
$$ 392 -398 -339 27 731 393 -617 -347 1218 621 -794 318 1333 -43 -272 1543 959 -5 417
1026D17O43j18j63m51K17Q14m62n87R31J64j657N62J768j474j208J559J29q97
$$ 417 1060 942 779 328 545 1359 897 310 1241 1405 -252 310 2078 604 -604 955 1084 187
1044A87N1K27J42Q0m72m84K92K80j347Q85K030k593r59K020K15j372N10q7q20
$$ 187 238 465 607 687 215 -269 23 303 -1044 -159 1871 -722 -1681 339 554 -818 -308 -395 -1215
1063a215P15M01q92K68j74n62J124Q43k280l90K215n01j025J101J40j719J199
$$ -1215 -500 -99 -991 -723 -897 -1459 -335 508 -1772 -2162 53 -448 -1473 -372 -232 -1951 -752
1080g52R08r51k10K70m03J112J059k635R3K560j005j348J854qj911J030K038j430
$$ -752 156 -795 -1005 -735 -1138 -26 1033 -1602 -1509 1051 46 -1302 552 544 -1367 -337 1701 271
1098B71n73M87O4O64M51j761K18J928j130p98J748r06j596K179J297k561n66J748
$$ 271 -302 185 249 913 1364 -397 -179 1749 619 -179 1569 663 -933 1246 2543 -18 -584 1164
1116A164l28K93L14j717j73K151r82o11J372j452j588K960J193l352m14J731l14
$$ 1164 836 1129 1443 -274 -447 1704 722 111 1483 31 -1557 1403 2596 -756 -1170 561 247
1133B47m16J343j953o50K056l46n26P20j286j017K947K08l133M04J966j135N28
$$ 247 -169 1174 -779 -1429 627 281 -245 475 -811 -1828 1119 1327 -1806 -1402 564 -571 -43
1150d3R11k099q37K684m60p96J052j469j277K973Q79l523N79K288j366N6J463
$$ -43 868 -1231 -2068 616 156 -640 412 -1057 -2334 639 1518 -2005 -1426 862 -504 -448 1015
1167A015k185o70K489K39j288K37q68k00L132n29l245J415J939k568R34K147k712
$$ 1015 -1170 -1840 649 888 -400 -163 -1031 -1231 1901 1372 -1873 -458 1481 -1087 -153 1994 -718
1184g18j689L753N42k349O05l43j71J926rl317J544J961k259M57K130k667j475
$$ -718 -2407 1346 1888 -461 144 -199 -370 1556 1547 -1770 -226 1735 -524 -67 2063 -604 -2079
1201b079M148k35k546N50J33k41J523K73k662Q40J435j424J018J134l183l01L865
$$ -2079 2069 1834 -712 -162 -29 -270 1253 1526 -1136 -296 1139 -285 733 1867 -1316 -1617 2248
1218B248o74l254J663O02j333J721M23k675L60J908r18K94J118k756m86L731p41
$$ 2248 1574 -1680 -17 585 -748 973 1396 -1279 -919 989 71 365 1483 -1273 -1759 1972 1231
1235A231k710J410K36r49J454N06k306k88K180r26M74K44k522O57L142j405k668
$$ 1231 -1479 -69 167 -782 672 1178 -1128 -1416 764 -162 312 556 -1966 -1309 1833 428 -2240
1252b240K254J13j431J836L82k675l6K451m98o22N47j887L78L125j598k005J852
$$ -2240 14 127 -1304 532 914 -1761 -1797 654 156 -466 81 -1806 -1428 1697 99 -1906 -54
1269e4K57j638J987N05k842M30J991k13o63L01j090M43K240j341j462J656l19
$$ -54 203 -1435 552 1057 -1785 -1355 636 423 -240 61 -1029 -586 1654 313 -1149 507 188
1286A88j100K323q3l009O95K909q75j207J106q20n03J873o50j457J287k69m79
$$ 188 -912 1411 1328 -1681 -986 1923 1048 -159 947 127 -376 1497 847 -610 677 408 -71
1303g1J522j68k376Q19K246r98j106P01l41m95J268j76j416Q27j40k59J166m24
$$ -71 1451 1283 -1093 -274 1972 974 -132 569 228 -267 1001 825 -591 236 96 -163 1003 579
1321E79k034J025J754j374r99J617p04q75J594J97j747M19O33m73L49j28j107
$$ 579 -1455 -430 1324 -50 -1049 568 -136 -1011 583 780 -967 -548 85 -388 -39 -167 -1274
1338a274Q52J092j370l20J132o83o99J497l06p96Q7L77J22J96l64r06P51Q77j215
$$ -1274 -422 670 -700 -1020 112 -571 -1270 227 -79 -875 -788 -411 -289 -93 -457 -1363 -612 265 -950
1357i50L16Q23p34k66J283k09j173O12P46n17R8O1l33K77K74k03R8M03n91l6J139
$$ -950 -634 189 -545 -811 472 263 -910 -298 448 -69 29 90 -243 34 308 105 203 606 15 -21 1118
1378A118o26j135Q19N59l47J52n0K5K33J67m61K79J80p86J98R59q34r57J144N24
$$ 1118 492 -643 176 735 388 540 490 515 748 915 454 733 913 127 325 1284 450 -507 637 1161
1398A161j226J20O51q8m69J19R2k01j20j12K03K44n55n7P14l43q29O57j46k16
$$ 1161 -65 55 706 618 149 268 360 159 39 -73 130 374 -181 -238 476 133 -696 -39 -185 -401
1418d01QL62k2k41k23k1K55L24q27j80R95k43p30P59J17m65j07N77r9m44j26M74
$$ -401 -393 -31 -53 -294 -517 -538 -283 41 -786 -966 29 -214 -944 -185 -68 -533 -640 -63 -162 -606 -732 -258
1440b58K33n33r5j45O68l17k48N94K30l91p8L53K00o63M47J96P1m64M82jj72k03
$$ -258 -25 -558 -653 -798 -130 -447 -695 -101 129 -262 -340 13 213 -450 -3 193 264 -200 282 281 109 -94
1462i4P0P56l90o24N32L85j32r1q0L91o4o31N23J54k70k30L63K10o85P8L08R2
$$ -94 -24 732 342 -282 250 635 503 412 332 723 659 28 551 705 435 205 568 778 93 171 479 571
1484E71p07J30L45m3n9k5K93k80K4k9j21p8o0jK79P8m78k06P02m65k99M07O3k65
$$ 571 -136 -6 339 296 237 212 505 225 249 220 99 21 -39 -40 239 317 -161 -367 335 -130 -429 -22 41 -224
1508b24l23K17K98j36n58J70K32lj82K76r4j6m61L84K43p36O55p2J15m17J61m
$$ -224 -547 -330 -32 -168 -726 -556 -324 -327 -509 -233 -327 -343 -804 -420 -177 -913 -258 -330 -215 -632 -471 -475
1530d75J70M7J59k35L83m62k62Q33l14j98K54K77k25j58J62J73j55J28L28j66
$$ -475 -305 -258 -99 -334 49 -413 -675 158 -156 -354 -100 177 -48 -206 -44 129 -26 102 430 264
1550B64k5j59J42M19l76k71M37J02n34N18J92k27l03L42L1P3l15J64k53M61m90
$$ 264 239 80 222 641 265 -6 431 533 -1 517 709 482 179 521 552 625 310 474 221 682 192
1571A92l23Q08k7o14M42K52q12J67R9L41o69R3Q4J97k23p6K68J26m81n06N77N43
$$ 192 -131 677 650 36 478 730 -82 85 184 525 -144 -51 33 230 7 -69 199 325 -156 -662 -85 458
1593D58j081r0R16j65n99L38J29l58N0K82k60L95l5p41P67K04j072K55O19m90
$$ 458 -623 -713 203 38 -561 -223 -94 -452 -402 -120 -380 15 -20 -761 6 210 -862 -607 12 -478
1613d78l49O90j69n81O63M04o73O23m90r3P71n1r31M06M67p8l03M18k96o11P93
$$ -478 -827 -137 -306 -887 -224 180 -493 130 -360 -453 318 267 -664 -258 209 131 -172 246 -50 -661 132
1634A32M65r18N63k17j43Q20j6q12NR31o47j19P91q55m82J134L55j124K56L28
$$ 132 597 -321 242 25 -118 702 686 -126 -121 810 163 44 835 -20 -502 632 987 -137 119 447
1654D47m51O69q1p56K13P35o85L99L70j016m05J773j83j648L21Q55o39L81J73
$$ 447 -4 665 584 -172 41 776 91 490 860 -156 -561 1212 1029 -619 -298 557 -82 299 472
1673D72o42l89R70m84L3P63r81n78J597k22j535O76R01j186O76N00j389L0J017
$$ 472 -170 -559 411 -73 -40 723 -258 -836 761 539 -996 -320 581 -605 71 571 -818 -788 229
1692B29j58o68P21p77j56J470j01j829J015M33r27Q69L17j552K6J270j32m63O28
$$ 229 71 -597 124 -653 -809 661 560 -1269 -254 179 -748 121 438 -1114 -1088 182 50 -413 215
1711B15q77k43J776n62j332J006P00j304P35N58j414l6J685o07p13K43K7m49J525
$$ 215 -662 -905 871 309 -1023 -17 683 -621 114 672 -742 -778 907 300 -413 -170 -143 -592 933
1730I33k65j587J028O51j124Q61O89k035K8J872k75j253P97n85L10J116m52j437
$$ 933 668 -919 109 760 -364 497 1186 -849 -821 1051 776 -477 320 -265 45 1161 709 -728
1748g28R03M51o10O72K98j919L74K164r58j131O33l9m61J489l85j550O74Q43j059
$$ -728 175 626 16 688 986 -933 -559 1605 647 -484 149 110 -351 1138 753 -797 -123 720 -339
1767c39P97J68j532L91J645r43q55P15n39k04J517l62j658P95J015r90M25K88
$$ -339 458 626 -906 -515 1130 187 -668 47 -492 -696 821 459 -1199 -404 611 -379 46 334
1785C34j852P38J601q48r37Q87l10j04R95j95j941J266Q19j125O67J22j474N89
$$ 334 -1518 -780 821 -27 -964 -77 -387 -491 504 309 -1632 -366 453 -672 -5 117 -1357 -768
1803g68J704j083o40Q65m97k79J525j77k024J074J140p73K46L82j593O52J384
$$ -768 936 -147 -787 78 -419 -698 827 650 -1374 -300 840 67 313 695 -898 -246 1138
1820A138q81o16Q29m29n61J650m09j612Q36J234j137J95M17j122O24J361j050
$$ 1138 257 -359 470 41 -520 1130 721 -891 -55 1179 42 237 654 -468 156 1517 467
1837D67q29N60K0r6J008m77j533J106Q68p93R1K61j005J36J159o13j101P78J00
$$ 467 -362 198 218 122 1130 653 -880 226 1094 301 392 653 -352 -216 943 330 -771 7 107
1856A07m66J122k47j589J016Q21j094R6P54j114J71J306p27r62N43k0p9M67j51
$$ 107 -359 763 516 -1073 -57 764 -330 -234 520 -594 -423 883 156 -806 -263 -283 -362 105 -46
1875d6j060R57O47j124K94M41q53K18J167r27l18N86J48o36L98q2m87M98M84p19
$$ -46 -1106 -149 498 -626 -332 109 -744 -526 641 -286 -604 -18 130 -506 -108 -190 -677 -179 305 -414
1895d14J94L16n29R7Q10n86n16O65J07l41R3M61p25O60K73j110Q90l82j11o7J231
$$ -414 -220 96 -433 -336 474 -112 -628 37 144 -197 -104 357 -368 292 565 -545 345 -37 -148 -215 1016
1916A016q03p41Q35L1k49K00P5o60N07M39o57J51M35r01N91K95n41m43R52K2n48
$$ 1016 213 -528 307 338 89 289 364 -296 211 650 -7 144 579 -322 269 564 23 -420 532 554 6
1937FM10k78k22K13L98m61k72M10j00kJ75l87l42O10n6m29L40k4q8M0J92l70m3
$$ 6 416 138 -84 129 527 66 -206 204 104 102 277 -110 -452 158 102 -327 13 -11 -99 -59 133 -237 -280
1960b80K90k57j37M48m37J0L23l03P5J42L4l48K20K23m43J07K21j27o9K24k56
$$ -280 10 -247 -384 64 -373 -363 -40 -343 -268 -126 -92 -440 -220 3 -440 -333 -112 -239 -308 -84 -340
1981c40P3K24r7m1n7K91l33J03J43Oo5J97j2p0L51o3l87k0J36K8K33J10k77j72
$$ -340 -267 -43 -140 -181 -238 53 -280 -177 -34 -28 -93 104 92 22 373 310 -77 -97 39 67 300 410 133 -39
2005c9N04k99j37P7J73j09O6N0k30J27J82j41J24k20J63kl2m93K24M69r7k22j05
$$ -39 465 166 29 106 279 170 236 286 56 183 365 224 348 128 291 289 257 -236 -12 457 360 138 33
2028C3J66p1q2L3K03j97j89J1M42k16K2l8k3k02j50K34m6o1j14J72j07K57j41
$$ 33 199 128 46 79 282 85 -104 -93 349 133 155 117 94 -108 -258 -24 -70 -131 -245 -73 -180 77 -64
2051f4n3j66oQ7J14r0j30R5n0nK2j40J00K60l03J54j50J2L15k26K94N7j01j69
$$ -64 -117 -283 -289 -202 -88 -178 -308 -213 -263 -268 -246 -386 -286 -26 -329 -175 -325 -313 2 -224 70 127 26 -143
2075a43J55r4J29K4Q0l94J68j0O4O0k4k11L75J56l31K32q5jk25K34K01m15J24
$$ -143 12 -82 47 71 151 -243 -75 -85 -21 39 15 -196 179 335 4 236 151 150 -75 159 360 -55 69
2098F9j1L80l35K15q5m1J17k53K96j68j76R2K80q2k41R0M6m5L9K21k47j89K56
$$ 69 58 438 103 318 233 192 309 56 352 184 8 100 380 298 57 147 193 148 187 408 161 -28 228
2121B28k66q6M39p5j57k15J02j19J49K26n00J79K76l39K3J73m53K30j73l1q3L65
$$ 228 -38 -124 315 240 83 -132 -30 -149 0 226 -274 -95 181 -158 -135 38 -415 -185 -358 -389 -472 -107
2143a07k44K14n2J5j3p5N5o9R4J89l67j01N88n37M11p2l58L67q4J03J2k5L2k8
$$ -107 -351 -137 -189 -174 -187 -262 -207 -276 -182 7 -360 -461 127 -410 1 -71 -429 -62 -146 -43 -31 -56 -24 -52
2167e2M2K38l80M4K15r0L5j90l0j25N25j68k2j52L19j68J66l3j67k7L64j2k68
$$ -52 -10 228 -152 -108 107 17 52 -138 -168 -293 232 64 42 -110 209 41 207 174 7 -20 344 332 64
2190F4K68q0m01N70j08m77L04R1l52N20j9p61N21N93m02o10N95j03j99Q2K22o94
$$ 64 332 252 -149 421 313 -164 140 231 -121 399 380 -381 140 733 331 -279 316 213 14 96 318 -376
2212c76L08J88j15J60J24n39K82N64m05l20J98j59qL26K0n63l0P74o45J65K14
$$ -376 -68 120 5 165 289 -250 32 596 191 -129 69 -90 -98 228 248 -315 -345 429 -216 -51 163
2233A63o86M1J062n32l37Q8j46k11N67J65o89K67M01k44r1N0j54k29R85m70m97
$$ 163 -523 -482 580 48 -289 -201 -347 -558 9 174 -515 -248 153 -91 -182 -132 -286 -515 470 0 -497
2254d97L20K39p22R18P3q60J19N72j51r4M16n92j00J051o07k82M46j64j26M91
$$ -497 -177 62 -660 258 331 -529 -410 162 11 -83 333 -259 -359 692 85 -197 249 85 -41 450
2274D50J5m68m8R58n46m39M72l14k61J091o30q07P19j00l4K67K71j045K80O64
$$ 450 465 -3 -51 907 361 -78 394 80 -181 910 280 -527 192 92 58 325 596 -449 -169 495
2294D95k36l16M54k07k85J054o61o69O19M9n49P29j87p53M11O85p09j30J08m61
$$ 495 259 -57 397 190 -95 959 298 -371 248 297 -252 477 290 -463 -52 633 -76 -206 -98 -559
2314e59K87R07n72p11O46K12m85L90p9q46O27O26m61l69M23l47R0Q20o92p28Q87
$$ -559 -272 635 63 -648 -2 210 -275 115 36 -810 -183 443 -18 -387 36 -311 -221 599 -93 -821 66
2335F6l0k9L66m01r54Q59P06q32l0L37r26L76J028n78p73P68L63n25O53l08q69
$$ 66 36 7 373 -28 -982 -123 583 -249 -279 58 -868 -492 536 -42 -815 -47 316 -209 444 136 -733
2356g33P56Q81r03k45M23m90L29O30m43q07P45M27n19M69k29l43o9J015r07k84
$$ -733 23 904 1 -244 179 -311 18 648 205 -602 143 570 51 520 291 -52 -121 894 -13 -297
2376b97P10p95L90R60q07o85Q89J37l49J30k3r62O80J011p89m41N58m38q6Q80
$$ -297 413 -382 8 968 161 -524 365 502 153 283 260 -702 -22 989 200 -241 317 -121 -207 673
2396F73p69n08Q42k0l81K01oo98L15Q26o84k47K37j94L12O36p22m73O76j4k49
$$ 673 -96 -604 238 218 -163 38 32 -666 -351 475 -209 -456 -219 -413 -101 535 -187 -660 16 2 -247
2417b47J79J38n85K47N27m50m68Q04n76L13M44o70l51J017l15k74L59k34k07L19
$$ -247 -68 70 -515 -268 259 -191 -659 145 -431 -118 326 -344 -695 322 7 -267 92 -142 -349 -30
2437c0M45n40k60M57j25j02O29p08p2N25L02m12P5P4n27M30M09p34k05O13m37
$$ -30 415 -125 -385 72 -53 -155 474 -234 -306 219 521 109 184 258 -269 161 570 -164 -369 244 -193
2458a93L78L11n28k13O91j74k38K39Mj40O0J63k59m1K05l0k12L03j37n30N47M17
$$ -193 185 496 -32 -245 446 272 34 273 277 137 197 360 101 60 265 235 23 326 189 -341 206 623
2480F23o20j55m1j16M34L36n21k05L14j58p1L09l44l5L83o0j44o5m8k10K12K86
$$ 623 3 -152 -193 -309 125 461 -60 -265 49 -109 -180 129 -215 -250 133 73 -71 -136 -184 -394 -182 104
2502A04l29q9K71n6N3m8r0m5L35k61l48L87P6n4k14L01k41J0M50n02J38M16n45
$$ 104 -225 -314 -43 -99 -46 -94 -184 -229 106 -155 -503 -116 -40 -94 -308 -7 -248 -238 212 -290 -152 264 -281
2525b81J21L65K45l53m8k9j81K24q3l1K7L45k68R0n4o4L5K75l49L7J82Oj79j27
$$ -281 -160 205 450 97 49 20 -161 63 -20 -51 -24 321 53 143 89 25 60 335 -14 23 205 211 32 -95
2549i5L58k16j32K77J08j26J06j82NM8K02l12L78p6k49J09l18L5R4K78o11J47
$$ -95 263 47 -85 192 300 174 280 98 103 151 353 41 419 343 94 203 -115 -80 14 292 -319 -172
2571a72J11m2J20R8M5l11L06P7k7m37L2L2NOK21k76J83L5l57M66k46L9l46K4M12
$$ -172 -61 -103 17 115 160 -151 155 232 205 -232 -200 -168 -163 -157 64 -212 -29 6 -351 115 -131 -92 -438 -414 -2
2596bk73K36j5j65J81k16l2J1J01K2j56M0m0K37M3j00j30K6J05j39O45l37l13
$$ -2 -275 -39 -54 -219 -38 -254 -286 -275 -174 -152 -308 -268 -308 -71 -28 -128 -258 -232 -127 -266 379 42 -271
2619b71K79j6R5J00k28j3L9l15K25M93l61J2r3K93r2p5J53k65K0O8J70jj52j11
$$ -271 8 -8 87 187 -41 -54 -15 -330 -105 388 27 39 -54 239 147 72 225 -40 -20 48 218 217 65 -46
2643d6N30l10j72J83j84R3j02j42K33J45k86K51K11j94k49j10Q0j5J99k0J33k69
$$ -46 484 174 2 185 1 94 -8 -150 83 228 -58 193 404 210 -39 -149 -69 -84 115 95 228 -41
2665d1J27k62q7J82L9J27k75J84j90P8j87M0K64n6j39rJ23k62K27P0m20M83k9
$$ -41 86 -176 -263 -81 -42 85 -190 -6 -196 -118 -305 -265 -1 -57 -196 -205 -82 -344 -117 -47 -467 16 -13
2688a3Q1L3k85o9P9K46l00J32L6k14M8J84m6p6J46k49J41L4J38p6j69J42K91k07
$$ -13 68 101 -184 -253 -174 72 -228 -96 -60 -274 -226 -42 -88 -164 -18 -267 -126 -92 46 -30 -199 -57 234 27
2712B7k38J47o5M71k30lj67j02J42K12P2k38P7o0j56K85pQj60J89j04p7K00j63
$$ 27 -211 -64 -129 342 112 109 -58 -160 -18 194 266 28 105 45 -111 174 167 175 15 204 100 23 223 60
2736F0PP3M0N3L8J87j06l92J39l9j75K90j56k48K44k23L8M02M1m71j85N42j20
$$ 60 67 140 180 233 271 458 352 -40 99 60 -115 175 19 -229 15 -208 -170 232 273 -198 -383 159 39
2759C9j14P5q2J34J85j79m74J95q1J67J31p4r1k30L75m4k46K0j3q1O26l02k3n5
$$ 39 -75 0 -82 52 237 58 -416 -221 -302 -135 -4 -78 -169 -399 -24 -68 -314 -294 -307 -388 238 -64 -87 -142
2783a42J65K1r9n2j65M8N03j49l86K13q6j35N23l7o72L63L73m63K43Q0l23R5M06
$$ -142 23 44 -55 -107 -272 -224 279 130 -256 -43 -129 -264 259 222 -450 -87 286 -177 66 146 -177 -82 324
2806C24m60K17O3k22K2N62o50J4Q3N49k60KJ06l01J75K25k6n58K15m1o6M29k72
$$ 324 -136 81 144 -78 -56 506 -144 -130 -47 502 242 244 350 49 224 449 423 -135 80 39 -27 402 130
2829A30k47J49M15l94L21k59n52J76M03K8j23j9k8j44O77m53k74K82P8j86K16
$$ 130 -117 32 447 53 374 115 -437 -261 142 170 47 28 0 -144 533 80 -194 88 166 -20 196
2850A96j16k56r0L95O3r07P98k33l73N57j5m74Q0N32k07j83N44o52p5Q79o35l69
$$ 196 80 -176 -266 129 192 -715 83 -150 -523 34 19 -455 -375 157 -50 -233 311 -341 -416 463 -172 -541
2872e41N92K0k20K42k29l56M75L61m38q0K75m94M74K96o09l42M57m2O5M96o04
$$ -541 51 71 -149 93 -136 -492 -17 344 -94 -174 101 -393 81 377 -232 -574 -117 -159 -94 402 -202
2893b02m63Q76M3l86J05J44n13K94O07l79k94M02m47J0M39p9n93O08M56o88K46
$$ -202 -665 211 254 -132 -27 117 -396 -102 505 126 -168 234 -213 -203 236 157 -436 172 628 -60 186
2914A86k13k28L93L57l55o48O46J26K98k36m43m93Q36L00n20j51j8K1K4N70m44
$$ 186 -27 -255 138 495 140 -508 138 264 562 326 -117 -610 226 526 6 -145 -163 -142 -118 452 8
2935Ho94R17J53n60N10n30j58K53N44n30k25K32j62K96J11m13m47O82j70J4K03
$$ 8 -686 231 384 -176 334 -196 -354 -101 443 -87 -312 -80 -242 54 165 -248 -695 -13 -183 -169 34
2956C4m35k46O21J28n60P5L54k52K8O33o50l13M51J83j63m0o5k29N06J81l00j26
$$ 34 -401 -647 -26 102 -458 -383 -29 -281 -253 380 -270 -583 -132 51 -112 -152 -217 -446 60 241 -59 -185
2978a85K68K6j42L82q6n06M01J64j73o7J55k30Q8J69l87K2K41m90Q10j79n53J93
$$ -185 83 109 -33 349 263 -243 158 322 149 82 237 7 95 264 -123 -101 140 -350 460 281 -272 -79
3000g9l0K78j89J86o8l77N25J61l28j63J82k04L39J35m67l4L35l9L3J3j28j60
$$ -79 -109 169 -20 166 98 -279 246 407 79 -84 98 -106 233 368 -99 -133 202 163 196 209 81 -79
3022g9l6O52o06K0K38l97L2M47l33m4Q3q5K6j65k7J29m0L77m73n8L17j3n9K23
$$ -79 -115 537 -69 -49 189 -208 -176 271 -62 -106 -23 -108 -82 -247 -274 -145 -185 192 -281 -339 -22 -35 -94 129
3046A29l48k0K16N0r7K0J38m92K41L38l65k7L05k74L7K42j27j49M95l24q5n5L90
$$ 129 -219 -239 -23 27 -70 -50 88 -404 -163 175 -190 -217 88 -186 -149 93 -34 -183 312 -12 -97 -152 238
3069B38m33M19r6k74K17L00m99Q8J73l28K26K09l4r5j49n3L86r0L8k61J76m5q
$$ 238 -195 224 128 -146 71 371 -128 -40 133 -195 31 240 206 111 -38 -91 295 205 243 -18 158 113 105
3092A05l4o9L08m02L86j41j99j65K40l8q2M14l49J01P6lk84K86q9k85R4J75J82
$$ 105 71 2 310 -92 294 153 -46 -211 29 -9 -91 323 -26 75 151 148 -136 150 61 -224 -130 45 227
3115B27l83J18j35N2J16K4j64J7p5J27N8k32ro9J83k08K30Q4j57L87j85j9j80
$$ 227 -156 -38 -173 -121 -5 19 -145 -128 -203 -76 -18 -250 -259 -328 -145 -353 -123 -39 -196 191 6 -13 -193
3138a93J66m55L71R8k35L14m2M8k40j25J71qj84L66k72O1K24j08LQ5qk37n3L25
$$ -193 -27 -482 -111 -13 -248 66 24 72 -168 -293 -122 -130 -314 52 -220 -159 65 -43 -40 45 37 -200 -253 72
3162G2k02K34j37p4L27o1r2N8L8k6l4r5J0L01k48O9J61j87r0L8k9K8M9J22k76
$$ 72 -130 104 -33 -107 220 159 67 125 163 137 103 8 18 319 71 140 301 114 24 62 33 61 110 232 -44
3187d4J44j27K42j96PK93j65j15l7J82j41O4l3N9k13k25L88j55J13m6R5NK2k44
$$ -44 100 -27 215 19 26 319 154 39 2 184 43 107 74 133 -80 -305 83 -72 41 -5 90 95 117 -127
3211a27L6j02K47j36Q7k30L41k27K1k06R4L4O0j89K45j01j4k0m3L95k76o2P5K79
$$ -127 -91 -193 54 -82 5 -225 116 -111 -90 -296 -202 -168 -108 -297 -52 -153 -167 -187 -230 165 -111 -173 -98 181
3235A81j06l43J97m0R9M4l3N1J32m21J23j21K77N7k98L12j08r1L12Lj87k50L50
$$ 181 75 -268 -71 -111 -12 32 -1 50 182 -239 -116 -237 40 97 -201 111 3 -88 224 227 40 -210 140
3258A40j47L25j87M0L8j20J82k35nO3K9K8K0n9k36J25j21L85k62q0j2L06l19M54
$$ 140 -7 318 131 171 209 89 271 36 31 94 123 151 171 112 -124 1 -120 265 3 -77 -89 217 -102 352
3282C52q0k00j3J74r1l50L99j95R5J21j35k55j32M56K5l24L10O8p4k35J10J9j77
$$ 352 272 72 59 233 142 -208 191 -4 91 212 77 -178 -310 146 171 -153 157 225 151 -84 26 45 -132
3305a32J3k11J01K48N5j27J66j76k13M29k64J6P5k12Q4J22N2J38l19L8O6J50L1
$$ -132 -119 -330 -229 19 74 -53 113 -63 -276 153 -111 -95 -20 -232 -148 -26 26 164 -155 -117 -51 99 130
3328A30k36P2NM8J30J13l61k99N16J8k69J28J39k13p8O01n25O0L78m34j16N45
$$ 130 -106 -34 -29 19 149 262 -99 -398 118 136 -133 -5 134 -79 -157 444 -81 -21 357 -77 -193 352
3350C52k10j15O3J42l39K1L8q4Q5L88l01o6J77r0j0N64o95K18O2l57M2M6K70k20
$$ 352 142 27 90 232 -107 -86 -48 -132 -47 341 40 -26 151 61 51 615 -80 138 200 -157 -115 -69 201 -19
3374a9j59L84k38k8J14oJ71j6k38r6P7L22k40J61l02K26j24M6k6j51p3Q1p3K15
$$ -19 -178 206 -32 -60 54 48 219 203 -35 -131 -54 268 28 189 -113 113 -11 35 9 -142 -215 -134 -207 8
3398Hj44n6K7Q7Q1q0j7j25L60J02n16J36j11jQ1J79l36K73j94K58o9j39K66k45
$$ 8 -136 -192 -165 -78 3 -77 -94 -219 141 243 -273 -137 -248 -249 -168 11 -325 -52 -246 12 -57 -196 70 -175
3422a75M18j02r4k79r5P2j02P95k80p00P08j10NQ8Lk67P0L66p97N3N61J3j40L73
$$ -175 243 141 47 -232 -327 -255 -357 438 158 -542 166 56 61 149 152 -115 -45 321 -476 -423 138 151 11 384
3446C84j80l75L06p2J3j0n3k58K27K61k74j34L20j08j78M67l71j76M46K04n42
$$ 384 204 -171 135 63 76 66 13 -245 -18 243 -31 -165 155 47 -131 336 -35 -211 235 439 -103
3467a03P0R1k82L23J94l50j88L08J64k66K26j56k05O11l26j97k0j4J85j38K33
$$ -103 -33 58 -224 99 293 -57 -245 63 227 -39 187 31 -174 437 111 -86 -106 -120 65 -73 160
3488A60l90k7K92l18K43J59j52m40M59K43l85K14l39J50M6L79n76l4K45P3k27
$$ 160 -230 -257 35 -283 -40 119 -33 -473 -14 229 -156 58 -281 -131 -85 294 -282 -316 -71 2 -225
3509b25K56K05l35K17k97J45R8M9j79J71J48j96l59J04L32n2M1j02l05M66J23
$$ -225 31 236 -99 118 -179 -34 64 113 -66 105 253 57 -302 -198 134 82 123 21 -284 182 305
3530C05j11j66j5l6R0K43l46K4L75q0m28M63j23l15J30K49o00M87J2j60q4M04
$$ 305 194 28 13 -23 67 310 -36 -12 363 283 -145 318 195 -120 10 259 -341 146 158 -2 -86 318
3552C18n24o4K24j05J84J64P5m68K99ll9O9j4l90J85K06j89j64K61R8k16J22k03
$$ 318 -206 -270 -46 -151 33 197 272 -196 103 100 61 130 116 -274 -89 117 -72 -236 25 123 -93 29 -174
3575a74M8K88j86j17K75r9l59N11j67m58K93M04p7j25j35Qk14O01l25p5J65Qk48
$$ -174 -126 162 -24 -141 134 35 -324 187 20 -438 -145 259 182 57 -78 -70 -284 317 -8 -83 82 90 -158
3598a58n3K59k64J42L02k00j07J50l83J80K53Pq3k1j85q9M60k03j13J83K3j88
$$ -158 -211 48 -216 -74 228 28 -79 71 -312 -132 121 128 45 24 -161 -250 210 7 -106 77 100 -88
3620h8J53k7K47k54j21L62m59M50j94J96m9k96J87L0m9m3KJ87m2k40l7J97km15
$$ -88 65 38 285 31 -90 272 -187 263 69 265 216 -80 107 137 88 45 47 234 192 -48 -85 112 110 -305
3644c05L08n5r9J80Q8l73J47p3J04K1qk07L29pk05J52J72l30J33J6k54K89l99
$$ -305 3 -52 -151 29 117 -256 -109 -182 -78 -57 -65 -272 57 50 -155 -3 169 -161 -28 -12 -266 23 -376
3667c76K19j16K66j02J36J39j99j05K75k8k42K10J7j40J08K02j76n3o7k34L72
$$ -376 -157 -273 -7 -109 27 166 -33 -138 137 109 -133 77 94 -46 62 264 88 35 -32 -266 106
3688A06kj65k28K74P6j89J02j84N1K43j13O8k69K16r2J53j70K35k07J28J45j22
$$ 106 104 -61 -289 -15 61 -128 -26 -210 -159 84 -29 39 -230 -14 -106 47 -123 112 -95 33 178 56
3710E6qJ22j5k45J83j14m3L8J57j32K35o0p2R1km11L31l38N37k28k24J91n5j6
$$ 56 48 170 155 -90 93 -21 -64 -26 131 -1 234 174 102 193 191 -220 111 -227 310 82 -142 49 -6 -22
3734b2L30k13k26L49j53O2k90q1K07q7J67J28k95N0j09j44M53q0J8Q1Oo1j58L02
$$ -22 308 95 -131 218 65 127 -163 -244 -37 -124 43 171 -124 -74 -183 -327 126 46 64 145 151 90 -68 234
3758B34l19l7J16k09K71j20J52q8j92q1K97J39j44J02L7j68j73K0K63k85K08p8
$$ 234 -85 -122 -6 -215 56 -64 88 0 -192 -273 24 163 19 121 158 -10 -183 -163 100 -185 23 -55
3780e5L05l17KJ8MO6q4o5K62j36q9j43M1L06m6R9l22L33j37k06J90j17L33j92
$$ -55 250 -67 -65 -47 -43 23 -61 -126 136 0 -89 -232 -191 115 69 168 -154 179 42 -164 26 -91 242 50
3804E0Kk36K44L0m7k50K61j65N9j58O51m05k7K74p6k68L82k82j03L49m86L99j03
$$ 50 52 -184 60 90 43 -207 54 -111 -52 -210 441 36 9 283 207 -61 321 39 -64 285 -201 198 95
3827I5p6m5N5J74k38j6J75k26M05l02j49K68q7j9j16J31n4j08N75o83p4L22j42
$$ 95 19 -26 29 203 -35 -51 124 -102 303 1 -148 120 33 14 -102 29 -25 -133 442 -241 -315 7 -135
3850a35J43l8Pj81K68o5JJ8j72P0L8j6J81k39M31j37j60k51J46J49J84l99J26
$$ -135 8 -30 -23 -204 64 -1 0 18 -154 -84 -46 -62 119 -120 311 174 14 -237 -91 58 242 -157 -31
3873c1J7J58j35K0j63J04J64k25J25K8k2j45K08q6R0k82L57l01L08j71L01k61
$$ -31 -14 144 9 29 -134 -30 134 -91 34 62 40 -105 103 17 107 -175 182 -119 189 18 319 58
3895E8Q1k72L06j66J2J76k91M0J6J48j9l1Q7j09K52m4k44K63J25m09R9KMj79K36
$$ 58 139 -133 173 7 19 195 -96 -56 -40 108 89 58 145 36 288 244 0 263 388 -21 78 80 84 -95 141
3920A41j23k8J35k39n5j3K52L8k91J57J8R1K9m38J61K85m7L4m0n3o6r4L40k07
$$ 141 18 -10 125 -114 -169 -182 70 108 -183 -26 -8 83 112 -326 -165 120 73 107 67 14 -52 -146 194 -13
3944a3r3o6p3K39J73l43J16O8q3k4j01J72j74K50j21j15R4p3RK12m5j18J44J6
$$ -13 -106 -172 -245 -6 167 -176 -60 8 -75 -99 -200 -28 -202 48 -73 -188 -94 -167 -158 54 9 -109 35 51
3968E1k9K2j23p4L75l76J0J72rP7k53m6L79l99P5K93k81K3K97j00j93J87k89o6
$$ 51 22 44 -79 -153 222 -154 -144 28 19 96 -157 -203 176 -223 -148 145 -136 -113 184 84 -109 78 -211 -277
3992b77L87J32l08J03O5M3k0l41K10j88K38J81l46K09k3k60K81J76m46K1P9J67
$$ -277 110 242 -66 37 102 145 125 -216 -6 -194 44 225 -121 88 65 -195 86 262 -184 -163 -84 83
4014H3jPj84q8K17l69L11K93k67j50J43p6m06L94J18l44M98o2j51j87J16n7Q9
$$ 83 82 89 -95 -183 34 -335 -24 269 2 -148 -5 -81 -487 -93 25 -319 179 117 -34 -221 -105 -162 -73
4037g3R4k11j99L94K25m20n2OL02J08J62j50j29J48p6M6k02J63n48M74K59m35
$$ -73 21 -190 -389 5 230 -190 -242 -236 66 174 336 186 57 205 129 175 -27 136 -412 62 321 -114
4059a14J20O0O1l14K35j17kJ41J20l08K02J33j54J55j25q3k71O03l04j2l2j71
$$ -114 6 66 127 -187 48 -69 -71 70 190 -118 84 217 63 218 93 10 -261 342 38 26 -6 -177
4081a77J02M27m4j95K34l41j21K01K05n00J70J37q7J90k16r7P4O1r9n5J82j62
$$ -177 -75 352 308 113 347 6 -115 86 291 -209 -39 98 11 201 -15 -112 -38 23 -76 -131 51 -111
4103a11j8K12J20m82K74m5K0M49m95k99K57K91j00k44J62j19k13L19k53J77L1
$$ -111 -129 83 203 -279 -5 -50 -30 419 -76 -375 -118 173 73 -171 -9 -128 -341 -22 -275 -98 -67
4124f7K86l94j69N09k60O8J7K42n61M8L12Q7n9J51m16Q6j3L58m63M7K27n7j9J70
$$ -67 219 -175 -344 165 -95 -27 -10 232 -329 -281 31 118 59 210 -206 -120 -133 225 -238 -191 36 -21 -40 130
4148A30k77J57m3J8m0K6j0R1j63J22J34j06l31L11p5k71K82J49J49j98J37j12
$$ 130 -147 10 -33 -15 -55 -29 -39 52 -111 11 145 39 -292 19 -56 -327 -45 104 253 55 192 80
4170H0k59KM52j61l58L45j73j03K96l02L6K04j53L2K22l8k21N9j75M83l26M8j37
$$ 80 -179 -177 275 114 -244 101 -72 -175 121 -181 -145 59 -94 -62 160 122 -99 -40 -215 268 -58 -10 -147
4193a47J44K27n53L66lOj51K22L1l12K26j92K58m85O42n3k29rJ95k61O5Pk62M87
$$ -147 -3 224 -329 37 34 40 -111 111 142 -170 56 -136 122 -363 279 226 -3 -12 183 -78 -13 -6 -268 219
4217B19j25j45o9J71l82J50L38k24o2L99m17J31q5K28l37J1J27K12J95j56l43
$$ 219 94 -51 -120 51 -331 -181 157 -67 -129 270 -147 -16 -101 127 -210 -199 -72 140 335 179 -164
4238a64MK86M0J35l50K56j4j47R5j36o5J39J18m87N12k05J73j43J75m12J35K17
$$ -164 -160 126 166 301 -49 207 193 46 141 5 -60 79 197 -290 222 17 190 47 222 -190 -55 162
4260A62j12Q2j75K77l32q6J07K05k16J49K1K09l58l1K89l12LN7N6k01O3K17K1
$$ 162 50 132 -43 234 -98 -184 -77 128 -88 61 82 291 -67 -98 191 -121 -118 -61 -5 -206 -143 74 95
4283I5N3q4j8j72J44k86K67j98K21J58k83j02N18k43n8k15l8K41j80J81m05J93
$$ 95 148 64 46 -126 18 -268 -1 -199 22 180 -103 -205 313 70 12 -203 -241 0 -180 1 -404 -211
4305b11L1K92j86j35K43k77J56l4j3Q1J08k0J25m71l2K53M8P0j32R4J9l6J23j10
$$ -211 -180 112 -74 -209 34 -243 -87 -121 -134 -53 55 35 160 -311 -343 -90 -42 28 -104 -10 9 -27 96 -14
4329a4Q0q7J89k54J98k27J31K04k90J05no2K02k41l1J72k38J54m8J33J09r4j9
$$ -14 66 -21 168 -86 112 -115 16 220 -70 35 30 -32 170 -71 -102 70 -168 -14 -62 71 180 86 67
4352F7l82M11j82K35J95k75q0J48o73M56K67J31j66n7r8K26j35j79J6R7K37j57
$$ 67 -315 96 -86 149 344 69 -11 137 -536 -80 187 318 152 95 -3 223 88 -91 -75 22 259 102
4374A02l96L71M8m88K24P6L1K50k69k46K11j76K37P5M3o7l3l7L7J22q2K6n3O9
$$ 102 -294 77 125 -363 -139 -63 -32 218 -51 -297 -86 -262 -25 50 93 26 -7 -44 -7 115 33 59 6 75
4398G5l75J69J79n27L15Q5K61j77J58m21J70K12o1j17R3j43l3J79J1m5r6K62p2
$$ 75 -300 -131 48 -479 -164 -79 182 5 163 -258 -88 124 63 -54 39 -104 -137 42 53 8 -88 174 102
4421A02Q6q2L9k90J29j76J52m8j85K34K88k83J16J64k75N9K12N1j64j52J74j73
$$ 102 188 106 145 -145 -16 -192 -40 -88 -273 -39 249 -34 82 246 -29 30 242 293 129 -23 151 -22
4443b2j80J27K5Rn4L6k40O99l38k20L4K40j46J64j56o2q2L12l08K11k29J21%P7
$$ -22 -202 -75 -50 -41 -95 -59 -299 400 62 -158 -124 116 -30 134 -22 -84 -166 146 -162 49 -180 -59 -59 18
4467A8l7k47L72m4r2J35l3k04qp1J41J34J52L8k78o3K89p5k28q4Q1L01l73J3J17
$$ 18 -19 -266 106 62 -30 105 72 -132 -140 -211 -70 64 216 254 -24 -87 202 127 -101 -185 -104 197 -176 -163 -46
4492d6J29J00j26j09j19K87j99J37n9n1J02l96K14L34m75K02J76j59L39k23K29
$$ -46 83 183 57 -52 -171 116 -83 54 -5 -56 46 -350 -136 198 -277 -75 101 -58 281 58 287
4513B87l17o0J26j49j1J46k11K68j34J65j88K11j9o6J98q3l28N2o2K82J00l41
$$ 287 -30 -90 36 -113 -124 22 -189 79 -55 110 -78 133 114 48 246 163 -165 -113 -175 107 207 -134
4535a34o4J51K02Rk02j44P8J40K87l36r7L03p0l33J67J63k54m5L85m45J33K00
$$ -134 -198 -47 155 164 -38 -182 -104 36 323 -13 -110 193 123 -210 -43 120 -134 -179 206 -239 -106 94
4557I4k67L86l86N3J41p7K17r5k53Q9J02k4j47L42l17K98j53QK12l66L9R0J68
$$ 94 -173 213 -173 -120 21 -56 161 66 -187 -98 4 -20 -167 175 -142 156 3 11 223 -143 -104 -14 154
4580A54l88K54l6M1J35j0j28j1m6o1l6P5R4m47N14Ok27k42M72j30m0J6K2p5J51
$$ 154 -234 20 -16 25 160 150 22 11 -35 -96 -132 -57 37 -410 104 110 -117 -359 113 -17 -57 -41 -19 -94 57
4605E7J22l43K00j21L18j09j54pJ16J35M0j42j60l89L46J78K3l86N26l16q4N62
$$ 57 179 -164 36 -85 233 124 -30 -37 79 214 254 112 -48 -437 -91 87 110 -276 250 -66 -150 412
4627D12l14j29K3M4l03K57M79m33k5K28m39k8J34J33m4J72l21N1r2L02m2k80J96
$$ 412 98 -31 -8 36 -267 -10 469 36 11 239 -200 -228 -94 39 -5 167 -154 -103 -195 107 65 -215 -19
4650a9l36L27K64k16J22jk89J67j00j23N4K45K7j28k79L50m9j05J50lj23n3J57
$$ -19 -355 -28 236 20 142 141 -148 19 -81 -204 -150 95 122 -6 -285 65 16 -89 61 58 -65 -118 39
4673C9l28K45J36l19J5K80n1J22j86j90J94J5O5m7J14j71j94L03r7J02k08L1J94
$$ 39 -289 -44 92 -227 -212 68 17 139 -47 -237 -43 -28 37 -10 104 -67 -261 42 -55 47 -161 -130 64
4696F4j40qm1K2L45l38O2j7M9j92J92J69j01J28l2o8K8l8kr3J20Q6k46R8o3j70
$$ 64 -76 -84 -125 -103 242 -96 -34 -51 -2 -194 -2 167 66 194 162 94 122 84 82 -11 109 195 -51 47 -16 -186
4722a86J75k25J29J79J20k15L2p9K70m88J61L86j43J07j16Q3j96o5l6J58J67j13
$$ -186 -11 -236 -107 72 192 -23 9 -70 200 -288 -127 259 116 223 107 190 -6 -71 -107 51 218 105
4744A05k07R8J6K85m82J62L21l59J20j70Q8j06P5J66P7j3j50j88j5J07j99K23
$$ 105 -102 -4 12 297 -185 -23 298 -61 59 -111 -23 -129 -54 112 189 176 26 -162 -177 -70 -269 -46
4766d6l66M36j77K42j85M1j56M3K36J8p6Lj61L5J70j11K00k07O3J63j73J51j24
$$ -46 -412 24 -153 89 -96 -55 -211 -168 68 86 10 13 -148 -113 57 -54 146 -61 2 165 -8 143 19
4789A9J46Ll09p9K27J38p6l5k61K55j76P9P3J50l65J13K25j84l2K1KL8O3j9K64
$$ 19 165 168 -141 -220 7 145 69 34 -227 28 -148 -69 4 154 -211 -98 127 -57 -89 -68 -66 -28 35 16 280
4814B80n69N49l52K76j33Q1j81r9L51k11j07K16k03j35L02j47K58n10M3J57j02
$$ 280 -289 260 -92 184 51 132 -49 -148 203 -8 -115 101 -102 -237 65 -82 176 -334 -291 -134 -236
4835b36K23k17J00K48j13p4O3j43J12J00l5j73L5J31k8j57K48o4Pll7j64L23k04
$$ -236 -13 -230 -130 118 5 -69 -6 -149 -37 63 28 -145 -110 21 -7 -164 84 20 27 24 -13 -177 146 -58
4859e8K66j33m3J46l89K70p1j65K00K4j68J71j41R6l31J07K45J6J14j25j36J90
$$ -58 208 75 32 178 -211 59 -12 -177 23 47 -121 50 -91 5 -326 -219 26 42 156 31 -105 85
4881H5J29k26K59k97jJ78R4m22m4R1L91P4j60l1o5J03m14K85J38k61J92j16p7
$$ 85 214 -12 247 -50 -51 127 221 -201 -245 -154 237 311 151 120 55 158 -256 29 167 -94 98 -18 -95
4904i5J75K8j24P6P5o9k20RJ06J50l4k74J08J19M5K74l52K53l02r7J31j03ql7
$$ -95 80 108 -16 60 135 66 -154 -145 -39 111 77 -197 -89 30 75 349 -3 250 -52 -149 -18 -121 -129 -166
4928a66J14r4K25r3R5j60j96J80j88P2o3K99p9K7J54o8j1o8J05k84K78K21m20
$$ -166 -52 -146 79 -14 81 -79 -275 -95 -283 -211 -274 25 -54 -27 127 59 48 -20 85 -199 79 300 -120
4951a20J09q9K16k04n4N8J65o7J82k57N7n4%j25M03k86o8J88RK43m84K16j42J6
$$ -120 -11 -100 116 -88 -142 -84 81 14 196 -61 -4 -58 -58 -183 220 -66 -134 54 63 306 -178 38 -104 -88
4975h8R3j89J82N9k06J23J2j18J03R5k99J49K0J05J42p3J52k18K3j13K00l28N10
$$ -88 5 -184 -2 57 -149 -26 -14 -132 -29 66 -233 -84 -64 41 183 110 262 44 67 -46 154 -174 336
4998C36m45J4K16j12L69l79m1NJ80k65J86M2j7j82L7KN3k15L61k83J30k9J60N1
$$ 336 -109 -95 121 9 378 -1 -42 -37 143 -122 64 106 89 -93 -56 -54 -1 -216 145 -138 -8 -37 123 174
5022A74k29l3m7J56n1J10oK2P3k10k09K9l1J69P0K13k41o1l7OKO7K04j01n7j57
$$ 174 -55 -88 -135 21 -30 80 74 96 169 -41 -250 -221 -252 -83 -13 200 -41 -102 -139 -133 -131 -64 140 39 -18 -175
5048a75J72j37J39j26m4j7Q3K90q8pL9j29ol08K83J37j18O3r8kK33j16j87R0J34
$$ -175 -3 -140 -1 -127 -171 -188 -105 185 97 90 129 0 -6 -314 -31 106 -12 51 -47 -49 184 68 -119 -29 105
5073A05j51k3O4q3jp3K85n3j2q9J82J40l42J85l63N01m83L43j09k47L78k77M3
$$ 105 -46 -69 -5 -88 -89 -162 123 70 58 -31 151 291 -51 134 -229 272 -211 132 23 -224 154 -123 -80
5096h0r0K41Q2l35O4j61k3L66l8J11j07J0l00J54J56J46j12J05l57r7J05L09j90
$$ -80 -170 71 153 -182 -118 -279 -302 64 26 137 30 40 -260 -106 50 196 84 189 -168 -265 -160 149 -41
5119d1m4P8L8m2J9J26k19N8j27O2j31K12N9K29m5M8l89L3l9K50l30K66K53k71
$$ -41 -85 -7 31 -11 8 134 -85 -27 -154 -92 -223 -11 48 277 232 280 -109 -76 -115 135 -195 71 324 53
5143E3J01M1l44n0O0K46l48J84K50O0k35J60J13m08k37O73m9j52k29K30l49L98
$$ 53 154 195 -149 -199 -139 107 -241 -57 193 253 18 178 291 -117 -354 319 270 118 -111 119 -230 168
5165A68q3j41k47P58k90l04J90l95L24J59m36J67J45r7m5Q2K69l79J34j08J23
$$ 168 85 -56 -303 455 165 -139 51 -344 -20 139 -297 -130 15 -82 -127 -45 224 -155 -21 -129 -6
5186fR2k29j5J78K38l49j60O06m19N8m6K18k46Q9j97J35J29j29o2J0J37o4l38
$$ -6 86 -143 -158 20 258 -91 -251 355 -64 -6 -52 166 -80 9 -188 -53 76 -53 -115 -105 32 -32 -370
5209c70O32k98k54J97k77L52j01R6j83J29L54m50R1j02K86k49J96R8j65J27l33
$$ -370 262 -36 -290 -93 -370 -18 -119 -23 -206 -77 277 -173 -82 -184 102 -147 49 147 -18 109 -224
5230b24R4J5J91k8K96l81k70L40j09M9K61k44J32k12N8J69K8j46J95l41K20k44
$$ -224 -130 -115 76 48 344 -37 -307 33 -76 -27 234 -10 122 -90 -32 137 165 19 214 -127 93 -151
5252a51K89J70j22j97p6J10K50k45j59N01j93k18j32L05j19j11J32K13P9j19r6
$$ -151 138 308 186 -11 -87 23 273 28 -131 370 177 -41 -173 132 13 -98 34 247 326 207 111
5273A11j48J42J71k14k17J92K13J2l63J48j86K3K0O8J96r2j45l9J07k45Q5k0j4
$$ 111 -37 105 276 62 -155 37 250 262 -101 47 -139 -116 -96 -28 168 76 -69 -108 -1 -246 -161 -181 -195
5296a95M14k34m87M94M1k89M20J13k93J95n0j9j51J16j32O2O0J5j9l46M83j03
$$ -195 219 -15 -502 -8 33 -256 164 277 -16 179 129 110 -41 75 -57 5 65 80 61 -285 198 95
5318I5j70Q2K09k93j06J08K10l0Mk58j8M10l22q4J24P0j91P3j15j1J60j14J54
$$ 95 -75 7 216 -77 -183 -75 135 105 109 -149 -167 243 -79 -163 -39 31 -160 -87 -202 -213 -53 -167 -13
5341a3k18K01R8r2M34m35M7J26p3o1j18J01J50k30K74n54J90J69L8j73J42J4j02
$$ -13 -231 -30 68 -24 410 -25 22 148 75 14 -104 -3 147 -83 191 -363 -173 -4 34 -139 3 17 -85
5364h5o3K01JJ62k60l33J36J81K33p9j7j96J36O1Q2j12j44q9q5L56j67J45k23
$$ -85 -148 53 54 216 -44 -377 -241 -60 173 94 77 -119 17 78 160 48 -96 -185 -270 86 -81 64 -159
5387a59K85J45m41L81j74J92j93o75O25m6j0J6j52J14J53j46J9j17P0L90l40J69
$$ -159 126 271 -170 211 37 229 36 -639 -14 -60 -70 -54 -206 -92 61 -85 -66 -183 -113 277 -63 106
5409A06k64K23j40K39j8k77J30l9k6K10k5j83J17J49o0j72R4R2k46M9r4J34k9
$$ 106 -158 65 -75 164 146 -131 -1 -40 -66 144 119 -64 53 202 142 -30 64 156 -90 -41 -135 -1 -30
5432c0j6J57p1o8q4J45j9L9J52k82k32J37M52k79O6j75n3J31L9m1L5N4L1N4N4
$$ -30 -46 111 40 -28 -112 33 14 53 205 -77 -309 -172 280 1 67 -108 -161 -30 9 -32 3 57 88 142 196
5457A96k71J68N9k10K57j3j03o1j68K62L00k61j72p5J09k49J83L22l85J8Rj00
$$ 196 -75 93 152 -58 199 186 83 22 -146 116 416 155 -17 -92 17 -232 -49 273 -112 -94 -85 -185
5479a85J36k16K95m18K40J91n7m1p2R7J19l00N20l63J77n5k08J35Q9q0P7n8q2
$$ -185 -49 -265 30 -388 -148 43 -14 -55 -127 -30 89 -211 309 -54 123 68 -140 -5 84 4 81 23 -59
5502e9Q2l44L72P8k19P6j72K82j79J7J24Rk54P8K08K07n88L31j9r6QQ5r7L13r9
$$ -59 23 -321 51 129 -90 -14 -186 96 -83 -66 58 67 -187 -109 99 306 -282 49 30 -66 -58 27 -70 243 144
5527A44j05r7p5Q7j23J56j37J59j59J13j86K28k4j54M71l47j77N51k46R3j22L4
$$ 144 39 -58 -133 -46 -169 -13 -150 9 -150 -37 -223 5 -19 -173 298 -49 -226 325 79 172 50 84
5549H4j58L88j47P5k43k20K99k12K13O4j78j46J06J69j86K66l33O8K02k15J56
$$ 84 -74 314 167 242 -1 -221 78 -134 79 143 -35 -181 -75 94 -92 174 -159 -91 111 -104 52
5570E2k63J9K22K6KJ56r4k09l5R3j86J49J02k51K52P8k71j77M69m7k63J24j05
$$ 52 -211 -192 30 56 58 214 120 -89 -124 -31 -217 -68 34 -217 35 113 -158 -335 134 87 -176 -52 -157
5593a57M69l63K73j56l27J14k8N72n45L42l01o9Q3K62mm05J48m8J03l5q2J06P3
$$ -157 312 -51 222 66 -261 -147 -175 397 -148 194 -107 -176 -93 169 165 -240 -92 -140 -37 -72 -154 -48 25
5616B5j18L8q8J90Lk29M16r5M9J3p5P8k32J6N9k6j04J66K2k0o8k25R1J89N2k2
$$ 25 -93 -55 -143 47 50 -179 237 142 191 204 129 207 -25 -9 50 24 -80 86 108 88 20 -205 -114 75 127 105
5642A05R3j62K51k44J01J27l16K49j59l39L30m57L75q7J97j28L4k3RJ11J23k13
$$ 105 198 36 287 43 144 271 -45 204 45 -294 36 -421 -46 -133 64 -64 -30 -53 -44 67 190 -23
5664b3j29o7L75k44J9P6K08r6n53N02l22K31M7l1J7k65J30O0J18j59J00nj25L47
$$ -23 -152 -219 156 -88 -69 7 215 119 -434 68 -254 -23 24 -7 10 -255 -125 -65 53 -106 -6 -11 -136 211
5688B11k21P5q6QL02k04L6l16J20m0J03J69k97L78j80J82l36J03qm2K08Lj0j76
$$ 211 -10 65 -21 -13 289 85 121 -195 -75 -115 -12 157 -140 238 58 240 -96 7 -1 -43 165 168 158 -18
5712a8K1N6p2N4K21l55j20J23P6j71J08J66P0m6k27J01N3L72m23R2j56P1K8j30
$$ -18 3 59 -13 41 262 -93 -213 -90 -14 -185 -77 89 159 113 -114 -13 40 412 -11 81 -75 -4 24 -106
5736a06n7L64k5l18N5K02J61l81J1J58k43K61j70K13j04k17J03N0j49J50K31q7
$$ -106 -163 201 176 -142 -87 115 276 -105 -94 64 -179 82 -88 125 21 -196 -93 -43 -192 -42 189 102
5758A02k49M1K54J57n29L17j64J47n0P4k27p2J85J20k0j76L15j12r9n1J10j90
$$ 102 -147 -106 148 305 -224 93 -71 76 26 100 -127 -199 -14 106 86 -90 225 113 14 -37 73 -117
5780a17K13K20k58Q2j02r7O7j00K42k87K19l17M23O6l08K35L1m05K80Ql11o7K51
$$ -117 96 316 58 140 38 -59 8 -92 150 -137 82 -235 188 254 -54 181 212 -193 87 95 -216 -283 -32
5803c2R7M5j55o0l7K46O3l02K60Lj27o3L1Q2j95M61l08J71k55Q7n7m8m9n6J77
$$ -32 65 110 -45 -105 -142 104 167 -135 125 128 1 -62 -31 51 -144 317 9 180 -75 12 -45 -93 -142 -198 -21
5828b1J8j80m8L38j57r1P3j2O2K06l7k25%k8K03J35l16KJ38k2j71j74L63l0K16
$$ -21 -3 -183 -231 107 -50 -141 -68 -80 -18 188 151 -74 -74 -102 101 236 -80 -78 60 38 -133 -307 56 26 242
5853B42j85j08P8J55q6j08k19K88p2J41q3l20K65R9j02K46l02J34j04L66j38j97
$$ 242 57 -51 27 182 96 -12 -231 57 -15 126 43 -277 -12 87 -15 231 -71 63 -41 325 187 -10
5875a0k24K94l22K65R6k10n5K7M5l1J6K39r9r8J49m6k47M2P2J05P1j14J78m8j87
$$ -10 -234 60 -262 3 99 -111 -166 -139 -94 -125 -109 130 31 -67 82 36 -211 -169 -97 8 79 -35 143 95 -92
5900i2M2M6q1J21n8J66k60K4K17j09j14K51j65M4j12N97n24J21qk23M16j97MN
$$ -92 -50 -4 -85 36 -22 144 -116 -92 125 16 -98 153 -12 32 -80 517 -7 114 106 -117 299 102 106 111
5924A11Q4k82J96K2k80J3k06L78J38r5r3OPPj08L08l93K02j08K33k62K57j46p9
$$ 111 195 -87 109 131 -149 -136 -342 36 174 79 -14 -8 -1 6 -102 206 -187 15 -93 140 -122 135 -11 -90
5948i0J20P5k26j40M29n2j75kJ33j1nJ39m01J68L79k26j79J5J01P1q0J00M1j15
$$ -90 30 105 -121 -261 168 116 -59 -61 72 61 56 195 -206 -38 341 115 -64 -49 52 123 43 143 184 69
$$ [...]
8191a27
##END NTUPLES=NMR FID
##END=
