##TITLE=1H_Pr Am-fin
 CDCl3, 8 sc, 
 14.3.2019
##JCAMPDX= 6.0         $$ Bruker NMR JCAMP-DX V2.0
##DATA TYPE= NMR FID
##DATA CLASS= NTUPLES
##ORIGIN= UXNMR, Bruker Analytische Messtechnik GmbH
##OWNER= root
$$ XWIN-NMR		Version 3.5
$$ Thu Mar 14 16:59:52 2019 Russian Standard Time (UT+4h)  she@DPX200
##.OBSERVE FREQUENCY= 200.1315
##.OBSERVE NUCLEUS= ^1H
##.DELAY= (6, 6)
##.ACQUISITION MODE= SIMULTANEOUS
##.ACQUISITION SCHEME= undefined
##.AVERAGES= 8
##.DIGITISER RES= 18
##SPECTROMETER/DATA SYSTEM= spect
##.PULSE SEQUENCE= zg30
##.SOLVENT NAME= CDCl3
##.SHIFT REFERENCE= (INTERNAL, CDCl3, 0, 15.7039)
##AUDIT TRAIL= $$ (NUMBER, WHEN, WHO, WHERE, WHAT)
$$ ##TITLE= Audit trail, XWIN-NMR		Version 3.5
$$ ##JCAMPDX= 5.01
$$ ##ORIGIN= Bruker BioSpin GmbH
$$ ##OWNER= she
$$ F:/spectra/data/she/nmr/H-F/1/audita.txt
$$ ##AUDIT TRAIL=  $$ (NUMBER, WHEN, WHO, WHERE, WHAT)
(   1,<2019-03-14 16:58:55.04 +0400>,<she>,<DPX200>,
      <created by zg, POWCHK disabled, PULCHK disabled
       configuration hash MD5:
       00 E9 B6 7A A2 85 ED C7 34 08 36 98 17 FE 4E 26
       data hash MD5: 16K
       2A C5 DA 9F 59 CB 97 EC A9 E5 18 39 7F EA A9 F2>)
$$ ##END=
$$ 
$$ hash MD5
$$ 8A 99 B9 A2 9C DE ED 72 04 4F C8 69 AA 58 A1 F4
##$RELAX= 
##$RELAX= 
##$RELAX= 
##$RELAX= 
##$RELAX= 
##$RELAX= 
$$ Bruker specific parameters
$$ --------------------------
##$DU= <F:/spectra>
##$EXPNO= 1
##$NAME= <H-F>
##$PROCNO= 1
##$TYPE= <nmr>
##$USER= <she>
##$AMP= (0..31)
100 100 100 100 100 100 100 100 100 100 100 100 100 100 100 100 100 100 
100 100 100 100 100 100 100 100 100 100 100 100 100 100 
##$AQSEQ= 0
##$AQ_mod= 1
##$AUNM= <au_zg>
##$AUTOPOS= <>
##$BF1= 200.13
##$BF2= 200.13
##$BF3= 200.13
##$BF4= 200.13
##$BF5= 200.13
##$BF6= 200.13
##$BF7= 200.13
##$BF8= 200.13
##$BYTORDA= 1
##$CFDGTYP= 0
##$CFRGTYP= 5
##$CHEMSTR= <none>
##$CNST= (0..31)
1 1 145 1 1 1 1 1 1 1 1 1 1 1 1 1 1 1 1 1 1 1 1 1 1 1 1 1 1 1 1 1 
##$CPDPRG= <>
##$CPDPRG1= <>
##$CPDPRG2= <>
##$CPDPRG3= <>
##$CPDPRG4= <mlev>
##$CPDPRG5= <mlev>
##$CPDPRG6= <mlev>
##$CPDPRG7= <mlev>
##$CPDPRG8= <mlev>
##$CPDPRGB= <>
##$CPDPRGT= <>
##$D= (0..31)
0 1.2 0 0 0 0 0 0 0 0 0 0.03 0 0 0 0 0 0 0 0 0 0 0 0 0 0 0 0 0 0 0 0 
##$DATE= 1552568334
##$DBL= (0..7)
120 120 120 120 120 120 120 120 
##$DBP= (0..7)
150 150 150 150 150 150 150 150 
##$DBP07= 0
##$DBPNAM0= <>
##$DBPNAM1= <>
##$DBPNAM2= <>
##$DBPNAM3= <>
##$DBPNAM4= <>
##$DBPNAM5= <>
##$DBPNAM6= <>
##$DBPNAM7= <>
##$DBPOAL= (0..7)
0.5 0.5 0.5 0.5 0.5 0.5 0.5 0.5 
##$DBPOFFS= (0..7)
0 0 0 0 0 0 0 0 
##$DE= 6
##$DECBNUC= <off>
##$DECIM= 24
##$DECNUC= <off>
##$DECSTAT= 4
##$DIGMOD= 1
##$DIGTYP= 9
##$DL= (0..7)
0 120 120 120 120 120 120 120 
##$DP= (0..7)
150 150 150 150 150 150 150 150 
##$DP07= 0
##$DPNAME0= <>
##$DPNAME1= <>
##$DPNAME2= <>
##$DPNAME3= <>
##$DPNAME4= <>
##$DPNAME5= <>
##$DPNAME6= <>
##$DPNAME7= <>
##$DPOAL= (0..7)
0.5 0.5 0.5 0.5 0.5 0.5 0.5 0.5 
##$DPOFFS= (0..7)
0 0 0 0 0 0 0 0 
##$DQDMODE= 0
##$DR= 18
##$DS= 0
##$DSLIST= <SSSSSSSSSSSSSSS>
##$DSPFIRM= 0
$$ [...]
##$SUBNAM2= <"">
##$SUBNAM3= <"">
##$SUBNAM4= <"">
##$SUBNAM5= <"">
##$SUBNAM6= <"">
##$SUBNAM7= <"">
##$SUBNAM8= <"">
##$SUBNAM9= <"">
##$SW= 24.9337058887773
##$SWIBOX= (0..15)
0 0 2 0 0 0 0 0 0 0 0 0 0 0 0 0 
##$SW_h= 4990.01996007984
##$TD= 16384
##$TD0= 1
##$TE= 0
##$TE2= 300
##$TE3= 300
##$TEG= 300
##$TL= (0..7)
0 120 120 120 120 120 120 120 
##$TP= (0..7)
150 150 150 150 150 150 150 150 
##$TP07= 0
##$TPNAME0= <>
##$TPNAME1= <>
##$TPNAME2= <>
##$TPNAME3= <>
##$TPNAME4= <>
##$TPNAME5= <>
##$TPNAME6= <>
##$TPNAME7= <>
##$TPOAL= (0..7)
0.5 0.5 0.5 0.5 0.5 0.5 0.5 0.5 
##$TPOFFS= (0..7)
0 0 0 0 0 0 0 0 
##$TUNHIN= 0
##$TUNHOUT= 0
##$TUNXOUT= 0
##$USERA1= <user>
##$USERA2= <user>
##$USERA3= <user>
##$USERA4= <user>
##$USERA5= <user>
##$V9= 5
##$VALIST= <valist>
##$VCLIST= <CCCCCCCCCCCCCCC>
##$VD= 0
##$VDLIST= <DDDDDDDDDDDDDDD>
##$VPLIST= <PPPPPPPPPPPPPPP>
##$VTLIST= <TTTTTTTTTTTTTTT>
##$WBST= 1024
##$WBSW= 4
##$XGAIN= (0..3)
0 0 0 0 
##$XL= 0
##$YL= 0
##$YMAX_a= 410354
##$YMIN_a= -528790
##$ZGOPTNS= <>
##$ZL1= 120
##$ZL2= 120
##$ZL3= 120
##$ZL4= 120
##$ABSF1= 10
##$ABSF2= 0
##$ABSG= 5
##$ABSL= 3
##$ALPHA= 0
##$AQORDER= 0
##$ASSFAC= 0
##$ASSFACI= 0
##$ASSFACX= 0
##$ASSWID= 0
##$AUNMP= <proc_1d>
##$AZFE= 0.1
##$AZFW= 0.1
##$BCFW= 1
##$BC_mod= 2
##$BYTORDP= 1
##$COROFFS= 0
##$CY= 11.3945322036743
##$DATMOD= 1
##$DC= 2
##$DFILT= <>
##$DTYPP= 0
##$F1P= 18.9103706918063
##$F2P= -1.10871071338519
##$FCOR= 0.5
##$FTSIZE= 0
##$FT_mod= 4
##$GAMMA= 1
##$GB= 0.15
##$INTBC= 1
##$INTSCL= 1
##$ISEN= 128
##$LB= 0.24
##$LEV0= 0
##$LPBIN= 0
##$MAXI= 10000
##$MC2= 0
##$MEAN= 0
##$ME_mod= 0
##$MI= 1.114404
##$NCOEF= 0
##$NC_proc= 0
##$NLEV= 6
##$NOISF1= 3.799351
##$NOISF2= 2.8
##$NSP= 1
##$NTH_PI= 0
##$NZP= 0
##$OFFSET= 15.70392
##$PC= 1
##$PHC0= -9223.012
##$PHC1= 17.80026
##$PH_mod= 1
##$PKNL= yes
##$PPARMOD= 0
##$PSCAL= 0
##$PSIGN= 0
##$REVERSE= no
##$SF= 200.130013532006
##$SI= 16384
##$SIGF1= 3
##$SIGF2= 2
##$SINO= 400
##$SIOLD= 16384
##$SREGLST= <1H.CDCl3>
##$SSB= 0
##$STSI= 0
##$STSR= 0
##$SW_p= 3612.71676300578
##$SYMM= 0
##$S_DEV= 0
##$TDeff= 0
##$TDoff= 0
##$TI= <>
##$TILT= no
##$TM1= 0
##$TM2= 0
##$TOPLEV= 0
##$USERP1= <user>
##$USERP2= <user>
##$USERP3= <user>
##$USERP4= <user>
##$USERP5= <user>
##$WDW= 1
##$XDIM= 8192
##$YMAX_p= 0
##$YMIN_p= 0
$$ End of Bruker specific parameters
$$ ---------------------------------
##NTUPLES= NMR FID
##VAR_NAME=  TIME,          FID/REAL,        FID/IMAG
##SYMBOL=    X,             R,               I
##VAR_TYPE=  INDEPENDENT,   DEPENDENT,       DEPENDENT
##VAR_FORM=  AFFN,          ASDF,            ASDF
##VAR_DIM=   8192,          8192,            8192
##UNITS=     SECONDS,       ARBITRARY UNITS, ARBITRARY UNITS
##FACTOR=    0.0002004,     1,               1
##FIRST=     0,             0,               0
##LAST=      1.6414764,     0,               0
##MIN=       0,             -528790,         0
##MAX=       1.6414764,     410354,          0
$$ Real data points
##PAGE= N=1
##DATA TABLE= (X++(R..R)), XYDATA
$$ [...]
3563b638p02R479n562n341R572m95r388N588O027r702J75R921o358o754R986N62
$$ -2638 -3340 6139 577 -4764 4808 4313 -5075 513 6540 -3162 -2987 6934 576 -6178 3808 4370
3579D370r871N950O059j0325m23J0382n045o811Q637P28r822N980O114r345j95
$$ 4370 -5501 449 6508 -3817 -4240 6142 1097 -5714 2923 3651 -6171 -191 5923 -3422 -3617
3594c617R169n695o298J0027O62j0375M820O667r032r21J0369n353p067Q607J187
$$ -3617 5552 -143 -6441 3586 4248 -6127 -1307 5360 -3672 -4593 5776 423 -6644 1963 3150
3609C150r062N104O527r429j137R658m754o198Q789N73j0167N625O818q831j358
$$ 3150 -5912 -808 5719 -3710 -4847 4811 57 -6141 2648 3221 -6946 -1321 5497 -3334 -4692
3624d692R487m897p004R209J885r384L745O639q249j190R334m355o824Q654J029
$$ -4692 4795 -102 -7106 2103 3988 -5396 -1651 4988 -3261 -4451 4883 528 -6296 2358 3387
3639C387r437N159O817q699k197R610l768p181Q905J809r844L742P551q262j709
$$ 3387 -6050 -891 5926 -2773 -4970 4640 872 -6309 2596 4405 -5439 -1697 5854 -2408 -4117
3654d117R320l840p553Q230K546r055L320P131q253j970R583l765p048Q342J870
$$ -4117 5203 1363 -6190 2040 4586 -4469 -1149 5982 -2271 -4241 5342 1577 -5471 2871 4741
3669D741r880M464P658q029k849Q983l031p342Q096K539r633L065P143p283j908
$$ 4741 -5139 -675 6983 -1046 -3895 5088 2057 -5285 2811 5350 -4283 -1218 5925 -1358 -3266
3684c266Q905l355p723P625K770r024L667O966p972k712R434k607p946P669K724
$$ -3266 5639 2284 -5439 2186 4956 -4068 -401 6565 -1407 -4119 5315 2708 -5238 2431 5155
3699E155r632L104P926p760k787R001l334o820P454K719r201K837O714p311k683
$$ 5155 -4477 -1373 6553 -1207 -3994 5007 1673 -5147 2307 5026 -4175 -1338 5376 -1935 -4618
3714d618R854k952p880O798L477q820K238P506p173l567Q892k102p170O923K962
$$ -4618 5236 2284 -5596 1202 4679 -4141 -1903 5603 -1570 -5137 3755 1653 -5517 1406 4368
3729D368r181K076Q207p149l136R025k389q398P352L999r195J474P749o862l399
$$ 4368 -4813 -2737 5470 -1679 -4815 4210 1821 -6577 775 4774 -4421 -2947 4802 -2060 -5459
3744e459R121j966p757O263L401q477K301P881o880m117Q833j947p635P052L923
$$ -5459 3662 1696 -6061 202 3603 -4874 -2573 5308 -1572 -5689 3144 1197 -6438 614 4537
3759D537r444J574P952n945m030R026j799q116O324M454q459J327P510o307l997
$$ 4537 -4907 -3333 4619 -1326 -5356 3670 1871 -6245 79 4533 -3926 -2599 4911 -1396 -5393
3774e393R113j128p971O167L673q887J388Q654n758m664Q473j107q023O562M292
$$ -5393 3720 2592 -5379 788 4461 -4426 -3038 5616 -142 -4806 3667 2560 -5463 1099 5391
3789E391q712Q33Q073n903m088Q616r51q479O269M074q249P27Q164n956m439Q564
$$ 5391 -3321 -2488 5585 -318 -4406 4210 3259 -5220 1049 5123 -3126 -2399 5765 -191 -4630 3934
3805C934m38q234N698M735q878Q54Q202n375m510Q177j013p882N420N235q205
$$ 3934 3496 -4738 960 5695 -3183 -2329 5873 498 -4012 4165 3152 -4730 690 5925 -2280
3820b280p9Q026n293n020Q615P7q809N501M827q299J15Q445n098n750Q028J12
$$ -2280 -2359 5667 374 -4646 3969 4046 -4763 738 5565 -2734 -2619 5826 728 -5022 3006 3118
3836C118p950N356M970q617k13Q389m610n072P737L15r096N407N174p885r3P859
$$ 3118 -4832 524 5494 -3123 -3336 5053 443 -4629 3108 3423 -5673 -266 4908 -2977 -3070 4789
3852D789n137n045Q293O47q674M457N183p718k79Q240m859n392P839j62p486M792
$$ 4789 -348 -5393 2900 3547 -5127 -670 4513 -3205 -3484 4756 -103 -5495 2344 2182 -5304 -512
3868e12N193p855o86P976m326n474Q089N65q517M023N881p337p19P985m353o106
$$ -512 4681 -3174 -3860 4116 -210 -5684 2405 2970 -5547 -1524 4357 -2980 -3699 4286 -67 -6173
3884f173Q170J085q171M101N620p837j231Q868m007o038P588Q80q057M176O017
$$ -6173 1997 3082 -5089 -988 4632 -3205 -4436 4432 425 -5613 1975 2855 -5202 -1026 4991
3899D991p429j547Q210l623n917P909Q19q402L775O012p502q59Q486l887o630
$$ 4991 -2438 -3985 4225 602 -5315 2594 3413 -4989 -1214 4798 -2704 -3563 4923 1036 -5594
3914e594P558K131q575L521O164p239j829Q365k975o179O988J717q645L763O408
$$ -5594 1964 4095 -4480 -959 5205 -2034 -3863 4502 1527 -4652 2336 4053 -4592 -829 5579
3929E579o754k308P897l331n585P338K008q665L275O035o998j503Q093l143o369
$$ 5579 -1175 -3483 4414 1083 -4502 2836 4844 -3821 -546 5489 -1509 -3012 5081 1938 -4431
3944d431O541J962p811L267O395p035k560Q397k564o614O646K235q517K964O739
$$ -4431 2110 4072 -3739 -472 5923 -1112 -3672 4725 2161 -4453 2193 4428 -4089 -1125 5614
3959E614o701k029P770k978o746P185K575q383K568O345o946k288Q544k529o989
$$ 5614 -1087 -3116 4654 1676 -5070 2115 4690 -3693 -1125 5220 -1726 -4014 4530 2001 -4988
3974d988O449K153p171J937O771o412l069Q159k523o568O763K748q446J652P111
$$ -4988 1461 3614 -3557 -1620 5151 -1261 -4330 3829 1306 -5262 1501 4249 -4197 -2545 4566
3989D566o127k804Q377k299p665O611L398q213J969O540o061l293Q254j963o650
$$ 4566 -1561 -4365 4012 1713 -5952 659 4057 -4156 -2187 4353 -1708 -5001 3253 1290 -5360
4004e360O124K886p988J797P116o273l082P780j912o938O576K985p631J103P123
$$ -5360 764 3650 -4338 -2541 4575 -1698 -4780 3000 1088 -5850 726 3711 -3920 -2817 4306
4019D306n829l307Q291j769p093N466L500p481J847O515n939l531Q500j495o920
$$ 4306 -1523 -4830 3461 1692 -5401 65 3565 -3916 -2069 4446 -1493 -5024 3476 1981 -4939
4034d939N640L474q244J514P282n240l835P491o79p391N684L933p853R66O996
$$ -4939 701 4175 -4069 -2555 4727 -513 -4348 3143 2464 -4927 757 4690 -3163 -2197 4799
4049D799n642l339P990q46p687N282M176p850J219P253n363m523P834l74p073
$$ 4799 -843 -4182 3808 2962 -4725 557 4733 -3117 -1898 5355 -8 -4531 3303 2929 -4144
4064d144N486L638p889Q04O997m896l827P357n22p478N281M130p321JP636n051
$$ -4144 1342 4980 -2909 -2105 4892 -4 -3831 3526 3004 -4474 807 4937 -2384 -2383 5253 202
4080B02m620Q191k78p454M731L922p327K49P669m813m403P224k48p371M602M787
$$ 202 -4418 3773 3495 -3959 772 4694 -2633 -2384 5285 472 -3931 3293 3045 -4326 276 5063
4096E063p819L80P162m781m402P684k08p743M359N017p103l35P273m330m927P237
$$ 5063 -2756 -2376 4786 5 -4397 3287 3079 -4664 -305 4712 -2391 -2726 4547 217 -4710 2527
4112B527M13p381M478M241p244l95P676l951n153P081qp188M393M999p606m99
$$ 2527 2940 -4441 37 4278 -2966 -3361 4315 364 -4789 2292 2284 -4904 -511 4488 -3118 -3617
4128c617P615m092n046P178O84p554L826N054o910q95P559l857m865O788P90p417
$$ -3617 3998 -94 -5140 2038 2722 -4832 -1006 4048 -2862 -3757 3802 -55 -4920 1868 2658 -4759
4144d759M337M345p165q43P902l532n485P280P08p591L377N864o673j397P370
$$ -4759 -422 3923 -3242 -4085 3817 285 -5200 2080 2788 -4803 -1426 4438 -2235 -3632 3738
4159C738l240n479O918J191p599L692N267p159q34Q090m128n031O314J379p289
$$ 3738 498 -4981 1937 3128 -4471 -779 4488 -2671 -3505 4585 457 -4574 1740 3119 -4170
4174d170L498N868o901j720P108k480n214O428J108p631L267N695o374j394P447
$$ -4170 -672 5196 -1705 -3425 3683 1203 -4011 2417 3525 -4106 -839 4856 -1518 -2912 4535
4189D535l446n641P067J673p879L129N959p026j613P808k689o049N964K102p324
$$ 4535 1089 -4552 2515 4188 -3691 -562 5397 -1629 -3242 4566 1877 -4172 1792 3894 -3430
4204c430L093N527o346k006P407k855n498O533J513p865L150N781o262j914P618
$$ -3430 -337 5190 -1156 -3162 4245 1390 -4108 2425 3938 -3927 -777 5004 -1258 -3172 4446
4219D446k524o453O392K322p449K396N870o325k039P214k202n960N873K025p448
$$ 4446 1922 -4531 1861 4183 -3266 -870 5000 -1325 -3364 3850 1648 -4312 1561 3586 -3862
4234c862K445O046n839k448P370k611n581N861K428p802K317N744n571k343P303
$$ -3862 -1417 4629 -1210 -3658 3712 1101 -4480 1381 3809 -3993 -1676 4068 -1503 -3846 3457
4249C457k072o227N678K580p193K159N633n680k739P723k148o031N738K855p975
$$ 3457 1385 -4842 836 3416 -3777 -1618 4015 -1665 -4404 3319 1171 -4860 878 3733 -4242
4264d242K069O092n610k556P319j955o301N748L041p030J034O376n853k346P193
$$ -4242 -2173 3919 -1691 -4247 3072 1117 -5184 564 3605 -3425 -2391 3985 -1868 -4214 2979
4279B979j682o256N084L071o918J770O258n576l274P208o52o608N356L221p599
$$ 2979 1297 -4959 125 3196 -3722 -1952 4306 -1270 -4544 2664 2012 -4596 760 3981 -3618
4294c618J197O602m778l436P139j615o014N088L453p021J415N967n225l052P236
$$ -3618 -2421 4181 -597 -4033 3106 1491 -4523 565 4018 -3003 -1588 4379 -846 -3898 3338
4309C338p39o885N015L651p403R06O780m637l845O705m28o587N189L426p220R14
$$ 3338 2599 -4286 729 4380 -3023 -2117 4663 26 -3819 2886 2458 -4129 1060 4486 -2734 -1820
4325a820O402m824l473P338o42o997M603M072o859M44O849m740m204O934k2o559
$$ -1820 4582 -242 -3715 3623 2981 -4016 587 4659 -2200 -1756 5093 353 -3851 3083 3061 -3498
4341c498M289L876p275N43O822m477l680O657n89o925M964L533o466j29O754m288
$$ -3498 791 4667 -2608 -2065 4757 280 -3400 3257 2668 -4257 707 4240 -2226 -2355 4399 111
4357A11l752O853p32o545M110M134o735L63O644m424m364O738L62o600L797M222
$$ 111 -3641 3212 2480 -4065 45 4179 -2556 -2193 4451 27 -4337 2401 2763 -3837 -40 4182
4373D182p164j51P129m195l954O452O2o879M088M310o280p88O640l762l937O375
$$ 4182 -2982 -3133 3996 -199 -4153 2299 2361 -4518 -430 3880 -2400 -3188 3452 -310 -4247 2128
4389B128J61o825L656M500o544J44O443l741m761O479O47o818L630M654o513q82
$$ 2128 2289 -4536 -880 3620 -2924 -2780 3663 -78 -4839 1640 2287 -4531 -901 3753 -2760 -3642
4405c642O984l328m663O276L78o676L475N172o127r18O841l563n042O456J140
$$ -3642 3342 14 -4649 1627 2005 -4671 -1196 3976 -2151 -3069 3772 209 -4833 1623 2763
4420B763o836L327M562o346o82P122l355m820N736J107o430L313M858n985j435
$$ 2763 -4073 -746 3816 -2530 -3212 3910 555 -4265 1471 2578 -3852 -539 4319 -1666 -3101
4435c101O541k793m693O099J117o773K713M966n612j324O881l032n114N957J645
$$ -3101 3440 647 -4046 2053 3170 -3603 -890 4076 -1536 -2860 4021 989 -4125 1832 3477
4450C477o826K967N034o213j517P028k183n264M933J914o797K696N700n772k000
$$ 3477 -3349 -382 4652 -1561 -3078 3950 1767 -3497 1436 3350 -3447 -751 4949 -823 -2823
4465b823O941k648n520O245J853p179K459N145n515k101P041k435n289N475K069
$$ -2823 4118 1470 -4050 2195 4048 -3131 -672 4473 -1042 -3143 3898 1463 -3826 1649 3718
4480C718o557K083N355n841j875O419j369n554N452J459o555J851N540m882k626
$$ 3718 -2839 -756 4599 -1242 -3117 3302 1933 -3621 1831 3290 -3265 -1414 4126 -756 -3382
4495c382O585j878n767N428K518o796J737N207m880k113O491j449n866N027K366
$$ -3382 3203 1325 -4442 986 3504 -3292 -1555 3652 -1228 -3341 3150 1701 -4165 862 3228
4510C228o288J468N501n429k558O861j617n415M792K629o636J281N643m335k800
$$ 3228 -3060 -1592 3909 -1520 -4078 2783 1166 -4249 543 3172 -3464 -2183 3460 -875 -3675
4525c675O500j872n715N012K994o412J514N050m841k758O728j025n979M976K375
$$ -3675 2825 953 -4762 250 3244 -3168 -1654 3396 -1445 -4203 2525 1500 -4479 497 2872
4540B872o509J823N700m907l135O508j351n541N006K962o534R54O090m562k908
$$ 2872 -3637 -1814 3886 -1021 -4156 2352 1001 -4540 466 3428 -3106 -2152 3938 -624 -3532
4555c532O477j224o006M853L123o664J358N460m395l253O472n80n789M158L342
$$ -3532 2945 1721 -4285 568 3691 -2973 -1615 3845 -550 -3803 2669 2089 -3700 458 3800
4570C800o567N71O360m142l435N946l75n872M644L303o312M65N825m458l021O109
$$ 3800 -2767 -2196 4164 22 -3413 2533 2158 -3714 930 4233 -2079 -1614 4211 -247 -3268 2841
4586B841j86o176L882L733n951J31O155m350l567O202j52n877M044L633o391k54
$$ 2841 2655 -3521 361 4094 -1857 -1726 4429 79 -3488 2714 2562 -3315 729 4362 -2029 -2283
4602b283O632l894l788N996p0o083L636M133o262k50O095l814l689O527o3o129
$$ -2283 4349 455 -3333 2663 2593 -3490 146 4279 -1983 -2233 3862 48 -3641 2886 2823 -3306
4618c306L285L759n737k38O082l403m114N663M14n951L386L827n784l76O039l195
$$ -3306 -21 3738 -1999 -2237 3845 442 -3672 1991 2405 -3546 -160 3667 -2117 -2493 3546 351
4634C51m195N994L09o323L287M304n911m07N854l332m346O144N98n995K871M191
$$ 351 -3844 2150 2459 -3864 -577 3727 -2184 -2591 3263 -69 -4415 1729 2327 -3668 -797 3394
4650C394n369q23O330l287m060N198P40n932L027M144n392q69N797k923m470N771
$$ 3394 -1975 -2798 3532 245 -3815 1383 2123 -3809 -782 3362 -2030 -2899 2898 -25 -4495 1276
4666A276J022o080K662M504n459j109O479l385m053N467J135n860K565M101n302
$$ 1276 2298 -3782 -1120 3384 -2075 -3184 3295 -90 -4143 1324 2459 -3401 -836 3265 -2037
4681b037q65N978k053m881N416Q91n899K493M870n608j225O002k632m123N265
$$ -2037 -2902 3076 1023 -3858 1558 2449 -3450 -957 3913 -1695 -2920 3082 450 -3673 1592
4696A592J476o116K072M852m859j720O190k342m611N152J257n448K087M241n090
$$ 1592 3068 -3048 -976 3876 -983 -2703 3487 1145 -3466 1686 2943 -2505 -418 3823 -1267
4711a267j138N907k140m779N244J213n843K261M268m519j857O012k206m327M571
$$ -1267 -2405 3502 1362 -3417 1827 3040 -2803 -542 3726 -793 -2650 3362 1156 -3171 1400
4726A400K376o460J888M627m971r59N569j833m722M140K185n579J341N276n225
$$ 1400 3776 -2684 -796 3831 -1140 -2099 3470 1637 -3085 1055 3240 -2339 -998 4278 -947
4741i47j827O250k147m498M464J910o123J831M742m340j664N346j337m958M442
$$ -947 -2774 3476 1329 -3169 1295 3205 -2918 -1087 3655 -685 -2349 2997 1660 -3298 1144
4756A144K158o145J428M859m371k240N971j579m955M812J875n685J291M844m412
$$ 1144 3302 -2843 -1415 3444 -927 -3167 2804 1225 -3730 1082 2957 -2728 -1437 3407 -1005
4771a005k213N722j280m744L785K542n524Q74N079m215k354N748j514m817L828
$$ -1005 -3218 2504 1224 -3520 265 2807 -2717 -1843 3236 -979 -3333 2415 901 -3916 -88
4786h8K870n648J142M813m049k554N670p33n100L823K405n421O94N539m256k712
$$ -88 2782 -2866 -1724 3089 -960 -3514 2156 1423 -3677 146 2551 -2870 -2176 3363 -893 -3605
4802c605N878j003n084M014K673n265O86M976m123k551N872q81n210L692K986
$$ -3605 2273 1270 -3814 200 2873 -2392 -1706 3270 -853 -3404 2468 1587 -3623 69 3055
4817C055n380N36N316l981k757N397m47m847L463K489n300M82N349l525l095N466
$$ 3055 -2325 -1789 3527 -454 -3211 2186 1739 -3108 355 2844 -2456 -1974 3375 -150 -3245 2221
4833B221n36n173L851L217n407J91N070l679k401M894N1n107L082K854m827K21
$$ 2221 1685 -3488 363 3580 -1827 -1636 3434 -245 -2646 2248 2299 -2808 274 3128 -1699 -1478
4849a478N109l160l111N167m35m969L531K976n086m74N547l001l196N156l32n129
$$ -1478 3631 471 -2640 2527 2092 -2877 654 3630 -1456 -1930 3617 616 -2580 2576 2244 -2885
4865b885L031L417m955k7M883l099l208N370m3n434L170L159n298p3N234l065
$$ -2885 146 3563 -1392 -1419 3464 365 -2843 2527 2484 -2950 220 3379 -1919 -1992 3242 177
4881A77l124M874N30n422K968L535n229k82M774k367l143M491K16n105K830L036
$$ 177 -2947 1927 2457 -2965 3 3538 -1691 -1973 2801 434 -2709 1782 1998 -3107 -277 2759
4897B759m283p68N191k660l810M841P02n054K615L657n219k50M905k285l498L957
$$ 2759 -1524 -2292 2899 239 -3571 1270 1972 -3082 -467 3190 -2029 -2279 2626 341 -3157 800
4913H00Q79m629K102L822m834n43N089k494l690M772Q35n123K206L376m322j097
$$ 800 1679 -2950 -848 2974 -1860 -2403 2686 192 -3498 1274 2109 -3014 -808 2568 -1754 -2851
4929b851N467k198m132M526J245m918K060L400m419o68N154k591l370M298J073
$$ -2851 2616 418 -3714 812 2057 -2861 -801 2599 -1820 -2488 2666 75 -3295 1003 2076
4944B076n012K241L687m448j191N488k119l901M110J704n341J732M091m241j117
$$ 2076 -2936 -695 2992 -1456 -2647 2841 722 -3179 931 2635 -2706 -974 3117 -1124 -2241
4959b241N152k053l858M241J258n020J949L878m557j177N186j606l866M105J139
$$ -2241 2911 858 -3000 1241 2499 -2521 -572 3306 -1251 -2428 2758 1152 -2714 1391 2530
4974B530m981K048L944m218j174M654j725l680L682J737n176J915L713m393j176
$$ 2530 -2451 -403 3541 -677 -1851 2803 1078 -2602 1080 2817 -2359 -444 3269 -1124 -2300
4989b300N147j555l762L738J503n072J602M183l831k175N213j069m690M279J402
$$ -2300 2847 1292 -2470 1268 2771 -2301 -699 3484 -347 -2522 2691 1622 -3068 1211 2613
5004B613n003J555L927l848j505M816j363m244L951J575m508Q57M476m087j871
$$ 2613 -2390 -835 3092 -756 -2261 2555 1192 -3052 899 2474 -2034 -1177 3299 -788 -2659
5019b659M830j231l529L167J900n019J329L982l312j892M656j370m130L672J784
$$ -2659 2171 940 -2589 578 2478 -2541 -1212 2770 -542 -2434 2222 852 -3278 394 2178
5034B178m538J255L881l875j720M422m52m755M005J619m283Q10M223l685j966
$$ 2178 -2360 -1105 2776 -1099 -2819 1603 1151 -3604 401 2020 -2263 -1453 2770 -915 -2881
5049b881M580o75m142L303K090m866J087M047l290j859M411q93m440L674K578
$$ -2881 1699 1024 -3118 185 2275 -2591 -1504 2543 -747 -2606 1805 912 -3528 146 2724
5064B724m753M25M056k913k178M465m30m549L266K488m641L09M391k892k654M697
$$ 2724 -2029 -1604 2452 -461 -2639 1826 1396 -3153 113 2601 -2040 -1731 2660 -232 -2886 1811
5080A811n36m001L046K545m779M58M028k831k199M265j08l950K267K909m323O4
$$ 1811 1275 -2726 320 2865 -1914 -1456 2572 -259 -2458 1807 1699 -2251 16 2925 -1398 -1334
5096a334M136k703k649M533j09m332K758K557m348R3M618l107k498M262k17m199
$$ -1334 2802 99 -2550 1983 1874 -2458 300 2857 -1491 -1398 3220 113 -2385 1877 1660 -2539
5112b539L150K271m243KM296k919k157M337r1m580K798K459m101j09M470k932
$$ -2539 611 2882 -1361 -1359 2937 18 -2139 2198 2107 -2473 325 2784 -1317 -1426 3044 112
5128A12k563M371j42m004K473K516m279LM397k371k921M123o0m210K522K960m225
$$ 112 -2451 1920 1778 -2226 247 2763 -1516 -1513 2884 513 -2408 1715 1655 -2555 -33 2927 -1298
5145a298l40M018k192k653M320j56m087K150K612l845j96M079k445k372L516O36
$$ -1298 -1638 2380 188 -2465 1855 1699 -2388 -238 2374 -1471 -1667 2412 -33 -2405 1111 1747
5161A747m293K163K701l825l94M499k177l181L810K86m006K318K998m312k44L881
$$ 1747 -2546 -383 2318 -1507 -1901 2598 421 -2760 1050 1336 -2670 -352 2646 -1666 -1910 1971
5177A971k242k688L992N32m329K240K913l886p13M487j953l148L830N50m060J704
$$ 1971 -271 -2959 1033 1565 -2764 -524 2389 -1497 -2210 2277 324 -2824 1006 1556 -2504 -800
5193h00L209l678q30M121j500l220L627P32m479K057L306l769o84L853j728l072
$$ -800 2409 -1269 -2099 2022 522 -2698 929 1661 -2818 -761 2545 -1224 -1908 1945 217 -2855
5209b855L766R11l950J722K962l545q80M290j606l395L676J129m551J947L210
$$ -2855 911 1822 -2128 -406 2556 -989 -1869 2421 815 -2580 1096 2225 -2326 -379 2831
5224B831l634j101M122j345l123L379R99l956J117L425l327j202M031j277l223
$$ 2831 -803 -1904 2218 873 -2250 1129 2128 -1828 -711 2714 -613 -1815 2216 939 -2284
5239b284L477J149m099J258K953k921j210L742j042l463L613J015l738Q90L420
$$ -2284 1193 2342 -1757 -499 2454 -467 -1677 2065 1023 -2440 1173 2188 -1550 -660 2760
5254B760l289j032L965j568l266L228J477l992R86L350l057j638M204r19l585
$$ 2760 -529 -1561 2404 836 -2430 798 2275 -1717 -731 2619 -438 -2076 2128 1209 -2376
5269b376K880J676l899J115K971k920j657L853q08l398L344J192m042Q37L603
$$ -2376 504 2180 -1719 -604 2367 -553 -2210 1643 835 -2563 781 1973 -2069 -1232 2371
5284B371k920j662L994r74l561L370J560m142R12L342l167j192L552o19l426K730
$$ 2371 -549 -2211 1783 809 -2752 618 2178 -1964 -1052 2290 -877 -2069 1483 864 -2562 168
5300A68J604l885R10L465k882j942M090o85l406K922J665m093M05L880k574k095
$$ 168 1772 -2113 -1203 2262 -620 -2562 1528 843 -2563 359 2024 -2069 -1664 2216 -358 -2453
5316b453M247r80l525K558K165l789L35L684k742k088M017n24l432K640K097l915
$$ -2453 1794 814 -2711 -153 2012 -1777 -1442 2242 -500 -2588 1429 905 -2527 113 2210 -1705
5332a705N57L569k844j909L784k89l454K460J743l685N02L688k638j839L564j62
$$ -1705 -1148 2421 -423 -2332 1452 1163 -2291 169 1912 -1773 -1271 2417 -221 -2060 1504 1342
5348A342l668K632K129l697K01L520k598k076M008n75l351K451J954l491R8L955
$$ 1342 -2326 306 2435 -1262 -1061 2459 -139 -2215 1793 1218 -2133 318 2272 -1219 -1121 2834
5364B834k636k015L369j01l293K142K604m081n2L492k076k134L825j55m025K644
$$ 2834 198 -1817 1552 1451 -1842 300 2904 -1177 -1229 2263 187 -1947 1878 1723 -2302 342
5380C42K148l607J5L662k119k689L824K36l758K321J935l524mL846k374k143L443
$$ 342 2490 -1117 -1102 2560 441 -2248 1576 1812 -1946 375 2310 -1214 -1218 2628 254 -1889 1554
5397A554N1l893K441K416l720m30L718j940k530L806J38l674J738K618l404k82
$$ 1554 1605 -2288 153 2569 -1151 -1581 2137 197 -2333 1473 1611 -2063 -325 2293 -1111 -1393
5413a393L344j883k480L260O46l516J784K210l188o53L965j705k787L464K18l558
$$ -1393 1951 68 -2412 848 1494 -2022 -238 1972 -1216 -1869 2096 391 -2396 1068 1286 -2272
5429b272J555K688l177o01L541j572k673L267O62l735J737K320l000n96L783j821
$$ -2272 -717 1971 -1206 -1807 1734 162 -2511 756 1418 -2317 -580 1740 -1260 -1856 1927 106
5445A06k622L324Q55l877J584K802l496o16L733j744k343L107O87l614J535K673
$$ 106 -2516 808 1663 -2214 -630 2172 -1324 -1940 1793 49 -2294 813 1500 -2114 -579 2094
5461B094l110p79L705j651k612L215N44l639J743K716l227p64L971j641k697K788
$$ 2094 -1016 -1795 1910 259 -2353 862 1406 -2233 -490 2226 -1001 -1765 2206 565 -2132 656
5477F56J037l667J644K648k854r01L436j295k892L146R94l749J298K928l217o28
$$ 656 1693 -1974 -330 2318 -536 -1437 1999 704 -2188 958 1952 -1797 -499 2429 -788 -1416
5493a416L478j269k645K742R44l514J106K795k628j113L808j330k760K719J161
$$ -1416 2062 793 -1852 890 1834 -1680 -574 2221 -407 -1520 2288 958 -1802 917 2078
5508B078l342P26K995k901j002L345p69l453L280J139l592P73K889k675j028L390
$$ 2078 -1264 -538 2457 -444 -1446 1899 1130 -2323 957 2096 -1496 -723 2166 -509 -1537 1853
5524A853o78l147K581J358l449P65K982k691j594L720j020k695K973P80l300R02
$$ 1853 1175 -1972 609 1967 -1482 -717 2265 -426 -2020 1700 680 -2015 958 1738 -1562 -660
5540f60K947k930j249L650j229k897K905J172l403Q52K576j842k175L796o17l191
$$ -660 2287 -643 -1892 1758 529 -2368 537 1709 -1694 -842 1734 -108 -2283 1513 896 -2295
5556b295K718J155l405Q36K698k444j366L614l69l705K985J373l618L78L171k158
$$ -2295 423 1578 -1827 -991 1707 -737 -2103 1511 1142 -2563 422 1795 -1823 -1445 1726 -432
5572d32j493K936m15l141K666J454l332P37K758k556j181L379p73k854K482J758
$$ -432 -1925 1011 596 -2545 121 1575 -1757 -1020 1738 -818 -1999 1380 607 -2247 235 1993
5588A993l624M98L051k249j930L381o11k709K205J814l531N27L364k392j882L981
$$ 1993 -1631 -1133 1918 -331 -2261 1120 509 -2200 5 1819 -1712 -1185 2179 -213 -2095 1886
5604A886q98l319K610J809l348K64L535k695j848L202jk966K041J788l184M0L444
$$ 1886 988 -2331 279 2088 -1260 -996 2539 -156 -2004 1198 1197 -1769 272 2060 -1124 -1084 2360
5621B360k370j657L043j75l045K022K454l563kL035k019j765L300l32l015J987
$$ 2360 -10 -1667 1376 1201 -1844 178 2632 -931 -933 2102 83 -1682 1618 1286 -1729 258
5637B58K010l112l81L541j980k240L018K81l069J897J934l276J34L037j973k019
$$ 258 2268 -844 -1225 2316 336 -1904 1114 1395 -1674 223 2157 -1119 -985 2052 79 -1940
5653a940L293k68k998J840K190l385lL411j945k252L251L15l505K042K014l070
$$ -1940 1353 1085 -1913 -73 2117 -1268 -1271 2140 195 -2057 1194 1509 -1996 46 2060 -1010
5669a010o90L653j677k531L399o8l229J805K426l302J68K669j522k340L436Kl120
$$ -1010 -1700 1953 276 -2255 1144 1076 -2153 -348 2078 -1224 -1056 1613 91 -2249 1187 1189 -1931
5686a931J459K408l068m13L111j785j651K557P24l399J700J961l219k39L504j606
$$ -1931 -472 1936 -1132 -1545 1566 -219 -1870 687 1411 -1988 -288 1673 -1546 -1785 1719 113
5702A13k563L204M95l509J692K707l295o51L542j516k321K837N74k939Q71K462
$$ 113 -2450 754 1249 -2260 -568 2139 -1156 -1807 1735 219 -2102 735 1309 -1630 -759 1703
5718A703k688n11L376j437k768K741J058l498J588K160k638r98L816j646k174
$$ 1703 -985 -1496 1880 443 -2325 416 1474 -2024 -436 1724 -914 -1912 1904 258 -1916
5733a916K787M89l133J235K618l061m26L203j188k553K893O62l302J333K593k981
$$ -1916 871 1360 -1773 -538 2080 -981 -1407 1796 608 -1945 948 1610 -1692 -359 2234 -747
5749g47q54L523j118k526K912P40l389J016K657k814o72L165r27k751K576J468
$$ -747 -1601 1922 804 -1722 1190 1930 -1459 -443 2214 -600 -1272 1893 966 -1785 791 2259
5765B259l689R26K875k882j186L692j011k972L069R41l476J199K612k750p42L157
$$ 2259 -1430 -504 2371 -511 -1697 1995 984 -1988 1081 2022 -1454 -255 2357 -393 -1135 2022
5781B022j106k712K503Q01l100J036K755k721j225L580r31k625K296J173l253
$$ 2022 916 -1796 707 1508 -1592 -556 2199 -522 -1747 1833 902 -1723 573 1746 -1507
5796a507R00K646k534j322L305q84k659K397J065l137Q41K653k365j315L311p44
$$ -1507 -607 2039 -495 -1817 1488 604 -2055 342 1407 -1730 -889 1764 -601 -1916 1395 651
5812F51k896K490J179l080M93L140k291j753L399o89k819K243J568l411O76K828
$$ 651 -2245 245 1424 -1656 -1163 1977 -314 -2067 1332 643 -2176 67 1635 -1776 -1100 1728
5828A728j859j900L353l59l178K399J271l109N09K901k408j011K594l70k673K445
$$ 1728 -131 -2031 1322 963 -2215 184 1455 -1654 -1145 1756 -652 -1663 931 561 -2112 333
5844C33J540l385M70K786k342j199K987k18l283K472J694l414K85K978j993j646
$$ 333 1873 -1512 -1042 1744 -598 -1797 1190 972 -2311 161 1855 -1559 -1274 1704 -289 -1935
5860a935L263j42l237K327J377k802K00L022j982j752L142k94l008K082J771l299
$$ -1935 1328 1186 -2051 276 1653 -1149 -949 2073 91 -1661 1481 1187 -1821 261 2032 -1267
5876a267K11K983j872j941L252j68l275K171J914k778J54K794k177j707L107o7
$$ -1267 -1056 1927 55 -1886 1366 1198 -2077 94 2008 -770 -616 2178 1 -1706 1401 1334
5892A334k895J818J963l354J39L194k134j769L195k29k709J835J677l250L08K898
$$ 1334 -1561 257 2220 -1134 -995 2199 65 -1704 1491 1262 -1447 388 2065 -1185 -877 2021
5908B021j779j895K913J27l007J583K102k997j68L265k090j763K657L41l018J615
$$ 2021 242 -1653 1260 1387 -1620 -37 2065 -932 -1100 2165 75 -1688 969 1310 -1708 -93
5924i3K176l369j32L363j416k323K724N89l189J519K049l102k95L114j487k077
$$ -93 2083 -1286 -1418 1945 529 -1794 930 1519 -1670 -151 1898 -1204 -1499 1615 128 -1949
5940a949K889K05l022J657J736k396m38K941j590j834K456M97k892J418K031k815
$$ -1949 940 1145 -1877 -220 1516 -880 -1318 1623 33 -1801 655 1152 -1740 -322 1709 -1106
5956a106m90L247j744j997K812L15k900J433K250k846m93L070j403k346K842O86
$$ -1106 -1596 1651 -93 -2090 722 1037 -1863 -430 1820 -1026 -1519 1551 148 -2198 644 1330
5972A330l076J490J991l065j94L233j636k176K710O87k914J117K499k798o18L139
$$ 1330 -1746 -256 1735 -1330 -1524 1709 73 -2103 607 1294 -1620 -503 1996 -802 -1420 1719
5988A719j451k159K405P33k572J003K175k556o54L256j310k691K907P18k951P63
$$ 1719 268 -1891 514 1247 -1325 -322 1853 -703 -1357 1899 589 -2102 805 1523 -1428 -665
6004f65K702k632p30L227j047k502K252Q33k906J132K139k321q37L196j129k380
$$ -665 2037 -595 -1325 1902 855 -1647 605 1438 -1468 -336 1803 -518 -1355 1841 712 -1668
6020a668K397Q68l129R26K586k438j114L565j214k384K417R95l020P40K307k049
$$ -1668 729 1597 -1532 -606 1980 -458 -1572 1993 779 -1605 812 1807 -1213 -473 1834 -215
6036b15j025L016q14k706K849O90l313Q01K395k264q19K595n67k438K434J274
$$ -215 -1240 1776 962 -1744 1105 1795 -1518 -717 1678 -586 -1405 1190 623 -1815 619 1893
6052A893l157O07K606k473r24K754o41k551K452J239l430J071K280j996j268K992
$$ 1893 -1264 -657 1949 -524 -1448 1306 665 -1886 566 1805 -1625 -554 1726 -270 -1538 1454
6068A454r35k400K331R98k904M81L085k490j214K966p12k650K224J245k751J44
$$ 1454 519 -1881 450 1448 -1456 -975 2110 -380 -1594 1372 660 -1990 234 1479 -1272 -1128
6084a128K697k122j206K987o73k356J752J258k603M74K506j817j709L123m48l054
$$ -1128 1569 -553 -1759 1228 555 -1801 -49 1209 -1394 -920 1586 -231 -1940 1183 735 -2319
6100b319K631J480l275K63K413j742j600L176m60k372J884J520k623k32K707j618
$$ -2319 312 1792 -1483 -1220 1193 -549 -2149 1027 567 -1805 79 1599 -1024 -1256 1451 -167
6116a67j621L082m70k565J728J626k678K43K481j895j462K891k26k636J841J603
$$ -167 -1788 1294 824 -1741 -13 1613 -1065 -822 1659 -236 -1698 1193 967 -1669 172 1775
6132A775k818J69K387j552j667L050m66k238J599J521k664P2K433j522j442K505
$$ 1775 -1043 -874 1513 -39 -1706 1344 878 -1360 239 1760 -904 -832 1601 79 -1363 1142
6148A142j46k650J678J713k624J26K657j310k152K829m0k991J759K005k963K3
$$ 1142 996 -1654 24 1737 -887 -761 1896 586 -1566 1263 1223 -1768 -9 1996 -967 -944
6164i44K992j851j797L085k15k833J741J561k595q0K944j823j661K490L31l015
$$ -944 2048 197 -1600 1485 1270 -1563 178 1739 -856 -936 2008 185 -1476 1014 1345 -1670
6180a670J680J845k788j29K620j250k255L007rk806J716J600k559j26K735j584
$$ -1670 10 1855 -933 -1062 1558 308 -1947 1060 1051 -1755 -39 1561 -998 -1124 1611 27
6196B7j621K542K96l232J551K000k336n22K985j702j781K683O6k610J425J807
$$ 27 -1594 948 1244 -1988 -437 1563 -773 -1295 1690 -12 -1793 890 956 -1654 -229 1578
6212A578k324m93K862j536k254L017K80l022J219K110j953j070K852j244j933
$$ 1578 -746 -1239 1623 87 -2167 850 1130 -1892 -673 1437 -516 -1586 1266 22 -1911
6227a911K393O07k914J278K160k434n09K643j037k162K479O10k650J312J733k304
$$ -1911 482 1089 -1825 -547 1613 -821 -1330 1313 276 -1886 593 1203 -1447 -135 1598 -706
6243g06k25K278j327j712K262P50k891J285J778k211o97L097j143k197K461M16
$$ -706 -931 1347 20 -1692 570 1320 -1571 -286 1492 -719 -1416 1681 538 -1659 802 1218
6259A218k818J348J726k341m17K738r06k187K450O38k580Q61K251k507o17K537
$$ 1218 -1600 -252 1474 -867 -1284 1454 548 -1639 811 1449 -1131 -270 1981 -526 -1143 1394
6275A394o60k404K590Q76l082J051K012k345m86K833j256k039K127Q01k708J170
$$ 1394 734 -1670 920 1796 -1286 -235 1777 -568 -1054 1779 523 -1516 611 1412 -1296 -126
6291a26K249k292j176K869j039j992K181P35k534M42K407k068p89K183m05k321
$$ -126 2123 -169 -1345 1524 485 -1507 674 1409 -1125 -683 1724 -344 -1133 1050 645 -1676
6307a676K359P38k693P88K453k479p83K316n13k219K190Q56k534M84K317j711
$$ -1676 683 1421 -1272 -484 1969 -510 -1293 1023 510 -1709 481 1337 -1197 -713 1604 -107
6323a07j356K527l82k362K119Q77k686N61K599k202p43K427q48k180K157P21k247
$$ -107 -1463 1064 682 -1680 439 1316 -1370 -809 1790 -412 -1155 1272 424 -1756 401 1122 -1125
6340a125J41K294j902j005K837p89k170J861J117k614N85K081j755j117K678o20
$$ -1125 -984 1310 -592 -1597 1240 451 -1719 142 1259 -1355 -770 1311 -444 -1561 1117 497
6356D97k728K236J384k724K68K654k251o49K452m21k194J669J311k547K56K222
$$ 497 -2231 5 1389 -1335 -1067 1587 -664 -1313 1139 718 -1476 193 1504 -1043 -787 1435
6372A435j600j310K201O9k082J304J297k216l9K400j369j393K479j13k775J770
$$ 1435 -165 -1475 726 795 -1287 17 1314 -902 -941 1459 90 -1303 1176 1063 -1712 58
6388E8J542k339k2K148j508j141K313k43j935J107J553k163j45K193j269j559
$$ 58 1600 -739 -761 1387 -121 -1262 1051 808 -1127 -20 1533 -630 -775 1418 149 -1410
6404a410K579l00k358J722J609k450K4K261j390j723K956l90k451J528J616k587
$$ -1410 1169 869 -1489 233 1842 -608 -584 1677 287 -1436 1520 1130 -1321 207 1823 -764
6420g64N7K390j790j018K163o2k151J459R38j933K86K282j527j672K060R6j755
$$ -764 -707 1683 -107 -1125 1038 976 -1175 284 1222 -711 -425 1857 330 -1342 718 814 -941
6437i41P96J734k296k15K742j695j491J949L76k156J136J481k264j55K153q18
$$ -941 -145 1589 -707 -922 1820 125 -1366 583 959 -1197 -61 1420 -844 -999 1154 336
6453C36j847J932L58k118J049K142k563o27K483j132j529K231K30k465J330J572
$$ 336 -1511 421 779 -1339 -290 1852 -711 -1338 1145 13 -1516 715 945 -1520 -190 1382
6469A382k452l29K456j024j113J285O44k248Q21K065k349k49K112j061j630K250
$$ 1382 -1070 -1399 1057 33 -1080 205 849 -1399 -578 1487 -862 -1111 1001 -60 -1690 560
6485E60M89k331N60K033k369k20K469j223j693K079K58k065J050J693k003l85
$$ 560 1049 -1282 -722 1311 -1058 -1278 1191 -32 -1725 354 612 -1453 -403 1290 -713 -1098
6501a098K363p98j871J665O54k015P87J864k525k34K617j112j674J953K61j994
$$ -1098 1265 467 -1404 261 915 -1100 -313 1551 -974 -1208 1409 297 -1377 576 837 -1157
6517a157R10J592k087k94J917k90j853J877M50k228R37J610j738n68K360q24k051
$$ -1157 -247 1345 -742 -1036 881 591 -1262 615 1065 -1163 -226 1384 -354 -922 1438 614 -1437
6534a437K293M40k517J012J978k001p17K188o71j771J452R51k052N95J849j943
$$ -1437 856 1296 -1221 -209 1769 -232 -949 1239 568 -1203 249 1200 -852 -257 1592 -351
6550c51p02K275p08j606J699N80k460P97J869j959m17J967m65j702J439R22k401
$$ -351 -1053 1222 514 -1092 607 1187 -1273 -476 1393 -566 -983 984 519 -1183 256 1178 -1223
6567a223O62J788j634q02K344n35j983J861P02k201P33J850j893q04K480q70j744
$$ -1223 -561 1227 -407 -1209 1135 600 -1383 478 1180 -1021 -288 1562 -331 -1135 1345 475 -1269
6584a269J610Q24k302M06J877j639o36J987m94j521J494R08k413N77J649j337
$$ -1269 341 1165 -1137 -731 1146 -493 -1129 858 364 -1157 337 1245 -1168 -591 1058 -279
6600b79j084K176m40j738J249J066k186O64J909k105o00K313m49j861J481J227
$$ -279 -1363 813 373 -1365 -116 950 -1236 -572 1337 -768 -1368 945 496 -1365 116 1343
6616A343k351K14K011j408j017J690J88k091J425J128k015K2K351j914n87J660
$$ 1343 -1008 -794 1217 -191 -1208 482 670 -1421 4 1132 -883 -861 1490 -424 -1011 649
6632F49q4j852J439J195k231j75J866j027j286K156l16j577J435J014j995J27
$$ 649 565 -1287 152 1347 -884 -1059 807 -220 -1506 650 334 -1243 192 1206 -789 -662
6648f62J900j336j114K195o5j892J081J269k257N06J662j414j225K327J5k008
$$ -662 1238 -98 -1212 983 918 -974 107 1376 -881 -375 1287 -127 -1352 975 990 -1018
6664a018J283J178k209K75J832j037j145J626k64j755J173J334j863j15J939j101
$$ -1018 265 1443 -766 -491 1341 304 -841 785 521 -1234 -61 1273 -590 -705 1234 133
6680A33j357K096L4k027J217J328j876n0J836j380j194K318n48j517R90J431k064
$$ 133 -1224 872 906 -1121 96 1424 -452 -502 1334 -46 -1240 1078 530 -987 3 1434 -630
6697f30m57K244p46j529J818j78j575J090J396k112rJ857j121j406K098j27k083
$$ -630 -1087 1157 411 -1118 700 522 -1053 37 1433 -679 -688 1169 48 -1358 740 613 -1470
6714a470J512J157j768l71K250j165j366J900L50k135R83J216j854o9J878j215
$$ -1470 42 1199 -569 -940 1310 145 -1221 679 1029 -1106 -123 1093 -761 -830 1048 -167
6730a67j188J856K98k260J384R09j648r0K084j194j431J985K18k075R38J180j581
$$ -167 -1355 501 799 -1461 -77 832 -816 -906 1178 -16 -1447 538 756 -1319 -381 799 -782
6747g82Q3J625n45j825J829K36j567P40J467j979k10J820q85j238J641L87j847
$$ -782 -699 926 381 -1444 385 621 -946 -206 1261 -718 -928 892 7 -1231 410 797 -1050
6764a050P29J472j568l9J307p02j440J972l4j941J017J351j854m9J923p55j606
$$ -1050 -321 1151 -417 -456 851 149 -1291 681 647 -1294 -277 1074 -780 -829 1094 339 -1267
6781a267K101J53k087Q99J504j922j37K061q12j492J955J16j931J070J038j782
$$ -1267 834 987 -1100 -201 1303 -619 -756 1305 493 -999 956 1072 -859 211 1249 -533
6797e33l21J763n61j342J457O36j923P90J434j830k41J760l86j483J274L84j897
$$ -533 -854 909 348 -994 463 1099 -824 -34 1400 -430 -671 1089 703 -780 494 878 -1019
6814a019J242J185j600l72J568n98j424J340Q48j742K21J685j517m40J752r83
$$ -1019 223 1408 -192 -564 1004 406 -1018 322 1170 -572 -351 1334 -183 -623 1129 146
6830A46j100J648K14j798P04J274j338p84J647j77j569J235R96k021O45J449j133
$$ 146 -954 694 908 -890 -186 1088 -250 -1034 613 436 -1133 102 1098 -923 -278 1171 38
6847C8j298J894j21j934J605M80j842O27J573j417r33K225n31j697J519Q81j938
$$ 38 -1260 634 513 -1421 184 664 -1178 -551 1022 -395 -1328 897 366 -1331 188 1069 -869
6864h69M73J424j288q79J903m12j487J615M62j796N8J858j243r40J853o55j348
$$ -869 -396 1028 -260 -1139 764 352 -1135 480 942 -854 -796 1062 -181 -1121 732 77 -1271
6881a271J264R31j710J02J572j259n92J677j27j973J741O28j860L50J497j168
$$ -1271 -7 924 -786 -684 888 -371 -963 714 587 -1386 355 983 -877 -527 970 -198
6897a98p07J467k52j705J583Q55j686L82J324j201j107J901j33j757J170J306
$$ -198 -905 562 310 -1395 188 1043 -643 -261 1063 -138 -1245 656 523 -1234 -64 1242
6913A242j953j4J898j252j003J731j64j588J070Q83j453o2J480p10p84J666j29
$$ 1242 -711 -725 1173 -79 -1082 649 485 -1103 -33 850 -603 -665 815 105 -679 987 858
6930H58j984J284R53j331m03J714r82r45J575k11j510J057J115j645RJ617j086
$$ 858 -1126 158 1111 -220 -623 1091 109 -836 739 528 -982 75 1190 -455 -446 1171 85
6947H5j082J672p2j624P54J177j385l62J846j178r80J935j43j642Q32R49j236
$$ 85 -997 675 603 -1021 -267 910 -475 -837 1009 -169 -1149 786 643 -999 -167 782 -454
6964d54j80J751j323n98J378R6j506Q90Q16j480j68J636j147q25J819J55k195
$$ -454 -634 1117 -206 -804 574 670 -836 54 870 -610 -778 858 -289 -1114 705 860 -1335
6981a335J086J473j681l81J561q20j132J898J98j994P85J390j936n9J864p63r43
$$ -1335 -249 1224 -457 -838 723 -97 -1229 669 867 -1127 -342 1048 -888 -947 917 154 -789
6998g89J275K83j926P17J374j818J63J554r03r45J437K80k039J176J131j751J8
$$ -789 486 769 -1157 -440 934 -884 -721 833 -70 -1015 422 702 -1337 -161 970 -781 -763
7015g63J621q15j123J702R7j661N95J253j662k29J741m01j290J124N37j794P82
$$ -763 858 43 -1080 622 719 -942 -347 906 -756 -985 756 355 -935 189 726 -1068 -286
7032b86J466j555m06J623n13j391J380J00j479R42J327j933j64J659m36j079J339
$$ -286 1180 -375 -781 842 329 -1062 318 418 -1061 -119 1208 -725 -889 770 334 -745 594
7049E94K08j612O88J085j273k10J734m38j672J460N47j855P55J127j365k88J395
$$ 594 802 -810 -122 963 -310 -520 1214 776 -896 564 1111 -744 11 1138 -227 -515 880
7066H80n57r42J240K07j524Q49R60j438l17J500l18j382J300J06j498P30R60j322
$$ 880 323 -619 621 828 -696 153 1113 -325 -642 858 540 -842 458 564 -934 -204 756 -566
7084e66j34J643l28j613J341O43j493j53J695j146n60J616n96j115J128N14j800
$$ -566 -700 943 615 -998 343 986 -507 -660 1035 -111 -671 945 349 -766 362 876 -924
7101i24M64J361j198l54J474m31j358J318M88j947R67J173j534n59J646k28j448
$$ -924 -460 901 -297 -651 823 392 -966 352 840 -1107 -140 1033 -501 -1060 586 358 -1090
7118a090J129P03j413K58J213j256l21J406j15j580P57J280j875M76J167q74p48
$$ -1090 39 742 -671 -413 800 -456 -777 629 514 -1066 -309 971 -904 -428 739 -135 -883
7135h83J592j46j579J309O18j848L96J338q99q75J672k47j311Q71R46j786J99
$$ -883 709 563 -1016 293 911 -937 -541 797 -102 -977 695 448 -863 8 954 -832 -633
7152f33J736j674k17J640m08j522J113O90j100O1J513j217r04J546l48r96Q69
$$ -633 1103 -571 -788 852 444 -1078 35 725 -375 -314 1199 -18 -922 624 276 -720 149
7169A49P23j575J82J544q97j071J584J9j679J543M55j858O43J006q31p05J516
$$ 149 872 -703 -521 1023 126 -945 639 658 -1021 522 977 -881 -238 768 -63 -768 748
7186G48j39j491J024Q64j449j5J310o61r48J403j9j692J436P54j562r9J591j044
$$ 748 609 -882 142 1006 -443 -458 852 191 -757 646 627 -1065 371 1125 -437 -536 1055 11
7204A1p02J357J55j612J019R49j731m5J354o01j137J610J8j230O25Q48j369j80
$$ 11 -691 666 821 -791 228 1177 -554 -599 755 154 -983 627 645 -585 40 888 -481 -661
7222f61J527r97o32J127J38j290O23J146j513j34J511n04j108J220p7j508J145
$$ -661 866 -131 -763 364 502 -788 -165 981 -532 -666 845 341 -767 453 376 -1132 13
7239A3R19j219n49J858j110q63J188K61j711Q93J072j278p7J518j023p25R68N62
$$ 13 932 -287 -836 1022 -88 -951 237 498 -1213 -320 752 -526 -603 915 -108 -833 135 697
7257F97j782R31P86j126j75J225n60r09J589j20j651Q61R19j367k00J507m24q46
$$ 697 -1085 -154 632 -494 -669 556 -4 -913 676 556 -1095 -234 685 -682 -882 625 201 -645
7275f45J151K51j424N01R61j386r6J713j337p58J506L54j972R41J335j473j23
$$ -645 506 757 -667 -166 795 -591 -687 1026 -311 -1069 437 791 -1181 -240 1095 -378 -501
7292e01J221o83q66J128L43j530P48J090j306l93J670o40j226J310N47j607M20
$$ -501 720 37 -829 299 642 -888 -140 950 -356 -749 921 281 -945 365 912 -695 -275
7309b75J198j404l0J182l62j047J218O03j774K33J533r23n59J237k99j160J292
$$ -275 923 -481 -511 671 309 -738 480 1083 -691 -458 1075 152 -407 830 531 -629 663
7326F63k0j323N59J244j189n30J249m68j150J315N91j450L24J214j181o04J383
$$ 663 643 -680 -121 1123 -66 -596 653 185 -965 350 941 -509 -185 1029 -152 -756 627
7343F27l40j341J351O06j578L97J063j093l93J538o91o91R74K31j048k82J649
$$ 627 287 -1054 297 903 -675 -278 785 -308 -701 837 146 -545 429 660 -388 -670 979
7360I79j105m79J395n13j444J318P74j632M43J221j069n98J382m28j215J068M69
$$ 979 -126 -605 790 277 -1167 151 925 -707 -264 957 -112 -710 672 244 -971 97 566
7377E66j259L28J069j057j91J302p53j036J156N60j725P83J234j214p19J403N
$$ 566 -693 -365 704 -353 -544 758 5 -1031 125 685 -1040 -257 977 -237 -956 447 452
7394D52j432J107L75j135j63J415q86q44J573j51j483J314O16j668K62J422m84
$$ 452 -980 127 502 -633 -796 619 -267 -1111 462 311 -1172 142 758 -910 -648 774 290
7411B90j092J170k74j268J148P96j299K63R15r90p75J825j33j521J120P32j253
$$ 290 -802 368 94 -1174 -26 770 -529 -266 649 -341 -1116 709 576 -945 175 907 -346
7428c46q5J260p77q71J198K05j057P09P10j218j94J432j162o08J569m14j022Q64
$$ -346 -431 829 52 -819 379 584 -473 236 946 -272 -466 966 -196 -804 765 351 -671 193
7446A93O49j138l9J350j087r20J801l90j121O53R84j147k6J052o33q27J016R7
$$ 193 842 -296 -335 1015 -72 -992 809 419 -702 -49 935 -212 -238 814 181 -646 370 467
7464D67j525J352M33j131k3J418p71q50J345l63j116Q63R73j373M5R63n03r79
$$ 467 -1058 294 727 -404 -427 991 220 -630 715 352 -764 99 1072 -301 -256 707 204 -775
7482g75J342l09j042P91R16j138k03J061k39j100J230p5j363R42Q32j391j57J211
$$ -775 567 258 -784 7 923 -215 -418 643 404 -696 534 459 -904 38 870 -521 -678 533
7500E33l89j079J317L9j148M61J060j462J6J347n72p29P61K94j516J169N38r35
$$ 533 144 -935 382 421 -727 -266 794 -668 -652 695 123 -606 155 449 -1067 102 640 -295
7518b95k08J218p60r72J159K26j488J290P81j268m21J441l74j269J297J03j476
$$ -295 -503 715 -45 -1017 142 368 -1120 170 951 -317 -738 703 329 -940 357 460 -1016
7535a016J019Q11j306l20J570p24p74J368J42j759O86J146j280k66J173k90j111
$$ -1016 3 814 -492 -812 758 34 -740 628 770 -989 -303 843 -437 -703 470 180 -931
7552i31J383K53j498O42R30r40m90J117k10j157J358J88j259L46J069j254l63
$$ -931 452 705 -793 -151 779 -161 -651 466 256 -901 457 645 -614 -268 801 -453 -816
7569h16J560n17j010J228L43j599N26R25r68r4R42j83j421J381N24j454L91J236
$$ -816 744 227 -783 445 788 -811 -285 640 -328 -422 520 337 -1084 297 821 -633 -242 994
7587I94j092m51J548r13j082J231M69j357O77Q23j290k22J398m98j155J522K45
$$ 994 -98 -549 999 86 -996 235 704 -653 24 847 -443 -665 733 235 -920 602 847
7604H47j437L77Q39q72k24R55l21r72R98N74j541O26R75j237k61J358l97p76N98
$$ 847 -590 -213 626 -246 -470 485 164 -808 190 764 -777 -151 824 -413 -674 684 287 -489 109
7623A09N05j235M56P72q28k95J138j90j051P71K68j096K85R66q14n93J195k83
$$ 109 614 -621 -165 607 -221 -516 622 432 -619 152 420 -676 -391 575 -239 -832 363 80
7641H0j119R97K53r36K59R93q75m33J073j78r54Q77N23j203K52J202j196m49J517
$$ 80 -1039 -42 211 -725 -466 527 -348 -781 292 114 -840 37 560 -643 -391 811 -385 -834 683
7660F83o97j015J153N75j473L54J230j316m20J502m39q83J056M23j270M19J011
$$ 683 -14 -1029 124 699 -774 -420 810 -506 -926 576 137 -746 310 733 -537 -118 893
7677H93q08q71J228j37r88J143J07r46K0J057q52k35J003k33j042Q15N85j626
$$ 893 85 -786 442 305 -683 460 567 -379 -359 698 -154 -389 614 381 -661 154 739 -887
7695h87L78J279p56m27Q62l7j006P53Q92j592M47J187j123m17R64j71r72J011
$$ -887 -509 770 14 -413 449 412 -594 159 1051 -541 -94 1093 -30 -447 517 346 -626 385
7713C85N72j454L80P53m92p37J002M50j532N15J034j266J64R71n54p69J028n5
$$ 385 957 -497 -117 636 144 -593 409 859 -673 -158 876 -390 -226 745 191 -578 450 395
7731C95j114J099O78j377k18J310p11o72J212K8j270P14J12o10J94Q62l69j147
$$ 395 -719 380 1058 -319 -537 773 62 -610 602 630 -640 74 186 -424 -230 632 263 -884
7749h84J097K60j122N19R89j258l95J623j078n74J117%j358J195M94j173k18J501
$$ -884 213 473 -649 -130 859 -399 -794 829 -249 -823 294 294 -1064 131 625 -548 -766 735
7767G35p81r37J296K1q46L72P44r48l83J359n20j159J266K24j363R07N48j008
$$ 735 -46 -983 313 334 -512 -140 604 -344 -727 632 112 -1047 219 443 -920 -13 535 -473
7785d73j10J259o32p16J000J46j406P78P50r20j55Q09l81q16J287J68j101L25
$$ -473 -583 676 44 -672 328 474 -932 -154 596 -324 -479 330 -51 -867 420 588 -513 -188
7803a88R54r30k57Q54l11o59Q42R2q92L57R09j168LR58n53o71R74J10j124K11
$$ -188 766 -164 -421 433 122 -537 305 397 -495 -138 771 -397 -394 564 11 -660 314 424 -700 -489
7823d89J378j415lJ103l67j118J205j2p18N29N38q59m31J261j86j121R24L02j378
$$ -489 889 -526 -529 574 207 -911 294 282 -436 93 631 -228 -659 602 416 -705 219 521 -857
7842h57J051N74j071Q5J142q61r02J031M92j111N76R57j513j3J010k26r82J019
$$ -857 194 768 -303 -218 924 63 -839 192 684 -427 149 1106 -407 -420 590 364 -618 401
7860D01l1p29K41P37q93l04J235j30j082P47K30j016M03R44p70m01Q48j82j224
$$ 401 370 -359 -118 619 -274 -578 657 527 -555 192 422 -594 -191 753 -17 -418 430 248 -976
7879i76J340J19j131O26M67o58l99J163m05q58J118j8p48L27M93m78n06J040n93
$$ -976 364 483 -648 -22 445 -213 -612 551 146 -712 406 388 -360 -33 460 -18 -524 516 -77
7898g7p45Q96N99j105J62Q46n21q12J064k79p97R08M06j276K64R85n59n72Q85
$$ -77 -822 74 673 -432 -270 576 55 -757 307 28 -769 139 545 -731 -467 518 -41 -613 272
7917B72q0q35N53P43j108K01Q50q33k07R24m13r39J222K23j085M12N98q17j82
$$ 272 192 -643 -90 653 -455 -254 596 -237 -444 480 67 -872 350 573 -512 -100 498 -319 -501
7936e01Q08K5j057R28L90j390M79R54p83j81P81l6r83O69K76o88K61Q22j006p7
$$ -501 307 332 -725 203 593 -797 -318 636 -147 -328 453 417 -566 103 379 -309 -48 774 -232 -309
7956c09P90j57r16Q32L68q93J45P95o97j85O34j20n91N81J01p05j43J120n27n82
$$ -309 481 324 -592 240 608 -285 -140 655 -42 -227 407 287 -304 277 378 -327 -470 650 123 -459
7976d59P33K2p43N57N77r17m13J302p38n24R90k4j034P88M55p15j36P94n86o49
$$ -459 274 296 -447 110 687 -230 -643 659 -79 -603 387 363 -671 117 572 -143 -279 515 -71 -720
7996g20J067K16r35K90R59j538K74R18m96o65J083Rr82M01Q01j268jJ390j023
$$ -720 347 563 -372 -82 877 -661 -387 531 35 -630 453 462 -520 -119 682 -586 -587 803 -220
8015b20m34J061o7p81K31N04p23R1Q99n51m42P33k22p07O51K66n86l54J260o52
$$ -220 -654 407 340 -441 -210 294 -429 -338 561 10 -432 301 79 -628 23 289 -297 -651 609 -43
8035d3m71R91j15j202O17P40j062K5O10N9q06J088M4r44L46M80o55k51J046m02
$$ -43 -514 477 362 -840 -223 517 -545 -520 90 149 -657 431 475 -469 -123 357 -298 -549 497 95
8055I5o64N95L62j224O21O74q76j20R14m61n63J115J7j130Q31L56n15l77P42l40
$$ 95 -569 26 388 -836 -215 459 -417 -537 377 -84 -647 468 485 -645 186 542 27 -350 392 52
8075E2m21N53O0q66O33K79n49k12J128p08m50R36O8j157N91O19p16J6P39n62n74
$$ 52 -369 184 244 -622 11 290 -259 -471 657 -51 -501 435 503 -654 -63 556 -160 -144 595 33 -541
8096e41Q01K14q90M61N07q35k37J193m47p59O23L97o80J79M99o71j39N40l66n77
$$ -541 260 474 -416 45 552 -283 -520 673 226 -533 90 487 -193 -14 485 -186 -325 215 -151 -728
8116g28Q62J48p04L70Q09j235N4J073m55p78Q46K30p81N02L06m43k67N99j83n67
$$ -728 134 282 -422 -52 757 -478 -424 649 194 -584 262 492 -289 213 519 76 -191 408 225 -342
8136c42M49L29o13k7P88q18k89J028k81n66M86K73r50J27Q10n32j80O48r1q73
$$ -342 107 436 -177 -204 584 -234 -523 505 224 -342 144 417 -533 -406 404 -128 -308 340 249 -624
8156f24O69K28n36K72N32p19l91R51l87o21Q18K67q33R3Q47p50j95O81k93m53
$$ -624 45 273 -263 9 541 -178 -569 382 -5 -626 192 459 -374 -281 566 -184 -379 302 9 -444
8176d44J23O14n82k25J016o61l34O15o9p54Q77lm07N2O74
$$ -444 -321 293 -289 -514 502 -159 -493 122 53 -701 176 173 -234 -182 492
8191D92
$$ Imaginary data points
##PAGE= N=2
##DATA TABLE= (X++(I..I)), XYDATA
0@%%%%qQqJ6j6J6k4L3m1N4o7P7q8J06j30J55j78K06k41K79l18L63m16M72n35O05
$$ 0 0 0 0 0 -8 0 -8 8 -8 8 -16 17 -24 30 -37 40 -48 58 -72 83 -95 111 -130 149 -169 194 -222 250 -285 320
30C20o78P60q53R56j069J188j318J467j629J804j998K212k447K709l004L333l701
$$ 320 -358 402 -451 505 -564 624 -694 773 -856 948 -1050 1162 -1285 1424 -1580 1753 -1948
47a948M123m613N181n851O657p651Q911j0559J2824j6147K1493l1463N6115k22368
$$ -1948 2175 -2438 2743 -3108 3549 -4102 4809 -5750 7074 -9073 12420 -19043 37072 -185296
61a85296l43494O12843L26301l41093l16560J21753K10176O7102j84324j51684
$$ -185296 -528790 84053 410354 69261 -247299 -125546 84630 151732 -32592 -184276
71a84276J90890J82651k76816j61571L46952J59836l49625j31807K63021J11418
$$ -184276 6614 189265 -87551 -249122 97830 257666 -91959 -223766 39255 150673
81A50673j30652j08797m0298J18260J70576j37605k34686J71243K24329j78385
$$ 150673 20021 -88776 -129074 -10814 159762 22157 -212529 -41286 183043 4658
91D658j35183J82648J9186j78738M6604J45611m3992q2746l8068p449J55043J04342
$$ 4658 -130525 52123 71309 -107429 -60825 84786 40794 -41952 -80020 -87469 67574 171916
103A71916k35533j40182K78192J12602k79186n0999K40331j1960j88725J1721
$$ 171916 -63617 -203799 74393 186995 -92191 -143190 97141 85181 -103544 -91823
113i1823J17186P0677p794j76506r4475K67274J66778k98708j81180K51712J20847
$$ -91823 25363 96040 88246 -88260 -182735 84539 251317 -47391 -228571 23141 143988
124A43988j66679l2803P5532k3180J4205K8925p4615K8282J09467j13902j13194
$$ 143988 -22691 -55494 20038 -3142 11063 39988 -34627 -6345 103122 -10780 -123974
135a23974J77869P2991k07178j4040J88893l3756j19716N9059L6570l6444M6588
$$ -123974 53895 126886 -80292 -94332 94561 60805 -58911 148 36718 274 46862
146D6862j6378r8971O8400P5552j27455J448J82962q8949k13925J45983K18727
$$ 46862 30484 -68487 -87 75465 -51990 -50542 132420 43471 -170454 -24471 194256
157A94256j26932j73330M1095Q3829O1699o628j61574l3880K33108K8033k64250
$$ 194256 67324 -106006 -64911 18918 80617 73989 -87585 -121465 111643 139676 -124574
168a24574R405K59109l1362k03467J7052R9246J9782P436p6175q7951J30066J07649
$$ -124574 -115169 143940 112578 -90889 -73837 25409 45191 52627 -23548 -111499 18567 126216
180A26216j77412o7389K19932J7591k27740P653J76262n036q7106l0437k2518
$$ 126216 -51196 -118585 101347 118938 -108802 -101149 75113 70077 -17029 -47466 -69984
191f9984P4942J02328j16102j13943J60389P5421j91063j7639J85830l7745j47483
$$ -69984 4958 107286 -8816 -122759 37630 113051 -78012 -95651 90179 52434 -95049
202i5049N6229P4410m1728L366J274m6585O8562M9537j44805k0855K01740j8691
$$ -95049 -38820 35590 -6138 -2772 -1498 -48083 20479 70016 -74789 -95644 106096 87405
214H7405k17978L7458J70366l7050p9525K0642r056K4108P3256q2866r1216J42532
$$ 87405 -130573 -93115 77251 40201 -39324 -18682 -27738 -3630 69626 -13240 -104456 38076
226C8076O7304j87371l2893J83094Nj23270K6505L8676k6578M5041K765q9362
$$ 38076 105380 -81991 -114884 68210 68215 -55055 -28550 10126 -16452 28589 31354 -58008
238e8008M6620Q5297j15333n5997J67276J9228j68213J6389J19298l8425l1903
$$ -58008 -11388 73909 -41424 -97421 69855 89083 -79130 -62741 56557 18132 -13771
249a3771M9156m4196l5718P9160j2629p2879P5838L3913j26165J7541J45403n7073
$$ -13771 35385 -8811 -44529 34631 22002 -50877 24961 58874 -67291 -49750 95653 38580
261C8580j11114Q5351N0135q8828L675N1421l7937J6642M3008r4413k4446J53029
$$ 38580 -72534 12817 62952 -25876 -22201 29220 -8717 7925 50933 -43480 -67926 85103
273H5103L65j56948L2496J11910o3911m7609P0928j4468m4676N0128j4941n6818
$$ 85103 85468 -71480 -38984 72926 9015 -38594 32334 17866 -26810 23318 8377 -48441
285d8441Q7531M2941j33062p826J35793l8659j01821P5049M4404q7641N132N4867
$$ -48441 39090 82031 -51031 -58857 76936 38277 -63544 11505 55909 -31732 -26600 28267
297B8267l7375J6427N5062q7997n0378J29380J8839j29570K7835Q6798p7152l6343
$$ 28267 -9108 7319 62381 -25616 -75994 53386 72225 -57345 -29510 57288 -19864 -56207
309e6207R6656m384o5369L2583l328m3602Q1373L3427j37346r682J44744l0920
$$ -56207 40449 36065 -29304 3279 -49 -43651 37722 71149 -66197 -75879 68865 37945
321C7945j14182O5435O2904p0774p459L8758l5864K3554O0726q8688o2671J22937
$$ 37945 -76237 -10802 52102 -18672 -26131 12627 -23237 317 61043 -27645 -90316 32621
333C2621K9688j23948K0242R6442o1643m8470P3723o86m3812M5675j5996p6555
$$ 32621 62309 -61639 -41397 55045 -6598 -55068 18655 17969 -25843 19832 3836 -72719
345g2719O9506P4703j00310l7600J01797j6702p6110O5829L9821p9745M642M8345
$$ -72719 -3213 71490 -28820 -66420 35377 18675 -57435 8394 48215 -31530 -26888 21457
357B1457m9579N411P9606n7662p6652Q8777L9170r1325K2954P7763p0696m7761
$$ 21457 -28122 -22711 56895 -767 -77419 11358 50528 -40797 -17843 59920 -10776 -58537
369e8537Q0154L809n0578M0388l810p0709N9587P2300r2054l4145J03587j8284
$$ -58537 21617 25426 -25152 15236 11426 -59283 304 72604 -19450 -53595 49992 31708
381C1708r0973N8622N3883o7975k427M2928n1129K325Q6574m2351p9396P3787
$$ 31708 -59265 -643 53240 -14735 -17162 25766 -25363 -23038 63536 21185 -58211 15576
393A5576L4748q8295K3488Q0855o6368n0830P4623o22n0973N5770J3807q4955
$$ 15576 50324 -37971 -14483 66372 4 -50826 23797 23175 -27798 27972 41779 -43176
405d3176K7023P5801o0050l0567P7496k8838p7954O8610N0805p6606L77N7815
$$ -43176 -16153 59648 -402 -30969 46527 17689 -60265 8345 59150 -17456 -17079 40736
417D0736n0881k1244P7650j9466o6926N5545K0776q5169K9598Q9922o1784o2182
$$ 40736 -10145 -31389 46261 26795 -40131 15414 36190 -48979 -19381 70541 8757 -53425
429e3425O7732J1515m9385M1640J4851p1794K4662O2354o6374k6780R3817j7037
$$ -53425 14307 25822 -23563 18077 32928 -38866 -14204 48150 -18224 -45004 48813 31776
441C1776r4491M7872O2574n6885o518M7163m8003k3512P0820j6491o0667N9733
$$ 31776 -62715 -14843 47731 -9154 -15672 31491 -16512 -40024 30796 14305 -46362 13371
453A3371K4956r1640J6005R5447m4619o1000N6662L900n5176M6234L1693o9438
$$ 13371 38327 -53313 -37308 58139 13520 -47480 9182 13082 -42094 4140 35833 -33605
465c3605P809N8031n2735k3875Q8816j4984r2187M4426N9550o0926o583N8718
$$ -33605 -25796 32235 -20500 -44375 44441 29457 -62730 -18304 41246 -19680 -26263 32455
477C2455m1402l7603O3986n195n4085N7647K6957r1999N953R3804l5099o0779
$$ 32455 -8947 -46550 17436 12241 -41844 15803 42760 -49239 -43286 50518 15419 -45360
489d5360N2679O949n4265M1254L3433o1191R862N8969n8672l5921R1335L425r1542
$$ -45360 7319 14268 -39997 1257 34690 -26501 -16639 42330 -16342 -52263 39072 42497 -49045
502d9045K7674N8583n0580q193N7204l2321l6005N3801p582n2870N8674L4846
$$ -49045 -21371 37212 -13368 -21561 35643 3322 -32683 21118 13536 -39334 19340 54186
514E4186q9691n677Q6905k9250n4847N9071J2894o6498K4620M4844m3178K510
$$ 54186 -35505 -41182 45723 16473 -38374 20697 33591 -32907 -8287 36557 -6621 -4111
526d111M5782n5871l4861Q6161R424q2164K6142N1756n6646r442O8007k4370m6474
$$ -4111 41671 -14200 -49061 37100 46524 -35640 -9498 42258 -14388 -23830 44177 19807 -26667
539b6667M1817l325m8618N7753M0462q9159j7772Q6091j6155n4822M8418J2897
$$ -26667 15150 11825 -36793 20960 61422 -27737 -45509 40582 24427 -30395 18023 30920
551C0920n9893K2942L9826m6449K836N0982n0966l8651Q1992R034q4520K9377
$$ 30920 -28973 -6031 33795 -12654 -9818 41164 -9802 -48453 33539 42573 -41947 -12570
563a2570O3555n9267l0267O1314q385l6372L9193o948n5418M7532M6499o8860
$$ -12570 50985 -8282 -38549 22765 14380 -21992 17201 10253 -45165 2367 48866 -19994
575a9994j1116P0426l7115n9010O8898L6024o9436o003L4909k6948J5652N0971
$$ -19994 -31110 39316 2201 -56809 12089 48113 -21323 -27326 7583 -19365 -3713 47258
587D7258n8681n1892P9077K4599p6260J8708N6780n6409l0535O4120M85l9085
$$ 47258 -11423 -63315 15762 40361 -35899 -17191 39589 -16820 -47355 16765 17250 -21835
599b1835K8451l994m5646M7785M2120p4634j6969P8476k1645o3081N2258L3173
$$ -21835 6616 2622 -43024 4761 46881 -27753 -44722 33754 12109 -50972 1286 34459
611C4459n9719N674M3126l7837r822N3391k6975m3101N4382J0054o6567L0131
$$ 34459 -25260 -19586 23540 -14297 -24119 29272 2297 -40804 13578 23632 -42935 -12804
623a2804O2443n7132l8369O0405K179l9024L5690N559n4561K8738M5251n7917
$$ -12804 49639 -7493 -45862 14543 16722 -22302 13388 18947 -35614 -6876 38375 -19542
635a9542j0808P5542k8839p4408N4917N3615n2760j3571L0800k9752l2N3478l0364
$$ -19542 -30350 45192 16353 -58055 -3138 50477 -2283 -15854 14946 -14806 -14838 38640 8276
648H276m5311N6425J1606p1344L0024P0996n5094m8555N6474O438l8769L7363
$$ 8276 -37035 19390 30996 -40348 -10324 60672 5578 -42977 13497 19935 -18834 18529
660A8529J3455o1159J4148N2493l8817j8392N6273k0852n6105M8614L1697n5453
$$ 18529 31984 -29175 -15027 37466 -1351 -19743 36530 15678 -40427 8187 39884 -15569
672a5569P106M3934m4854k1126O1775q792n0587L9973J9300o0951J6498O1538
$$ -15569 -8463 35471 -9383 -30509 31266 22474 -28113 11860 31160 -29791 -13293 48245
684D8245m5615m0340N6356N553m9106K4444K3661l6430J5326K8852n7403r148
$$ 48245 2630 -37710 18646 24199 -24907 -463 23198 -13232 2094 30946 -26457 -35605
696c5605Q0815j4082p5672L3815M2118m8516J493N0504l4887l4825M4777l77l1727
$$ -35605 45210 31128 -44544 -10729 31389 -17127 -15634 34870 -17 -34842 9935 9558 -22169
709b2169M2069Q574p4772J1612P6050k5315m4664L2294n796l1639N0904K1358
$$ -22169 19900 28474 -46298 -34686 41364 16049 -28615 3679 -2117 -33756 17148 38506
721C8506p0595l43N9090k9823k8119N3558q561n8647L8757M1483n3443p609M7688
$$ 38506 -32089 -32432 26658 -3165 -31284 22274 13713 -44934 -6177 35306 -18137 -25746 21942
734B1942k5427k6169M5325p486m4069M0674K4504n9513O238N6208l9509l2403
$$ 21942 -3485 -29654 15671 8185 -35884 4790 29294 -30219 -23981 32227 -7282 -39685
746c9685O4912N151o9408J6270M5112k6982O47K7890m6450k0526P1985N517o4143
$$ -39685 25227 30378 -39030 -22760 22352 -4630 -3983 23907 -22543 -43069 28916 34433 -29710
759b9710J9578L2900m3985K540N4217k7822l7317L8142j420l5676M6722K6821
$$ -29710 -10132 22768 -21217 -18677 35540 7718 -29599 8543 7123 -28553 18169 44990
771D4990p3013r630O9547j4295m0931L7809M719m6792K5062L4846m1956m191M3294
$$ 44990 -28023 -37653 31894 17599 -23332 14477 19196 -27596 -2534 32312 -9644 -13835 29459
784B9459k8297k6600M8947l085n0737L7963L5757o2861j2508O5407j3227m1977
$$ 29459 1162 -25438 23509 20424 -30313 7650 43407 -19454 -31962 33445 20218 -21759
796b1759L4940N924m4473K6183L5382m3677p158M2431l0234k9631N9439R826o2866
$$ -21759 13181 19105 -25368 815 36197 -7480 -14638 27793 -2441 -32072 27367 37193 -25673
809b5673J2254L8727l2592M38M2709l7382l6469N8128J1639n9483K0225M3562
$$ -25673 -13419 25308 -7284 -6846 35863 -1519 -37988 20140 31779 -27704 -7479 36083
821C6083m5036j7932M9250j1455l1609L6026Rm7846K9048L8198m7050j0102M8819
$$ 36083 -8953 -26885 22365 10910 -20699 15327 15336 -32510 -3462 34736 -12314 -22416 26403
834B6403k6108l6844N2304J4884n6800J2361L8035m0049q602N3895j8428m6200
$$ 26403 295 -36549 15755 30639 -26161 -13800 24235 -15814 -24416 29479 11051 -35149
846c5149L4145J6964l6924K0371K8115m8993r385N4358j6355l8015M1228Q661
$$ -35149 -1004 15960 -20964 -593 27522 -21471 -30856 23502 7147 -30868 10360 19021
858A9021n4134J9900M5564l9323j7865M7019j6251m0404M0697J9148m5764J1466
$$ 19021 -35113 -15213 30351 -8972 -26837 20182 3931 -36473 4224 23372 -22392 -10926
870a0926L3021l9925j0017N2099j4357l9373L6026R704m8934K1989M6660m2201
$$ -10926 22095 -17830 -27847 24252 9895 -29478 6548 16252 -32682 -10693 35967 -6234
882f234k3690M4677j1407l2231M4946J3886n8650O953M6079k6724j3554M0849
$$ -6234 -29924 14753 3346 -28885 16061 29947 -28703 -21750 24329 -2395 -15949 24900
894B4900k0036m0886M1915K2217m5156J0922L3863m1138j3606N5424j0446m4912
$$ 24900 4864 -36022 5893 28110 -17046 -6124 27739 -13399 -27005 28419 17973 -26939
906b6939L3859J6673m6482J4014M3945l7198k2070M6868r206l9855L6118K1139
$$ -26939 6920 23593 -22889 -8875 35070 -2128 -24198 22670 13464 -26391 9727 30866
918C0866m6415O020L6077l3481j1971N0117j4307m6209L4766K1789m4087J1635
$$ 30866 -15549 -9529 26548 -6933 -18904 31213 16906 -29303 5463 27252 -16835 -5200
930e200M0735l8071k5182M7395k399l7254L1857J4909n0352Q736M8026k7848k3573
$$ -5200 35535 -2536 -27718 19677 17278 -19976 11881 26790 -23562 -14826 33200 5352 -18221
943a8221L7175j0459l6663L7748K1983m7730L614L7890l3057j6116N1378o842
$$ -18221 18954 8495 -28168 9580 31563 -16167 -12553 25337 -7720 -23836 27542 20700
955B0700n1012K6573K7191l8795N328L8268l2392k3543M3561l518l8311L2122
$$ 20700 -30312 -3739 23452 -15343 -10015 28253 -4139 -27682 15879 12361 -25950 6172
967F172J9614m9292M008M4807k7190k2268M3508q560m5758L2087K9655m2801M3
$$ 6172 25786 -23506 -19498 25309 -1881 -24149 19359 10799 -34959 -2872 26783 -16018 -15975
980a5975L8986l1018k4105M7751K003m2927K1863J9068m0501R885M4955l2864
$$ -15975 23011 -8007 -32112 15639 17642 -25285 -3422 15646 -24855 -14970 29985 -2879
992b879k9258M3655p02m1822L0908K8321m7018n487M2387k0402k1151M1269n821
$$ -2879 -32137 11518 10816 -31006 -98 28223 -18795 -24282 18105 -2297 -23448 17821 12000
1005A2000m5854K8290L0451l9797l39L9921k8742k8685M4939O531m1016K1238
$$ 12000 -33854 -5564 24887 -14910 -15249 24672 -4070 -32755 12184 18715 -22301 -1063
1017a063K1560m2123M133M7336k5405l1738L9312L278m2068K5137L0710l9228
$$ -1063 20497 -21626 -17493 29843 4438 -27300 12012 15290 -26778 -1641 29069 -10159
1029a0159o024L7166k2494k1876M4725L68m7872K1199L0774l6981j467M2988k4837
$$ -10159 -16183 20983 -1511 -23387 21338 21706 -26166 -4967 25807 -11174 -12641 30347 5510
1042E510l3896L8745R694l5722K0857K1639m3790j224M8298j9953l2361L7818
$$ 5510 -28386 10359 20053 -15669 5188 26827 -16963 -18187 30111 10158 -22203 15615
1054A5615L351m3904K3169L4531l7676r907L8100k0729k5651M2078N222m5782
$$ 15615 18966 -24938 -1769 32762 -4914 -14821 23279 2550 -23101 18977 24199 -21583
1066b1583J8949K9025l8276l189M6627k1779l6053L5321R536l7526K0707K8171
$$ -21583 -2634 26391 -11885 -15074 31553 9774 -26279 9042 18578 -18948 1759 29930
1078B9930m2484q793M4130j5975k8729L7578M016m6470J8771L5895l3650j0153
$$ 29930 -12554 -21347 22783 6808 -21921 15657 19673 -26797 -8026 27869 -5781 -15934
1090a5934L7689k0928k9979M0161J0996m3057J5668K8250l8928o489M7905j4892
$$ -15934 21755 827 -29152 11009 22005 -21052 -5384 22866 -16062 -22551 25354 10462
1102A0462l8109K9955J0762l5765J9012K9609l8348j1241M1019j5816k9611L9821
$$ 10462 -27647 2308 13070 -22695 -3683 25926 -12422 -23663 17356 1540 -28071 11750
1114A1750R566m9009J1549L7996k8877j2196L6767j5814l1599L4432J2263l8147
$$ 11750 21316 -27693 -16144 21852 -7025 -19221 17546 1732 -29867 4565 16828 -21319
1126b1319J6139K8428m0342j0926M8743r155l7572K8126J2028l7950J5041L4337
$$ -21319 -5180 23248 -17094 -28020 20723 11568 -26004 2122 14150 -23800 -8759 25578
1138B5578l3122j4157L8107j4441l0650L9338J4104m7448P790L6682k7798j2764
$$ 25578 -7544 -21701 16406 1965 -28685 10653 24757 -22691 -14901 21781 -6017 -18781
1150a8781L9497j2726l4878L1656J3699l8069J5812L3820l9376j8613M7154m180
$$ -18781 20716 7990 -26888 4768 18467 -19602 -3790 30030 -9346 -27959 19195 15015
1162A5015l5389K6812J3752l9374R933L5546k7985j3474L6795j5930l4667L9482
$$ 15015 -20374 6438 20190 -19184 -9251 26295 -1690 -15164 21631 5701 -28966 10516
1174A0516K0422m5884L240L6486k7450j6693M0900n309l5999K4034J3827l4318
$$ 10516 30938 -14946 -11706 24780 -2670 -19363 21537 16228 -19771 4263 18090 -16228
1186a6228J5304L4126l7930k1203M4835k089l6239K6408J8277m0131L088L5121
$$ -16228 -924 33202 -4728 -25931 18904 16815 -19424 6984 25261 -14870 -11782 23339
1198B3339k2327j3877L4333j4100l4710L5540K1539m4521J767L8640k6217k2016
$$ 23339 1012 -12865 21468 7368 -27342 8198 29737 -14784 -13017 25623 -594 -22610
1210b2610L8211l24l3200K2104J3069l6511J1441L7164l1923k2471M0528l735
$$ -22610 15601 15277 -17923 4181 17250 -19261 -7820 29344 -2579 -25050 15478 11743
1222A1743l7731K8746K4051m0713l408L3569j9812j3543L6710j0775l9733K9579
$$ 11743 -25988 2758 26809 -13904 -17312 16257 -3555 -17098 19612 8837 -30896 -1317
1234a317K4184l8638K222L7460k8639k6146M0224O807l3287J5898J2491l4533
$$ -1317 22867 -15771 -13549 23911 -4728 -30874 9350 16157 -17130 -1232 11259 -23274
1246b3274J2401L8590l2503k5146M2626r6m1205K4533K9237l7312p692L2767j6140
$$ -23274 -10873 27717 -4786 -29932 12694 12598 -28607 -4074 25163 -12149 -19841 12926 -3214
1259c214j5781L3679o223l6030K7405K1433m0337K138M2126k3988k9533L5262
$$ -3214 -18995 14684 8461 -27569 -164 21269 -19068 -16930 25196 1208 -28325 6937
1271F937N390l1942K1143J9781l9105j475L9937j7890k2776L3548k273l8563K4415
$$ 6937 12327 -19615 1528 21309 -17796 -19271 20666 2776 -20000 13548 11275 -27288 -2873
1284b873K9793l4285p590L1765j8767j9121L7358P68l7978K0668K2118l7244J553
$$ -2873 26920 -7365 -14955 16810 -1957 -21078 16280 17048 -20930 -262 21856 -15388 -13835
1297a3835M4007k2467l5211L3837J3174l1911J2754K0452l1624j29L3590k1959
$$ -13835 30172 7705 -27506 6331 19505 -12406 348 20800 -10824 -10953 22637 678
1309F78j9426L9277j260m5443K1496L5046l2983j1755L3703j5534k2894L3524
$$ 678 -18748 20529 19269 -26174 -4678 30368 -2615 -14370 19333 3799 -19095 14429
1321A4429M224l6566J8499K4364l6885m145M1459j5485l0229K9257O265l2675
$$ 14429 18653 -17913 586 24950 -11935 -16080 25379 9894 -20335 8922 15187 -17488
1333a7488J8647K5063l5207o970L5921j7557k3045L7356L436m4192J5341L4175
$$ -17488 1159 26222 -8985 -15955 19966 2409 -20636 16720 20156 -24036 -8695 25480
1345B5480l0027j1766L4913j2881k7636K7571Q105k8922J6878J9118l9210k858
$$ 25480 -4547 -16313 18600 5719 -21917 5654 13759 -15163 1715 20833 -18377 -21235
1357b1235M6005j5622l4155K9084J1275l5651J2468K8987k7630r901K9794j6580
$$ -21235 24770 9148 -25007 4077 15352 -20299 -7831 21156 -6474 -16375 13419 -3161
1369c161k2205L9497Q031m7205Q443L5216k1915j2071K8226j2853k3144L0561
$$ -3161 -25366 14131 22162 -25043 -16600 18616 -3299 -15370 12856 3 -23141 7420
1381G420N276l5299J7907K8566l7157j1638M2577j0093l2193K8847J2759l6781
$$ 7420 12696 -22603 -4696 23870 -13287 -24925 17652 7559 -24634 4213 16972 -19809
1393a9809P226L0313k3301r078L0077j6078k5434L3903J1025l7110J1310K6426
$$ -19809 -12583 17730 -5571 -14649 15428 -650 -26084 7819 18844 -18266 -6956 19470
1405A9470l2929p701M3893j0137l7434K3837J6032k9388J1433K5538l1954j1913
$$ 19470 -13459 -21160 22733 12596 -24838 -1001 15031 -14357 -2924 22614 -9340 -21253
1417b1253L9470q670l0434K7877J3064l7121P426L0538k2923r643L0708j5870
$$ -21253 18217 9547 -20887 6990 20054 -17067 -9641 20897 -2026 -11669 19039 3169
1429C169k7588L5427J3841m1446P160L4211k7069j7037L6630k676l0553J9843
$$ 3169 -24419 11008 24849 -16597 -9437 24774 -2295 -19332 17298 14622 -15931 3912
1441C912J2570k9476J0077K7274k7791j2249L4899j1237k8878L1619J4988m1108
$$ 3912 16482 -12994 -2917 24357 -3434 -15683 19216 7979 -20899 10720 25708 -15400
1453a5400L416L4440k1757j5876L3367n950l2695K2240J6990k8827P830K5576
$$ -15400 -11984 22456 699 -15177 18190 12240 -20455 1785 18775 -10052 -2222 23354
1465B3354l0676j5273L9965n61l2858J7899J2572l0369J0392L0219k8534j6183
$$ 23354 -7322 -22595 17370 16809 -16049 1850 14422 -15947 -5555 24664 -3870 -20053
1477b0053L6624o317l4870K6882K2026l5981l250K9815j7381j3214L0921p304
$$ -20053 16571 10254 -24616 2266 24292 -11689 -14939 14876 -2505 -15719 15202 7898
1489G898l0325K4129J4116l3436P978L3434k7238k2233L4992J318k9501K1131
$$ 7898 -22427 1702 15818 -17618 -9640 23794 -3444 -25677 9315 10633 -18868 2263
1501B263J3906l5996M869L5695k1096k0790L1259k198l1262K1953J9993l1608
$$ 2263 16169 -19827 -14958 20737 -359 -21149 10110 7912 -23350 -1397 18596 -13012
1513a3012K08K8306k1190j5211L4133k782l2853K0887J7477l3626M235L6172k2374
$$ -13012 -12804 15502 -5688 -20899 13234 10452 -22401 -1514 15963 -17663 -13428 22744 370
1526C70k4633L0415M292k8372J8323J7729l2610m92L1868j6967j6842L0452m065
$$ 370 -24263 6152 10444 -17928 395 18124 -14486 -14978 16890 -77 -16919 13533 9468
1539I468l3135K2387K2484l0971j697K9599j9781j9277L4697J569l3682J7129
$$ 9468 -23667 -1280 21204 -9767 -11464 18135 -1646 -20923 13774 15343 -18339 -1210
1551a210K0453l1018r63L4687j6823k2885K6778J676k6825K0240J8203l3423j208
$$ -1210 19243 -11775 -12738 21949 5126 -17759 9019 10695 -16130 4110 22313 -11110 -12318
1564a2318L2117j8099j7965L2831m27l6914J8062K5886k8949m877L1287j6667
$$ -12318 19799 1700 -16265 16566 16139 -20775 -2713 23173 -5776 -10653 20634 3967
1576C967k2587K8585N446k8141J5993J5856l1455N49L4645j6790k3253K9086J741
$$ 3967 -18620 9965 15411 -12730 3263 19119 -12336 -11787 22858 6068 -17185 11901 13642
1589A3642l3161J8410K6179l0367p910K9308j4053j9171L0713L173l4816J3153
$$ 13642 -19519 -1109 25070 -5297 -13207 16101 2048 -17123 13590 16763 -18053 -4900
1601d900K3592k5803l640K9490j5825k2758K7374M802k8177J5923K0052l2279
$$ -4900 18692 -7111 -10751 18739 2914 -19844 7530 12332 -15845 78 20130 -12149
1613a2149n239L5138j1733k4982K5948O078l1853J1754K5076k4252o442K6456
$$ -12149 -17388 17750 6017 -18965 6983 13061 -18792 -7038 18038 -6214 -12656 13800
1625A3800j5594k0017L1453N648l3919J0810K3737k6179n449L2208j2740k4978
$$ 13800 -1794 -21811 9642 15290 -18629 -7819 15918 -10261 -15710 16498 3758 -21220
1637b1220K4658O928k8742J4643K3037k9498r081L2489r404k2898K5061O402l1947
$$ -21220 3438 10366 -18376 -3733 19304 -10194 -19275 13214 3810 -19088 5973 12375 -19572
1650a9572J1478K4747k3835o365K8684j5066k3980L0030J0171l2137Q496K4111
$$ -19572 -8094 16653 -7182 -13547 15137 71 -23909 6121 16292 -15845 -7349 16762
1662A6762k5496p505L1985r375k4689K2499P341k8604J3457K4955k7315j0883
$$ 16762 -8734 -16239 15746 6371 -18318 4181 11522 -17082 -3625 21330 -5985 -16868
1674a6868L0434q385k3125K5698R076l1588P647K4440k1456p320K9790j2569k6398
$$ -16868 13566 5181 -17944 7754 16830 -14758 -7111 17329 -4127 -11447 18343 5774 -20624
1687b0624K5727J3055k9527P455K3296k4814j0058L1442n811k4130K0341P792
$$ -20624 5103 18158 -11369 -3914 19382 -5432 -15490 15952 10141 -13989 6352 14144
1699A4144k8455J0805K5891k4127j2066K8593p206k4892K4691J3103l1637L997
$$ 14144 -14311 -3506 22385 -1742 -13808 14785 7579 -17313 7378 20481 -11156 -7159
1711g159K5028j9903r870K8851p968k6154K1298J2047k7273P720K4670k4990j3322
$$ -7159 17869 -2034 -11904 16947 8979 -17175 4123 16170 -11103 -3383 21287 -3703 -17025
1724a7025L0671l619k4305J9591J0401k9583O126K7132k0639j2501K7293p232
$$ -17025 13646 10027 -14278 5313 15714 -13869 -7743 19389 -1250 -13751 13542 6310
1736F310k6777K4059J5664k9697J006K3876j8566j0592K8703o464k6234K0381
$$ 6310 -20467 3592 19256 -10441 -9435 14441 -4125 -14717 13986 7522 -18712 1669
1748A669J1913k8635P258K8106k2877j7719K8353k22k3920J8078J1024k7615M146
$$ 1669 13582 -15053 -7795 20311 -2566 -20285 8068 7846 -16074 2004 13028 -14587 -10441
1761a0441K5527j9532j1880K8977o405k8827K0917J8184k7104j31K3506j7808
$$ -10441 15086 -4446 -16326 12651 6246 -22581 -1664 16520 -10584 -10715 12791 -5017
1773e017j3100K8206j820k5682J7549J2092k7690M854K8876j8940j8283K5504
$$ -5017 -18117 10089 8269 -17413 136 12228 -15462 -10608 18268 -672 -18955 6549
1785F549L41k3553J7664J4611k7774K83K5664j6231j3328K8200k792k9052J6536
$$ 6549 6890 -16663 1001 15612 -12162 -11879 13785 -2446 -15774 12426 9634 -19418 -2882
1798b882J9171k4516n34K4079j7332j4884K6709O13k4609J6403J3708k8637J935
$$ -2882 16289 -8227 -8761 15318 -2014 -16898 9811 10424 -14185 2218 15926 -12711 -10776
1811a0776K9741j5419j8718K3710P80k4410J6985J6588k6168o78K3948j5889j4076
$$ -10776 18965 3546 -15172 8538 9318 -15092 1893 18481 -7687 -8365 15583 -306 -14382
1824a4382K8557o32k9293J4430J8630k4232j91K5411j5721j8805K5293L204k3790
$$ -14382 14175 13543 -15750 -1320 17310 -6922 -7113 18298 2577 -16228 9065 12269 -11521
1837a1521J4801J3811k7157%K8379j3898j8127K4230R95k6818J4850J9285k3484
$$ -11521 3280 17091 -10066 -10066 18313 4415 -13712 10518 11513 -15305 -455 18830 -4654
1850d654m074K3131j3791j5352K6135K143k7566J2543J7470k3931k311K7257j2986
$$ -4654 -8728 14403 612 -14740 11395 13538 -14028 -1485 15985 -7946 -10257 17000 4014
1863D014k0003K2133L525k3212J4288J6229k6202m145K7413j1175j8147K3273
$$ 4014 -15989 6144 9669 -13543 745 16974 -9228 -13373 14040 2865 -15282 7991
1875G991K826k6883J0612J9753k0028l828K2429j4220j7100K6006L880k6660J1077
$$ 7991 10817 -16066 -5454 14299 -5729 -9557 12872 -1348 -18448 7558 11438 -15222 -4145
1888d145J8367k3963m540K7694r243k0832J9067M683k1841J2606J7250k4556n110
$$ -4145 14222 -9741 -14281 13413 4170 -16662 2405 7088 -14753 -2147 15103 -9453 -14563
1901a4563K5896j0610j7934K3865M812k7766R120K0200j9849m415K4116j2451
$$ -14563 11333 723 -17211 6654 11466 -16300 -7180 13020 -6829 -11244 12872 421
1913D21j9143K3599O353k5242R866J8462k2435o276K6317p255j9007J9123M315
$$ 421 -18722 4877 11230 -14012 -4146 14316 -8119 -14395 11922 4667 -14340 4783 9098
1926I098k4217J1651K0084k1743p134K3912r541j8544K4038P433k7201N299K0346
$$ 9098 -15119 -3468 16616 -5127 -12261 11651 2110 -16434 7604 15037 -12164 -6865 13481
1939A3481j6995n960K3477r582j9310K0016O707k3180J0150J8612k2663q237K6264
$$ 13481 -3514 -9474 14003 4421 -14889 5127 11834 -11346 -1196 17416 -5247 -13484 12780
1952A2780m530j9779J7749O159k4109Q144K0843j8957q256K3460q539j9657K0616
$$ 12780 8250 -11529 6220 12379 -11730 -3586 17257 -1700 -9956 13504 4965 -14692 5924
1965E924J0416k4484L372J8939j7215o565K4050o812k0945J7530Q211k2795P757
$$ 5924 16340 -8144 -4772 14167 -3048 -9613 14437 7625 -13320 4210 12421 -10374 -2617
1978b617K0673k0257j0912K4549m296k0024J8282R446k5258L196K1063j4686q185
$$ -2617 18056 -2201 -13113 11436 7140 -12884 5398 14844 -10414 -7218 13845 -841 -9026
1991i026K1231p885k0401K0027J0544k3917L893J9550j8251r038K5051m473k1690
$$ -9026 12205 4320 -16081 3946 14490 -9427 -5534 14016 -4235 -13273 11778 7305 -14385
2004a4385J6127R286k3353N755K2227j7327j2983K1494j892j8799J6021R706k3423
$$ -14385 1742 11028 -12325 -6570 15657 -1670 -14653 6841 4949 -13850 2171 11877 -11546
2017a1546L320J9622j6032q519K4378n648k3646J6506J3869k2153K053J9931j6319
$$ -11546 -8226 11396 -4636 -13155 11223 5575 -18071 -1565 12304 -9849 -7796 12135 -4184
2030d184j2356K4265j7k1602J2837J0525k0305K401K0382j4818j0363K1345l756
$$ -4184 -16540 7725 7708 -13894 -1057 9468 -10837 -8436 11946 -2872 -13235 8110 4354
2043D354k1316J7837J3337k3892m86K1350j3473j1267K2510r48k2596J2578J3208
$$ 4354 -16962 875 14212 -9680 -10166 11184 -2289 -13556 8954 8006 -14590 -2012 11196
2056A1196j9647J818K0585j5479j2836K1089N89j8029J3702Q878k3252K840K4280
$$ 11196 -8451 -6633 13952 -1527 -14363 6726 7315 -10714 2988 11866 -11386 -8546 15734
2069A5734j4015j5049K2329j14k2358J3141J5424k0270j491J8978j2737j1411
$$ 15734 1719 -13330 8999 8885 -13473 -332 15092 -5178 -6669 12309 -428 -11839
2081a1839K2139K03k1573J1665J1673j9896K385K1729j4655j4462K0694J612k0592
$$ -11839 10300 10503 -11070 595 12268 -7628 -5243 16486 1831 -12631 8063 9675 -10917
2094a0917J3135J3642k2393k217K2571j0218j4105J9665Q15k1857J0968J4702
$$ -10917 2218 15860 -6533 -8750 13821 3603 -10502 9163 9978 -11879 -911 13791
2106A3791j7856j047J8677j3385j2522K1578J398k1676J1446J3402k1650j751
$$ 13791 -4065 -5112 13565 180 -12342 9236 10634 -11042 404 13806 -7844 -9595
2118i595K4748j0104j7406J6577L900j8373J0666J3178k0563k751K0651r477j3426
$$ -9595 15153 5049 -12357 4220 8120 -10253 413 13591 -6972 -9723 10928 1451 -11975
2131a1975J8978J666k1532R930J4931j8743j577K0923j2034j6519K0351N364k1274
$$ -11975 7003 8669 -12863 -2933 11998 -6745 -8322 12601 567 -15952 4399 9763 -11511
2144a1511Q454J4780j9339m083K1403p428j4603J6300J824j9944J1519J5779j9598
$$ -11511 -3057 11723 -7616 -11699 9704 2276 -12327 3973 5797 -14147 -2628 13151 -6447
2157f447m928J9778r233j2926K0009K732k3622Q997J7373j8186m401K1329q058
$$ -6447 -11375 8403 -830 -13756 6253 8985 -14637 -5640 11733 -6453 -10854 10475 2417
2170B417j7063J6264N409j7572Q671J3041j8854l633K1629q606j4028J8083K767
$$ 2417 -14646 1618 7027 -10545 -1874 11167 -7687 -11320 10309 1703 -12325 5758 8525
2183H525k2985R713J9025j7962o771J9758p339j5472J8276O394k0742N510J4853
$$ 8525 -14460 -4747 14278 -3684 -10455 9303 1964 -13508 4768 11162 -9580 -4070 10783
2196A0783j5608l490K0170p867j6190J6622M994j9713R090J6396j8771p428K1344
$$ 10783 -4825 -8315 11855 3988 -12202 4420 9414 -10299 -1209 15187 -3584 -11012 10332
2209A0332m900j6622J7121O454k1791M381J7827j3262n826J7031p403j5166J7557
$$ 10332 5432 -11190 5931 12385 -9406 -5025 12802 -460 -6286 10745 3342 -11824 5733
2222E733O626k0445N839J5883j6922o029K1665n681j7478J5119O790k0078N767
$$ 5733 12359 -8086 -2247 13636 -3286 -9315 12350 6669 -10809 4310 11100 -8978 -3211
2235c211J8472j5552r345J8526l870j4975J5167O797k0510M423J5842j4561n200
$$ -3211 15261 -291 -9636 8890 5020 -9955 5212 12009 -8501 -4078 11764 -2797 -7997
2248g997K0184p588j8769J6236R984j9497L219J5940j5054p775K0354l292j7009
$$ -7997 12187 4599 -14170 2066 12050 -7447 -4228 11712 -3342 -11117 9237 5945 -11064
2261a1064J3340P272j9682M326J8139j4067q981J7926m518j6022J5746Q364k0190
$$ -11064 2276 9548 -10134 -5808 12331 -1736 -10717 7209 2691 -13331 2415 10779 -9411
2274i411K872J6569j4124p396K0666l744j9416J2566J0335j7313K985J6070j4496
$$ -9411 -6539 10030 -4094 -11490 9176 5432 -13984 -1418 8917 -8396 -5411 10659 -3837
2287c837r296J9512j906j6283J2854P722j9543L248J8041j2551r241J8347l725
$$ -3837 -13133 6379 4473 -11810 1044 8766 -10777 -7529 10512 -2039 -11280 7067 3342
2300C342j7511J4200J1041j8823J51J7206j2496r002J9337j119j8053J1085Q841
$$ 3342 -14169 31 11072 -7751 -7600 9606 -2890 -11892 7445 6326 -11727 -642 8199
2313H199j6876L789J6959j3930j0251J8480q32j6656J3173R443j9872R19J8476
$$ 8199 -8677 -4888 12071 -1859 -12110 6370 5538 -11118 2055 11498 -8374 -7455 11021
2326A1021j0768j0112J8054j856j8116J1965J1549j7095N95J5965j1886r658J9017
$$ 11021 253 -9859 8195 6339 -11777 188 11737 -5358 -4763 11202 -684 -10342 8675
2339H675m54j7557J0999R016j8079K312J9167j1826j2579J7400M91j6522J0907
$$ 8675 8221 -9336 1663 10679 -7400 -5088 14079 2253 -10326 7074 7565 -8957 1950
2352A950J0942j7799q00J6625j0298r149J8089j551j8602J0956J2037j6952l17
$$ 1950 12892 -4907 -5707 10918 620 -8529 9560 8009 -10593 363 12400 -4552 -4869
2365d869J7451j1822j1742J8045J639j7150R590J0098j7806m39J8621r251j1473
$$ -4869 12582 760 -10982 7063 8702 -8448 1142 11240 -6566 -7005 11616 2365 -9108
2378i108J5056J57j6997J1523J1742j7441k187J7261r725j1528J7912J630j9068
$$ -9108 5948 6105 -10892 631 12373 -5068 -7255 10006 281 -11247 6665 8295 -10773
2391a0773Q127J2253j5706o91J7793j0693j2769J6415K681j6744R290J1141j7829
$$ -10773 -2646 9607 -6099 -6790 11003 310 -12459 3956 6637 -10107 -817 10324 -7505
2404g505j853J8573q528j1796J5845R40j8496R973J3345j6380k928J7060r149
$$ -7505 -9358 9215 687 -11109 4736 5676 -12820 -2847 10498 -5882 -8810 8250 -899
2417h99j1947J7496K490j8185P891J1922j5950j382J8528q833j4174J5937K907
$$ -899 -12846 4650 7140 -11045 -3154 8768 -7182 -8564 9964 1131 -13043 2894 5801
2430E801j6379Q692J2394j7200l169J8373p626j1782J6024J580j8668Q618J3806
$$ 5801 -10578 -1886 10508 -6692 -9861 8512 886 -10896 5128 6708 -11960 -3342 10464
2443A0464j4601l405J6876q595j2691J6221M215j7097O548J2307j5869k736J8825
$$ 10464 -4137 -7542 9334 739 -11952 4269 8484 -8613 -2065 10242 -5627 -8363 10462
2456A0462p263j3640J4605L584j7103Q223J3839j5916n036J7526o402j2404J5613
$$ 10462 3199 -10441 4164 7748 -9355 -1132 12707 -3209 -8245 9281 2879 -9525 6088
2469F088L910j8732N893J4383j3571m223J7161p313j4361J5297N121j6661O187
$$ 6088 9998 -8734 -2841 11542 -2029 -6252 10909 3596 -10765 4532 9653 -7008 -821
2482h21J3017j5651m832J8779m899j4272J2995M643j7182O289J4719j4299n755
$$ -821 12196 -3455 -8287 10492 5593 -8679 4316 8959 -8223 -1934 12785 -1514 -7269
2495g269J6330n718j3263J5177N491j8390M009J4327j3334m734J8093o298j5637
$$ -7269 9061 3343 -9920 5257 10748 -7642 -3633 10694 -2640 -7374 10719 4421 -11216
2508a1216J3740O609j6688M881J3785j4329o242J7625l957j3929J3157N061j8294
$$ -11216 2524 9133 -7555 -2674 11111 -3218 -9460 8165 4208 -9721 3436 8497 -9797
2521i797M963J5713j3007o894J6368m879j4615J4374P680j7788K843J3780j2352
$$ -9797 -4834 10879 -2128 -9022 7346 2467 -12148 2226 9906 -7882 -5039 8741 -3611
2534c611o292J7588l703j5319J1926O580j6357M731J4733j3726p995J7577k708
$$ -3611 -9903 7685 3982 -11337 589 7169 -9188 -4457 10276 -3450 -11445 6132 3424
2547C424j4692J2905O641j7768K646J6065j1340p818J6481l693j5247J2767Q476
$$ 3424 -11268 1637 8278 -9490 -6844 9221 -2119 -9937 6544 2851 -12396 371 8847
2560H847j6581K358J4526j3044p277J8157j644j5902J0559Q106j6655L370J5631
$$ 8847 -7734 -5376 9150 -3894 -11171 6986 5342 -10560 -1 8105 -8550 -5180 10451
2573A0451j2106q523J6279k324j4471J2802Q202j7338N83J5871j0275p556J6528
$$ 10451 -1655 -10178 6101 3777 -10694 2108 10310 -7028 -6445 9426 -849 -8405 8123
2586H123k817j6238J1717R371j5793J810J5015j1972r183J7399o87j5189J0300
$$ 8123 5306 -10932 785 10156 -5637 -3827 11188 -784 -9967 7432 6745 -8444 1856
2599A856Q270j6788J809J6458j0168r724J5558j320j5227J1289J0057j6588l29
$$ 1856 10126 -6662 -4853 11605 1437 -8287 7271 5951 -9276 2013 12070 -4518 -4847
2612d847J4714r728q381J6630l71j7412R740J0384j5577L49J6645j0468j1637
$$ -4847 9867 139 -8242 8388 8017 -9395 345 10729 -4848 -4499 12146 1678 -9959
2625i959J6307J725j5822R187R158j6222p3J6178r072r859J5314q33j5922J0108
$$ -9959 6348 8073 -7749 1438 10596 -5626 -5699 10479 1407 -8452 6862 6029 -9893 215
2639B15J1019j5841j356J5455r439j0347J6634J431j6737P457J0518j4456n44
$$ 215 11234 -4607 -5963 9492 53 -10294 6340 7771 -8966 -1509 9009 -5447 -5991
2652e991J5580r201j0824J4688R71j5252R878J0274j6849j481J6611p822j0979
$$ -5991 9589 388 -10436 4252 5223 -10029 -151 10123 -6726 -8207 8404 582 -10397
2665a0397J5372J045j7345Q557J1911j4480j988J5539q792j0968J5172K430j5473
$$ -10397 4975 6020 -11325 -2768 9143 -5337 -7325 8214 -578 -11546 3626 6056 -9417
2678i417P691R492j5022q24J7688q632j2573J4747K188j5897Q328J1893j5169
$$ -9417 -1726 7766 -7256 -8080 9608 976 -11597 3150 5338 -10559 -2231 9662 -5507
2691e507l148J6039p028j0852J4982K365j6777O759J1256j2911j803J5498q264
$$ -5507 -8655 7384 356 -10496 4486 6851 -9926 -3167 8089 -4822 -6625 8873 609
2704F09j1837J5050L336j5937P326J1303j5263l309J7680n550j2778J3174L288
$$ 609 -11228 3822 7158 -8779 -1453 9850 -5413 -8722 8958 3408 -9370 3804 7092
2717G092j5807O962J3039j4105m329J5017n524j1123J4200L180j6822O506J2422
$$ 7092 -8715 -1753 11286 -2819 -7148 7869 2345 -8778 5422 8602 -8220 -1714 10708
2730A0708j4058l674J7353n992j3943J2867N610j5670O045J2114j4151m891J6560
$$ 10708 -3350 -7024 10329 4337 -9606 3261 8871 -6799 -754 11360 -2791 -7682 8878
2743H878m621j1877J2368L560j5969N775J3495j3178m552J5441o600j2330J4155
$$ 8878 4257 -7620 4748 8308 -7661 -1886 11609 -1569 -6121 9320 2720 -9610 4545
2756D545N375j7007M362J3374j2905m800J5991m425j3597J1661N367j5214N484
$$ 4545 9920 -7087 -2725 10649 -2256 -7056 8935 4510 -9087 2574 7941 -7273 -1789
2769a789J2758j3635n676J5722m737j1636J3359L985j7508M246J5307j2449o180
$$ -1789 10969 -2666 -8342 7380 2643 -8993 4366 8351 -9157 -4911 10396 -2053 -8233
2782h233J5575m154j3711J1944O879j5474L100J2541j1808n863J6172l701j3368
$$ -8233 7342 3188 -10523 1421 8300 -7174 -4074 8467 -3341 -9204 6968 3267 -10101
2795a0101J1843M925j5896M856J4541j3035o761J5521l175j4057J2620P453j6907
$$ -10101 1742 6667 -9229 -4373 10168 -2867 -9628 5893 2718 -11339 1281 8734 -8173
2808h173J982J3385r614n575J4287m222j3461J1982O979j5262L141J3329j2284
$$ -8173 -6191 7194 -2420 -7995 6292 2070 -11391 591 7570 -7692 -4551 8778 -3506
2821c506o324J6363k258j4546J1185P111j6357K562J5097r969p940J4179k340
$$ -3506 -9830 6533 4275 -10271 914 8025 -8332 -5770 9327 -642 -8582 5597 3257
2834C257j2885J1225O876j5089K451J2451j0722n810J6286l194j5001J1012Q278
$$ 3257 -9628 1597 8473 -6616 -4165 8286 -2436 -8246 8040 4846 -10155 857 9135
2847I135j5109K238J4465j1612q460J5839q10j3717R988P022j5034J724J3868
$$ 9135 -5974 -3736 10729 -883 -9343 6496 5686 -8031 1957 8979 -6055 -4331 9537
2860I537r452o960J4643k628j4742J1256Q732j4981P21J3558j0378p337J5922
$$ 9537 85 -6875 7768 5140 -9602 1654 10386 -4595 -3874 9684 -694 -8031 7891
2873G891r99j5075Q668Q933j4129Q32J4312r470r046J4326o64j2992R562Q085
$$ 7891 6892 -8183 485 9418 -4711 -3879 10433 963 -8083 6243 5579 -7413 2149 10234
2887A0234j5608M73J4694r369q346J5074r32j5337R224R939j4358n63J4151r373
$$ 10234 -5374 -4901 9793 424 -7922 7152 6220 -9117 107 10046 -4312 -4875 9276 -97
2901i7r103J4484J216j4101P535Q011j4069J175J4670r478r638J4334J66j4753
$$ -97 -9200 5284 6500 -7601 -66 7945 -6124 -4949 9721 243 -9395 4939 5105 -9648
2915i648R154R676j4576j552J4611p890r235J4337R13j5209P169J0017j2974p58
$$ -9648 -494 9182 -5394 -6946 7665 -225 -9460 4877 5790 -9419 -2250 7767 -5207 -5965
2929e965J3828r098r143J4247J126j4393Q229R498j5394p87J5995p318j0794J2993
$$ -5965 7863 -1235 -10378 3869 4995 -9398 -1169 8329 -7065 -7852 8143 825 -9969 3024
2943C024J596j4357P889J0570j3516k346J3786o789r038J3542J429j4682P029
$$ 3024 4620 -9737 -1848 8722 -4794 -7140 6646 -143 -9181 4361 5790 -8892 -1863
2956a863R647j3165j058J5303p942j1333J3467L075j4396P015J0272j4009k801
$$ -1863 7784 -5381 -6439 8864 922 -10411 3056 6131 -8265 -1250 9022 -4987 -7788
2969g788J5405n322j0596J2343K096j4526P206J0539j2577k528J3876o853j0512
$$ -7788 7617 2295 -8301 4042 6138 -8388 -1182 9357 -3220 -5748 8128 1275 -9237
2982i237J4021L469j5416N721J0926j2636k935J5078n856j1476J1895L641j3790
$$ -9237 4784 8253 -7163 -1442 9484 -3152 -6087 8991 3135 -8341 3554 7195 -6595
2995f595O273J0387j2993l608J4737n448j0198J2413K644j5233N609J2306j2090
$$ -6595 -322 10065 -2928 -6536 8201 2753 -7445 4968 7612 -7621 -2012 10294 -1796
3008a796l800J4294n639j1620J2532M319j4256M827J0418j2121l529J4769m811
$$ -1796 -5596 8698 3059 -8561 3971 8290 -5966 -1139 9279 -2842 -6371 8398 3587
3021C587j1697J1553L691j4144N489J1515j2313m576J4401m873j1154J2296M362
$$ 3587 -8110 3443 7134 -7010 -1521 9994 -2319 -6895 7506 2633 -8521 3775 8137
3034H137j5506L829J1959j1020l934J3808m716j1917J1451M632j3848M266J1348
$$ 8137 -7369 -3540 8419 -2601 -6535 7273 2557 -9360 2091 6723 -7125 -2859 8489
3047H489j2099m842J5125l664j1945J1023M223j4463L997J2743j1012n796J3672
$$ 8489 -3610 -8452 6673 3009 -8936 2087 6310 -8153 -4156 8587 -2425 -8221 5451
3060E451l532j1607J1126N708j4309K710J1442j0424m223J3543l867j1995J0794
$$ 5451 1919 -9688 1438 7146 -7163 -4453 6989 -3435 -7658 5885 2018 -9977 817
3073H17N395j3782L826J2065j1522n847J4481k336j1760R652N723j4054K960J2237
$$ 817 6212 -7570 -3744 8321 -3201 -9048 5433 3097 -8663 989 6712 -7342 -4382 7855
3087G855r886n566J3437l448j1868J0650O564j4153K351J1996j0287n523J4604
$$ 7855 -2031 -7597 5840 2392 -9476 1174 7738 -6415 -4064 7932 -2355 -7878 6726
3100F726k783j2576R721O142j3263K736J2460r913p042J3316j807j1615J0332
$$ 6726 3943 -8633 1088 7230 -6033 -3297 9163 -750 -7792 5524 3717 -7898 2434
3113B434O259j4596J670J3289r227o474J3607k048j3416R848P405j3256J246J2270
$$ 2434 8693 -5903 -4233 9056 -171 -6645 6962 4914 -8502 1346 8751 -4505 -3259 9011
3127I011r366o844J3740n00j2897Q388O497j3214J763J3116r072p449J2791j089
$$ 9011 -355 -7199 6541 6041 -6856 1532 8029 -5185 -3422 9694 622 -6827 5964 4875
3141D875j2122R136P547j3966J59J2766p926p096J3105j099j3179Q326P712j2617
$$ 4875 -7247 1889 9436 -4530 -4371 8395 469 -6627 6478 5379 -7800 526 8238 -4379
3155d379Q27J2233q907q069J3812P2j2888P818P157j3077L95J3089p445q292J2290
$$ -4379 -3552 8681 -226 -8295 5517 5589 -7299 519 7676 -5401 -5006 8083 638 -7654 4636
3170D636j4j2945P904Q551j3131l69J2501p964p264J2857K66j3473O961Q757j2560
$$ 4636 4622 -8323 -419 8132 -4999 -5368 7133 -831 -8095 4762 5028 -8445 -1484 7273 -5287
3185e287J83J2822q159q865J2898P04j2133P501P606j3046r38J3285o734q325
$$ -5287 -5104 7718 -441 -9306 3592 4296 -7837 -336 7270 -5776 -6714 6571 -163 -8488
3199h488J2048P19j3227P313Q985j1954j345J2046o382q534J2277J614j3193O629
$$ -8488 3560 4279 -8948 -1635 7350 -4604 -5949 6097 -285 -8819 3458 5072 -8121 -1492
3213a492Q177j1642j027J3154o225r353J1036K322j2498O463R262j2306j936J2712
$$ -1492 6685 -4957 -5984 7170 945 -8408 2628 4950 -7548 -1085 8177 -4129 -6065 6647
3227F647n497q917J1803J468j3204N877R800j1134j760J2265o383r183J2309K379
$$ 6647 1150 -7767 4036 5504 -7700 -1823 7977 -3157 -4917 7348 965 -8218 4091 6470
3241F470j2901N462Q669j0867k227J3057n071r519J0736J991j1890N671R290j1276
$$ 6470 -6431 -969 7700 -3167 -5394 7663 2592 -6927 3809 5800 -6090 -419 8871 -2405
3255b405k983J2762n372q945J1537K392j3225M714R936j0261k454J1977n141r417
$$ -2405 -5388 7374 2002 -6943 4594 6986 -6239 -1525 8411 -1850 -4304 7673 2532 -6885
3269f885J0638K677j1836M841R077j1381l065J3386m447r951J0330L044j3169
$$ -6885 3753 6430 -5406 -565 8512 -2869 -5934 7452 3005 -6946 3384 6428 -6741
3282f741N160J0350j0451l923J1774l819r533J0517L129j2253L351R619r749l307
$$ -6741 -1581 8769 -1682 -5605 6169 2350 -7183 3334 6463 -5790 -2439 7180 -2569 -5876
3296e876J2953m892j0319J0157L706j1868M180R388j0412m050J2211l025r865
$$ -5876 7077 2185 -8134 2023 5729 -6139 -1959 7429 -2983 -7033 5178 2153 -7712
3309g712J0061L339j2596L563J0043q987m089J1543l832r957J0423L889j2035
$$ -7712 2349 5688 -6908 -3345 6698 -2289 -6378 5165 1333 -8624 1799 5688 -6347
3322f347L085R765r267m240J2657l152j0710Q968M302j1653L220J0607r706m786
$$ -6347 -3262 6503 -2764 -7004 5653 2501 -8209 759 5061 -6592 -3372 7235 -2471 -7257
3336g257J2179l024r646R124M031j1814K587J0348q559m671J1968l218j0519R344
$$ -7257 4922 1898 -7748 1376 5407 -6407 -3820 6528 -2031 -6702 5266 2048 -8471 873
3350H73N304j1877K425J0197q880n165J2180j580j0695Q047N079j1028K247J0429
$$ 873 6177 -5700 -3275 6922 -1958 -7123 5057 3477 -7218 829 5908 -5120 -2873 7556
3364G556q684n318J1322j908j0109R307N132j2492J712J0970p922n180J1652k072
$$ 7556 -1128 -6446 4876 2968 -7141 2166 7298 -5194 -3482 7488 -434 -5614 6038 3966
3378C966j0919P935N981j1078J558J0162p845n547J1140j205r819P730M957j1747
$$ 3966 -6953 982 6963 -4115 -2557 7605 -240 -5787 5353 4148 -5671 2059 7016 -4731
3392d731J842J1136p566o177J0849j121j0865Q080O433j1455P9J0517p208n344
$$ -4731 -2889 8247 681 -5496 5353 4232 -6633 1447 7880 -3575 -3496 7021 -187 -5531
3406e531J0952p67j0779O982N687j0766J332J0377p589o534J1518o25j0480O759
$$ -5531 5421 4654 -6125 857 6544 -4222 -2890 7487 -102 -6636 4882 4257 -6223 536
3420E36O578j1698K00J1039o472o309J0548j189j0210O820O799j0651N6J0011
$$ 536 7114 -4584 -4384 6655 183 -6126 4422 3233 -6977 -157 6642 -4009 -3953 6058
3434F058p137n691J0891o32j0851O951O619j0812qJ0964o450p475J0413K25r557
$$ 6058 -1079 -6770 4121 3489 -7362 -411 6208 -4604 -4612 6352 -98 -7573 2840 3065 -6492
3449f492N913O560j0533n46J0123n448o371J0097M4j1205O633P412j0269p85J0752
$$ -6492 -579 5981 -4552 -5098 5025 -423 -6794 3303 3347 -7858 -1225 6187 -4082 -4867 5885
3464E885o582p394J1276J476j1394N078P240r919l61J0283n509p115R746J155
$$ 5885 -697 -8091 3185 4661 -6733 -1655 5585 -4334 -4695 5588 79 -7036 2710 3865
3478C865j0370N794P057j0028j145J0188n213o870J0121J153j1114M977P829q792
$$ 3865 -6505 -711 6346 -3682 -4827 5361 148 -6722 3399 4552 -6562 -1585 6244 -2548
3492b548j711J0414n007p756R331K168j0021M570O846r749j041J1008m835p791
$$ -2548 -4259 6155 1148 -6608 2723 4891 -5130 -560 6286 -3463 -4504 6504 1669 -6122
3506f122R470J557j0811N288Q432r963k140J0596m538p727R355K452j0737L979
$$ -6122 3348 4905 -5906 -618 7814 -2149 -4289 6307 1769 -5958 3397 5849 -4888 -909
3520i09P655r013j133J0317n238p443R180J744r917M609P257r490k401J1366l975
$$ -909 6746 -2267 -3400 6917 1679 -5764 3416 5160 -4757 -148 7109 -2381 -4782 6584 2609
3535B609q182Q438K655j0736L986Q251q316k788R660l948p956R506K041j0363
$$ 2609 -5573 2865 5520 -5216 -1230 7021 -1295 -4083 5577 1629 -6327 3179 5220 -5143
3549e143L853P610r168j963J0764l657q588Q194K772j0153L889Q413r079l358
$$ -5143 -1290 6320 -2848 -4811 5953 2296 -6292 1902 4674 -5479 -1590 6823 -2256 -5614
3563e614J0159k952p468P780K592j0181L576P982q075l035R883l513q515Q461
$$ -5614 4545 1593 -5875 1905 4497 -5684 -2108 5874 -2201 -5236 4647 1134 -7381 1080
3577A080L734j0203K458Q447q260l266J0306k289q385O958L366r628L061Q378
$$ 1080 4814 -5389 -2931 5516 -2744 -6010 4296 2007 -6378 580 3946 -5682 -2621 5757
3591E757p952l314R515k845q080Q513L298j0862K595R078p737l470R612k355q517
$$ 5757 -2195 -5509 4006 1161 -6919 1594 4892 -5970 -3375 5703 -2034 -5504 4108 1753 -6764
3606f764P305M199r511K393P935p264m043R897k265p685P288L342j0014K668Q931
$$ -6764 541 4740 -4771 -2378 5557 -1707 -5750 4147 1882 -5803 1485 4827 -5187 -2519 6412
3621F412p457m187R554k072q496P467N236j0456J317Q589o437m271R377j497q583
$$ 6412 -1045 -5232 4322 2250 -6246 1221 6457 -3999 -2682 5907 -530 -4801 4576 3079 -5504
3636e504O617M352r197K141Q587p647m508R609p80q772O887M324r695J256Q559
$$ -5504 1113 5465 -3732 -1591 6996 -651 -5159 4450 3670 -5102 1785 6109 -3586 -2330 6229
3651F229n617n134R063j035q963O758M880r076M00Q453o344m316R598j284q978
$$ 6229 612 -4522 4541 3506 -5457 1301 6181 -2895 -2495 5958 -386 -4702 4896 3612 -5366
3666e366O275M909r160R99Q969o417n314Q743k34q907O523M832r502M20Q676n829
$$ -5366 909 5818 -3342 -2343 6626 209 -5105 3638 3404 -5503 1020 5852 -3650 -3230 5446 -383
3682c83m238Q313p29q934O132N198q896N92Q337o395m982R406q8r253N523N206
$$ -383 -4621 3692 2963 -5971 161 5359 -3537 -2945 5392 -1003 -5985 3421 3333 -5920 -397 4809
3698D809q678l6Q989n114n816Q241l34q016N556N624r162m50Q801n050n484R020
$$ 4809 -3869 -3905 5084 -30 -5846 2395 2061 -5955 -399 5225 -3937 -4387 4414 -636 -6120 2900
3714B900j07r103M913O257q480m39Q869n027o049Q411R90q686M809N352q584l77
$$ 2900 2793 -6310 -1397 4860 -3620 -4059 4810 -217 -6266 2145 3135 -5551 -742 4610 -3974 -4351
3730d351R106m804n693Q495K38q896M871O644q589j430Q562m212n474Q406P93
$$ -4351 4755 -49 -5742 2753 2991 -5905 -1034 5610 -2979 -4409 4153 -59 -5533 2873 3666
3745C666q742M061O045p910l79Q553m800o193Q691O46q259M598N946q660r07Q940
$$ 3666 -5076 -1015 5030 -2880 -3259 5294 494 -5699 2992 3638 -4621 -23 5923 -2737 -3644 5296
3761E296m187o035P887R82q591M055O696q064j290Q162m029n740Q058J250q702
$$ 5296 1109 -4926 2961 3943 -4648 -593 6103 -1961 -3251 4911 882 -4858 3200 4450 -4252
3776d252L858O188p723j295Q888l677o990P789J619q439M198O019q022j878Q666
$$ -4252 -394 5794 -1929 -3224 5664 1987 -5003 2786 4405 -4034 164 6183 -1839 -3717 4949
3791D949l147o538P728J665q841L342O870p561j666Q205l448o740P541K384q772
$$ 4949 1802 -4736 2992 4657 -4184 -842 6028 -1533 -3199 5006 1558 -5182 2359 4743 -4029
3806d029K783O853p686j876R061l279p092P115K348q654L010P095p824k076Q251
$$ -4029 -1246 5607 -2079 -3955 5106 1827 -5265 1850 4198 -4456 -1446 5649 -2175 -4251 4000
3821D000l158o030O956K592r228K648P073p127k380Q915l147p199P109K970q827
$$ 4000 842 -5188 1768 4360 -4868 -2220 4853 -2274 -4654 4261 1114 -6085 1024 3994 -4833
3836d833K637O961p046k697Q976k827o682O218K821q574K401P746o877l262Q428
$$ -4833 -2196 4765 -2281 -4978 3998 1171 -5511 707 3528 -5046 -2645 5101 -1776 -5038 3390
3851C390k370p010P149K692q204J937O754o336k865Q758k189p443O323L105q206
$$ 3390 1020 -5990 1159 3851 -4353 -2416 4338 -1998 -4863 3895 1706 -5737 586 3691 -4515
3866d515K231P451o753l479Q403j736o947O631L377q920J597Q054o033l603P988
$$ -4515 -2284 5167 -1586 -5065 3338 1602 -5345 1286 4663 -4257 -2660 5394 -639 -4242 3746
3881C746j815p526O961L309q301J459P271o300l198Q718j349p410N546L623q305
$$ 3746 1931 -5595 1366 4675 -3626 -2167 5104 -1196 -4394 4324 2975 -4435 1111 4734 -3571
3896c571K111P457o468m014Q381j295o937N673M058q475J024P378n367l634P874
$$ -3571 -1460 5997 -471 -4485 3896 2601 -4336 1337 5395 -3080 -2056 5322 -45 -3679 4195
3911D195j217p666N682M226p894J113P163n711m150P937p19p305N058M441q052
$$ 4195 2978 -4688 994 5220 -2674 -1561 5602 -109 -4259 3678 2959 -4346 712 5153 -2899
3926b899P55P806n635m382P981r68p226N724L968q197O00P526m965m623Q669j153
$$ -2899 -2144 5662 27 -4355 3626 2658 -4568 1156 5124 -3073 -2473 5053 88 -4535 4134 2981
3942B981p997N072M405p744R18P439n449n015Q346k85p565N129M224q155L33Q190
$$ 2981 -5016 56 4461 -3283 -2365 5074 -375 -5390 2956 2671 -4894 235 4459 -3696 -3363 4827
3958D827n051n098P952m53p688N220M742p814l5P839n251m557Q234j36q159M450
$$ 4827 -224 -5322 2630 2177 -5511 -291 4451 -3363 -3398 4441 -810 -5367 2867 2731 -5428 -978
3974i78M935p288r6P742m977n045P747L56p410M755M711p749j068Q154l727n330
$$ -978 3957 -3331 -3427 4315 -662 -5707 2040 2396 -5014 -259 4452 -3297 -4365 3789 62 -5268
3990e268P673L01p954M520N288p292q21P534m215m981P507R01p678L695N390p581
$$ -5268 2405 2706 -5248 -728 4560 -2732 -3553 3981 -234 -5215 2292 3193 -4485 -790 4600 -2981
4006b981l57Q149m448n097P085Q80p860M306N434p068j555Q296l773n420P480
$$ -2981 -3338 4811 363 -4734 2351 3231 -4629 -323 5111 -1957 -3512 4784 1011 -4409 3071
4021C071L86p589L244N972o719j252P561m000n313P649P24p742L687N425p058
$$ 3071 3457 -4132 -888 5084 -1635 -2887 4674 674 -4639 3010 3734 -4008 -321 5104 -1954
4036a954j066Q216l266o217O874J331p700L373N827o620j777P510l379n531P258
$$ -1954 -3020 5196 1930 -4287 2587 3918 -3782 -409 5418 -1202 -2979 4531 1152 -4379 2879
4051B879J439q227L318N960o708j880Q035l058o494O697K206p851K888N846o660
$$ 2879 4318 -3909 -591 5369 -1339 -3219 4816 1758 -4736 1961 4167 -3684 -796 5050 -1610
$$ [...]
8191A83
##END NTUPLES=NMR FID
##END=
