##TITLE=1H_Pr Am-dep
 CDCl3, 8 sc, 
 14.3.2019
##JCAMPDX= 6.0         $$ Bruker NMR JCAMP-DX V2.0
##DATA TYPE= NMR FID
##DATA CLASS= NTUPLES
##ORIGIN= UXNMR, Bruker Analytische Messtechnik GmbH
##OWNER= root
$$ XWIN-NMR		Version 3.5
$$ Thu Mar 14 16:30:21 2019 Russian Standard Time (UT+4h)  she@DPX200
##.OBSERVE FREQUENCY= 200.1315
##.OBSERVE NUCLEUS= ^1H
##.DELAY= (6, 6)
##.ACQUISITION MODE= SIMULTANEOUS
##.ACQUISITION SCHEME= undefined
##.AVERAGES= 8
##.DIGITISER RES= 18
##SPECTROMETER/DATA SYSTEM= spect
##.PULSE SEQUENCE= zg30
##.SOLVENT NAME= CDCl3
##.SHIFT REFERENCE= (INTERNAL, CDCl3, 0, 15.7039)
##AUDIT TRAIL= $$ (NUMBER, WHEN, WHO, WHERE, WHAT)
$$ ##TITLE= Audit trail, XWIN-NMR		Version 3.5
$$ ##JCAMPDX= 5.01
$$ ##ORIGIN= Bruker BioSpin GmbH
$$ ##OWNER= she
$$ F:/spectra/data/she/nmr/H-F/1/audita.txt
$$ ##AUDIT TRAIL=  $$ (NUMBER, WHEN, WHO, WHERE, WHAT)
(   1,<2019-03-14 16:29:24.59 +0400>,<she>,<DPX200>,
      <created by zg, POWCHK disabled, PULCHK disabled
       configuration hash MD5:
       00 E9 B6 7A A2 85 ED C7 34 08 36 98 17 FE 4E 26
       data hash MD5: 16K
       2B CA 75 B9 0A 8F 9D AF C1 58 66 32 79 EC E0 5E>)
$$ ##END=
$$ 
$$ hash MD5
$$ DF DC B8 68 CF F6 BB A3 8B A2 38 97 33 14 14 A5
##$RELAX= 
##$RELAX= 
##$RELAX= 
##$RELAX= 
##$RELAX= 
##$RELAX= 
$$ Bruker specific parameters
$$ --------------------------
##$DU= <F:/spectra>
##$EXPNO= 1
##$NAME= <H-F>
##$PROCNO= 1
##$TYPE= <nmr>
##$USER= <she>
##$AMP= (0..31)
100 100 100 100 100 100 100 100 100 100 100 100 100 100 100 100 100 100 
100 100 100 100 100 100 100 100 100 100 100 100 100 100 
##$AQSEQ= 0
##$AQ_mod= 1
##$AUNM= <au_zg>
##$AUTOPOS= <>
##$BF1= 200.13
##$BF2= 200.13
##$BF3= 200.13
##$BF4= 200.13
##$BF5= 200.13
##$BF6= 200.13
##$BF7= 200.13
##$BF8= 200.13
##$BYTORDA= 1
##$CFDGTYP= 0
##$CFRGTYP= 5
##$CHEMSTR= <none>
##$CNST= (0..31)
1 1 145 1 1 1 1 1 1 1 1 1 1 1 1 1 1 1 1 1 1 1 1 1 1 1 1 1 1 1 1 1 
##$CPDPRG= <>
##$CPDPRG1= <>
##$CPDPRG2= <>
##$CPDPRG3= <>
##$CPDPRG4= <mlev>
##$CPDPRG5= <mlev>
##$CPDPRG6= <mlev>
##$CPDPRG7= <mlev>
##$CPDPRG8= <mlev>
##$CPDPRGB= <>
##$CPDPRGT= <>
##$D= (0..31)
0 1.2 0 0 0 0 0 0 0 0 0 0.03 0 0 0 0 0 0 0 0 0 0 0 0 0 0 0 0 0 0 0 0 
##$DATE= 1552566563
##$DBL= (0..7)
120 120 120 120 120 120 120 120 
##$DBP= (0..7)
150 150 150 150 150 150 150 150 
##$DBP07= 0
##$DBPNAM0= <>
##$DBPNAM1= <>
##$DBPNAM2= <>
##$DBPNAM3= <>
##$DBPNAM4= <>
##$DBPNAM5= <>
##$DBPNAM6= <>
##$DBPNAM7= <>
##$DBPOAL= (0..7)
0.5 0.5 0.5 0.5 0.5 0.5 0.5 0.5 
##$DBPOFFS= (0..7)
0 0 0 0 0 0 0 0 
##$DE= 6
##$DECBNUC= <off>
##$DECIM= 24
##$DECNUC= <off>
##$DECSTAT= 4
##$DIGMOD= 1
##$DIGTYP= 9
##$DL= (0..7)
0 120 120 120 120 120 120 120 
##$DP= (0..7)
150 150 150 150 150 150 150 150 
##$DP07= 0
##$DPNAME0= <>
##$DPNAME1= <>
##$DPNAME2= <>
##$DPNAME3= <>
##$DPNAME4= <>
##$DPNAME5= <>
##$DPNAME6= <>
##$DPNAME7= <>
##$DPOAL= (0..7)
0.5 0.5 0.5 0.5 0.5 0.5 0.5 0.5 
##$DPOFFS= (0..7)
0 0 0 0 0 0 0 0 
##$DQDMODE= 0
##$DR= 18
##$DS= 0
##$DSLIST= <SSSSSSSSSSSSSSS>
##$DSPFIRM= 0
$$ [...]
##$SUBNAM2= <"">
##$SUBNAM3= <"">
##$SUBNAM4= <"">
##$SUBNAM5= <"">
##$SUBNAM6= <"">
##$SUBNAM7= <"">
##$SUBNAM8= <"">
##$SUBNAM9= <"">
##$SW= 24.9337058887773
##$SWIBOX= (0..15)
0 0 2 0 0 0 0 0 0 0 0 0 0 0 0 0 
##$SW_h= 4990.01996007984
##$TD= 16384
##$TD0= 1
##$TE= 0
##$TE2= 300
##$TE3= 300
##$TEG= 300
##$TL= (0..7)
0 120 120 120 120 120 120 120 
##$TP= (0..7)
150 150 150 150 150 150 150 150 
##$TP07= 0
##$TPNAME0= <>
##$TPNAME1= <>
##$TPNAME2= <>
##$TPNAME3= <>
##$TPNAME4= <>
##$TPNAME5= <>
##$TPNAME6= <>
##$TPNAME7= <>
##$TPOAL= (0..7)
0.5 0.5 0.5 0.5 0.5 0.5 0.5 0.5 
##$TPOFFS= (0..7)
0 0 0 0 0 0 0 0 
##$TUNHIN= 0
##$TUNHOUT= 0
##$TUNXOUT= 0
##$USERA1= <user>
##$USERA2= <user>
##$USERA3= <user>
##$USERA4= <user>
##$USERA5= <user>
##$V9= 5
##$VALIST= <valist>
##$VCLIST= <CCCCCCCCCCCCCCC>
##$VD= 0
##$VDLIST= <DDDDDDDDDDDDDDD>
##$VPLIST= <PPPPPPPPPPPPPPP>
##$VTLIST= <TTTTTTTTTTTTTTT>
##$WBST= 1024
##$WBSW= 4
##$XGAIN= (0..3)
0 0 0 0 
##$XL= 0
##$YL= 0
##$YMAX_a= 481176
##$YMIN_a= -537595
##$ZGOPTNS= <>
##$ZL1= 120
##$ZL2= 120
##$ZL3= 120
##$ZL4= 120
##$ABSF1= 10
##$ABSF2= 0
##$ABSG= 5
##$ABSL= 3
##$ALPHA= 0
##$AQORDER= 0
##$ASSFAC= 0
##$ASSFACI= 0
##$ASSFACX= 0
##$ASSWID= 0
##$AUNMP= <proc_1d>
##$AZFE= 0.1
##$AZFW= 0.1
##$BCFW= 1
##$BC_mod= 2
##$BYTORDP= 1
##$COROFFS= 0
##$CY= 11.3945322036743
##$DATMOD= 1
##$DC= 2
##$DFILT= <>
##$DTYPP= 0
##$F1P= 18.9103706918063
##$F2P= -1.10871071338519
##$FCOR= 0.5
##$FTSIZE= 0
##$FT_mod= 4
##$GAMMA= 1
##$GB= 0.15
##$INTBC= 1
##$INTSCL= 1
##$ISEN= 128
##$LB= 0.24
##$LEV0= 0
##$LPBIN= 0
##$MAXI= 10000
##$MC2= 0
##$MEAN= 0
##$ME_mod= 0
##$MI= 1.114404
##$NCOEF= 0
##$NC_proc= 0
##$NLEV= 6
##$NOISF1= 3.799351
##$NOISF2= 2.8
##$NSP= 1
##$NTH_PI= 0
##$NZP= 0
##$OFFSET= 15.70392
##$PC= 1
##$PHC0= -9226.652
##$PHC1= 22.40026
##$PH_mod= 1
##$PKNL= yes
##$PPARMOD= 0
##$PSCAL= 0
##$PSIGN= 0
##$REVERSE= no
##$SF= 200.130013532006
##$SI= 16384
##$SIGF1= 3
##$SIGF2= 2
##$SINO= 400
##$SIOLD= 16384
##$SREGLST= <1H.CDCl3>
##$SSB= 0
##$STSI= 0
##$STSR= 0
##$SW_p= 3612.71676300578
##$SYMM= 0
##$S_DEV= 0
##$TDeff= 0
##$TDoff= 0
##$TI= <>
##$TILT= no
##$TM1= 0
##$TM2= 0
##$TOPLEV= 0
##$USERP1= <user>
##$USERP2= <user>
##$USERP3= <user>
##$USERP4= <user>
##$USERP5= <user>
##$WDW= 1
##$XDIM= 8192
##$YMAX_p= 0
##$YMIN_p= 0
$$ End of Bruker specific parameters
$$ ---------------------------------
##NTUPLES= NMR FID
##VAR_NAME=  TIME,          FID/REAL,        FID/IMAG
##SYMBOL=    X,             R,               I
##VAR_TYPE=  INDEPENDENT,   DEPENDENT,       DEPENDENT
##VAR_FORM=  AFFN,          ASDF,            ASDF
##VAR_DIM=   8192,          8192,            8192
##UNITS=     SECONDS,       ARBITRARY UNITS, ARBITRARY UNITS
##FACTOR=    0.0002004,     1,               1
##FIRST=     0,             0,               0
##LAST=      1.6414764,     0,               0
##MIN=       0,             -537595,         0
##MAX=       1.6414764,     481176,          0
$$ Real data points
##PAGE= N=1
##DATA TABLE= (X++(R..R)), XYDATA
0@%%%%Qj6J6j8K6l9M7n9P7r1J13j45J75k04K43k91L40l96M62n34O14p06Q10r21
$$ 0 0 0 0 0 8 -8 8 -10 16 -23 24 -35 42 -49 64 -81 94 -110 133 -158 182 -214 248 -286 328 -378 432 -489
28d89J044j184J337j504J689j892K115k361K629k919L240l593L981m408M880n404
$$ -489 555 -629 708 -796 893 -999 1116 -1245 1384 -1535 1705 -1888 2093 -2315 2565 -2839
44b839N983o632P364q189R128j0214J1485j2992J4810j7067J9952k3779K9145
$$ -2839 3144 -3488 3876 -4313 4815 -5399 6086 -6906 7904 -9163 10789 -12990 16155
57A6155l7272N1165q1210K55285k52950l92782O03267K77964k95955l65332N3696
$$ 16155 -21117 30048 -51162 204123 -48827 -441609 161658 439622 143667 -221665 -167969
68a67969L08084K27044l69981m18151L14035N01428l11305m68762J97582L52064
$$ -167969 140115 367159 -2822 -420973 -106938 394490 83185 -385577 -187995 164069
78A64069q2739j75889p6894M1105K23345P9300l06927q4329L33953P1789k53033
$$ 164069 81330 -94559 -171453 -130348 92997 172297 -134630 -218959 114994 186783 -66250
89f6250J5373J25655p1649L5496J17818j68470j20299K18944Q2189j95211m8664
$$ -66250 -50877 74778 3129 38625 156443 -12027 -132326 86618 168807 -26404 -75068
100g5068O0489M06R8060K278k80390m834L93590j2337m28496M798L67807M3379
$$ -75068 -14579 -14173 83887 86165 -194225 -199059 194531 182194 -246302 -241504 126303 169682
112A69682k23397j23828N6647K48258J19229l52157k31418M32097K96504m25643
$$ 169682 -53715 -177543 -120896 127362 246591 -105566 -336984 95113 391617 -34026
122c4026k94134L40273K60954j77347k23881l0684J94966K21642j98617l70483
$$ -34026 -328160 12113 273067 95720 -128161 -158845 36121 257763 59146 -311337
132c11337K00581M22496k04466l96840J66566K95863q9996j69203k5832N8361
$$ -311337 -110756 311740 107274 -289566 -123000 172863 82867 -86336 -112168 -53807
142e3807J58547J3730k64992k2128L30185m561l16144N6202K46093q2104j30433
$$ -53807 104740 118470 -146522 -168650 161535 156974 -159170 -102968 143125 61021 -69412
153f9412P4438J4829k0684O7150o3677r4639J44504N7319k02775J5011K05692
$$ -69412 5026 19855 -829 66321 2644 -91995 52509 109828 -92947 -77936 127756
164A27756j00603j65089J53790Q7128j58430r968J06624l8515j3788M0648q5752
$$ 127756 27153 -137936 15854 102982 -55448 -65416 41208 2693 -11095 29553 -56199
175e6199J0939J67401q8344j99358J70062J86948k13186j36221K03041P9192j32050
$$ -56199 -45260 122141 33797 -165561 4501 191449 -21737 -157958 45083 124275 -7775
186g775m1043J6067L9954J10007q0817k17488J37469K74522j89196k78730J98267
$$ -7775 -48818 -32751 7203 117210 36393 -181095 -43626 230896 41700 -237030 -38763
197c8763K33347j51820j66328M6774J02247R4213o1480k34565N1364L39243n7555
$$ -38763 194584 42764 -123564 -76790 25457 119670 58190 -176375 -125011 214232 156677
208A56677l77153O4824L42109m4442k45781j0746J19612R8821K234k01059q8782
$$ 156677 -220476 -155652 186457 142015 -103766 -114512 5100 103921 106155 -94904 -183686
219a83686K83545J24222l21303j16282K92243P9289k02512m4578P2281K8154O0399
$$ -183686 99859 224081 -97222 -213504 78739 158028 -44484 -89062 -16781 11373 71772
230G1772m0663j59244P4347J96113j10070j64572J29316Q1353j16227K4188P2450
$$ 71772 31109 -128135 -53788 142325 32255 -132317 -3001 78352 -37875 -13687 58763
241E8763j11819j1238J53925m1479j36414O3976O7345m4119L0044j6502j25117
$$ 58763 -53056 -64294 89631 48152 -88262 -24286 43059 -1060 28984 12482 -112635
252a12635R5783J89172j63529k11262J89644J90422j55035j43944N9916R3064
$$ -112635 -16852 172320 8791 -202471 -12827 177595 22560 -121384 -61468 31596
262C1596P3904n3770k11746L3974L17182k6462l58769J8467L27619Q666k32484
$$ 31596 105500 51730 -160016 -126042 191140 164678 -194091 -175624 151995 160661 -71823
273g1823o1008J01697J37743K9343k19783j29256K81796J80853k99424j83157
$$ -71823 -132831 -31134 106609 135952 -83831 -213087 68709 249562 -49862 -233019
283b33019K58086J51863j61490j09481K9367P7336J03960o6653k03554P5692K44659
$$ -233019 25067 176930 15440 -94041 -64674 12662 116622 49969 -153585 -77893 166766
294A66766r0357k19444R5473J40005p5390l6058L0601n6843K9137J10875q3805
$$ 166766 76409 -143035 -47562 92443 17053 -19005 11596 -45247 -16110 94765 10960
305A0960j10630J11978O2436j00779J3937N0461q9681K1832J40044r2437j49749
$$ 10960 -99670 12308 74744 -26035 -12098 38363 -51318 -29486 110558 18121 -131628
316a31628J31397J20281j20057o8786N6484J5385M2434K2053j50096l3170K32118
$$ -131628 -231 120050 -7 -68793 -12309 3076 45510 67563 -82533 -115703 116415
327A16415K3043k61892r083K32623O292j51151k8703M1804P7625O3944j41043
$$ 116415 139458 -122434 -131517 101106 107398 -43753 -72456 -30652 46973 110917 -30126
338c0126j39873J96107J71313k21132j60601J99312J21621j29449p8063K5411
$$ -30126 -169999 26108 197421 -23711 -184312 15000 136621 7172 -70891 -45480
348d5480M8838Q5539m4192j75077O0945K18092q4081k07691R5582J51168q1202
$$ -45480 3358 88897 44705 -130372 -69427 148665 64584 -143107 -47525 103643 22441
359B2441p0340L6340o881L0136N5645r7887o4793J45723L6011j55661J3039J22979
$$ 22441 -47899 -11559 -18440 11696 67341 -30546 -95339 50384 86395 -69266 -56227 66752
371F6752n9209n8598Q2055j6069p2131P4913L2779r7834K1109P5850o7463j7138
$$ 66752 7543 -51055 31000 14931 -57200 17713 50492 -47342 -26233 49617 -17846 -34984
383c4984Q8604n7147p7677J20616M1865j50746L805J36476l6575q2291M0057P041
$$ -34984 53620 -3527 -81204 39412 81277 -69469 -65664 70812 34237 -48054 -7997 -956
395i56r100O6013m7907j14200J10907J27136j54919j06494J61325O6940j21428
$$ -956 -10056 55957 8050 -106150 4757 131893 -23026 -129520 31805 98745 -22683
406b2683k9304M4977J0467M8343j7802j30830M6428J80423q0681j85163J01491
$$ -22683 -51987 -7010 3457 51800 33998 -96832 -50404 130019 49338 -135825 -34334
417c4334J47918r1225q5314M5941K0704K5317K6164j02763m2242J62574K9342
$$ -34334 113584 22359 -62955 -17014 3690 29007 55171 -47592 -89834 72740 102082
428A02082j84529l87J61963k6532j00480L4289K0309j5822N3910k4555r9133P1403
$$ 102082 -82447 -82834 79129 52597 -47883 -13594 6715 -9107 44803 20248 -78885 -7482
440g482J04329j06679p2043J14636J6445q8174L8577L5701p3265K5310P5639p4076
$$ -7482 96847 -9832 -81875 32761 49206 -38968 -391 35310 -37955 -12645 62994 -11082
452a1082m5627R1430l896p0259N2547J7640q3914M8540Q7185j04798o4174J29498
$$ -11082 -56709 34721 30825 -39434 13113 30753 -53161 -4621 82564 -22234 -86408 43090
464D3090K6095j12161P975N6517k3107K0681J0881r4935K2171J43976o2406j54981
$$ 43090 69185 -42976 -35001 21516 -1591 19090 29971 -64964 -42793 101183 38777 -116204
476a16204Q9946J26936q8238p3971N1302J5800J3011K7920q7333m6106J48090
$$ -116204 -26258 100678 12440 -61531 -10229 5571 18582 46502 -40831 -86937 61153
487F1153L7292j75196j2524J58613j1773j02889J9709K4888l666N1030l2841j02562
$$ 61153 98445 -76751 -89275 69338 57565 -45324 -25615 -727 -4393 46637 13796 -88766
499h8766P6023J17394j08724r4402J14182M7366q6864L673L2872l9963L2247M8799
$$ -88766 -12743 104651 -4073 -98475 15707 63073 -23791 -20118 12754 -27209 5038 53837
511E3837q6742k9696J13202p447j01962M5589N7110o8073O026O5019o4222l8090
$$ 53837 -32905 -62601 50601 43154 -58808 -13219 43891 -24182 -18156 46863 -17359 -55449
523e5449R8149j066r5414L6893N7741n3609K183M3635o3494r320J05240l4505
$$ -55449 42700 41634 -53780 -16887 40854 -12755 -10572 33063 -30431 -39751 65489 30984
535C0984j15246P0621R2468q1850m6471O0695l681j0952M1452n2870n4428J09452
$$ 30984 -84262 -13641 78827 -3023 -49494 11201 7520 -3432 38020 -14850 -69278 40174
547D0174M2492j39587j3930J32102j4684q8256K8426K2144j7809M5223j4732r3200
$$ 40174 82666 -56921 -70851 61251 46567 -41689 -13263 8881 -8928 36295 21563 -71637
559g1637N7324J09223r2627r1234J04804M9936q5486l028L7622l1531K4678M1085
$$ -71637 -14313 94910 2283 -88951 15853 65789 -19697 -22725 14897 -16634 8044 49129
571D9129q1696k4437J14265q826j11746M2513P6725o1779k0614N6020l6706k5987
$$ 49129 -32567 -57004 57261 48435 -63311 -20798 55927 -5852 -26466 29554 -7152 -33139
583c3139P4759j6543q2952N6341N8104p6919j1991O8851l7541l5200P2340j2812
$$ -33139 41620 25077 -57875 -1534 56570 -20349 -32340 36511 -1030 -36230 36110 23298
595B3298q1035N7115O1180q0816k1861P3572k1159l7473N0898j6552n7590O9180
$$ 23298 -57737 -622 60558 -20258 -42119 31453 10294 -27179 23719 7167 -50423 18757
607A8757M0390j02522p860J04596k5655p4153M3844K1730l8349L4378R132p6663
$$ 18757 59147 -43375 -51235 53361 27706 -46447 -2603 19127 -19222 15156 24288 -52375
619e2375L3035R2141p2393p7307R1143M2210q2022k07M3722l1526J1887M0771
$$ -52375 -19340 72801 408 -76899 14244 56454 -25568 -25775 17947 -13579 -1692 39079
631C9079o6311k5951J02111n178j07298L7783Q0674n7186l1353N2412k1466k4510
$$ 39079 -27232 -53183 48928 43750 -63548 -25765 54909 -2277 -33630 18782 -2684 -27194
643b7194O1820j8595p4924O0055N8756q3566k1773Q0268k1218m8659N2272Q41
$$ -27194 34626 16031 -58893 1162 59918 -23648 -45421 34847 13629 -35030 17242 18083
655A8083o1130M8355M4204p9651q969Q2342k8844n5594N5128Q823n8386M0408
$$ 18083 -43047 5308 49512 -30139 -39108 43234 14390 -41204 13924 22747 -35639 4769
667D769L8890p5761l023Q4983l4149o4054N7274K2137n6214K5908L0085o2726
$$ 4769 43659 -32102 -35125 49858 15709 -48345 8929 31066 -25148 760 30845 -31881
679c1881J2022P6055n3064o3411P9209L0595p8315P899M9423l6525j697M4853
$$ -31881 -19859 56196 3132 -60279 18930 49525 -28790 -20891 28532 -7993 -9690 35163
691C5163m8158l0993Q4431L95r3744L2815P4173n3925l3092N2812j4693k8657
$$ 35163 -12995 -43988 40443 40838 -52906 -20091 54082 157 -32935 19877 5184 -23473
703b3473N2583j1109o7687N1437N6282p7644k5063P8894j3424n3477M3470Q782
$$ -23473 29110 18001 -49686 1751 58033 -19611 -44674 34220 20796 -32681 10789 19571
715A9571n2638L9165L7739p3089o812Q2201k9024o3240N4696K2212n8303K3966
$$ 19571 -33067 6098 43837 -29252 -36064 46137 17113 -46127 8569 30781 -27522 -3556
727c556L8533n9680k100P1809l6892n7783O2967K3087o6498J9168M4159n2674
$$ -3556 34977 -24703 -26803 45006 8114 -49669 13298 36385 -30113 -10945 33214 -19460
739a9460m155O4866l9397n2180O9185K1048p4938J5450N3830m3519j3179N1740
$$ -19460 -23615 41251 1854 -50326 18859 39907 -35031 -19581 34249 -9270 -22449 29291
751B9291l2800l7272O8350N397q0374L0041O5373n4446l0307N8301j3252l7656
$$ 29291 -3509 -40781 27569 32966 -47408 -17367 48006 -6440 -36747 21554 8302 -29354
763b9354M8015O49o2586L9597N2744o7851k4215P4213j2213n4349M1312J5340
$$ -29354 18661 19310 -43276 -3679 49065 -18786 -43001 31212 18999 -35350 5962 21302
775B1302n1284K9436L8928o3727r369P5872k4861o2477N1523K7443n7166J4884
$$ 21302 -29982 -546 38382 -25345 -34714 41158 16297 -46180 5343 32786 -24380 -9496
787i496M0074m8798o707O3980l2251n3413O0701K3906o8087J4189N0743m4969
$$ -9496 30578 -18220 -24927 39053 6802 -46611 14090 37996 -30091 -15902 34841 -10128
799a0128j4587N7420k7034m7186N9743J8155p0763J7609N6258m5223k1685N5165
$$ -10128 -24715 32705 5671 -41515 18228 36383 -34380 -16771 39487 -5736 -27421 27744
811B7744k0678m1944N5729J0650o9975K6112N9100n4006k7851O2111j1792m6042
$$ 27744 7066 -34878 20851 31501 -38474 -12362 46738 -7268 -35119 26992 15200 -30842
823c0842M4661J1807n8913K7980M9931n8923k1960O9081j3180n5135M2688K0761
$$ -30842 13819 25626 -33287 -5307 44624 -14299 -36259 32822 19642 -35493 7195 27956
835B7956n4174K1072M2961n4658j4646O9011k0682n8668M8196K8167n7754J0876
$$ 27956 -26218 -5146 37815 -16843 -31489 37522 16840 -41828 6368 34535 -23219 -12343
847a2343M4356m4562j2600N9392k4861n1983N4695K4788o5600J0702N2780m0828
$$ -12343 32013 -12549 -25149 34243 9382 -42601 12094 36882 -28718 -18016 34764 -6064
859f064k0981N4151j8517m6118N1602J8874o5443J5055N5721m3717k5853N4489
$$ -6064 -27045 27106 8589 -37529 14073 32947 -32496 -17441 38280 -5437 -31290 23199
871B3199j2418m4431M5950J5596o1774J9960N4699m9709k7708O1391q557m9808
$$ 23199 10781 -33650 12300 27896 -33878 -13918 40781 -8928 -36636 24755 16198 -33610
883c3610M0145J9775n5469J8016M8786n0490k2471O4199j2171n4556M1812K5006
$$ -33610 6535 26310 -29159 -11143 37643 -12847 -35318 28881 16710 -37846 3966 28972
895B8972n5194J3482M7063m6747k0337O3001j5201n5411M4740K8299n7209Q376
$$ 28972 -26222 -12740 34323 -12424 -32761 30240 15039 -40372 4368 32667 -24542 -16166
907a6166M8224m1136k0054N8007j7094n1772M8196K6600o2018Q326N3369l9077
$$ -16166 32058 -9078 -29132 28875 11781 -39991 8205 34805 -27213 -18887 34482 -4595
919d595k4801N4570j2716m7840M4804K3454o0790J0579N4309m0392k7823N4599
$$ -4595 -29396 25174 12458 -35382 9422 32876 -27914 -17335 36974 -3418 -31241 23358
931B3358q675m7069M1297K0929n7445J3491N3055m3375k9167N7445m516n0789
$$ 23358 14683 -32386 8911 29840 -27605 -14114 38941 -4434 -33601 23844 19328 -31461
943c1461L6510K4614n3145J0957M8569m2544k5521N9056p870n3033L7783K7633
$$ -31461 5049 29663 -23482 -12525 36044 -6500 -32021 27035 19165 -33868 3915 31548
955C1548n3538P796M8634m0056k4790N7450q742n3057L8717K9284n4408N257M8477
$$ 31548 -21990 -14194 34440 -5616 -30406 27044 18302 -34755 3962 33246 -21162 -15905 32572
968C2572l7048k4056N4393r865n1609M1037K9046n7619M641N2245l6075k7544
$$ 32572 -4476 -28532 25861 15996 -35613 5424 34470 -23149 -18508 33737 -2338 -29882
980b9882N2843p334m9691L9659K7202n7004N480N2725l6093k9421N2916n379m9011
$$ -29882 22961 15627 -34064 5595 32797 -24207 -18727 33998 -2095 -31516 21400 16021 -32990
993c2990L7809K6295n6201O692N3832l7909l1220N3924j753n0791L4240K6857
$$ -32990 4819 31114 -25087 -18395 35437 -2472 -33692 20232 18479 -32312 1928 28785
1005B8785n1944O249N0335l7745k9661N5218k624n1917L3291K9420n1149M214
$$ 28785 -23159 -16910 33425 -4320 -33981 21237 18613 -33304 -13 29407 -21742 -17528
1017a7528M9395l6515k8319N4741l053n2974L2750L2048m9842M50M7935l2603
$$ -17528 31867 -4648 -32967 21774 18721 -34253 -1503 30545 -19297 -18847 29088 -3515
1029c515k6865N2303n255n1731L5599L2563n3575p97N1076k9603l0105M8847k270
$$ -3515 -30380 21923 16668 -35063 536 33099 -20476 -21273 29803 200 -29905 18942 16672
1042A6672m9161L4247L0461n3281K27N2522l0478l2085M8765l08m8099L3002K9016
$$ 16672 -32489 1758 32219 -21062 -20835 31687 1209 -30876 17889 17581 -30518 2484 31500
1055C1500n3005J719N3195l1775l4251N0482K718m9537K9695K9421m9979K271
$$ 31500 -21505 -19786 33409 1634 -32617 17865 20583 -28954 741 30162 -19817 -17546
1067a7546N1326l3306l3573N2415L185n1440K7725L1299m7613J065M9025l3979
$$ -17546 33780 474 -33099 19316 22501 -28939 -1214 30085 -17528 -16463 32562 -1417
1079a417l0993N3925J684n4286K7444L5963m6181l977M5862k8281k7565N0218
$$ -1417 -32410 21515 23199 -31087 -3643 32320 -13861 -17838 28024 -257 -27822 22396
1091B2396k866n2667L2892L6013n1646o946N1216k3677l2035M4364N12m7297L1385
$$ 22396 19530 -33137 -245 35768 -15878 -22824 28392 4715 -27320 17044 17556 -29741 1644
1104A644L1139n1912l005N3192k5932l5545M4889M880m6296K6586L0028m8694
$$ 1644 32783 -19129 -22134 31058 5126 -30419 14470 19350 -26946 -360 29668 -19026
1116a9026j272N2216k8853l5861M7301P227m8665K3757L1358m5610j726M9621
$$ -19026 -20298 31918 3065 -32796 14505 21732 -26933 -3176 28182 -17428 -19154 30467
1128C0467k9177l4997M9421O715n1237K3432L3348m3617l166M6989k8921l2855
$$ 30467 1290 -33707 15714 22429 -28808 -5376 27972 -15645 -18811 28178 -743 -33598
1140c3598N1297N421n4543K3552L8153m2820q622M5030k4064k8177M7021k57n2676
$$ -33598 17699 23120 -31423 -7871 30282 -12538 -21160 23870 -194 -28371 18650 18393 -34283
1153c4283L0551L9163n0531j2137N2352j8422l4085L9549L714m4276K8962L0984
$$ -34283 -3732 35431 -15100 -27237 25115 6693 -27392 12157 15871 -28405 557 31541
1165C1541n1464n222N6071k3041m0816M2570J1752m4978K0572K9870m4494j913
$$ 31541 -19923 -25145 30926 7885 -32931 9639 21391 -23587 -3015 26855 -17639 -19552
1177a9552N0795k7277l8590M8101J1991n0720J7756L5259l9842o710M5739k4358
$$ -19552 31243 3966 -34624 13477 25468 -25252 -7496 27763 -12079 -18789 26950 2592
1189B592l3588M6978Q532n1991K0042L8068m1124r739M6299k1836l3444M4870
$$ 2592 -30996 15982 24514 -27477 -7435 30633 -10491 -20230 26069 4233 -29211 15659
1201A5659Q579n2070K0140L9565m0485j2770M4695j7979l1004M1984M348n0543
$$ 15659 24238 -27832 -7692 31873 -8612 -21382 23313 5334 -25670 16314 20662 -29881
1213b9881K5863L9905m6636j6194N1550j2699l6946L4735Q283m1938K4178L1390
$$ -29881 -4018 35887 -10749 -26943 24607 11908 -25038 9697 17980 -23958 220 31610
1225C1610m8654p708N6235j9350m4959L9094J8215m3588J4017K9796l9173l429
$$ 31610 -17044 -24752 31483 12133 -32826 6268 24483 -19105 -5088 24708 -14465 -17894
1237a7894M9107k6804m0007M8102J6616n3426J1581L9713l3862j1767M1444k0575
$$ -17894 31213 4409 -35598 12504 29120 -24306 -12725 26988 -6874 -18641 22803 2228
1249B228l1690M5247Q233n3513J9115M2586m0417j6764M6128j4042l4409L8410
$$ 2228 -29462 15785 24018 -29495 -10380 32206 -8211 -24975 21153 7111 -27298 11112
1261A1112R774m8001J9118L9020m0758j5560M6759j3110l5780L7220J0124m6805
$$ 11112 20886 -27115 -7997 31023 -9735 -25295 21464 8354 -27426 9794 19918 -26887
1273b6887J9676L8633m2505j6868N0162j0390l9112L2316J3016m0150J7530L2374
$$ -26887 -7211 31422 -11083 -27951 22211 11821 -27291 5025 18041 -22109 -4579 27795
1285B7795m3145j0607N3800j5727m5576L6275K2123m2515Q285L0868l3367o402
$$ 27795 -15350 -25957 27843 12116 -33460 2815 24938 -17577 -9292 21576 -11791 -18193
1297a8193M5368k2610m0083M5780K0151n3683O394M2588k7883j6531L6646j4844
$$ -18193 27175 4565 -35518 10262 30413 -23270 -16876 25712 -2171 -18702 17944 3100
1309C100k9404M1355Q454n3162J7978M6506l8708k3864M5668n674l5441L1100
$$ 3100 -26304 15051 23505 -29657 -11679 34827 -3881 -27745 17923 12249 -23192 7908
1321G908J1691m3235J7886L7654m1754j6760N0509j0238m1233L3194J7279m3157
$$ 7908 19599 -23636 -5750 31904 -9850 -26610 23899 13661 -27572 5622 22901 -20256
1333b0256J2709L6984l8007j5909M8657j0920m0804L2927J8469m2884J1437L5428
$$ -20256 -7547 29437 -8570 -24479 24178 13258 -27546 5381 23850 -19034 -7597 27831
1345B7831l6969j4234M9120j2716m3700L4855K2706m3097N262L4195k9884j1840
$$ 27831 -9138 -23372 25748 13032 -30668 4187 26893 -16204 -10942 23253 -6631 -18471
1357a8471M3145j7081l9342M1064K0946n0973L600M3365k5183k0852L5094r449
$$ -18471 24674 7593 -31749 9315 30261 -20712 -17112 26253 1070 -19782 15312 5863
1369E863k9449L6399R772n0243J5099M6969l6382k8122M4820R61l6512K3734J3900
$$ 5863 -23586 12813 22585 -27658 -12559 34410 -1972 -30094 14726 15687 -20825 2909 16809
1382A6809l7465J5106L4905l9997j8051N2042o949m5845K8830K4165l9218M808
$$ 16809 -20656 -5550 29355 -10642 -28693 23349 16400 -29445 -615 23550 -15668 -10860
1394a0860L3719l1048j4184M4878j1766m1747L4564K2594m4938M466L8973k9543
$$ -10860 22859 -8189 -22373 22505 10739 -31008 3556 26150 -18788 -14322 24651 -4892
1406d892j8241M2404q714l9567L3065K1025m4392M559L9126k8787j8374M1654
$$ -4892 -23133 19271 10557 -29010 4055 25080 -19312 -14753 24373 -4414 -22788 18866
1418A8866r486l8675L4978K1400m7716L164M3377k5520k2883L6314n046l1993
$$ 18866 9380 -29295 5683 27083 -20633 -17469 25908 388 -22495 13819 8773 -23220
1430b3220L1397J3856m6941J1693M5933l3828k8980M3773M019l7662K0073J6856
$$ -23220 8177 22033 -24908 -13215 32718 -1110 -30090 13683 17702 -19960 113 16969
1442A6969l3982J1528L3313l7040j8394N0875m112m8390K5737K9107l5904j430
$$ 16969 -17013 -5485 27828 -9212 -27606 23269 19157 -29233 -3496 25611 -10293 -11723
1454a1723L1830k5158j3495M0865j1591m1194L4414K6012m5812k207M1946k1508
$$ -11723 20107 -5051 -18546 22319 10728 -30466 3948 29960 -15852 -18059 23887 2379
1466B379k2599L5918n204l4389L0052J9306m4393M360M2572k7076k5254M0230
$$ 2379 -20220 15698 10494 -23895 6157 25463 -18930 -14570 28002 926 -24328 15902
1478A5902j595l7983K6805K1584m1780L021M0514k6055k4049L8706j830l5892
$$ 15902 14307 -23676 3129 24713 -17067 -14046 26468 413 -23636 15070 13240 -22652
1490b2652K7240J8569m2814O255M3079k9815k8151M1902M439l8816J9273K0674
$$ -22652 4588 23157 -19657 -13402 29677 -138 -28289 13613 18052 -20764 -1491 19183
1502A9183l4315O590L4183l2327k0307M7477j418m7391K2831L1183l4857n074
$$ 19183 -15132 -8542 25641 -6686 -26993 20484 19066 -28325 -5494 25689 -9168 -14242
1514a4242L1752k1260j5592L8645q939m0699L1973K8339m5124o282M2666j6454
$$ -14242 17510 -3750 -19342 19303 10364 -30335 1638 29977 -15147 -21429 21237 4783
1526D783k5673L1201p42l1713K6657J8421m3128L372M4346k5432k9760L7970N876
$$ 4783 -20890 10311 9569 -22144 4513 22934 -20194 -16822 27524 2092 -27668 10302 16178
1539A6178l7407J9456K1657l4927J430L7467k4989k4347L9279J654l9391K2026
$$ 16178 -21229 -1773 19884 -15043 -13613 23854 -1135 -25482 13797 15451 -23940 -1914
1551a914K4706l7290r44L9135k2977k6270L8143M040l8390J9467K3644l4908P72
$$ -1914 22792 -14498 -15442 23693 716 -25554 12589 16629 -21761 -2294 21350 -13558 -12786
1564a2786L6566k5608k3722M1840J799m3491K0657K9716l4140n667L3611j8896
$$ -12786 23780 -1828 -25550 16290 18089 -25402 -4745 24971 -9169 -14836 18775 -121
1576a21j9235L6311l949m0073K7846K8690m1976p953M2197j4765k6967K9288K489
$$ -121 -19356 16955 13006 -27067 779 29469 -12507 -20460 21737 6972 -19995 9293 11782
1589A1782l1145K3126J9711m0817J442M3951k3451l2035L7410R562l7111J4168
$$ 11782 -19363 3763 23474 -17343 -15901 28050 4599 -27436 9974 19536 -17575 -3407
1601c407K3040l0723k48L4950k3628k4783L9954L817m1476J7923K9296l3619o686
$$ -3407 19633 -11090 -11338 23612 -16 -24799 15155 18972 -22504 -4581 24715 -8904 -15590
1614a5590L5725j7415k4157L4058L249l7801J9556K6256l5062n011L7835j8685
$$ -15590 20135 2720 -21437 12621 15870 -21931 -2375 23881 -11181 -16192 21643 2958
1626B958k6212L5208N161l8846J7276K7957l2815o819L5370j7123k3490L3719
$$ 2958 -23254 11954 17115 -21731 -4455 23502 -9313 -16132 19238 2115 -21375 12344
1638A2344K313l8410K0942K8853l6947r498M0190j3370k7598K8556N774l2494
$$ 12344 14657 -23753 -2811 26042 -10905 -20403 19787 6417 -21181 7375 13149 -19345
1650a9345J9163K2277l7863j747M2258j9259l3016L4789J1731l6453J1049K4315
$$ -19345 -182 22095 -15768 -17515 24743 5484 -27532 7257 18988 -17465 -6416 17899
1662A7899k8451k254L3551k1796k4516L8575O336m2685J5034L1895l0352j0470
$$ 17899 -10552 -12806 20745 -1051 -25567 13008 19344 -23341 -8307 23588 -6764 -17234
1674a7234L3731j3826k3256L1792K996l6967J9148K8423l5167r263L8654j3100
$$ -17234 16497 2671 -20585 11207 14203 -22764 -3616 24807 -10360 -19623 19031 5931
1686E931k8142L0065P763l4705J4992K6121l1863p118L6454j4501k7459L1652
$$ 5931 -22211 7854 15617 -19088 -4096 22025 -9838 -16956 19498 4997 -22462 9190
1698I190P576l6629J4679K8330l1374r726L6529j1697k7411K7893P823l3036J5156
$$ 9190 16766 -19863 -5184 23146 -8228 -17954 18575 6878 -20533 7360 15183 -17853 -2697
1711b697K5045l3144o508L9412j4744l1451L0078J3329l4447R018K5203k6569
$$ -2697 22348 -10796 -17304 22108 7364 -24087 5991 19320 -15127 -6109 19094 -7475
1723g475n467L3435j7704k6411L4711R530m0037J0881L1917k7220j2469L1935
$$ -7475 -12942 20493 2789 -23622 11089 20619 -19418 -8537 23380 -3840 -16309 15626
1735A5626j0598k3693K9013N467l6022J5862K9579l2464j2355L7206q835k8963
$$ 15626 5028 -18665 10348 15815 -20207 -4345 25234 -7230 -19585 17621 8786 -20177
1747b0177K6359R555l2219J2345K5793l0408q412L6578j2229l0095K9438J1829
$$ -20177 6182 15737 -16482 -4137 21656 -8752 -17164 19414 7185 -22910 6528 18357
1759A8357l5392J0400K7876k7490j0896L3802j0247k6996K7028R820l4010J2043
$$ 18357 -17035 -6635 21241 -6249 -17145 16657 6410 -20586 6442 16262 -17748 -5705
1771e705K7087k9114j0963L6414r916l0343K6615J3355l2299P730K5336k5344
$$ -5705 21382 -7732 -18695 17719 7803 -22540 4075 17430 -14869 -7139 18197 -7147
1783g147q591L3111j2569k8117L0097J2430l7001P528L0081k3660j3177L0204
$$ -7147 -15738 17373 4804 -23313 6784 19214 -17787 -10259 19822 -3838 -17015 13189
1795A3189q411k4394K6712Q428l4592J1492L0096k7919j4698L4472n346k8428
$$ 13189 4778 -19616 7096 15524 -19068 -7576 22520 -5399 -20097 14375 9029 -19399
1807a9399K2645J1859l0449R369K5758k7335j0514L5118q912l0231K5783J4768
$$ -19399 3246 15105 -15344 -5975 19783 -7552 -18066 17052 8140 -22091 3692 18460
1819A8460l3297O206K7711k3611j1993L1607q107k7360K5938J2080l3626P947
$$ 18460 -14837 -8631 19080 -4531 -16524 15083 6976 -20384 5554 17634 -15992 -8045
1831h045K9311k5738j3451L3168o290k8581K3803J2997l1028O627K6668k4340
$$ -8045 21266 -4472 -17923 15245 8955 -19626 4177 17174 -13854 -7227 19441 -4899
1843d899j1285L2801r136k8281K5775J4335l3529M979K9122k2286j3249K9828
$$ -4899 -16184 16617 7481 -20800 4975 19310 -14219 -9240 19882 -2404 -15653 14175
1855A4175o603k5946K4598J1361l3349P722K9953k4139j6174L1994l490k7640
$$ 14175 7572 -18374 6224 17585 -15764 -8042 21911 -2228 -18402 13592 10102 -17538
1867a7538K0682J2722k9268P250K6045k4738j2676L3553o002l0032K1821J6343
$$ -17538 3144 15866 -13402 -6152 19893 -4845 -17521 16032 10030 -20002 1819 18162
1879A8162k9867L238K6134k0646j2599K9647o186k7438K3535J4281l2200M477
$$ 18162 -11705 -8467 17667 -2979 -15578 14069 7883 -19555 3980 18261 -13939 -9462
1891i462K8874k1720j5027L0224m196k7389K1453J3993l0400N304K6837k1980
$$ -9462 19412 -2308 -17335 12889 8693 -18696 2757 16750 -13650 -8346 18491 -3489
1903c489j3719L0596n171k8044K2452J4828l1052L674K7759j9873j4690K8678
$$ -3489 -17208 13388 8217 -19827 2625 17453 -13599 -9925 17834 -2039 -16729 11949
1915A1949m229k6332K1650J3229l1083M997K9118k1555j6516K9752j208k7380
$$ 11949 7720 -18612 3038 16267 -14816 -9819 19299 -2256 -18772 10980 9772 -17608
1927a7608J9093J3370k8181N344K6455k2371j4561L1341k619k9565J9183J6924
$$ -17608 1485 14855 -13326 -7982 18473 -3898 -18459 12882 10263 -19302 -119 16805
1939A6805k7764J593K5478j8941j2967K8812m819k7757K1343J6293l0120J169
$$ 16805 -10959 -9366 16112 -2829 -15796 13016 8197 -19560 1783 18076 -12044 -10875
1951a0875K8538j8354j5844K7720k492k5980J9326J4587k8714K246K7713j8409
$$ -10875 17663 -691 -16535 11185 8693 -17287 2039 16626 -12088 -9842 17871 -538
1963e38j6331K8248j744k6553J8519J5426k8525J689K7310j8025j5826K7578j284
$$ -538 -16869 11379 9635 -16918 1601 17027 -11498 -9809 17501 -524 -16350 11228 9944
1976I944k6396J8600J4963k8334J877K7682j8182j7194K7965n6k6311J6348J4877
$$ 9944 -16452 2148 17111 -11223 -9346 18336 154 -17040 10925 10869 -15442 906 15783
1989A5783k6496K349K6464j9429j5987K9499n40k8988J6851J7666k6141j03K4875
$$ 15783 -10713 -8364 18100 -1329 -17316 12183 11643 -17345 -494 17172 -8969 -9072 15803
2002A5803j6519j4229K7634k914k7864J9283J7267k8433j348K7684j5229j6718
$$ 15803 -716 -14945 12689 9775 -18089 1194 18461 -9972 -11320 16364 1135 -15583
2014a5583K5680q76k5584J7232J6051k8207N25K7763j6602j7274K6008J049k6555
$$ -15583 10097 9221 -16363 869 16920 -11287 -10762 17001 399 -16875 9133 10182 -16373
2027a6373J6279J5673k6063K97K6540j6290j7504K6592J435k6606J5199J6363
$$ -16373 -94 15579 -10484 -10187 16353 63 -17441 9151 10586 -16020 -821 15542
2039A5542k5380n27K6344j6021j7146K6210J480k6682J4393J7207k5288l37K5289
$$ 15542 -9838 -10365 15979 -42 -17188 9022 10502 -16180 -1787 15420 -9868 -10205 15084
2052A5084j5730j6461K6622J483k8015J5124J7882k4821j837K4970j4396j5514
$$ 15084 -646 -17107 9515 10998 -17017 -1893 15989 -8832 -10669 14301 -95 -15609
2064a5609K5141q5k6596J6301J7781k6503k262K6969j3583j7221K3825J157k4739
$$ -15609 9532 9447 -17149 -848 16933 -9570 -11832 15137 1554 -15667 8158 9315 -15424
2077a5424J5408J6433k6362j271K7557j4465j8950K4901L082k5261J3052J6452
$$ -15424 -16 16417 -9945 -11216 16341 1876 -17074 7827 10909 -14352 -1300 15152
2089A5152k4164j094K6065j4853j7729K5465L199k6955J2915J7748k3192k454
$$ 15152 -9012 -10106 15959 1106 -16623 8842 12041 -14914 -1999 15749 -7443 -9897
2101i897K5102j3915j6766K4803J903k5997J3178J8198k3989l268K5330j2616
$$ -9897 15205 1290 -15476 9327 11230 -14767 -1589 16609 -7380 -10648 14682 2066
2113B066j7277K3790K914k6024J2479J8434k3258l892K5137j1846j7062K2608
$$ 2066 -15211 8579 11493 -14531 -2052 16382 -6876 -10768 14369 2523 -14539 8069
2125H069K436k4710J3168J7755k4082m366K6691j1491j8304K1698L905k4051J1864
$$ 8069 10505 -14205 -1037 16718 -7364 -11730 14961 3470 -14834 6864 10769 -13282 -1418
2138a418J7342k3643l188K6278j2244j9427K2989N100k5221J0926J7535k2575
$$ -1418 15924 -7719 -10907 15371 3127 -16300 6689 11789 -13432 -2506 15029 -7546
2150g546k972K5527j3208j7910K3475M522k6105J0491J8761k1918m046K3913j1401
$$ -7546 -10518 15009 1801 -16109 7366 11888 -14217 -3726 15035 -6883 -10929 12984 1583
2163A583j7176K2889L400k5777J1772J9190k2397n647K5143j0483j7635K1363
$$ 1583 -15593 7296 10696 -15081 -3309 15881 -6516 -12163 12980 2497 -15138 6225
2175F225M012k4728J1691J8078k2461n240K5430r823j8698K1176M862k4035J0631
$$ 6225 10237 -14491 -2800 15278 -7183 -12423 13007 3184 -15514 5662 10524 -13511 -2880
2188b880J7606k2053m968K5627r893j9452K1093O095k4031R396J7622k0923m442
$$ -2880 14726 -7327 -12295 13332 3439 -16013 5080 11175 -12856 -3460 14162 -6761 -11203
2201a1203K4412j0033j8871K1010O805k4957Q932J8366k0062n624K3778r254j8394
$$ -11203 13209 3176 -15695 5315 12120 -12837 -3905 14461 -5601 -11225 12553 3299 -15095
2214a5095K1105N899k4749Q301J9633j9782o449K3181q639j7414K0192N352k4318
$$ -15095 6010 11909 -12840 -4539 15094 -4688 -11137 12044 3405 -14009 6183 11535 -12783
2227a2783R262J9419k0675o958K4118p720j8841J9578O057k3450Q873J8522k0708
$$ -12783 -3521 15898 -4777 -11735 12383 4663 -14178 5400 11457 -11993 -3120 15402 -5306
2240e306o139K4291p922j9293J9520O612k2753P855J8217k0109o020K4383q701
$$ -5306 -11445 12846 4924 -14369 5151 11763 -10990 -3135 15082 -5027 -11047 13336 4635
2253D635j9367J9201Q106k3712O862J8752j8672o580K2997q170j8562J9670P124
$$ 4635 -14732 4469 12575 -11137 -4275 14477 -4195 -10775 12222 4052 -14510 5160 12284
2266A2284k4179P450J9178j8615p621K3418p363j8571J8956O660k3358P003J9429
$$ 12284 -11895 -4445 14733 -3882 -11503 11915 4552 -14019 4937 11597 -11761 -4758 14671
2279A4671j8592q199K3275o691j8511J7997P397k3115P360J8727j8765q179K3485
$$ 14671 -3921 -12120 11155 4464 -14047 3950 11347 -11768 -4408 14319 -4446 -12625 10860
2292A0860n922j9355J7762Q090k2388N786J9006j8442p530K2999o071j9477J7583
$$ 10860 4938 -14417 3345 11435 -10953 -5167 13839 -4603 -12133 10866 4795 -14682 2901
2305B901Q284k2252N566J8810j7478p599K2536o383j9039J7584Q827k2862N233
$$ 2901 11185 -11067 -5501 13309 -4169 -11768 10768 4385 -14654 2930 11757 -11105 -5872
2318e872J9272j6763q422K1956n840j8622J7672Q306k3091N527J9647j7270r103
$$ -5872 13400 -3363 -11785 10171 4331 -14291 3381 11687 -11404 -5877 13770 -3500 -12603
2331a2603K2723n189j8731J6484Q977k2586N673J9310j7353q819K2641m804j9484
$$ -12603 10120 4931 -13800 2684 11661 -10925 -5252 14058 -3295 -12114 10527 5723 -13761
2344a3761J6411R290k2269M958J9283j7253q106K2200m732j9794J6289R807k1935
$$ -13761 2650 11940 -10329 -5371 13912 -3341 -11447 10753 6021 -13773 2516 12323 -9612
2357i612M233J8874j6102q623K1620m541j9313J6326R593k1910L817J9663j5856
$$ -9612 -5379 13495 -2607 -11230 10390 5849 -13464 2862 12455 -9455 -5638 14025 -1831
2370a831r819K1716l921j9387J5880J0104k2053L518J9496j5282r882K0901k982
$$ -1831 -11650 10066 6145 -13242 2638 12742 -9311 -5793 13703 -1579 -11461 9440 6458
2383F458j9110J5407R683k2037L717J9841j5544j0334K1584k910j9428J4731R936
$$ 6458 -12652 2755 12438 -9599 -5882 13959 -1585 -11919 9665 6755 -12673 2058 11994
2396A1994k0948L362J8789j5105r852K1347l123j9578J4902J0384k1404L336J8955
$$ 11994 -8954 -5592 13197 -1908 -11760 9587 6464 -13114 1788 12172 -9232 -5896 13059
2409A3059j5057r609K1200l663j9658J5169J0807k1409K506J9407j4353r802K0236
$$ 13059 -1998 -11607 9593 5930 -13728 1441 12248 -9161 -6655 12752 -1601 -11403 8833
2422H833k792j9282J4741J0386k1433K382K0066j4605j0806K0844j806j9453J3735
$$ 8833 6041 -13241 1500 11886 -9547 -7165 12901 -1704 -12510 8334 6528 -12925 810
2435H10J0668k0553K444J9397j4507j0698K1058k083j9539J3895J0650k0068J609
$$ 810 11478 -9075 -6631 12766 -1741 -12439 8619 6536 -13003 892 11542 -8526 -6917
2448f917J9229j3924j0811K0661j526j9956J3509J1585k0415J435J9216j3367
$$ -6917 12312 -1612 -12423 8238 6712 -13244 265 11850 -8565 -7130 12086 -1281
2460a281j0778K0121j366j9748J3847J1432k0467R67J9557j2879j1476K0061j238
$$ -1281 -12059 8062 6696 -13052 795 12227 -8240 -7273 12284 -595 -12071 7990 6752
2473F752j9078J3029J1532k0407N01K0351j2698j2232J9890o28j8898J2516J1359
$$ 6752 -12326 703 12235 -8172 -7671 12680 -18 -12250 7640 7012 -11886 630 11989
2486A1989k0124J070J9948j2977j2332K0575k09j9975J2138J1949j9173N66J9319
$$ 11989 -8135 -7065 12883 -94 -12426 8149 7940 -12035 103 12052 -7121 -6555 12764
2499A2764j3097j1511K0263m39j9929J2062J2614j9544l67J9217j2172j1438J9806
$$ 12764 -333 -11844 8419 7980 -11949 113 12727 -6817 -7184 12033 -139 -11577 8229
2512H229o67j9445J2077J2679j9642r02J9690j1099j2566J8898O04j9369J2017
$$ 8229 7562 -11883 194 12873 -6769 -7671 12019 920 -11646 7252 7856 -11513 504
2525E04J1997j9650p05K0106j1433j3054J8889J179j9368J1228J2156j8905o69
$$ 504 12501 -7149 -7854 12252 819 -12235 6654 7833 -11535 -307 11849 -7056 -7725
2538g725K0006j1602j3189J9232J032j9175J0468J2719j8611j156J9704j1692
$$ -7725 12281 679 -12510 6722 7754 -11421 -953 11766 -6845 -8001 11703 11
2550A1j2706J8969J894k0163J0331J3420j8354j284J8982j0775j2297J8835P23
$$ 11 -12695 6274 8168 -11995 -1664 11756 -6598 -7882 11100 325 -11972 6863 7586
2563G586j9667J0510J3976j9067j829J9297j0077j2879J8288J151j9320J1115
$$ 7586 -12081 -1571 12405 -6662 -8491 10806 729 -12150 6138 7289 -12031 -916
2575i16J3212j9132k170K0137r839j3493J7986J990j9131J0142J3146j8575j997
$$ -916 12296 -6836 -9006 11131 1292 -12201 5785 7775 -11356 -1214 11932 -6643 -8640
2588h640J9891r830j3932J8181K499j9064R482J3339j7959j941J9424j0422j3481
$$ -8640 11251 1421 -12511 5670 8169 -10895 -1413 11926 -6033 -7974 11450 1028 -12453
2601a2453J8474K543j9707R294J3799j7429k612J8631r296j3158J8293K683k0138
$$ -12453 6021 8564 -11143 -1849 11950 -5479 -8091 10540 1244 -11914 6379 9062 -11076
2614a1076R137J4458j7424l129J8743q577j3514J7555K453j9681R813J3830j7882
$$ -11076 -1939 12519 -4905 -8034 10709 2132 -11382 6173 8626 -11055 -1242 12588 -5294
2627e294l233J9255q080j4082J6816L062j9058R525J3437j7879k951J9719q401
$$ -5294 -8527 10728 2648 -11434 5382 8444 -10614 -1089 12348 -5531 -8482 11237 2836
2640B836j4295J6360M183j8982Q415J3311j6906l219J9832r123j4909J7858M089
$$ 2836 -11459 4901 9084 -9898 -1483 11828 -5078 -8297 11535 2412 -12497 5361 9450
2653I450j9424P307J4260j6178l574J8734q571j3720J7307L761j9819P781J4633
$$ 9450 -9974 -2667 11593 -4585 -8159 10575 2004 -11716 5591 9352 -10467 -2686 11947
2666A1947j6537m210J8645p470j4197J7144L175j9147P932J4866j6914m775J9546
$$ 11947 -4590 -8800 9845 2375 -11822 5322 8497 -10650 -2718 12148 -4766 -9541 10005
2679A0005p455j4138J6032L602j8493Q111J4083j6821m432J9548p193j5076J5739
$$ 10005 2550 -11588 4444 8046 -10447 -2336 11747 -5074 -9506 10042 2849 -12227 3512
2692C512M909j8439P220J3907j6251m098J9534p663j4938J6027N166j8702O501
$$ 3512 8421 -10018 -2798 11109 -5142 -9240 10294 2631 -12307 3720 8886 -9816 -3315
2705c315J4140j5148m773J8603o896j4994J6047N866j9264N715J5169j5053m864
$$ -3315 10825 -4323 -9096 9507 2611 -12383 3664 9530 -9734 -4019 11150 -3903 -8767
2718h767J8140o656j4509J5831M878j9049O331J5622j5337n971J8644n668j4603
$$ -8767 9373 2717 -11792 4039 8917 -10132 -3801 11821 -3516 -9487 9157 3489 -11114
2731a1114J4993N340j9105O736J5247j5932o041J9244n517j4893J4661N345j7987
$$ -11114 3879 9219 -9886 -3150 12097 -3835 -9876 9368 3851 -11042 3619 8964 -9023
2744i023O244J4479j5522n672J9555n897j5770J4925O519j8378N167J5063j5037
$$ -9023 -2779 11700 -3822 -9494 10061 4164 -11606 3319 9838 -8540 -3373 11690 -3347
2757c347n441J8686o054j5599J5734O586j9104M501J5454j4250n919J8064n726
$$ -3347 -8788 9898 3844 -11755 3979 10565 -8539 -4038 11416 -2834 -8753 9311 3585
2770C585j4763J5026N899j9068N524J5708j4495o776J8005m626j4849J4542O001
$$ 3585 -11178 3848 9747 -9321 -3797 11911 -2584 -9360 8645 4019 -10830 3712 9713
2783I713j8930N786J5290j4366p474J9088m699j5626J4101O519j8260N010J5243
$$ 9713 -9217 -3431 11859 -2507 -9981 9107 4408 -11218 2883 9402 -8858 -3848 11395
2796A1395j4542o607J8426m194j6034J3837O958j7651M150J5053j3639o869J8261
$$ 11395 -3147 -9754 8672 4478 -11556 2281 9239 -8412 -4262 10791 -2848 -9717 8544
2809H544m723j5586J3952P491j8477L799J5753j3391o746J7450m363j5368J4392
$$ 8544 3821 -11765 2187 9678 -8799 -5000 10753 -2638 -9384 8066 3703 -11665 2727
2822B727P183j8910L772J6091j2888p867J7410l522j5273J3468P449j8507M025
$$ 2727 9910 -9000 -5228 10863 -2025 -9892 7518 3996 -11277 2191 9640 -8867 -4842
2835d842J6035j3452q329J8370k867j5800J2754P224j7819M011J5918j3668p777
$$ -4842 11193 -2259 -10588 7782 4915 -10885 1869 9093 -8726 -4715 11203 -2465 -10242
2848a0242J8416k997j6280J2522Q180j7085K365J5810j3003p423J8111l644j5856
$$ -10242 8174 5177 -11103 1419 9599 -7486 -5121 10689 -2314 -9737 8374 4730 -11126
2861a1126J2743Q600j7874K591J5842j2484p858J7596l112j6003J3058Q610j7938
$$ -11126 1617 10217 -7657 -5066 10776 -1708 -9566 8030 4918 -11085 1973 10583 -7355
2874g355K292J6041j2240q309J7282k584j6006J2932Q294j7660K168J6418j2378
$$ -7355 -5063 10978 -1262 -9571 7711 5127 -10879 2053 10347 -7313 -5145 11273 -1105
2887a105q563J7160j846j5975J2233Q273j7830K979J6082j2299r215J7683j658
$$ -1105 -9668 7492 5646 -10329 1904 10177 -7653 -4674 11408 -891 -10106 7577 5919
2900E919j6242J1398Q673j6704K125J5868j2470q226J7571k041j6528J1688R124
$$ 5919 -10323 1075 9748 -6956 -4831 11037 -1433 -9659 7912 5871 -10657 1031 10155
2913A0155j6731J310J5558j1352q465J6850j812j6256J2030R169j7548J179J6193
$$ 10155 -6576 -5266 10292 -1060 -9525 7325 5513 -10743 1287 10456 -7092 -5913 10280
2926A0280j0924r092J6660j508j6020J1668Q781j6814J218J6210j1313r506J6839
$$ 10280 -644 -9736 6924 5416 -10604 1064 9845 -6969 -5751 10459 -854 -10360 6479
2939F479q35j5932J0900R149j7204J501J6394j1218r828J6952r75j5843J0812
$$ 6479 5644 -10288 612 9761 -7443 -5942 10452 -766 -10594 6358 5383 -10460 352
2952C52R363j6493R19J6089j1100r491J7093j011j6514J0650R947j6517O44J5912
$$ 352 9715 -6778 -5859 10230 -870 -10361 6732 5721 -10793 -143 9804 -6713 -6069 9843
2966I843j0500r395J6295l50j6512J0264J0396j6071l54J5946r343r817J5663
$$ 9843 -657 -10052 6243 5893 -10619 -355 10041 -6030 -6384 9562 219 -9598 6065
2979F065n19j5809J0835R559j6785J00J6501r575j0475J6029l3j5472R633R685
$$ 6065 5546 -10263 572 10131 -6654 -6554 9947 372 -10103 5926 5893 -9579 54 9739
2993I739j6007j8J6697j0189j0452J6376M34j6123R356J0177j5998O9J5903r719
$$ 9739 -6268 -6286 10411 222 -10230 6146 6580 -9543 -187 9990 -6008 -5939 9964 245
3007B45j0096J6385R2j6106R269J0451j5482o99J5535r121r909J5801K55j6111
$$ 245 -9851 6534 6626 -9480 -211 10240 -5242 -5941 9594 473 -9436 6365 6620 -9491
3021i491R513J0181j5663p88J6191r236j0210J5460O81j6051R317J0597j5951
$$ -9491 22 10203 -5460 -6248 9943 707 -9503 5957 6638 -9413 -96 10501 -5450
3034e450q90J6095q587j0392J4694J194j6000Q877J0750j5928q20J6042q375j0931
$$ -5450 -6340 9755 1168 -9224 5470 6664 -9336 -459 10291 -5637 -6457 9585 1210 -9721
3048i721J4923J429j5748P993J0827j5107j042J5966q858j0555J5349J407j5929
$$ -9721 5202 6631 -9117 -1124 9703 -5404 -6446 9520 662 -9893 5456 6863 -9066
3061i066P370J1375j4783j653J5664p992j0880J4865J645j6291Q380J1287j4750
$$ -9066 -1696 9679 -5104 -6757 8907 915 -9965 4900 6545 -9746 -1366 9921 -4829
3074d829k568J6056p582j0844J4289J739j5523Q184J1186j5294j946J6098p756
$$ -4829 -7397 8659 1077 -9767 4522 6261 -9262 -1078 10108 -5186 -7132 8966 1210
3087A210j1243J4089K371j5539P727J0745j4458k024J5923p660j1268J4753J696
$$ 1210 -10033 4056 6427 -9112 -1385 9360 -5098 -7122 8801 1141 -10127 4626 6322
3100F322j5411P778J0940j4595k112J5863p269j1389J4119K237j5124O783J1111
$$ 6322 -9089 -1311 9629 -4966 -7078 8785 1516 -9873 4246 6483 -8641 -1858 9253
3113I253j3582k588J5629p470j0786J4213K497j5605O737J1607j3879k818J5191
$$ 9253 -4329 -6917 8712 1242 -9544 4669 7166 -8439 -1702 9905 -3974 -6792 8399
3126H399o712j0787J3551K739j5746O799J1697j3792l417J5718o420j1309J3461
$$ 8399 1687 -9100 4451 7190 -8556 -1757 9940 -3852 -7269 8449 2029 -9280 4181
3139D181K780j5279P329J0883j3981k777J5721o545j1891J3613L282j5097O088
$$ 4181 6961 -8318 -989 9894 -4087 -6864 8857 2312 -9579 4034 7316 -7781 -1693
3152a693J1227j3365k745J5255o719j1401J3677L407j5814O063J1587j2832l533
$$ -1693 9534 -3831 -6576 8679 1960 -9441 4236 7643 -8171 -2108 9479 -3353 -6886
3165f886J5227o296j1134J3494K981j5650O184J1528j2876l532J4833n789j1145
$$ -6886 8341 2045 -9089 4405 7386 -8264 -2080 9448 -3428 -6960 7873 2084 -9061
3178i061J2675L386j5278N939J2115j3530l613J5155n647j1388J2924L587j5408
$$ -9061 3614 7000 -8278 -2339 9776 -3754 -7367 7788 2141 -9247 3677 7264 -8144
3191h144O128J0933j2638l606J5096n339j2006J2611L959j5138N597J1268j2352
$$ -8144 -2016 8917 -3721 -7327 7769 2430 -9576 3035 6994 -8144 -2547 8721 -3631
3204c631l947J5486n478j2290J2789M255j4717M628J1677j2075m206J4715n216
$$ -3631 -7578 7908 2430 -9860 2929 7184 -7533 -2905 8772 -3303 -7509 7206 1990
3217A990j1385J2261M091j4912N034J1896j2052m460J4748m823j1278J1618M032
$$ 1990 -9395 2866 6957 -7955 -2921 8975 -3077 -7537 7211 2388 -8890 2728 6760
3230F760j4480M719J2214j2243m878J5029m118j1804J1441M631j4726M790J1569
$$ 6760 -7720 -3001 9213 -3030 -7908 7121 3003 -8801 2640 7271 -7455 -2665 8904
3243H904j2184m269J4990m274j2379J1766M873j4647M359J1722j1252m833J4793
$$ 8904 -3280 -7549 7441 3167 -9212 2554 7427 -7220 -2861 8861 -2391 -7224 7569
3256G569m431j2171J1644N142j4646L803J1932j0920n110J4599m126j2031J1423
$$ 7569 3138 -9033 2611 7753 -6893 -3090 8842 -2078 -7188 7411 3285 -8746 2677
3269B677N002j4544L901J2124j1210m630J3881l881j1818J1376M556j4520M016
$$ 2677 7679 -6865 -2964 9160 -2050 -6680 7201 3320 -8498 2878 7434 -7086 -3070
3282c070J2637j1383n603J3910k890j1968J0707N210j4058L853J1487j0819n312
$$ -3070 9567 -1816 -7419 6491 3601 -8367 2340 7550 -6508 -2655 8832 -1987 -7299
3295g299J4173l248j2036J0654N260j3609L123J1657j0788m926J4083l553j2132
$$ -7299 6874 3626 -8410 2244 7504 -6105 -2982 8675 -2113 -7039 7044 3491 -8641
3308h641J0639N387j3458K631J1705j0150n444J3992l491j1945J0867N612j4206
$$ -8641 1998 7385 -6073 -3442 8263 -1887 -7331 6661 3170 -8775 2092 7704 -6502
3321f502K705J2217j0334n509J3275k679j1630J0042N733j3880K966J2001j0062
$$ -6502 -3797 8420 -1914 -7423 5852 3173 -8457 1585 7318 -6562 -3596 8405 -1657
3334a657o007J3502k548j1784J0013N440j3533L134J1665j0074n904J3756k581
$$ -1657 -7664 5838 3290 -8494 1519 6959 -6574 -3440 8225 -1849 -7753 6003 3422
3347C422j1831R638N773j3389K529J2206j0324n928J3777k585j1666R453O074
$$ 3422 -8409 1229 7002 -6387 -3858 8348 -1976 -7904 5873 3288 -8378 1075 7149
3360G149j3077K152J1798r815n666J3685k504j2353J0022O312j3345J605J1979
$$ 7149 -5928 -3776 8022 -1793 -7459 6226 3722 -8631 1391 7703 -5642 -4037 7942
3373G942q875o328J2960k154j1762R432O235j3320J949J2502r617o512J2951j340
$$ 7942 -933 -7261 5699 3545 -8217 1215 7450 -5870 -3921 8581 -1036 -7548 5403 4063
3387D063j1488Q996N957j3089J713J2312r363o558J3318j347j2284Q926O203j2680
$$ 4063 -7425 1571 7528 -5561 -3848 8464 -899 -7457 5861 4514 -7770 1156 7359 -5321
3401e321K202J1749r665o272J3339j541j2267Q702O908j2771J113J1645q395o433
$$ -5321 -3119 8630 -1035 -7307 6032 4491 -7776 926 7834 -4937 -3824 7821 -574 -7007
3415g007J2611j161j2149Q842O340j2417J116J1645q432o436J2837j864j1891
$$ -7007 5604 4443 -7706 1136 7476 -4941 -3825 7820 -612 -7048 5789 3925 -7966
3428g966R016O716j2785P76J1499p603o995J2325p96j1813Q545O318j2686J132
$$ -7966 1050 7766 -5019 -4243 7256 -347 -7342 4983 4187 -7626 919 7237 -5449 -4317
3442d317J2256q494p184J2628n56j1572P734O366j2328J394J1378q192o734J2600
$$ -4317 7939 -555 -7739 4889 4333 -7239 495 6861 -5467 -4073 7305 -887 -7621 4979
3456D979m86j2034P460P000j1680M80J1517p652o849J2073n99j2388Q105P507
$$ 4979 4493 -7541 -81 6919 -4761 -4281 7236 -416 -7265 4808 4209 -8179 -74 7433
3470G433j2172P7J1775p573p080J2143n44j1807P773P522j2430K85J1871p233
$$ 7433 -4739 -4662 7113 -460 -7540 4603 4059 -7748 25 7547 -4883 -4598 7273 40
3484D0p648J1550N29j1737P074P336j1600j45J1996p222p501J1585J14j1354O427
$$ 40 -7608 3942 4471 -7266 -192 7144 -4456 -4601 7395 173 -7328 4257 4371 -6983 -556
3499e56P586j1521j17J2068p138p662J1337Q44j1765O469P658j1147j84J1282
$$ -556 7030 -4491 -4608 7460 322 -7340 3997 4841 -6924 -455 7203 -3944 -4128 7154
3513G154o948p572J1893L55j2051O638Q242j1527p43J1500o377p307J1127L84
$$ 7154 206 -7366 4527 4882 -7169 -531 7711 -3816 -4559 6941 564 -6743 4384 4768
3527D768j1871O997P448j1103p30J1159n968p264J0597P19j1343O660P347j1120
$$ 4768 -7103 -106 7342 -3761 -4491 6668 700 -6564 4033 4752 -6591 69 7416 -3704
3541c704j024J1930o407p823J1085J041j1675O184P730j1209n93J1490o345p809
$$ -3704 -4728 7202 795 -7028 4057 5098 -6577 -393 7337 -3872 -4465 7025 680 -7129
3555g129J1252J290j1929N871P775j0795r45J1387n954p870J0867P95j1125N478
$$ -7129 4123 5413 -6516 -645 7130 -3665 -4610 6777 823 -7047 3820 4615 -6510 -1032
3569a032Q280j0664j441J1375o210p122J0537J022j1421N672P931j0543j291J1157
$$ -1032 7248 -3416 -4857 6518 308 -6814 3723 4745 -6676 -1004 6927 -3616 -4907 6250
3583F250n526p754J0422R68j0863N565P628j0276j789J1884n634p818R927J554
$$ 6250 724 -7030 3392 4360 -6503 -938 6690 -3586 -5375 6509 875 -6943 2984 4538
3597D538j0854N301P415j0058j499J1310n446q220J0541K123j1435M987Q042r990
$$ 4538 -6316 -1015 6400 -3658 -5157 6153 707 -7513 3028 5151 -6284 -1297 6745 -3245
3611c245j482J1026n592p929J0295J669j1097N188P969r645j930J0580m811p800
$$ -3245 -4727 6299 707 -7222 3073 4742 -6355 -1167 6802 -2843 -4773 5807 996 -6804
3625f804R681J982j1284N080Q380r848k021J0549m314q124R846J738j0965M910
$$ -6804 2877 4859 -6425 -1345 7035 -2813 -4834 5715 1401 -6723 3123 4861 -6104 -1194
3639a194Q275r905k397J1365m282q549R609K103j0713M459P959r701j834J0930
$$ -1194 7081 -2824 -5221 6144 1862 -6687 2922 5025 -5688 -1229 6730 -2971 -4805 6125
3653F125m320q388R289K611j0915M034Q423r331k507J1107m565q363R713K773
$$ 6125 1805 -6583 2706 5317 -5598 -1564 6859 -2472 -4979 6128 1563 -6800 2913 5686
3667E686j1152L802Q640r360k521J0759m403p824R146K683j0948L847Q612r228
$$ 5686 -5466 -1664 6976 -2384 -4905 5854 1451 -6373 2773 5456 -5492 -1645 6967 -2261
3681b261l166J0833l706q166Q961K584j0699M070Q488r269k850J0977l722q267
$$ -2261 -5427 5406 1700 -6466 2495 5079 -5620 -1550 6938 -2331 -5181 5796 2074 -6193
3695f193Q592K896j0669L965Q068r008k791J0708m029q115Q651L335j0557L233
$$ -6193 2399 5295 -5374 -1409 6659 -2349 -5140 5568 1539 -6576 2075 5410 -5147 -1914
3709a914Q101q487k889J0436l708q183Q543L487j0814L199Q739q651k966J0137
$$ -1914 6187 -2300 -5189 5247 1539 -6644 1899 5386 -5428 -2229 6510 -2141 -5107 5030
3723E030l445q282Q881L230j1148L209Q952q471l286J0517l456q083Q201L462
$$ 5030 1585 -6697 2184 5414 -5734 -2525 6427 -2044 -5330 5187 1731 -6352 1849 5311
3737E311j0880L479Q638q512l894J0776k649q707Q038L181j0105L241Q309q339
$$ 5311 -5569 -2090 6548 -1964 -5858 4918 2269 -6438 1600 4781 -5324 -2083 6226 -2113
3751b113l418J0543k822q752Q284L374j0025K904Q174q032l427J0358k947q311
$$ -2113 -5531 5012 2190 -6562 1722 5096 -4929 -2025 6149 -1883 -5310 5048 2101 -6210
3765f210P984L615j0109K452Q510p793l351R898k690q479P918L813j0541K855
$$ -6210 1774 5389 -4720 -2268 6242 -1551 -4902 4996 2306 -6173 1745 5558 -4983 -2128
3779b128Q629p950l344R583k442q301P819L358j0166K537Q939p755m052R846k030
$$ -2128 6501 -1449 -4793 4790 2348 -5953 1866 5224 -4942 -2405 6534 -1221 -5273 4573 2543
3794B543q466P380L950r892K523Q601p781m295J0361j961r070P359M301r922J956
$$ 2543 -5923 1457 5407 -4485 -1962 6639 -1142 -5437 4924 2963 -6107 1252 5553 -4369 -2413
3809b413Q614p371l750R900k183q765P204M480r972J469Q639o685m335R636j865
$$ -2413 6201 -1170 -4920 4980 2797 -5968 1236 5716 -4256 -2787 5852 -833 -5168 4468 2603
3824B603q636P408M103r966J843Q777p174m294R496j849q187P128L995r982J792
$$ 2603 -6033 1375 5478 -4488 -2645 6132 -1042 -5336 4160 2311 -5876 1252 5247 -4735 -2943
3839b943R076p089m737R878j553q606O662M507r644J558Q691o893m566J0041j507
$$ -2943 6133 -956 -5693 4185 2632 -5974 688 5195 -4449 -2891 5800 -1093 -5659 4382 2875
3854B875r006O896M196r374J609Q658o903m651R895j511q866O787M543r467J216
$$ 2875 -6131 765 4961 -4413 -2804 5854 -1049 -5700 4195 2684 -6182 605 5148 -4319 -3103
3869c103Q495o373m312R256j172q961P049M401r663J125R083o466m972R528j092
$$ -3103 5392 -981 -5293 3963 2791 -6170 879 5280 -4383 -3258 5825 -641 -5613 3915 2823
3884B823q680O760M378r678J279Q788o295m801R170o01q846O468M679r504J143
$$ 2823 -5857 903 5281 -4397 -3118 5670 -625 -5426 3744 3143 -5703 765 5444 -4060 -2917
3899b917Q950o615m967R545n72r217O513M793r098Q16Q770o426m946R675r97r086
$$ -2917 6033 -582 -5549 3996 3424 -5793 720 5513 -3585 -2769 6001 -425 -5371 4304 3307 -5779
3915e779O142N232r345P37Q667n861n136R332j063q450O374N055r565L22R126
$$ -5779 363 5595 -3750 -3013 5654 -207 -5343 3989 2926 -5524 850 5905 -3660 -3338 5788
3930E788n644n248R064r46q781O579N007r497O70Q804n869n257Q836j18q803N963
$$ 5788 144 -5104 3960 3014 -5767 812 5819 -3678 -3008 5796 -73 -5330 3506 3388 -5415 548
3946E48M895r077M98Q948o322m955R349l22r169N696N389q895K28R020o573m898
$$ 548 5443 -3634 -3136 5812 -510 -5465 3884 3562 -5607 89 5478 -3417 -3189 5831 -742 -5640
3962e640R329j81r600O100N566r162L43Q650n647n370Q970j97q909N587N503q947
$$ -5640 3689 3508 -6092 8 5574 -3588 -3245 5405 -242 -5612 3358 3161 -5748 -161 5342 -3605
3978c605jQ750m999n761Q799p8q689N464N274q727k27R367n280n934Q786qq331
$$ -3605 -3606 5144 145 -5616 3183 3105 -5584 -120 5154 -3573 -3800 5567 287 -5647 3139 3131 -5200
3995e200N074N781r331n3R168n605n867R318L15q924M931N619q685l57R156n212
$$ -5200 -126 5655 -3676 -3729 5439 -166 -6033 3285 3600 -5324 -393 5226 -3459 -3816 5340 128
4011A28n891Q977K30q987M867N904q358l67Q513m943n201Q410M45r469N381O134
$$ 128 -5763 3214 3444 -5543 -676 5228 -3130 -3497 5016 73 -5128 3282 3727 -5742 -361 5773
4027E773q843q15R233n003n464Q254J26q592N031N918q797m02Q820m428o126Q193
$$ 5773 -3070 -3885 5348 345 -5119 3135 3261 -5331 -300 5618 -3179 -3581 5239 811 -5315 2878
4043B878O67q567M879N821q684o29Q907m598o221Q231J131q737M549N829q286
$$ 2878 3545 -5022 -143 5678 -3006 -3635 5272 674 -5547 2684 3815 -4922 -373 5456 -2830
4058b830n34Q797m838n905Q326J202r279M416O345q195j105Q606m510o011Q652
$$ -2830 -3364 5433 595 -5310 3016 4218 -5061 -645 5700 -2495 -3600 5006 496 -5515 3137
4073C137P61q975M434O309q120j395Q907m338o270Q086J158r013M505O169q218
$$ 3137 3898 -5077 -643 5666 -2454 -3849 5058 720 -5550 2536 3694 -5319 -814 5355 -2863
4088b863j333R176l897o423P808J188q807M510N852q018j142Q725m012o391Q138
$$ -2863 -4196 4980 1083 -5340 2468 3656 -5151 -641 5211 -2807 -3949 4776 764 -5627 2511
4103B511J384q971M234O052p928j038R153m770o280P902J834r027L978O196p555
$$ 2511 3895 -5076 -842 5210 -2718 -3756 5397 627 -5653 2249 4083 -4944 -966 5230 -2325
4118b325j658Q515l977o357Q646R98q884L960O786p993j989Q899l906o188P766
$$ -2325 -3983 4532 555 -5802 2844 3842 -5042 -1082 5704 -2289 -4278 4621 715 -5473 2293
4133B293J485q845M155O371p913j914R131l849o333P356J658q187L840O221p750
$$ 2293 3778 -5067 -912 5459 -2454 -4368 4763 914 -5419 1937 3595 -4592 -752 5469 -2281
4148b281j938Q746l347o812P598J953q576L395O496p456j860R129l842o848P675
$$ -2281 -4219 4527 1180 -5632 1966 3919 -4657 -1262 5234 -2222 -4082 5047 1205 -5643 2032
4163B032K432r157L348O710p485j875Q985l714o532P896J830q909L239O797p098
$$ 2032 4464 -4693 -1345 5365 -2120 -3995 4990 1276 -5256 2640 4470 -4439 -1200 5597 -1501
4178a501k144Q498l386o435P310J943q481L080O932p455k783R031l220o484P043
$$ -1501 -3645 4853 1467 -4968 2342 4285 -4196 -1116 5816 -1639 -4422 4609 1389 -5095 1948
4193A948K297q542L129O677p272k568Q811k744p272P300K598q709L006O413o893
$$ 1948 4245 -4297 -1168 5509 -1763 -4331 4480 1736 -5536 1764 4362 -4347 -1341 5072 -1821
4208a821k181Q506l113o522P059K335q478K334P237p172k394Q775l210o974P396
$$ -1821 -4002 4504 1391 -5131 1928 4263 -4215 -1881 5356 -1816 -4210 4565 1355 -5619 1777
4223A777K795r074K870O810o900k672Q626l052o516P059K403q539K270P438o861
$$ 1777 4572 -4502 -1632 5178 -1722 -4394 4232 1180 -5336 1723 4126 -4413 -2143 5295 -1566
4238a566l196Q861k577o913O565K715q642L057O955p112k698Q558k156p356O638
$$ -1566 -4762 4099 1522 -5391 1174 3889 -4753 -1696 5259 -1853 -4551 4007 1851 -5505 1133
4253A133L332q861K663O690o818k615Q735k136p755O703L213q575K306O871o400
$$ 1133 4465 -4396 -1733 4957 -1861 -4476 4259 2123 -5632 1071 4284 -4291 -1985 4886 -1514
4268a514k678Q359k574p116P075K586q154K050O862o355k881Q362k342p040O840
$$ -1514 -4192 4167 1593 -5523 1552 4138 -4016 -1966 4896 -1459 -4340 4022 1680 -5360 1480
4283A480K927q593K032P591o596l249Q618k098p245O632L034q596K390O787o218
$$ 1480 4407 -4186 -2154 5437 -1159 -4408 4210 2112 -5133 1499 4533 -4063 -1673 5114 -1104
4298a104l459Q613j906p116O355K841q185K139P165o417l276Q709j979p464O307
$$ -1104 -4563 4050 2144 -4972 1383 4224 -3961 -1822 5343 -1074 -4350 4359 2380 -5084 1223
4313A223L451q456J740P212o320l091Q230j965p060O184L391q232J266P758n914
$$ 1223 4674 -3782 -2042 5170 -1150 -4241 3989 2024 -5036 1148 4539 -3693 -2427 5331 -583
4328e83l931Q407j867p144O496L150q471J647P695o519l312Q373j754p253O264
$$ -583 -4514 3893 2026 -5118 1378 4528 -3943 -2296 5399 -1120 -4432 3941 2187 -5066 1198
4343A198L308q250J751P149n988l935Q438j386p276N656L497p795J418P208n761
$$ 1198 4506 -3744 -1993 5156 -832 -4767 3671 2285 -4991 665 4162 -3633 -2215 4993 -768
4358g68m100Q311q41p722O131L329q050J241P340n587l913Q421j767p419O060
$$ -768 -4868 3443 2602 -5120 1011 4340 -3710 -2469 4871 -716 -4629 3792 2025 -5394 666
4373F66M052q138R47P011n102m343Q177j177p464O026L974q386J152P630n503
$$ 666 4718 -3420 -2473 4538 -564 -4907 3270 2093 -5371 655 4629 -3757 -2605 5025 -478
4388d78m075Q052j175p350N480L924p850N95Q048n692m506Q423r37p601N184M643
$$ -478 -4553 3499 2324 -5026 454 4378 -3472 -2877 5171 -521 -5027 3396 2459 -5142 42 4685
4404D685q392J193P520n605m229P928k63p895N260M545p963M95P674n377m111
$$ 4685 -3707 -2514 5006 -599 -4828 3100 2837 -5058 202 4747 -3216 -2721 4953 -424 -4535
4419d535P926n99p816N517M625q178M15P232m638m425P675n14p637N297M777q087
$$ -4535 3391 2792 -5024 493 5118 -3060 -2645 4587 -51 -4476 3199 2685 -4952 345 5122 -2965
4435b965k6Q258n432m374P587l25p306M965M466p974N02P324m716m655P731l35
$$ -2965 -2991 5267 -165 -4539 3048 2723 -4583 382 4848 -3126 -2624 4700 -16 -4671 3060 2725
4451B725p308M989M379q001O92P612n175m679Q090k07p769M601M743p213l02P587
$$ 2725 -4583 406 4785 -3216 -2524 5088 -87 -4766 3324 3117 -4652 -51 4692 -2521 -2823 4764
4467D764m886m687Q025R2p878M348M927p669J57P474m473m880P725k43p702M673
$$ 4764 -122 -4809 3216 3308 -4570 -222 4705 -2964 -2807 4667 194 -4686 3039 2796 -4906 -233
4483b33N196p784l13P798m469m825P442J62p700M627M584p303q09Q393m574n309
$$ -233 4963 -2821 -3134 4664 195 -4630 2812 2974 -4726 -99 4485 -2818 -3627 4766 192 -5117
4499e117P727L42p384M253M677p372k46Q057n002n078P583O98p658L892N112p125
$$ -5117 2610 2952 -4432 -179 4498 -2874 -3120 4937 -65 -5143 2440 3138 -4520 -628 4484 -2641
4515b641l44P400m449m821P446Q21q089M448N017p362o75P953m381m822P352K13
$$ -2641 -2985 4415 -34 -4855 2591 3412 -4677 -229 4788 -2574 -3249 4704 323 -4499 2853 3066
4531C066p687M251N177p124r85P583l774n181P387N32p892M382N085p411p28P629
$$ 3066 -4621 -370 4807 -2317 -3302 4281 507 -4674 2713 3245 -4647 -265 4820 -2591 -3319 4310
4547D310l659n359P167Q00p782M504M910p134q15P516l541n617P067J160p947
$$ 4310 651 -4708 2459 3259 -4523 -19 4891 -2243 -3058 4458 917 -4700 2367 3527 -4420
4562d420L705N511o955q85P484m177m727P040J044p573L608N288o896j270P285
$$ -4420 -715 4796 -2159 -3044 4440 263 -4464 2576 3620 -3953 -345 4943 -1953 -3223 4062
4577D062l511n165P161P59p794L785N595o979j258P250l100n406O999J138p633
$$ 4062 551 -4614 2547 3306 -4488 -703 4892 -2087 -3345 3905 805 -4601 2398 3536 -4097
4592d097L356N585o938j330P894l526n610O666J222p276L400N287o618j448P655
$$ -4097 -741 4844 -2094 -3424 4470 944 -4666 2000 3222 -4054 -654 4633 -1985 -3433 4222
4607D222l438n337O399J384p291L197N526o921r71P369l419n685O719J766p937
$$ 4222 784 -4553 1846 3230 -4061 -864 4662 -2259 -3230 4139 720 -4965 1754 3520 -4417
4622d417L250N825o401j882P289l092n257O406J751p775L258N577o142j691P141
$$ -4417 -1167 4658 -1743 -3625 3664 572 -4685 1721 3472 -4303 -1045 4532 -1610 -3301 3840
4637C840k923n390O266J449p371L233N498o540j466P080k333o060O120J792p113
$$ 3840 917 -4473 1793 3242 -4129 -896 4602 -1938 -3404 3676 1343 -4717 1403 3195 -3918
4652c918K866N641o716j594P832l088n651O340J814p342K503N488n894j577P311
$$ -3918 -1052 4589 -2127 -3721 4111 1023 -4628 1712 3526 -3816 -1313 4175 -1719 -3296 4015
4667D015k797n699O111K191p844K911N958o221k002P185k624n941O715J455p451
$$ 4015 1218 -4481 1630 3821 -4023 -1112 4846 -1375 -3377 3808 1184 -4757 1958 3413 -4038
4682d038K503O251n979k225P173k543n736O362J872p225K304N792n911k132P223
$$ -4038 -1535 4716 -1263 -3488 3685 1142 -4594 1768 3640 -3585 -1281 4511 -1400 -3532 3691
4697C691k477n504N851J937p091K284N714n842k053P264k304n907N755K462p155
$$ 3691 1214 -4290 1561 3498 -3593 -1309 4405 -1437 -3490 3774 1470 -4437 1318 3780 -3375
4712c375K117N672n986j884P260k498n966O152K250p115J903N925n659k388P350
$$ -3375 -1258 4414 -1572 -3456 3804 1306 -4660 1492 3742 -3373 -1470 4455 -1204 -3592 3758
4727C758k452n868O151K137p247K180N664n475k384O986j775n895N442K198o981
$$ 3758 1306 -4562 1589 3726 -3521 -1341 4323 -1152 -3536 3450 1675 -4220 1222 3420 -3561
4742c561J756O094n579k367O930j819n893N563K475p164J811N902n285k649P075
$$ -3561 -1805 4289 -1290 -3657 3273 1454 -4439 1124 3599 -3565 -1754 4148 -1137 -3786 3289
4757C289j743n898N663K229o794J547N879n284k443O554j496n909N521K589o979
$$ 3289 1546 -4352 1311 3540 -3254 -1707 4172 -1112 -3555 2999 1503 -4406 1115 3704 -3275
4772c275J502N960n182k660P029j716o192N551K466o689J375N723n073k538P247
$$ -3275 -1773 4187 -995 -3655 3374 1658 -4534 1017 3483 -3206 -1831 3892 -1181 -3719 3528
4787C528j698o001M994K814p197J516O439n259k968P034j435o019N013K809o677
$$ 3528 1830 -4171 823 3637 -3560 -2044 4395 -864 -3832 3202 1767 -4252 761 3570 -3107
4802c107J474N832n195k540O580j369n921N155K922o875J271N928n094k906O954
$$ -3107 -1633 4199 -996 -3536 3044 1675 -4246 909 3831 -3044 -1773 4155 -939 -3845 3109
4817C109j067o016M680L022o639J436N763m993k668O687j360n933M980K968p085
$$ 3109 2042 -3974 706 3728 -2911 -1475 4288 -705 -3373 3314 1954 -3979 1001 3969 -3116
4832c116J281N926m871k537O551j549n860N078K919o739Q87O264m715l034O387
$$ -3116 -1835 4091 -780 -3317 3234 1685 -4175 903 3822 -2917 -2030 4234 -481 -3515 2872
4847B872q76n884M599L154o712J225N762m718l176O624o56o102M216L064o235
$$ 2872 1996 -3888 711 3865 -2847 -1622 4140 -578 -3754 2870 2214 -3888 328 3392 -2843
4862b843Q18O107m716k955O723r47o390M435L408o538J006N514l995l322O411
$$ -2843 -2025 4082 -634 -3589 3134 2187 -4203 232 3640 -2898 -1892 3622 -373 -3695 2716
4877B716q08n792M164L425o447M59O182m272l353O197m85o033M328L535o307K16
$$ 2716 1908 -3884 280 3705 -2742 -2283 3899 -373 -3726 2471 1986 -4047 281 3816 -2491 -2275
4893b275O253m119l456N726m2n614L705L365o181P15N824m412l573O444k57n825
$$ -2275 3978 -141 -3597 2129 2087 -3527 178 3543 -2638 -1923 3901 -511 -4084 2360 2103 -3722
4909c722L828L565o175L49O121m531l305O169l38n660L664L385n472j5N795l934
$$ -3722 106 3671 -2504 -2155 3966 -565 -3870 2299 1961 -3699 -35 3350 -2122 -2137 3658 -276
4925b76l232O209m35o064M011L532o050J61N821l813l273N695k30n643L873L778
$$ -276 -3508 2701 2266 -3798 213 3745 -2305 -2144 3677 -136 -3409 2286 2056 -3587 286 4064
4941D064o584L66O141l785l609N806k03n672L695L533n967L11N903l957l720O088
$$ 4064 -2520 -2154 3987 202 -3407 2399 2196 -3476 219 3752 -2215 -1904 3999 42 -3678 2410
4957B410K14o066L736L230n474k28N826l643l468N655J28n903L387M015n671j90
$$ 2410 2624 -3442 294 3524 -1950 -2178 3648 5 -3463 2192 2320 -3583 -196 3819 -1852 -2042
4973b042N378l276l537N701K41o004L505L806n628l23N760l516l524N710q9n566
$$ -2042 3336 60 -3477 2224 2465 -3539 -34 3772 -1856 -2179 3581 65 -3459 2251 2162 -3404
4989c404L127M193n750p42O215l479l869N533L24n693L349L920n774k72N987l487
$$ -3404 -277 3916 -1834 -2576 3639 160 -3709 1824 2148 -3545 -196 3724 -2050 -2322 3665 178
5005A78l965N494O19n757K934M104n844k1N378k945m041N945J34n476K811L968
$$ 178 -3787 1707 2326 -3431 -497 3607 -2237 -2258 3120 175 -3866 2079 2213 -3263 -452 3516
5021C516n325n66N589k692l769N113N12n718K685M279n355q09N692k583l831M974
$$ 3516 -1809 -2375 3214 522 -3247 1866 2378 -3340 -655 3624 -1731 -2540 3152 569 -3262 1712
5037A712N20n719K962M213n574o01N575k656m163N271O69n345K703L782n060r81
$$ 1712 2232 -3487 -525 3688 -1886 -2487 3088 432 -3731 1540 2209 -3136 -433 3349 -1711 -2692
5053b692O029k988l731N002P66n301K635L685n032p05N801k867m122N195R84n976
$$ -2692 3337 349 -3382 1620 2386 -2915 -280 3405 -1627 -2332 3469 602 -3520 1675 2659 -3317
5069c317K781M328n055r68N386k435m081M765R34n305K457M164m947j122N684
$$ -3317 -536 3792 -1263 -2231 3155 720 -3361 1404 2338 -2967 -510 3654 -1293 -2415 3269
5084C269k509l828M544J303n625K318M150n356r02N674k302m102N038J000n988
$$ 3269 760 -3068 1476 2779 -2846 -528 3622 -1734 -2636 3038 736 -3366 1672 2672 -3316
5099c316K779M142n052j313N913k528l991M816J347n510K057M219m826j186N519
$$ -3316 -537 3605 -1447 -2760 3153 625 -3366 1450 2797 -2713 -656 3563 -1263 -2449 3070
5114C070k406m230N034J016n375J672M511m498j332N598k259m272M960J331n725
$$ 3070 664 -3566 1468 2484 -2891 -1219 3292 -1206 -2538 3060 801 -3471 1489 2820 -2905
5129b905K367M190n135j022N217k034m276M760J278n376K213L997m547j454N204
$$ -2905 -538 3652 -1483 -2505 2712 678 -3598 1162 2440 -2936 -723 3274 -1273 -2727 2477
5144B477j856l972M379J291n503K435L995m368j725N437j674m439M719J385n435
$$ 2477 621 -3351 1028 2319 -3184 -749 3246 -1122 -2847 2590 916 -3523 1196 2581 -2854
5159b854J731M438m510j600N465j716m489M715J347n296J563M231l858j865N188
$$ -2854 -1123 3315 -1195 -2795 2670 954 -3535 1180 2527 -2769 -1206 3025 -833 -2698 2490
5174B490j728l982M276J571n891K294M315m241j926N503j668m376M503J649n588
$$ 2490 762 -3220 1056 2627 -3264 -970 3345 -896 -2822 2681 1013 -3363 1140 2789 -2799
5189b799J790M435m488j504N256j633m254M318J784n524J797M167m244j905N570
$$ -2799 -1009 3426 -1062 -2566 2690 1057 -3197 1121 2905 -2619 -822 3345 -899 -2804 2766
5204B766j628m334M028J829n487J879M285l998j920N214j458m518M484J824n172
$$ 2766 1138 -3196 832 2661 -2826 -947 3338 -660 -2580 2634 1176 -3342 1142 2966 -2206
5219b206J099M379m383j313N245j877m213M446J697n360J094M579l782k086M813
$$ -2206 -1107 3272 -1111 -2424 2821 944 -3269 1177 2874 -2486 -1392 3187 -595 -2681 2132
5234B132q81m347L837K482n936J508M588m271j664M776r36m452L855K171n147
$$ 2132 1251 -3096 741 3223 -2713 -1205 3383 -888 -2552 2224 1288 -3164 691 2862 -2285
5249b285J030M505l997k076N188r77m524L683J952m941J116M164l824k146N580
$$ -2285 -1255 3250 -747 -2823 2365 1388 -3136 547 2499 -2442 -1326 2838 -986 -3132 2448
5264B448j062m522L639K277n051P01M666m210j632N125j170m635M078K184n258
$$ 2448 1386 -3136 503 2780 -2271 -1570 3096 -1114 -2746 2379 1209 -3426 652 2836 -2422
5279b422R02M596l818j990M816j149m611M227K209m906M63M753l665k570N540
$$ -2422 -1520 3076 -742 -2732 2084 935 -3676 551 2760 -2146 -1683 3070 -595 -3165 2375
5294B375j068m270L458J860n031J271M283l310k289M809o15m679L542K201m816
$$ 2375 1307 -2963 495 2355 -2676 -1405 2878 -432 -2721 2088 1473 -3206 336 2537 -2279
5309b279Q80M373l653j946M731o33m469L281K525m787N00M661l832k251N159p28
$$ -2279 -1399 2974 -679 -2625 2106 1473 -2996 285 2810 -1977 -1477 3184 -648 -2899 2260 1532
5325A532m328L182K511m708L87M873l509k712N005n60m737L711K308m860M17M293
$$ 1532 -2796 386 2897 -1811 -1424 3449 -60 -2772 2233 1673 -3064 647 2955 -1905 -1488 2805
5341B805k978k661N014m07m761L269K557n130O38M883l317k653N162q93m005K731
$$ 2805 -173 -2834 2180 1773 -2988 281 2838 -2292 -1654 3229 -88 -2741 2421 1528 -2477 254
5357B54K611m668M97M481l741k199M962l65m784L216K463m373L80M228k983k775
$$ 254 2865 -1803 -1306 3175 -566 -2765 2197 1832 -2952 264 2727 -1646 -1266 2962 -21 -2796
5373b796M791m95m419L088K510m576J96M423k690k796M982j037l997L060K724
$$ -2796 1995 1500 -2919 169 2679 -1897 -1701 2722 32 -2764 2218 1181 -2816 244 2968
5388B968m897p0M784l145k626M662k60m627L301K552m597j3M690k717k903M870
$$ 2968 -1929 -1999 2785 -360 -2986 1676 1416 -3211 90 2642 -1955 -1968 2722 5 -2898 1972
5404A972j71m564K803K208m036L9M494l185k305M403R0m603K900K485m447M15
$$ 1972 1801 -2763 40 2248 -1788 -1749 2745 -440 -2745 1658 1748 -2855 45 2530 -1917 -1502
5420a502M299l033k707M591K45m756K734K956m771L46M501k900k682M471k52m374
$$ -1502 2797 -236 -2943 1648 1893 -2863 -129 2827 -1944 -1598 2903 3 -2679 1792 1540 -2834
5436b834K656L025m798K5M530k195l396M614K67m835L127K698m617k1M545k414
$$ -2834 -178 2847 -1951 -1926 2604 409 -2987 1627 1894 -2941 186 2884 -1733 -1754 2791 377
5452C77l042M180J41m311K592K738m162l76M636k527l078M589J54m595K657L065
$$ 377 -2665 1515 1656 -2655 -63 2675 -1487 -1863 2773 246 -2832 1757 1911 -2684 -27 3038
5468C038m401l75M453k554k925M444L82m638K463L218m474m70M471k392l190M587
$$ 3038 -1363 -1738 2715 161 -2764 1680 2062 -2576 -113 3105 -1369 -1839 2632 240 -2950 1637
5484A637K31m685K638L198m209q06M622k325l029M175L28m571K539L199m408n93
$$ 1637 1868 -2817 -179 3019 -1190 -1996 2626 301 -2728 1447 1775 -2796 -257 2942 -1466 -2059
5500b059M545k183k957L958N72m451K395K919m129k91M529k484l273M509K48m276
$$ -2059 2486 303 -2654 1304 1876 -2575 -180 2739 -1390 -1681 2848 364 -2909 1600 1848 -2428
5516b428J912L477m442o11N178k921l277M618L49m509J998L328m019q62M769k469
$$ -2428 -516 2961 -1481 -2092 3086 165 -3112 1506 1855 -2654 -656 2672 -1347 -2209 2560 91
5532I1k856M089L68m540K000L599m270n19M298j483l425L773P73m661K600K949
$$ 91 -2765 1324 1692 -2848 -848 2751 -1519 -2038 2260 777 -2648 1125 1898 -2763 -163 2786
5548B786m381l15M436j945l530M110Q33m275K013K989m080k96M379k150l302L960
$$ 2786 -1595 -1910 2526 581 -2949 1161 1994 -2281 -268 2721 -1359 -1655 2724 574 -2728 1232
5564A232O57m315J996L134m192m10M292j812l226L697J115m492J589L563m002
$$ 1232 1889 -2426 -430 2704 -1488 -1898 2394 582 -2644 1053 2168 -2324 -735 2828 -1174
5579a174j016M724j942l198L651J083m532J815L316l969r00M514j732l404L742
$$ -1174 -2190 2534 592 -2606 1045 2128 -2404 -589 2727 -1242 -2142 2372 640 -2764 978
5594I78J065m511K098L130m020q72M646j513l529L485J136m213J739L338m205
$$ 978 2043 -2468 -370 2760 -1260 -2132 2514 1001 -2528 957 2093 -2120 -381 2957 -1248
5609a248p33M827j944l898M182R42m430J860L288l707j354M529j475l407L669
$$ -1248 -1981 2846 902 -2996 1186 2128 -2302 -442 2846 -861 -2215 2314 839 -2568 1101
5624A101J285m716J861L253l771j240M570j911l379L908J242m567J719L528l780
$$ 1101 2386 -2330 -469 2784 -987 -2227 2343 432 -2947 961 2203 -2364 -645 2883 -897
5639h97j234M435j699l199L649J032m692J776L436l726r88M324j392l734L799
$$ -897 -2131 2304 605 -2594 1055 2087 -2605 -829 2607 -1119 -2107 2217 825 -2909 890
5654H90J119m298J574L077l508j070M378j460l563L476J453m310J255L908l961
$$ 890 2009 -2289 -715 2362 -1146 -2216 2162 702 -2861 615 2068 -2242 -987 2921 -1040
5669a040j220M526j851l378L593J620m588J428L549l847j149M539j603l408L416
$$ -1040 -2260 2266 415 -2963 630 2250 -2338 -910 2639 -1208 -2357 2182 579 -2829 587
5684E87J704m689J611L546l529j539M172j281l108L124J476m264J237L378l193
$$ 587 2291 -2398 -787 2759 -770 -2309 1863 582 -2526 598 2074 -2190 -953 2425 -768
5699g68j780M494p63l799L436J280m163J416L411l633j363M507j087l692L089
$$ -768 -2548 1946 1183 -2616 820 2100 -2063 -647 2764 -869 -2232 2275 1188 -2504 585
5714E85J536m325J409L667l643j531M375j086l578L483J374m373J081L953l634
$$ 585 2121 -2204 -795 2872 -771 -2302 2073 987 -2591 892 2266 -2107 -1026 2927 -707
5729g07j225L872j004l810L884J274m173J215L197k975j494M124j288l503L374
$$ -707 -1932 1940 936 -2874 1010 2284 -1889 -674 2523 -452 -1946 2178 890 -2613 761
5744G61J706m581J254L645l321j688M379j069l601L023J831m357J099L734l412
$$ 761 2467 -2114 -860 2785 -536 -2224 2155 1086 -2515 508 2339 -2018 -919 2815 -597
5759e97j545M454j066l836L176J741m403P90L651l004j704M386j105l721L441
$$ -597 -2142 2312 1246 -2590 586 2327 -2076 -1286 2365 -639 -2343 2043 938 -2783 658
5774F58J642m187R88L697l412j795M083p60l572L146J697l940M83L778k923j735
$$ 658 2300 -1887 -899 2798 -614 -2409 1674 914 -2658 488 2185 -1755 -1272 2506 -417 -2152
5790b152M274j021l662L032J809m237P51L999l448j802L931n99l364K735K341
$$ -2152 2122 1101 -2561 471 2280 -1957 -1206 2793 -655 -2457 1474 875 -2489 246 2587
5805B587m340K17L866k836j868M159o85l608K623K253m304Q62L649l036j829M311
$$ 2587 -1753 -1536 2330 -506 -2374 1785 1100 -2508 115 2368 -1936 -1074 2575 -461 -2290 2021
5821B021p73l703K521K396m247M89L837k926k014M418r94l572K842K096m185N30
$$ 2021 1248 -2455 66 2462 -1785 -1296 2541 -385 -2399 2019 1025 -2547 295 2391 -1794 -1264
5837a264L824k631k550M397n80l898L182K033m432O04L796k701k293M402o06l578
$$ -1264 2560 -71 -2621 1776 1196 -2702 480 2513 -1919 -1315 2481 -220 -2513 1889 1283 -2295
5853b295K745J625l996O42L587k341k339M192o22l712L053J828l971O47L570k751
$$ -2295 450 2075 -1921 -1279 2308 -33 -2372 1820 1198 -2514 539 2367 -1604 -957 2613 -138
5869a38k087M123o79l896K861J975l472q4L942k796k034M350o05m013K692K125
$$ -138 -2225 1898 1219 -2677 184 2159 -1313 -1397 2545 -251 -2285 2065 1460 -2553 139 2264
5885B264l932L27L643k381k236L994o17l453K424K171l630K23L873k673k620M066
$$ 2264 -1668 -1341 2302 -79 -2315 1679 1062 -2391 33 2204 -1426 -1203 2670 -3 -2623 1443
5901A443l82l533K511K369l986J59L983k861k242M002j75l863K665K303l921n2
$$ 1443 1061 -2472 39 2408 -1578 -1419 2564 -297 -2539 1463 1288 -2575 90 2393 -1528 -1580
5917a580M112k956k338M607k98m241K649K231l785K52L564k442k239M013l06l790
$$ -1580 2532 -424 -2762 1845 1547 -2694 -45 2186 -1599 -1347 2217 -225 -2464 1549 1243 -2547
5933b547K263K493l620j83L877k088k594L808J27l975K605K189l831r3M003k376
$$ -2547 -284 2209 -1411 -1594 2283 195 -2399 1409 1536 -2439 166 2355 -1476 -1569 2434 58
5949E8k701M029j76l439K196K397m002J6M030k220k690L836P7l401J963K631l891
$$ 58 -2643 1386 1210 -2229 -33 2364 -1638 -1622 2408 188 -2502 1334 1411 -1990 -27 2604 -1287
5966a287o8L637k267k274L487O19m067K093K559l603o12M093k343k246M120k98
$$ -1287 -1355 2282 15 -2259 1228 1847 -2220 -127 2432 -1171 -1783 2310 -33 -2279 1841 1543
5982A543l572J883K844l953l92M075k291k421L675L51m327K253K594l338o12L882
$$ 1543 -2029 -146 2698 -1255 -1647 2428 137 -2284 1391 1742 -2585 -332 2262 -1076 -1688 2194
5998B194j885k601L640J39l670K153K230l520OL512j838k726L692Q9l592K068
$$ 2194 309 -2292 1348 1487 -2183 -30 2200 -1320 -1314 2198 360 -2366 1326 1415 -2177 -109
6014a09K369l434l16L782k024k541L657P67m134J736K415l617l27L985k074k551
$$ -109 2260 -1174 -1490 2292 268 -2273 1384 2151 -1983 -247 2168 -1449 -1776 2209 135 -2416
6030b416L825J31l585J491K892l508m71L788j976k517L462K85l567J813K665l309
$$ -2416 1409 1540 -2045 -554 2338 -1170 -1641 2147 171 -2346 1116 1401 -2166 -353 2312 -997
6046i97p95M028j644l023L812K90l868J846K363l141o72L930j736k813L651K76
$$ -997 -1792 2236 592 -2431 1381 1671 -2197 -351 2012 -1129 -1801 2129 393 -2420 1231 1507
6062A507l585J970K538l646m68L985j659l130L160Q47l820J954K873l497q47L631
$$ 1507 -2078 -108 2430 -1216 -1684 2301 642 -2488 672 1519 -2301 -347 2526 -971 -1818 1813
6078A813j331k848L156J220m179J852K612l400p79L925j026l438L054J118l454
$$ 1813 482 -2366 790 2010 -2169 -317 2295 -1105 -1884 2041 1015 -2423 631 1749 -1705
6093a705J213K792l340o55M011k028k465L323O12l837J404L237l822n86L866j190
$$ -1705 -492 2300 -1040 -1695 2316 288 -2177 1146 1758 -2079 -675 2562 -1260 -1846 2020 830
6109H30l180L195J003l616J369K737l267r56M052j577k983L162J202l621J098
$$ 830 -2350 845 1848 -1768 -399 2338 -929 -1885 2167 590 -2393 769 1971 -1650 -552
6124e52K996l515m93L757j602k819L206R74l824J255K980l215q65L771j425k874
$$ -552 2444 -1071 -1564 2193 591 -2228 978 1952 -1872 -617 2363 -852 -1717 2054 629 -2245
6140b245L070R95l986J423L080k997j091L820j560k785K959J171l987J549K867
$$ -2245 825 1820 -2166 -743 2337 -660 -1751 2069 509 -2276 683 1854 -2133 -584 2283
6155B283l449q18L828j064l099L262O49l513J317K698k839j204L957j447k784
$$ 2283 -1166 -1984 1844 780 -2319 943 1592 -1921 -604 2094 -745 -1949 2008 561 -2223
6170b223K614J289l388J317K527l004r83L784j336k829K828J381l881J284K786
$$ -2223 391 1680 -1708 -391 2136 -868 -1851 1933 597 -2232 596 1977 -1904 -620 2166
6185B166k846j178L649j309k695L011J093l987J279L033k648j538L673j239k741
$$ 2166 -680 -1858 1791 482 -2213 798 1891 -2096 -817 2216 -432 -1970 1703 464 -2277
6200b277K991J127l446Q63L087l046j221L604r02k805K603J217l480P32L376k946
$$ -2277 714 1841 -1605 -742 2345 -701 -1922 1682 780 -2025 578 1795 -1685 -953 2423 -523
6216e23r19L189j179k951L011J276l619Q07L102k749j080L225r14l027L147J202
$$ -523 -1442 1747 568 -2383 628 1904 -1715 -908 2194 -555 -1635 1590 676 -2351 796 1998
6232A998l286P36K858k662j522L679r94k648K544J031l430R46L324l006j401L369
$$ 1998 -1288 -552 2306 -356 -1878 1801 807 -1841 703 1734 -1696 -750 2574 -432 -1833 1536
6248A536m42k982K311J292l267N89K964k437j478L617p38k834K277J427l504P12
$$ 1536 1094 -1888 423 1715 -1552 -963 2001 -436 -1914 1703 965 -1869 408 1835 -1669 -957
6264i57K736k251j233L518p68l329K737J593l516Q21K666k491j222L614r68l018
$$ -957 1779 -472 -1705 1813 1045 -2284 453 2046 -1470 -649 2017 -474 -1696 1918 950 -2068
6280b068K373J492l206K71L020k220j240L105n93l148K583J273l243N99L262k707
$$ -2068 305 1797 -1409 -1138 1882 -338 -1578 1527 934 -2214 369 1642 -1601 -1002 2260 -447
6296d47j490L537p01k777K267J176l423J064K901k608j577L552m99k961K237J503
$$ -447 -1937 1600 899 -1878 389 1565 -1858 -794 2107 -501 -2078 1474 975 -1986 251 1754
6312A754l417P26K846k479j461L391k87l000J918J760l101M53L146k674j384L428
$$ 1754 -1663 -937 1909 -570 -2031 1360 1073 -1927 -9 1751 -1350 -897 2249 -425 -1809 1619
6328A619o95k961K380J740l402M01K912k329j561L393k81l333K374J460l333O83
$$ 1619 924 -2037 343 2083 -1319 -918 1994 -335 -1896 1497 1216 -2117 257 1717 -1616 -933
6344i33L037k534j490L279k40l092K372J511l470N99K716k068j757L439k07k868
$$ -933 2104 -430 -1920 1359 1119 -1973 399 1910 -1560 -961 1755 -313 -2070 1369 1162 -1706
6360a706J678J734l173M86L184k608j489L485o74k767J994J872l338J72K946j825
$$ -1706 -28 1706 -1467 -981 2203 -405 -1894 1591 917 -1850 144 2016 -1322 -1150 1796 -29
6376b9j982L108l6l205K203J995l226J54L255k224j712L238m97l071K412J755
$$ -29 -2011 1097 1061 -2144 59 2054 -1172 -1018 2237 13 -1699 1539 1042 -2029 383 2138
6392B138k963k14K922j723k047L114k10k810K229J445l220N48K700j905j731L088
$$ 2138 -825 -1039 1883 160 -1887 1227 1017 -1793 436 1881 -1339 -791 1909 4 -1727 1361
6408A361k30l012K022J771k980K0K915k067j334K789r7l108J978J763l015J31
$$ 1361 1131 -1881 141 1912 -1068 -1048 1867 -200 -1534 1255 1158 -1950 28 1791 -1224 -1093
6424a093K944j998j477L012n17k861J939J603k774J40K579j470j799K958j20l110
$$ -1093 1851 -147 -1624 1388 871 -1990 -51 1552 -1222 -1082 1497 27 -1772 1186 1066 -2044
6440b044J746K554l605K70K986k233j488K832j73k666J844J833k875j04L108k288
$$ -2044 -298 2256 -1349 -1079 1907 -326 -1814 1018 845 -1821 23 1856 -1019 -1123 1985 -303
6456c03j431K929N4l390K196K046l218j1K932j969j645K983j17k554J443J781
$$ -303 -1734 1195 1249 -2141 55 2101 -1117 -1128 1804 -165 -1810 1173 1056 -1498 -55 1726
6472A726k794o0K796j808j676K801n6k824J811J742k730k81L162j618j881K895
$$ 1726 -1068 -1128 1668 -140 -1816 985 929 -1895 -84 1658 -1072 -1353 1809 191 -1690 1205
6488A205l3k804J641K018l398j35L081j246k128K723J81k929J636K123l079%K988
$$ 1205 1172 -1632 9 2027 -1371 -1506 1575 329 -1799 924 1105 -1824 -188 1935 -1144 -1144 1844
6505A844j643j725K440L31k926J491K022k518l97K975j632j999L031P5k995J606
$$ 1844 201 -1524 916 1247 -1679 -188 1834 -684 -1081 1894 262 -1737 1294 1369 -1626 -20
6521b0K033k970l85L352j789j853K816j12k799J252K503k987o8K375j136k002
$$ -20 2013 -957 -1342 2010 221 -1632 1184 1072 -1727 -475 2028 -959 -1027 1348 212 -1790
6537a790K605O75k990J424J811k530m90K690j241k010K602M52k824J143K447k696
$$ -1790 815 1490 -1500 -76 1735 -795 -1285 1405 164 -1846 756 1208 -1616 -473 1974 -722
6553g22o96K956j269j802K369K33k505J226J820k267l78K692j170k236K411O87
$$ -722 -1418 1538 269 -1533 836 1069 -1436 -210 1610 -657 -1035 1657 487 -1749 662 1349
6569A349k814J333J841k424p39K824j315k203K824N02k785J329J569k290l11K696
$$ 1349 -1465 -132 1709 -715 -1454 1370 55 -2148 676 1178 -1607 -278 1291 -999 -1310 1386
6585A386r97k117K512K17k382J152K043k478o93K766j304j816K315P21l087J320
$$ 1386 389 -1728 784 1001 -1381 -229 1814 -664 -1357 1409 105 -1711 604 1325 -1762 -442
6601d42K342k632o07K889j121k034K506K88k920J520K188k969m47L091j528j676
$$ -442 1900 -732 -1339 1550 429 -1605 901 1189 -1731 -211 1977 -992 -1439 1652 124 -1552
6617a552K087P71k956J531J848k617n57K993j023k281K540M76k419P03K017j981
$$ -1552 535 1306 -1650 -119 1729 -888 -1445 1548 525 -1756 784 1260 -1159 -456 1561 -420
6633d20p61K592j229j902K385Q81l269J397K243k576n50K427q09k009K302P20
$$ -420 -1181 1411 182 -1720 665 1546 -1723 -326 1917 -659 -1209 1218 409 -1600 702 1422
6649A422l035J172K120k339o05K556p56k300K499O57k700J080J905k385o26K811
$$ 1422 -1613 -441 1679 -660 -1265 1291 535 -1765 734 1391 -1309 -229 1676 -709 -1335 1476
6665A476j083k260K668M98k978J353J885k092r57K493o06k207K339P65k716Q73
$$ 1476 393 -1867 801 1299 -1679 -326 1559 -533 -1490 1003 397 -1810 529 1294 -1422 -549
6681e49K032j875r62K772q89k276K249P40k963J169K425k244o34K383j075k057
$$ -549 1483 -392 -1354 1418 529 -1747 502 1242 -1721 -552 1873 -371 -1005 1378 303 -1754
6697a754K425P06k714Q54J749j834j133K917q35k073K057J143k907R48K090k087
$$ -1754 671 1377 -1337 -483 1266 -568 -1701 1216 381 -1692 365 1508 -1399 -451 1639 -448
6713d48p95K600q68j845J896P44k411L30K294k068j042K943o44k074J771Q90k431
$$ -448 -1243 1357 489 -1356 540 1284 -1127 -797 1497 -571 -1613 1330 686 -1388 383 1273 -1158
6730a158L33K362k106m54K470j057j899K040Q70k638P88J898j956q28K448q77
$$ -1158 -825 1537 -569 -1023 1447 390 -1509 531 1401 -1237 -449 1449 -507 -1335 1113 236
6746B36j471J411J122k487Q10J885k167q94K538k26k041K043O46k441M09K307
$$ 236 -1235 176 1298 -1189 -379 1506 -661 -1555 983 757 -1284 759 1405 -1036 -627 1680
6762A680k182m84K247m44k413K095R53k820Q30K073j998r54K582k19k732K155
$$ 1680 -502 -986 1261 817 -1596 499 1452 -1368 -538 1535 -463 -1417 1165 946 -1786 369
6778C69R46k460N90K005j835j166K621l80k222J792J121k285J36K379j838j031
$$ 369 1315 -1145 -555 1450 -385 -1551 1070 690 -1532 260 1381 -904 -768 1611 -227 -1258
6794a258K365j05k346J649J032k447N66K018j609j452K651k97k302J820J064k859
$$ -1258 1107 1002 -1344 305 1337 -1110 -544 1474 -135 -1587 1064 767 -1535 285 1349 -1510
6810a510Q84K292j933j143K178Q3k418J683J178k389M29K063j685j084K248m6
$$ -1510 -626 1666 -267 -1410 768 851 -1567 116 1294 -1095 -666 1397 -288 -1372 876 830
6826H30k662J621J521k257J37K203j554j016K499m14k404J712J021k399L23K623
$$ 830 -1832 -211 1310 -947 -810 1393 -161 -1177 1322 908 -1496 216 1237 -1162 -839 1784
6842A784k078j144K670l94k289J779J047k563K40K392j567j364K603m37k231J610
$$ 1784 -294 -1438 1232 838 -1451 328 1375 -1188 -948 1444 -123 -1487 1116 679 -1552 58
6858E8J274k414M90K189j811j276K589k49k353J656J371k335L21K182k059j100
$$ 58 1332 -1082 -592 1597 -214 -1490 1099 850 -1503 153 1524 -811 -490 1692 -367 -1467
6874a467K295k35j975J628J300k380J68K055j447j381K002K25k448J885J187k058
$$ -1467 828 593 -1382 246 1546 -834 -666 1389 -58 -1439 563 788 -1660 225 1412 -646
6890f46N9J998j543j102K481n12k119J541J283k408J53K516j735j500K263J04
$$ -646 -587 1411 -132 -1234 1247 735 -1384 157 1440 -968 -815 1701 -34 -1534 729 833
6906H33k431J918J411k853M65K310j520j706K358K2j984J320J116k326N97K036
$$ 833 -1598 320 1731 -1122 -657 1653 133 -1573 785 807 -1177 143 1259 -1067 -470 1566
6922A566j645j140K125j15k250J494J391k462J59K234j442j072K111k33k441K032
$$ 1566 -79 -1219 906 791 -1459 35 1426 -1036 -877 1357 -85 -1157 954 721 -1720 312
6938C12J043k422J35K524j634j315K398j43k343J352J440k281j33K519j459j614
$$ 312 1355 -1067 -932 1592 -42 -1357 1041 898 -1445 -93 1347 -934 -1067 1452 -7 -1621
6954a621K399o6k171J361J290j924k61K214j214j453K025J24k250J293J751k644
$$ -1621 778 712 -1459 -98 1192 -732 -993 1221 7 -1446 579 703 -1547 -254 1497 -1147
6970a147L14K028j181j501K384n5k163J158J711k563J18K267j815o44J752k5k255
$$ -1147 -833 1195 14 -1487 897 842 -1321 -163 1548 -1015 -897 1370 -445 -1089 663 638 -1617
6987a617J492J380k204l95K697j453j138K240J43k838J495J605j955p9K026j647
$$ -1617 -125 1255 -949 -1344 1353 -100 -1238 1002 1145 -1693 -198 1407 -548 -627 1399 -248
7003b48j209K394l40j642J187J616k637l65K797j483j378J797M06k143J265J255
$$ -248 -1457 937 597 -1045 142 1758 -879 -1244 1553 70 -1308 489 895 -1248 17 1272
7019A272k286R8K622j614j631K501K11k786J573J395j869m27K373j339j513K155
$$ 1272 -1014 -916 1706 92 -1539 962 1173 -1613 -40 1355 -514 -941 1432 93 -1420 735
7035G35K68k084R81J553k407M0K228j287j358K110K23j933O99J937k228n95K465
$$ 735 1003 -1081 -100 1453 -954 -914 1314 27 -1331 779 1002 -931 -232 1705 -523 -1118 1347
7052A347j100j398K068K45k426Q47J879k344j77K504j241j797K285K47k275J448
$$ 1347 247 -1151 917 1162 -1264 -417 1462 -882 -1059 1445 204 -1593 692 939 -1336 112
7068A12J145j957p57K660j139j664K329L36k261Q00J902k180j67K109j089j869
$$ 112 1257 -700 -1457 1203 64 -1600 729 1065 -1196 -396 1506 -674 -841 1268 179 -1690
7084a690K409M5j951Q26J852k249k22K119j036j387J680N06k179J098J277j918
$$ -1690 719 764 -1187 -361 1491 -758 -980 1139 103 -1284 396 902 -1277 -179 1098 -820
7100h20j30K373j129j760K169K80k111R11J663k378J97J814r48j595K076L34j884
$$ -820 -950 1423 294 -1466 703 983 -1128 -217 1446 -932 -735 1079 131 -1464 612 946 -938
7117i38O91J637k209j65K423j214j702K338K0k102R44J784j975m94K198p91j854
$$ -938 -247 1390 -819 -984 1439 225 -1477 861 881 -1221 -277 1507 -468 -962 1236 445 -1409
7134a409K072P05k717Q62J751j441p19K109j095j720K408M11k764J159K035k124
$$ -1409 663 1368 -1349 -487 1264 -177 -896 1213 118 -1602 806 1217 -1547 -388 1647 -477
7150d77n36K386j093j799K383Q8k047R30J960k452m13K184q63j804K161N25k355
$$ -477 -1013 1373 280 -1519 864 952 -1095 -165 1795 -657 -1070 1114 251 -1553 608 1133 -1222
7167a222R20J642j824n40K268j159j658K379J15k294R75J655j874m39K403q62
$$ -1222 -302 1340 -484 -1024 1244 85 -1573 806 921 -1373 -398 1257 -617 -1056 1347 485
7183D85j836J937P11k299R88J318j735r91K508m61k082K046O56k409R15J492j445
$$ 485 -1351 586 1297 -1002 -14 1304 -431 -1422 1086 625 -1457 589 1245 -1164 -249 1243 -202
7200b02r35K356o24k031J735O22j994O25J752j800p53K115o49j825K118N10k033
$$ -202 -1137 1219 595 -1436 299 921 -1073 -448 1304 -496 -1249 866 217 -1608 510 1020 -1013
7217a013M11J990j702p35K038o83j820J712Q64k256P72J500j295j034K515r40
$$ -1013 -602 1388 -314 -1049 989 306 -1514 198 1062 -1194 -422 1078 -217 -1251 1264 324
7233C24j899K048R03k534K67K300j699j118K467m86k320K094Q85k786Q28J947
$$ 324 -1575 473 1376 -1158 -891 1409 -290 -1408 1059 573 -1747 347 1232 -1554 -726 1221
7249A221j286q50J766l83j766J727J043k835R65K037k296o37K507p45j737J760
$$ 1221 -65 -915 851 468 -1298 429 1472 -1363 -398 1639 -657 -1294 1213 468 -1269 491
7265D91P43k204M55J995j936q54K275n29j783J644Q08k249N23K308j665j231K208
$$ 491 1234 -970 -515 1480 -456 -1310 965 436 -1347 297 1105 -1144 -621 1687 22 -1209 999
7282I99j68k047J631Q63k159M65J768j535p37J845j41k477K226N80k120J50K005
$$ 999 831 -1216 415 1278 -881 -416 1352 -183 -920 925 784 -1693 533 1113 -1007 -857 1148
7299A148j495o56K000l30j962J680R17k360M99K053j583j175K448m52j823J207
$$ 1148 -347 -1003 997 667 -1295 385 1302 -1058 -559 1494 -89 -1264 1184 732 -1091 116
7315A16J084k247N44J865j450j280K677n98k028J497O66j591j89J982j361r01
$$ 116 1200 -1047 -503 1362 -88 -1368 1309 711 -1317 180 846 -745 -934 1048 -313 -1214
7331a214K315m33k430J856J118k306O83J615j265j157K052m22k056J649J351k344
$$ -1214 1101 668 -1762 94 1212 -1094 -411 1204 -61 -1218 834 412 -1644 5 1356 -988
7347i88K99J954j541q23K120n34k051J657J262j980L0J743j206j065K046m88j947
$$ -988 -689 1265 -276 -1099 1021 487 -1564 93 1355 -625 -595 1148 -58 -1123 923 435 -1512
7364a512J824Q05k145M25K213j759j118K113J38k461J745R27k499M50K175j412
$$ -1512 312 1117 -1028 -603 1610 -149 -1267 846 984 -1477 268 1195 -1304 -854 1321 -91
7380i1j314K428l99k053J507J156k147L36J725j465r10K198n02j875J606J064
$$ -91 -1405 1023 624 -1429 78 1234 -913 -577 1148 -317 -1227 971 469 -1406 200 1264
7396A264k326L33J966j460j083K374l12k091J655J106k168j5K085j276j220J950
$$ 1264 -1062 -729 1237 -223 -1306 1068 756 -1335 320 1426 -742 -757 1328 52 -1168 782
7412G82j07j856J557J063k338J25K193j374j398K100K62k246J162J475k335K83
$$ 782 675 -1181 376 1439 -899 -774 1419 45 -1353 747 1009 -1237 -75 1400 -935 -652
7428f52J944j248j360K278l95j677R94J179j815K60J732j301j120J976J0k012
$$ -652 1292 44 -1316 962 567 -1110 -116 1063 -752 -492 1240 -61 -1181 795 805 -1207
7444a207J209J277j964O7K023j620j061K087O5k268J249J230k064R1J988r95j735
$$ -1207 2 1279 -685 -618 1405 -215 -1276 811 876 -1392 -143 1087 -977 -886 1102 107 -1628
7461a628K369j87j704J455P85k087mK457j451j351K481m17k154J523J151j884
$$ -1628 741 554 -1150 305 1090 -997 -1001 1456 5 -1346 1135 718 -1436 87 1238 -646
7477f46o9J944j207j367J999oj785R42J086j552r8J764r68j448K174J24k159J187
$$ -646 -715 1229 22 -1345 654 648 -1137 -195 891 -661 -759 1005 37 -1411 763 887 -1272 -85
7495h5J666k392J0J888j150j302K243l27k196J614J338k220q7K531j442j251J992
$$ -85 1581 -811 -801 1087 -63 -1365 878 551 -1645 -31 1307 -913 -1000 1531 89 -1162 830
7512H30l11j380P93J577k314k56K253j244j169J969J26j999J183J271k066q2K051
$$ 830 519 -861 -68 1509 -805 -1061 1192 -52 -1221 748 874 -1125 58 1329 -737 -819 1232
7529A232j285j155J834J84j940Q99J581j864j85J943j173j214J784R1j903Q54
$$ 1232 -53 -1208 626 810 -1130 -231 1350 -514 -699 1244 71 -1143 641 732 -1171 -317
7545c17J563k190J43K158j121j698K127J18j906R54J402j795l90K079q52j385
$$ -317 1246 -944 -801 1357 236 -1462 665 783 -1123 -169 1233 -562 -952 1127 275 -1110
7561a110J988j8j938R65J621k011o09K260j008j213J704K95k094J062J271j688
$$ -1110 878 860 -1078 -113 1508 -503 -1112 1148 140 -1073 631 926 -1168 -106 1165 -523
7577e23k83K016j164j277J711M45k165J091J425j717m61K355j502j365J933L89
$$ -523 -806 1210 46 -1231 480 925 -1240 -149 1276 -441 -902 1453 -49 -1414 519 908
7593I08k188Q90J716j977m05K188j058j272K059j80j858J097J233j614q40K502
$$ 908 -1280 -390 1326 -651 -1056 1132 74 -1198 861 681 -1177 -80 1153 -461 -1301 1201
7609A201j015j414J891J50j784P50J493j844n38K269j053j657K025N97k084O88
$$ 1201 186 -1228 663 813 -971 -221 1272 -572 -1110 1159 106 -1551 474 1071 -1013 -325
7625c25J643j979l80J932p85j439J759N95k109J004J416j577n61J850o18j659
$$ -325 1318 -661 -1041 891 106 -1333 426 1021 -1088 -84 1332 -245 -806 1044 426 -1233
7641a233K156j29j979R52J511j850k39J880j065j139J665O70k326J062J641k041
$$ -1233 923 794 -1185 -233 1278 -572 -811 1069 4 -1135 530 1200 -1126 -64 1577 -464
7657d64o84K119m18j601J833K6k157J052J560j745m54K253q95j725J794L51j908
$$ -464 -1148 971 553 -1048 785 811 -1346 -294 1266 -479 -933 1320 425 -1300 494 845 -1063
7674a063P20J463j637l76J928r01j343J537O46k143R49J459j744j81J751o85j248
$$ -1063 -343 1120 -517 -893 1035 134 -1209 328 974 -1169 -220 1239 -505 -686 1065 380 -868
7691h68J617K07j959N61J447j207p81K053p63j789J997L45j942O85J551j548r20
$$ -868 749 956 -1003 -442 1005 -202 -983 1070 307 -1482 515 860 -1082 -397 1154 -394 -1314
7708a314K162l42j766J678M14j991P99J750j637n81J803n14j801J533P32k069
$$ -1314 848 506 -1260 418 832 -1159 -360 1390 -247 -828 975 461 -1340 193 925 -1144
7724a144P80J481j530o86K191m81k084K107J56j738P93J350j659l97J783m12j713
$$ -1144 -364 1117 -413 -1099 1092 611 -1473 634 790 -948 -155 1195 -464 -861 922 510 -1203
7741a203J612O75k328Q30J384j251o09J758m23j569J250Q69j852O57J481j406
$$ -1203 409 1084 -1244 -414 970 -281 -890 868 445 -1124 126 995 -857 -200 1281 -125
7757a25p23J699n30j581J514P27k072P50J895k019l65J852n40j831J632R65k194
$$ -125 -848 851 321 -1260 254 981 -1091 -341 1554 -465 -830 1022 482 -1349 283 1248 -946
7774i46Q74J155j392o55K088o28k015J740J098k194L62J886j668o46J779k20j459
$$ -946 -72 1083 -309 -964 1124 496 -1519 221 1319 -875 -513 1373 -295 -941 838 618 -841
7791h41J181P20j774J72J698j352p28K026l75k232J692Q16j824L74J824j694p71
$$ -841 340 1060 -714 -542 1156 -196 -924 1102 727 -1505 187 1003 -821 -447 1377 -317 -1088
7808a088K055l48k010J365J018j761L05J815j624o30J776m03j748J770P76j874
$$ -1088 967 619 -1391 -26 992 -769 -464 1351 -273 -903 873 470 -1278 492 1268 -606
7824f06J75J663j538n84J957m65j660J206P88j712P9J494j056o77J760j65j922
$$ -606 -431 1232 -306 -890 1067 602 -1058 148 936 -776 -697 797 -259 -936 824 659 -1263
7841a263J244R31j779L13J761j198r86J751l23j722J725M53j711M34J501j629
$$ -1263 -19 912 -867 -554 1207 9 -977 774 451 -1271 454 907 -804 -370 1131 -498
7857d98n36J957l68j952J759O56j979M77J478j070r54J743k99j409J190J308k208
$$ -498 -1034 923 555 -1397 362 1018 -961 -484 994 -76 -1030 713 414 -995 195 1503 -705
7874g05L45J457j154j164K163p36j425J309Q36j814M17J612j391o48J743j21k101
$$ -705 -360 1097 -57 -1221 942 206 -1219 90 926 -888 -471 1141 -250 -898 845 724 -1377
7891a377J844N95j940K27J862j511n82J650j18j593Q51J160j809K08J878j686
$$ -1377 467 1062 -878 -651 1211 -300 -882 768 650 -943 -92 1068 -741 -533 1345 -341
7907c41q68K008l45j650J288J356k088p7J923j295r57J781l39j147Q95O19j519
$$ -341 -1209 799 454 -1196 92 1448 -640 -717 1206 -89 -1046 735 396 -751 144 763 -756
7924g56L03J512j022r03J634k23j591J168R01j612K93J342q25j137J495o0j476
$$ -756 -453 1059 37 -866 768 545 -1046 122 1023 -589 -296 1046 221 -916 579 519 -957
7941i57Q60J008j523Q2J407j137q60J916l32j704J467R04j994K50J924j360r40
$$ -957 -97 911 -612 -530 877 -260 -1120 796 464 -1240 227 1131 -863 -613 1311 -49 -989
7958i89J763k14j468J097R67j898L29J356j001j076J652M12k088R56J082j667
$$ -989 774 560 -908 189 1156 -742 -413 943 -58 -1134 518 930 -1158 -202 880 -787
7974g87J31J745j029j294J855p9j692J065J219j805q3J705r52r79J548J41j765
$$ -787 -656 1089 60 -1234 621 542 -1150 -85 1134 -671 -754 951 -1 -980 568 709 -1056
7991a056R44J001j489K83J002p11j073J627M2j892J479R21j721J38J531j385p15
$$ -1056 -112 889 -600 -317 685 -26 -1099 528 570 -1322 157 1078 -643 -505 1026 -359 -1074
8008a074J728n4j800J273J015j728q8J626r11j115J919k09j641J024R35j470P0
$$ -1074 654 600 -1200 73 1088 -640 -728 898 -13 -1128 791 582 -1059 -35 900 -570 -500
8025e00J452q81j058J474J47j849J030J436j795J23J763j129j170J531K39j927
$$ -500 952 71 -987 487 634 -1215 -185 1251 -544 -421 1342 213 -957 574 813 -1114
8041a114J014J026j249J54J050r26j155J806r7j486N70J493j754k32J779q33j306
$$ -1114 -100 926 -323 -169 881 -45 -1200 606 509 -977 -407 1086 -668 -900 879 46 -1260
8058a260J747K02j698R48J363j671p6J279p49r92J402K5j317R02Q16j477m3J626
$$ -1260 487 689 -1009 -61 1302 -369 -445 834 85 -907 495 520 -797 105 921 -556 -599 1027
8076A027j037r22J629m23j108Q95R10j477l71J943j112q29J165J60j366P99R73
$$ 1027 -10 -932 697 274 -834 61 971 -506 -877 1066 -46 -875 290 450 -916 -117 856
8093H56j359k97J869j115j026J654K02j933J066J423k028k9J767p69j283J443
$$ 856 -503 -800 1069 -46 -1072 582 784 -1149 -83 1340 -688 -717 1050 281 -1002 441
8109D41J13j301O48J334j806l3J691q65j273J376J03j350Q36R70j412k92J450
$$ 441 554 -747 -99 1235 -571 -604 1087 222 -1051 325 428 -922 -86 884 -528 -820 630
8126F30m88j438J650N47j908R42P79j351j71J729j020p81J464R9j460N01J362
$$ 630 142 -1296 354 901 -1007 -65 714 -637 -808 921 -99 -880 584 683 -777 -276 1086
8143A086j375l62J765j051j031J423J22j485N91J290j517l66J621k89j226J303
$$ 1086 -289 -651 1114 63 -968 455 577 -908 -317 973 -544 -910 711 422 -804 499
8159D99J87j733Q39J025j006l58J485r84q55J155P28j916P22J403j554k55J420
$$ 499 686 -1047 -208 817 -189 -547 938 -46 -901 254 982 -934 -212 1191 -363 -618 802
8176H02p39j183J383J58j326Q58J057j542p9J358o82j095J471L68j759
$$ 802 63 -1120 263 421 -905 -47 1010 -532 -611 747 65 -1030 441 809 -950
8191i50
$$ Imaginary data points
##PAGE= N=2
##DATA TABLE= (X++(I..I)), XYDATA
0@%%%%qQqJ6j6J6k4M0m8N6p2Q5r6J15j40J63j88K19k57K96l38L89m41M98n68O44
$$ 0 0 0 0 0 -8 0 -8 8 -8 8 -16 24 -24 32 -40 45 -51 64 -76 87 -101 118 -139 157 -181 208 -233 265 -303 341
30C41p22Q08r08J016j132J262j404J557j727J917k122K347k599K879l191L541
$$ 341 -381 427 -481 535 -597 665 -739 818 -909 1008 -1114 1233 -1366 1513 -1678 1863
46A863l933M380m900N508o220P073q131R470j1222J3630j7161K2834l3401N9474
$$ 1863 -2070 2310 -2590 2918 -3302 3771 -4360 5110 -6112 7518 -9643 13191 -20210 39264
60C9264k33935l42924O66887L08396m14906l28072K04629L33459J09085l45028
$$ 39264 -194671 -537595 129292 437688 22782 -305290 -100661 232798 341883 -3145
70c145l26638L35415M75544l31466n04387K45648M10119j60596k75457j1150R5603
$$ -3145 -329783 5632 481176 149710 -354677 -109029 301090 140494 -134963 -146113 -50510
81e0510J42917K2371k80985r1929L29803Q6886l00769k3609K01047l6330l6595
$$ -50510 92407 114778 -166207 -258136 71667 158553 -142216 -165825 35222 -1108 -37703
92c7703J09170r9813j14897K12467J11667k14017o0993J39401K3212J4087K365
$$ -37703 71467 -28346 -143243 69224 180891 -33126 -94119 45282 68494 82581 84946
103H4946j97051r613L40439j1372m29451N880M03331P982l08526q2753J39060
$$ 84946 -112105 -121718 218721 207349 -222102 -216222 187109 195091 -113435 -196188 -57128
114e7128J82509L4122l02462j80930M02540K75453m35651k96180L98249K84809
$$ -57128 125381 159503 -142959 -323889 78651 354104 -81547 -377727 20522 305331
124C05331k61282k36957P9323K09754J32714j92466l04736J99466M07284k07078
$$ 305331 44049 -192908 -113585 96169 228883 36417 -268319 -68853 338431 131353
134A31353m22411J87717L49808j37366k37000L2521J06385Q9603j7668k18182
$$ 131353 -291058 -103341 246467 109101 -127899 -95378 11007 100610 82942 -135240
144a35240k5774L04920J2133l31011L1159K89694p0748j88784Q6361P2769m9996
$$ -135240 -161014 143906 156039 -174972 -143813 145881 75133 -113651 -27290 45479 -4517
155d517L5084j7138q7759J07789Q3564j78476k4024K10305n9834j91729J30810
$$ -4517 30567 13429 -74330 33459 117023 -61453 -85477 124828 64994 -126735 4075
166D075J26396j65024m8818J37203k1554o4779M4152l7589k0942J30444m8314
$$ 4075 130471 -34553 -83371 53832 32278 -32501 11651 -25938 -46880 83564 35250
177C5250j89551J31799J99594j96953j63651K17168J08287j72972n5366P8590
$$ 35250 -154301 -22502 177092 -19861 -183512 33656 141943 -31029 -86395 -7805
187g805L7131M8362n5912j68086J07859K53075j66972k84010J99617K59820j83709
$$ -7805 29326 77688 21776 -146310 -38451 214624 47652 -236358 -36741 223079 39370
198C9370k02073J04378J31487K0230p9132j67363N2543K93535n3836l67574O3118
$$ 39370 -162703 -58325 73162 93392 14260 -153103 -100560 192975 139139 -228435 -165317
$$ [...]
8191f81
##END NTUPLES=NMR FID
##END=
