##TITLE=1H_Pr Am-bzl
 CDCl3, 8 sc, 
 3.08.2021
##JCAMPDX= 6.0         $$ Bruker NMR JCAMP-DX V2.0
##DATA TYPE= NMR FID
##DATA CLASS= NTUPLES
##ORIGIN= UXNMR, Bruker Analytische Messtechnik GmbH
##OWNER= root
$$ XWIN-NMR		Version 3.5
$$ Tue Aug  3 13:47:07 2021 Russian Standard Time (UT+4h)  she@DPX200
##.OBSERVE FREQUENCY= 200.131506
##.OBSERVE NUCLEUS= ^1H
##.DELAY= (6, 6)
##.ACQUISITION MODE= SIMULTANEOUS
##.ACQUISITION SCHEME= undefined
##.AVERAGES= 8
##.DIGITISER RES= 18
##SPECTROMETER/DATA SYSTEM= spect
##.PULSE SEQUENCE= zg30
##.SOLVENT NAME= D2O
##.SHIFT REFERENCE= (INTERNAL, D2O, 0, 15.7039)
##AUDIT TRAIL= $$ (NUMBER, WHEN, WHO, WHERE, WHAT)
$$ ##TITLE= Audit trail, XWIN-NMR		Version 3.5
$$ ##JCAMPDX= 5.01
$$ ##ORIGIN= Bruker BioSpin GmbH
$$ ##OWNER= she
$$ F:/spectra/data/she/nmr/H-F/1/audita.txt
$$ ##AUDIT TRAIL=  $$ (NUMBER, WHEN, WHO, WHERE, WHAT)
(   1,<2021-08-03 13:45:21.95 +0400>,<she>,<DPX200>,
      <created by zg, POWCHK disabled, PULCHK disabled
       configuration hash MD5:
       00 E9 B6 7A A2 85 ED C7 34 08 36 98 17 FE 4E 26
       data hash MD5: 16K
       CF C3 69 6C B6 A7 A7 57 C2 A1 7D CB 35 7E D4 C4>)
$$ ##END=
$$ 
$$ hash MD5
$$ DC D2 D7 9C A2 AF 8E 0F 0B 3D 32 A2 DD EF 3B 8C
##$RELAX= 
##$RELAX= 
##$RELAX= 
##$RELAX= 
##$RELAX= 
##$RELAX= 
$$ Bruker specific parameters
$$ --------------------------
##$DU= <F:/spectra>
##$EXPNO= 1
##$NAME= <H-F>
##$PROCNO= 1
##$TYPE= <nmr>
##$USER= <she>
##$AMP= (0..31)
100 100 100 100 100 100 100 100 100 100 100 100 100 100 100 100 100 100 
100 100 100 100 100 100 100 100 100 100 100 100 100 100 
##$AQSEQ= 0
##$AQ_mod= 1
##$AUNM= <au_zg>
##$AUTOPOS= <>
##$BF1= 200.13
##$BF2= 200.13
##$BF3= 200.13
##$BF4= 200.13
##$BF5= 200.13
##$BF6= 200.13
##$BF7= 200.13
##$BF8= 200.13
##$BYTORDA= 1
##$CFDGTYP= 0
##$CFRGTYP= 5
##$CHEMSTR= <none>
##$CNST= (0..31)
1 1 145 1 1 1 1 1 1 1 1 1 1 1 1 1 1 1 1 1 1 1 1 1 1 1 1 1 1 1 1 1 
##$CPDPRG= <>
##$CPDPRG1= <>
##$CPDPRG2= <>
##$CPDPRG3= <>
##$CPDPRG4= <mlev>
##$CPDPRG5= <mlev>
##$CPDPRG6= <mlev>
##$CPDPRG7= <mlev>
##$CPDPRG8= <mlev>
##$CPDPRGB= <>
##$CPDPRGT= <>
##$D= (0..31)
0 1.2 0 0 0 0 0 0 0 0.06 0 0.03 0 0 0 0 0.0002 0 0 0 0 0 0 0 0 0 0 0 0 
0 0 0 
##$DATE= 1627983921
##$DBL= (0..7)
120 120 120 120 120 120 120 120 
##$DBP= (0..7)
150 150 150 150 150 150 150 150 
##$DBP07= 0
##$DBPNAM0= <>
##$DBPNAM1= <>
##$DBPNAM2= <>
##$DBPNAM3= <>
##$DBPNAM4= <>
##$DBPNAM5= <>
##$DBPNAM6= <>
##$DBPNAM7= <>
##$DBPOAL= (0..7)
0.5 0.5 0.5 0.5 0.5 0.5 0.5 0.5 
##$DBPOFFS= (0..7)
0 0 0 0 0 0 0 0 
##$DE= 6
##$DECBNUC= <off>
##$DECIM= 32
##$DECNUC= <off>
##$DECSTAT= 4
##$DIGMOD= 1
##$DIGTYP= 9
##$DL= (0..7)
0 120 120 120 120 120 120 120 
##$DP= (0..7)
150 150 150 150 150 150 150 150 
##$DP07= 0
##$DPNAME0= <>
##$DPNAME1= <>
##$DPNAME2= <>
##$DPNAME3= <>
##$DPNAME4= <>
##$DPNAME5= <>
##$DPNAME6= <>
##$DPNAME7= <>
##$DPOAL= (0..7)
0.5 0.5 0.5 0.5 0.5 0.5 0.5 0.5 
##$DPOFFS= (0..7)
0 0 0 0 0 0 0 0 
##$DQDMODE= 0
##$DR= 18
##$DS= 0
##$DSLIST= <SSSSSSSSSSSSSSS>
$$ [...]
##$SUBNAM2= <"">
##$SUBNAM3= <"">
##$SUBNAM4= <"">
##$SUBNAM5= <"">
##$SUBNAM6= <"">
##$SUBNAM7= <"">
##$SUBNAM8= <"">
##$SUBNAM9= <"">
##$SW= 20.0188882624521
##$SWIBOX= (0..15)
0 0 2 0 0 0 0 0 0 0 0 0 0 0 0 0 
##$SW_h= 4006.41025641026
##$TD= 16384
##$TD0= 1
##$TE= 0
##$TE2= 300
##$TE3= 300
##$TEG= 300
##$TL= (0..7)
0 120 120 120 120 120 120 120 
##$TP= (0..7)
150 150 150 150 150 150 150 150 
##$TP07= 0
##$TPNAME0= <>
##$TPNAME1= <>
##$TPNAME2= <>
##$TPNAME3= <>
##$TPNAME4= <>
##$TPNAME5= <>
##$TPNAME6= <>
##$TPNAME7= <>
##$TPOAL= (0..7)
0.5 0.5 0.5 0.5 0.5 0.5 0.5 0.5 
##$TPOFFS= (0..7)
0 0 0 0 0 0 0 0 
##$TUNHIN= 0
##$TUNHOUT= 0
##$TUNXOUT= 0
##$USERA1= <user>
##$USERA2= <user>
##$USERA3= <user>
##$USERA4= <user>
##$USERA5= <user>
##$V9= 5
##$VALIST= <valist>
##$VCLIST= <CCCCCCCCCCCCCCC>
##$VD= 0
##$VDLIST= <DDDDDDDDDDDDDDD>
##$VPLIST= <PPPPPPPPPPPPPPP>
##$VTLIST= <TTTTTTTTTTTTTTT>
##$WBST= 1024
##$WBSW= 4
##$XGAIN= (0..3)
0 0 0 0 
##$XL= 0
##$YL= 0
##$YMAX_a= 63157
##$YMIN_a= -66685
##$ZGOPTNS= <>
##$ZL1= 120
##$ZL2= 120
##$ZL3= 120
##$ZL4= 120
##$ABSF1= 10
##$ABSF2= 0
##$ABSG= 5
##$ABSL= 3
##$ALPHA= 0
##$AQORDER= 0
##$ASSFAC= 0
##$ASSFACI= 0
##$ASSFACX= 0
##$ASSWID= 0
##$AUNMP= <proc_1d>
##$AZFE= 0.1
##$AZFW= 0.1
##$BCFW= 1
##$BC_mod= 2
##$BYTORDP= 1
##$COROFFS= 0
##$CY= 11.3945322036743
##$DATMOD= 1
##$DC= 2
##$DFILT= <>
##$DTYPP= 0
##$F1P= 2.36226072786647
##$F2P= -0.459571619588291
##$FCOR= 0.5
##$FTSIZE= 0
##$FT_mod= 4
##$GAMMA= 1
##$GB= 0.15
##$INTBC= 1
##$INTSCL= 1
##$ISEN= 128
##$LB= 0.24
##$LEV0= 0
##$LPBIN= 0
##$MAXI= 10000
##$MC2= 0
##$MEAN= 0
##$ME_mod= 0
##$MI= 1.114404
##$NCOEF= 0
##$NC_proc= 0
##$NLEV= 6
##$NOISF1= 3.799351
##$NOISF2= 2.8
##$NSP= 1
##$NTH_PI= 0
##$NZP= 0
##$OFFSET= 15.70392
##$PC= 1
##$PHC0= -13432.14
##$PHC1= 9.400991
##$PH_mod= 1
##$PKNL= yes
##$PPARMOD= 0
##$PSCAL= 0
##$PSIGN= 0
##$REVERSE= no
##$SF= 200.130013532006
##$SI= 16384
##$SIGF1= 3
##$SIGF2= 2
##$SINO= 400
##$SIOLD= 16384
##$SREGLST= <1H.CDCl3>
##$SSB= 0
##$STSI= 0
##$STSR= 0
##$SW_p= 3612.71676300578
##$SYMM= 0
##$S_DEV= 0
##$TDeff= 0
##$TDoff= 0
##$TI= <>
##$TILT= no
##$TM1= 0
##$TM2= 0
##$TOPLEV= 0
##$USERP1= <user>
##$USERP2= <user>
##$USERP3= <user>
##$USERP4= <user>
##$USERP5= <user>
##$WDW= 1
##$XDIM= 8192
##$YMAX_p= 0
##$YMIN_p= 0
$$ End of Bruker specific parameters
$$ ---------------------------------
##NTUPLES= NMR FID
##VAR_NAME=  TIME,          FID/REAL,        FID/IMAG
##SYMBOL=    X,             R,               I
##VAR_TYPE=  INDEPENDENT,   DEPENDENT,       DEPENDENT
##VAR_FORM=  AFFN,          ASDF,            ASDF
##VAR_DIM=   8192,          8192,            8192
##UNITS=     SECONDS,       ARBITRARY UNITS, ARBITRARY UNITS
##FACTOR=    0.0002496,     1,               1
##FIRST=     0,             0,               0
##LAST=      2.0444736,     0,               0
##MIN=       0,             -66685,          0
##MAX=       2.0444736,     63157,           0
$$ Real data points
##PAGE= N=1
##DATA TABLE= (X++(R..R)), XYDATA
0 0 0 0 0 0 0 0 0 0 0 0 0 0 0 0 0 0 0 0 0 0 0 0 0 0 8 -8 8 -8 8 -8 8 -8 14 -16 16 -16 20 -24 24 -28 32 -32 38 -40 46
45 46 -50 56 -60 68 -75 82 -92 100 -108 122 -135 150 -170 191 -217 249 -291 344 -418 526 -697
66 -697 992 -1605 3377 -18340 -66685 15435 50647 -21737 -33760 24860 15304 -28015 -10207
79 -10207 19017 5411 -7630 -8512 -11561 4085 21257 -4153 -26318 1950 18807 -9287 -12896
92 -12896 14920 6788 -19813 -6802 14536 5653 -4330 -3398 -8089 -1369 15718 4732 -16378 -2055
106 -2055 13913 -4663 -10413 13929 11251 -16022 -10108 13652 9361 -3756 -2458 -2464 -1682 7790 5558
121 5558 -5426 141 5639 -6236 -3900 14705 6291 -14758 -3385 12064 -1167 -4388 11004
134 11004 -462 -17921 4853 20703 -7687 -16243 12671 8492 -19287 -2014 23979 -1868
146 -1868 -24777 2015 18210 -3737 -10285 4458 1310 -7301 956 4768 -1813 -968 -1689 -8046
160 -8046 1103 12312 -2279 -14731 1142 9625 -4978 -5465 7711 239 -11584 231 9649
173 9649 -995 -5079 1115 -2108 -3210 6815 4675 -7645 -3212 6216 -390 -3293 6334 3321
187 3321 -8410 -2384 8816 3288 -3529 140 536 -1461 3278 4144 -1589 -570 1778 -3019 138
202 138 9301 1155 -10869 150 10922 -1693 -7416 6395 5130 -10274 -3710 12004 3224 -10305
216 -10305 -2419 5770 -404 -2460 2182 -305 -3724 -522 681 -53 2276 -650 -6904 -1542 6872
231 6872 850 -6479 -598 2787 -3295 -1934 4717 386 -5866 -1055 2816 -634 141 2164 -3423
246 -3423 -4622 3945 4720 -3527 -2861 2980 -133 -3099 2721 4184 -2467 -3601 1424 2600 1345 911
262 911 -1532 -2112 2261 3110 -901 -153 2430 -1318 -2712 3698 4656 -2449 -3136 2194 1692 -603 1996
279 1996 1429 -3218 -1282 3649 1282 -1907 760 730 -2963 -353 4211 648 -3989 -1295 1629 239
295 239 -146 275 -1485 -1805 177 254 -184 689 -1195 -3760 -322 3511 -209 -3782 -545 1174 -1776
312 -1776 -859 2463 -222 -3811 -839 2280 415 -819 8 -1067 -1351 1437 1962 -747 -1080 337
328 337 -147 230 2153 1005 -1739 -745 1620 1268 707 938 -515 -1124 1416 2357 161 -328 763 -284
346 -284 -474 2230 2208 -1407 -1693 1291 1460 -39 517 479 -1280 -770 1439 1114 -486 -656 -735 -749 772
365 772 1307 -785 -1814 -382 215 -227 297 63 -1646 -1536 414 660 -490 -645 -903 -1454 -200 1229
383 1229 -91 -1749 -938 45 -287 41 583 -678 -1696 -298 1026 384 -325 -410 -695 -335 957 1058
401 1058 -275 -751 -85 386 790 983 130 -611 33 819 800 875 661 -499 -591 1251 1916 224 -686 312
421 312 812 342 601 1029 229 -714 -230 1020 1349 225 -998 -594 773 892 -176 -387 35 -407 -711
440 -711 306 839 -371 -1393 -800 162 361 -48 -842 -1270 -527 317 -88 -743 -535 -471 -954 -571 508
459 508 269 -1131 -1382 -179 600 185 -516 -800 -492 196 428 -77 -253 137 -73 -560 284 1441 477
478 477 -1328 -668 1561 1516 -454 -744 789 1053 -135 -125 1151 1134 -463 -943 804 2116 686 -1465
496 -1465 -719 1815 1652 -1012 -1036 1611 1326 -1669 -1097 2424 1764 -2348 -2069 2080 2172 -1545 -1918 1026
514 1026 1153 -1196 -1099 880 728 -1105 -1433 -10 1041 289 -1447 -1601 411 1248 -795 -1781 246
531 246 969 -1292 -1621 1074 1224 -1672 -1834 869 1123 -832 -839 251 -194 -466 576 422 -778 -243
549 -243 787 -112 -622 929 1114 -986 -1054 1366 1628 -503 -880 659 979 194 102 334 377 541 147
568 147 -448 653 1859 -73 -2096 422 3135 208 -2871 240 3156 -311 -2900 918 3056 -1080
584 -1080 -3060 928 2698 -715 -2304 82 1197 -165 -871 -497 -28 335 -378 -1493 -223 1672
600 1672 -266 -2923 -484 2671 -9 -3136 -343 2344 -509 -2489 497 1900 -962 -1934 545
615 545 1329 -314 -806 -93 120 308 434 -242 -390 594 516 -571 -27 1259 351 -1079 40 1474 428
634 428 -676 268 807 -123 -11 1051 419 -786 165 1280 73 -783 753 1142 -878 -968 1516 1347
652 1347 -1403 -1161 1419 991 -1233 -609 1068 182 -1088 -236 657 70 -496 -558 -456 297 613 -770
670 -770 -1401 408 994 -1121 -1398 949 807 -1721 -1256 1326 750 -1580 -1039 803 416 -790 -479 249
688 249 114 -280 -377 -9 537 191 -748 -373 916 653 -650 -383 816 482 -428 122 884 231 -452 227
708 227 877 371 -148 172 475 256 143 452 443 -101 -116 567 609 -168 -191 506 288 -405 55 712 -37 -763
730 -763 -12 637 -26 -548 -144 89 -160 -193 -126 -187 -148 -231 -505 -221 311 -163 -939 -387 454 -105 -801 -254
752 -254 213 -342 -554 -21 141 -245 -411 -272 0 259 -45 -548 -160 477 62 -460 126 539 -182 -423
772 -423 423 625 -118 -256 301 396 165 149 192 164 238 232 169 358 354 2 23 466 424 41 95 275 120 135 378
797 378 175 -118 97 270 -19 -6 281 -7 -359 21 313 -99 -324 -46 -18 -244 -132 14 -192 -320 -218
818 -218 -167 -141 -97 -290 -450 -172 -17 -284 -344 -65 -196 -458 -153 141 -200 -446 -132 45 -156 -115 24 -113
840 -113 -182 45 102 -3 50 79 -60 49 349 221 -63 104 317 174 120 291 266 70 152 310 271 216 186 94
864 94 172 350 234 24 133 258 41 22 298 171 -159 -35 213 70 -83 41 3 -167 -64 71 -82 -203
886 -203 -118 -121 -164 -70 -84 -257 -238 -102 -178 -190 -61 -170 -362 -166 35 -170 -314 -94 -62 -269 -140 67 -83 -250
910 -250 -102 36 -46 -44 2 -82 -50 94 52 -5 108 79 -56 109 293 113 -40 194 261 49 136 332 151 -25
934 -25 207 336 144 81 202 141 105 208 173 45 128 150 -6 37 264 75 -211 1 242 -19 -201 3 77
957 77 -126 -163 -8 -24 -127 -183 -217 -92 24 -194 -382 -145 56 -220 -365 -51 1 -311 -299 5 0 -214 -209 -93
981 -93 -51 5 -61 -196 -69 145 -23 -184 97 244 -79 -155 199 263 21 -15 122 144 182 202 45 41 309 251 -76
1006 -76 100 459 168 -220 116 498 175 -179 48 330 186 -62 -52 172 218 -85 -221 136 311 -129 -377
1027 -377 67 281 -143 -334 -8 77 -112 -207 -155 -51 30 -173 -416 -68 294 -218 -621 18 351 -337 -567
1048 -567 167 204 -442 -320 202 1 -295 -37 22 -175 56 172 -266 -194 354 139 -378 44 475 -54 -293
1069 -293 278 373 -100 -34 313 113 -5 283 209 -99 148 436 68 -136 300 401 -50 -99 320 381 -20 -137
1091 -137 157 357 67 -217 35 331 39 -305 21 297 -86 -304 -14 95 -92 -121 -144 -241 8 96 -395
1112 -395 -417 261 121 -707 -343 538 -72 -875 -77 540 -311 -665 174 250 -451 -208 266 -136 -281 200 32
1133 32 -378 141 413 -333 -316 548 281 -493 44 645 -49 -366 404 449 -216 -14 490 109 -153 322 347
1154 347 -138 25 429 153 -120 172 287 29 -21 148 151 77 26 -5 99 175 -19 -131 93 141 -113 -86 63
1177 63 -42 -111 -3 -94 -164 82 -5 -404 -121 319 -179 -598 73 332 -446 -499 285 118 -571 -201 278 -166
1199 -166 -371 81 -9 -325 44 167 -339 -191 368 -51 -476 182 428 -315 -327 465 243 -374 39 474 -36
1220 -36 -169 338 231 -143 154 345 -15 27 379 140 -108 246 336 -45 23 337 90 -82 219 207 -106 52
1242 52 240 -41 -95 193 87 -194 20 154 -130 -125 108 -93 -229 56 21 -308 -106 137 -218 -334 113 41
1264 41 -402 -172 173 -168 -340 38 40 -300 -109 105 -174 -187 113 -48 -275 88 178 -240 -157 289 28 -290
1286 -290 122 292 -174 -131 302 120 -176 127 265 -92 -8 310 64 -114 222 231 -111 65 339 15 -119
1307 -119 265 230 -128 52 301 -13 -117 225 157 -144 25 191 -76 -94 172 23 -208 72 150 -182 -131 154
1329 154 -49 -261 31 103 -225 -184 76 -87 -239 -3 -11 -238 -121 49 -175 -221 62 -43 -278 -48 118 -168
1351 -168 -202 94 10 -212 6 133 -106 -78 163 35 -120 133 178 -107 1 264 68 -110 168 234 -44 18
1373 18 272 107 -31 176 178 -33 75 223 14 -34 210 133 -104 65 215 -39 -96 168 82 -142 -16 103
1395 103 -79 -106 68 -39 -179 -16 41 -167 -131 61 -81 -209 -14 23 -199 -129 26 -107 -180 -11 -19 -195 -85
1418 -85 44 -111 -162 42 -5 -162 -22 72 -81 -96 60 23 -86 28 85 -54 -15 127 24 -46 116 133 -47
1441 -47 31 179 52 -19 132 146 2 68 172 52 16 154 109 9 107 156 -19 12 180 73 -60 81 154 -37
1465 -37 -55 132 61 -110 -1 88 -68 -82 45 -27 -141 -19 3 -145 -100 7 -98 -171 -29 -33 -185 -142 -11 -94
1489 -94 -175 -51 -17 -135 -117 -5 -53 -105 -24 -35 -80 -26 15 -40 -45 55 24 -37 39 81 10 18 90 64 33 93 90 45 88 137
1519 137 50 49 156 104 12 108 172 44 18 139 101 -9 70 115 2 3 111 38 -60 52 94 -57 -69 74 35 -110
1545 -110 -30 40 -53 -103 -13 -16 -92 -53 -44 -86 -65 -34 -98 -109 -30 -34 -132 -104 -12 -57 -100 -61 -29 -74 -75 -57 -54 -45 -34 -63 -65 19 -21
1578 -21 -66 -13 58 -19 -41 57 53 -27 31 92 22 6 100 80 -12 63 150 44 -1 135 132 10 38 147 94 5 83 120 34
1607 34 57 98 42 16 85 74 -26 8 98 5 -82 20 54 -40 -89 15 11 -73 -94 -30 -25 -97 -101 -57 -44 -79 -101 -61 -47 -86
1637 -86 -90 -66 -65 -91 -55 -55 -80 -60 -16 -46 -79 1 32 -48 -40 66 17 -69 37 94 6 -21 105 72 -33 56 140 18 -11 128
1667 128 97 -40 40 162 44 -38 105 138 -12 11 131 70 -30 62 107 0 -4 87 27 -49 30 50 -48 -50 42 12 -78
1694 -78 -25 33 -28 -67 -26 12 -41 -61 -33 -29 -53 -55 -46 -36 -48 -52 -46 -43 -63 -46 -34 -60 -65 -25 -45 -82 -41 18 -50 -82 16 36 -61 -46
1728 -46 64 26 -55 25 86 -3 -13 90 68 -25 55 120 18 14 123 95 -11 67 132 30 4 118 96 -9 41 111 20
1755 20 -13 78 63 -31 14 72 3 -45 36 24 -65 -38 12 -32 -75 -38 -36 -74 -61 -36 -71 -67 -58 -71 -84 -56 -61 -91 -65 -40 -73 -69 -18
1788 -18 -52 -50 -20 -9 -61 -35 25 -22 -43 28 15 -41 8 60 -2 -8 57 52 -21 34 85 16 -4 84 68 -10 41 97 21 4 93 57
1820 57 -9 45 90 17 0 86 49 -32 39 69 -14 -16 53 28 -33 12 43 -18 -27 24 -4 -37 5 0 -47 -24 -4 -49 -82 -20 -36 -96
1852 -96 -49 -29 -74 -84 -19 -57 -92 -42 -34 -82 -74 -12 -55 -90 -23 -7 -63 -34 15 -36 -58 25 22 -55 -4 53 -11 -24 71 58 -13 29
1884 29 97 37 -1 89 92 32 50 113 57 35 91 84 28 69 88 25 31 79 66 -3 32 56 16 -6 32 21 -30 -12 11 -37 -44 -23
1916 -23 -41 -40 -21 -27 -66 -42 -31 -81 -68 -25 -57 -80 -45 -36 -75 -57 -18 -49 -75 -10 -14 -79 -33 3 -26 -69 2 8 -43 -30 26 -7 -29
1949 -29 31 31 -14 2 51 13 -11 41 46 2 22 56 15 16 52 48 15 44 56 33 22 61 56 27 58 57 22 25 56 39 21 32 34 22
1983 22 15 19 7 9 23 5 -39 -4 6 -46 -42 9 -31 -77 -41 -23 -57 -72 -42 -41 -72 -52 -36 -71 -78 -43 -44 -81 -45 -32 -66 -56 -18 -30
2017 -30 -42 -22 6 -26 -16 18 13 -18 11 32 20 11 44 44 38 47 45 53 51 45 40 55 66 34 42 62 39 23 57 60 30 20 47 21 -2 20
2053 20 28 1 -10 20 2 -31 -7 -1 -23 -36 -6 -31 -58 -27 -12 -42 -47 -21 -23 -66 -35 -6 -45 -58 -23 -13 -43 -40 -6 -25 -44 -20 -14
2086 -14 -42 -47 -16 -26 -41 -22 -19 -16 -22 5 -5 -13 2 4 -3 -5 17 10 13 10 17 28 43 16 33 45 40 21 46 59 40 29 53 47 12 39 62
2123 62 24 23 51 35 9 33 47 -6 -1 23 22 -29 -17 24 -25 -54 -16 -12 -64 -56 -20 -47 -81 -35 -24 -65 -71 -37 -47 -77 -47 -30 -57
2156 -57 -61 -29 -37 -46 -42 -22 -24 -31 -15 -6 -6 -5 9 3 6 22 19 18 26 25 26 27 32 41 51 33 25 58 64 20 28 68 40 7 28 63 15 3 51 41 -21
2197 -21 16 42 15 -33 12 31 -31 -9 21 -10 -40 2 15 -39 -22 15 -20 -37 0 -16 -47 -40 -4 -31 -66 -11 -7 -51 -49 -12 -27 -59
2229 -59 -40 -15 -38 -49 -26 -15 -33 -35 -45 -25 -20 -25 -21 -15 -9 -10 -9 5 3 -15 8 23 13 2 30 24 14 43 47 31 46 68 28 21 74 59
2265 59 18 35 63 33 19 53 60 10 10 56 30 -1 16 27 -11 -19 15 -6 -48 -11 -10 -58 -30 -2 -47 -63 -34 -23 -64 -57 -26 -57 -80
2298 -80 -44 -38 -61 -68 -28 -52 -52 -38 -27 -46 -28 -20 -40 -16 -3 -15 -14 5 11 -11 1 31 -7 1 32 31 -5 22 49 17 10 40 38 8 36
2333 36 48 9 11 50 22 4 37 47 -6 0 50 26 -6 20 40 3 8 39 28 -16 22 25 -16 -13 18 4 -28 -6 9 -22 -28 8 -24
2366 -24 -35 -19 -5 -43 -27 -12 -32 -38 -16 -36 -59 -42 -27 -50 -35 -19 -30 -47 -15 -17 -51 -26 -1 -19 -37 0 -3 -25 4 14 -16 2
2398 2 35 22 -11 33 52 9 15 61 48 11 48 72 22 10 65 43 5 48 61 14 7 38 39 -5 25 36 -5 -2 17 -8 -27 9 4
2431 4 -42 -27 0 -26 -42 -24 -22 -44 -38 -22 -36 -55 -30 -32 -42 -28 -39 -39 -23 -13 -32 -34 -11 -6 -33 -17 4 -20 -29 10 17 -13 -13 21 -7
2466 -7 -12 20 19 -18 4 32 7 -11 16 22 -1 17 53 8 8 48 35 -1 40 52 7 17 42 22 -4 31 42 7 -2 36 24 8 28
2499 28 34 4 -7 19 8 -12 8 8 -29 -7 16 -16 -31 -12 -16 -33 -26 -15 -44 -40 -25 -35 -53 -33 -18 -58 -53 -20 -40 -49 -29 -24 -53 -29
2533 -29 -6 -19 -37 -11 -8 -22 -8 13 -9 -9 27 23 -1 13 52 16 15 33 52 14 26 52 27 18 39 38 17 43 45 14 15 35 19 -6
2567 -6 13 13 -12 -2 4 5 -15 -12 -4 -27 -13 -11 -20 -34 -21 -21 -44 -24 -19 -24 -40 -8 -25 -31 -21 -18 -39 -27 -11 -16 -34 -9 -15 -23 -23 -3 -17 -32 -16
2606 -16 7 -31 -19 24 -10 -17 -6 5 -10 -22 5 1 -9 0 9 -12 3 22 6 -2 24 21 4 -1 16 17 10 31 25 17 29 45 11 18 22 28 18
2643 18 25 23 8 19 30 5 -5 7 8 -16 4 -1 -19 -13 -4 -10 -34 -17 -17 -28 -34 -29 -24 -52 -38 -29 -53 -51 -28 -25 -51 -22 -18 -30 -35 -11 -27 -32 -10
2682 -10 -10 -25 -28 1 -2 -5 -6 24 9 2 21 21 12 15 25 23 18 17 28 27 17 34 13 14 22 26 8 9 17 4 0 5 8 4 3 4 0 -2 -5 -1 -4 4 -3 -14 5 -5
2728 -5 -20 -9 -7 -24 -20 5 -15 -22 5 -5 -24 -20 -10 -16 -25 -13 -8 -15 -21 -14 -15 -34 -13 0 -27 -26 -9 -21 -25 -10 -6 -18 -19 -5 -8 -19 -9 -16 -14 -19
2768 -19 11 12 -1 13 12 18 13 31 25 17 25 36 21 26 32 39 23 30 31 23 27 27 16 23 25 23 14 10 18 4 1 -4 -2 -7 -7 -11 -11 -14 -15 -17 -29 -20 -30 -40 -34 -27 -40
2815 -40 -35 -26 -31 -29 -25 -29 -25 -30 -8 -21 -18 -11 -1 -5 6 15 11 12 12 19 10 7 29 7 5 21 25 9 11 17 2 14 23 23 17 21 31 23 13 18 17 16 12 15 9 -2 8
2862 8 16 -8 -7 -3 5 -8 8 8 -1 -11 10 3 -10 2 7 -7 5 0 6 -1 -3 6 -2 -13 -8 -13 -5 -15 -19 -25 -21 -12 -29 -18 -31 -30 -31 -21 -32 -36 -20 -16 -30
2905 -30 -26 -9 -23 -24 -13 -8 -12 -3 4 -10 2 9 18 -10 15 18 8 7 23 26 16 32 44 30 14 35 35 19 34 37 23 20 24 19 12 18 7 14 -3 9
2945 9 -2 -16 1 3 -1 -26 -11 -28 -31 -25 -17 -30 -40 -18 -21 -19 -14 -29 -21 -17 -18 -22 -10 -7 -24 -21 -13 -17 -20 -10 8 -20 -5 -4 -7 -12 12 10 -14 -4 8
2986 8 4 -18 9 11 -9 -1 9 3 -1 6 16 -2 9 9 11 -5 6 15 4 -2 16 11 1 9 24 9 4 22 18 5 13 31 15 4 17 10 5 10 14 -6
3026 -6 5 6 -1 -3 3 -6 -15 -17 -19 -10 -17 -22 -26 -24 -17 -38 -33 -26 -31 -32 -26 -22 -26 -32 -33 -19 -21 -35 -1 -9 -25 -9 -11 -9 1 1 10 -18 8 17 9 8 29 32 12 21 31 9
3074 9 4 33 28 13 17 41 20 -1 14 16 3 13 21 -5 -4 8 10 -14 -1 9 -3 -8 -13 -7 -8 -19 -1 -2 -22 -15 -14 -20 -14 -14 -17 -16 -17 -6 -11 -5 -7 -13 -7
3117 -7 -11 -7 -3 11 -1 -13 4 6 -4 0 3 -10 -5 -3 -8 -12 -15 -13 -18 -16 0 5 -14 -7 4 -4 -13 10 6 1 12 26 9 8 20 21 11 23 39 31 18 30
3159 30 32 19 15 27 26 15 20 21 6 3 9 15 7 -3 0 0 -8 -7 -11 -20 -15 -9 -12 -27 -18 -25 -21 -27 -29 -23 -24 -29 -24 -24 -21 -30 -22 -8 -21 -31 -16 -7 -13 -8 8 -2 -9 9
3207 9 6 4 9 27 8 5 29 17 6 10 29 22 11 29 24 22 16 23 23 3 15 23 -2 9 5 24 7 6 11 -9 -9 -8 5 -6 -6 -8 -2 -13 -11 6 -9
3248 -9 -12 5 -9 -8 10 3 5 1 -8 -5 -6 -3 4 2 -12 -4 1 -1 -21 -10 -11 -11 -15 -14 -10 -22 -16 5 -19 -26 -3 -11 -18 -8 -2 4 -1 -3 5 1 -7 0 6 1 4 13 5 2 16
3297 16 20 9 4 23 26 22 29 31 26 13 31 26 23 15 26 22 26 30 23 16 18 16 -5 -13 -7 -2 -6 -16 -16 -17 -19 -30 -15 -23 -25 -22 -19 -25 -31 -24 -14 -15 -32 -15 -9 -24 -16
3344 -16 -15 -22 -19 7 3 3 6 10 8 -3 10 11 8 -4 12 25 18 12 17 14 11 16 10 13 11 1 8 -4 8 11 2 8 4 -1 -3 15 13 -2 3 8 0 5 7 17 14 -1 18
3391 18 -1 4 4 10 17 11 12 6 0 -2 9 7 0 -2 -6 -6 -4 -14 -10 -7 -15 -17 -16 -22 -19 -17 -27 -24 -21 -16 -25 -22 -29 -35 -16 -16 -20 -14 -13 -9 -5 -1 -2 -4 0 6 0 4 6 -4 13 14 25
3444 25 29 27 22 23 31 16 11 18 32 16 17 35 16 2 11 24 4 7 2 8 -8 -1 1 -5 -13 -14 -11 -16 -16 -8 -22 -19 -19 -27 -10 -21 -27 -36 -29 -17 -19 -17 -14 -5 -11 -8 -4
3491 -4 1 -3 4 4 7 5 -6 1 -3 6 2 2 8 8 6 -4 1 6 -12 0 15 -4 -1 13 -1 1 2 3 10 -3 8 -13 3 5 6 4 -3 14 -1 -5 4 12 6 10 16 8 5
3538 5 10 15 11 12 17 12 9 5 9 5 -14 5 -2 -4 -2 -9 -10 -18 -5 -13 -21 -18 -18 -28 -23 -26 -30 -17 -21 -25 -27 -17 -10 -14 -16 -19 -10 -11 -2 -10 -2 -4 4 0 6 14 3 18 16 23 14 23 10
3591 10 19 19 17 21 9 15 18 12 5 9 10 3 8 17 8 3 2 3 -11 -11 -10 -16 -15 -5 -9 -8 -16 -7 -15 -20 -5 -13 -12 -16 -6 -12 -11 -8 2 -10 -6 -5 -2 -1 -3 0 -6 -11 -9 -2 -8 -14 -10
3644 -10 -16 -1 -11 -6 -5 -13 -11 -6 1 -8 -7 -1 1 -16 -1 -1 2 -4 8 -1 -2 10 3 6 14 20 10 7 4 15 11 22 20 19 8 23 22 14 19 18 14 10 21 13 10 10 17 6
3692 6 -3 -2 4 -9 -2 -5 -24 -17 -21 -24 -16 -23 -22 -28 -16 -29 -24 -25 -20 -27 -26 -20 -20 -15 -16 -9 -12 -18 -18 -4 3 -11 -13 -9 -2 0 9 2 4 12 21 8 23 22 5 3 19 11 5 13 19
3743 19 6 -2 4 12 -6 2 12 0 0 -7 -7 -1 -6 -5 -3 -3 -5 -6 -12 -10 0 1 -11 -6 2 -7 -12 -2 -9 -4 -6 -13 -6 2 -2 -8 2 -3 2 8 -9 0 -8 -10 -9 -7 -8 -18 -17 -21
3793 -21 -6 -19 -17 -20 -12 -18 -12 -22 -15 -18 -11 -9 -15 -18 -5 -1 -12 4 17 8 0 20 14 9 14 30 -1 9 32 33 16 18 21 21 27 20 20 19 12 21 8 -7 8 6
3837 6 -11 -6 0 0 -7 -6 -11 -6 -10 -19 -17 -15 -30 -23 -33 -23 -38 -26 -30 -24 -15 -23 -13 -13 -12 -6 -2 0 -7 -5 -14 -4 2 3 -4 0 1 10 7 10 14 7 9 13 3 6 7 2 0 3 7 6
3889 6 6 7 5 2 1 5 -7 -5 6 8 -4 8 0 -8 -5 2 10 2 4 5 -5 3 6 10 -1 -1 11 -3 6 3 0 10 -5 -3 3 1 13 -8 -8 -5 -4 -18 -8 -13 -15 -11 -13
3936 -13 -14 -23 -11 -25 -22 -14 -14 -27 -27 -9 -25 -13 -11 -4 -6 -7 -2 4 -8 7 3 0 7 12 13 6 14 7 10 14 23 14 19 26 39 20 26 26 22 12 11 10 7 6 5 3 -1 -2 -3
3985 -3 0 -9 -8 -9 -10 -10 -10 -18 -22 -13 -12 -14 -31 -13 -21 -15 -16 -16 -6 -8 -5 -2 -14 -5 -1 -8 -5 1 3 0 5 -6 -4 1 -3 -2 -6 11 1 -4 -1 -1 1 4 -6 -5 8 7 -1 0 -1 5
4037 5 9 9 10 -6 13 12 2 -7 11 10 5 10 16 10 11 17 17 7 11 6 22 20 19 19 16 10 7 10 11 3 7 3 -1 -6 0 -15 -17 -23 -8 -21 -13 -20 -29 -22 -26 -17 -16 -26 -28 -22 -21
4088 -21 -23 -26 -18 -27 -28 -14 -10 -5 8 -5 0 5 5 5 9 13 17 9 9 11 30 25 22 25 15 30 26 20 21 26 19 17 14 18 6 11 5 8 10 -4 -7 -2 0 -2 -12 -10 -14 -11 -7 -24
4138 -24 -19 -6 -11 -9 -10 -16 -4 -11 5 -16 -10 -5 -11 -5 0 -9 -9 -7 -1 -10 -10 -9 -2 -3 -15 -10 -6 -3 -10 -10 -8 -3 5 -6 -18 -5 -4 -4 -16 -8 -9 -2 8 -12 -9 -4 -5 -1 3
4187 3 1 11 3 2 10 7 9 16 21 6 12 21 19 11 17 19 12 7 5 8 11 7 1 2 1 2 -5 1 0 -12 -13 -19 -7 -14 -17 -16 -24 -32 -25 -27 -21 -20 -19 -24 -23 -15 -35 -28 -25 -16 -15 -11 1 -4 -15
4242 -15 -9 2 -1 14 1 3 8 15 22 15 13 4 17 15 21 23 9 6 11 2 9 6 12 0 -2 3 -6 6 0 -8 6 -8 0 -4 6 5 3 -6 -4 -4 5 5 -1 2 -10 -7 -10 -8 1
4291 1 3 11 5 0 1 3 8 -5 -2 -13 1 -1 -3 -6 -6 1 -8 -7 -9 -8 -8 -9 -14 -19 -14 -14 -25 -18 -9 -12 -8 -1 2 -15 -1 -11 -2 -9 4 14 11 9 12 14 7 8 24 13 18 20
4341 20 11 21 30 19 23 36 14 16 18 15 13 16 3 11 -7 1 1 6 -1 -17 -19 -14 -13 -19 -23 -20 -19 -17 -20 -25 -13 -16 -22 -21 -17 -24 -13 -21 -12 -13 -1 -12 0 -8 -3 9 6
4388 6 2 -1 2 15 -8 18 1 9 4 5 9 -3 10 14 7 4 6 6 10 11 9 13 3 -1 -3 -1 3 -8 7 -3 0 4 -5 -2 7 1 6 -2 13 7 7 7 4 0 10 8 21 12
4436 12 3 12 8 8 6 6 1 -4 -3 0 0 -9 -14 -8 -10 -3 -16 -4 -11 -17 -19 -13 -19 -12 -18 -26 -15 -23 -21 -16 -12 -13 -11 -4 -12 -4 7 0 2 3 4 15 13 10 13 17 18 12 24 28 23 25 37
4489 37 20 17 28 18 16 9 19 5 11 4 1 1 -4 2 -10 -7 0 -8 -17 -5 -17 -5 -19 -18 -15 -8 -17 -10 -9 -20 -7 -23 -11 -13 -12 -5 0 -4 -22 -8 2 2 -6
4532 -6 12 10 -1 5 15 -1 6 4 0 -2 5 -3 0 5 -6 1 5 5 -6 -2 -9 -2 0 -2 -6 -1 -2 -4 15 -2 5 -1 0 15 17 15 9 13 12 12 2 11 11 1 2 10 3 3 1 2
4582 2 6 8 4 -8 0 6 3 0 3 -6 -5 -7 -9 -7 -8 -11 -10 -11 -10 -21 -16 -17 -24 -26 -19 -28 -24 -16 -23 -5 -2 -9 -7 1 7 8 8 -5 2 9 17 4 10 20 22 18 18 21 7 18 23 17 19
4635 19 12 17 14 6 8 6 17 9 1 6 -3 0 -5 -8 -4 -4 -13 -6 -17 -15 -8 -15 -3 -16 -17 -1 -9 -6 -2 5 -9 -6 -2 4 2 -4 -3 -3 3 8 6 -4 8 -5 0 -3 6 5 -3 -2 -7
4686 -7 -2 1 -1 -2 -11 -4 -5 -7 4 -1 -9 -4 0 -4 2 6 -4 7 0 4 22 4 7 14 20 6 15 10 16 12 17 24 26 16 15 14 12 21 19 10 15 10 7 15 10 -6 -7 -1 -12 -2 -9
4737 -9 -9 -13 -15 -23 -17 -13 -20 -42 -22 -26 -26 -25 -8 -16 -14 -14 -9 -2 -2 -9 -12 0 -6 6 -2 1 6 9 3 9 7 6 25 12 17 15 14 23 13 15 22 14 3 5 -3 12 9 5 10 3 -3
4788 -3 2 4 -2 -9 -2 -2 -3 -2 -5 -3 -9 -8 0 1 2 3 6 2 1 -3 -4 5 0 4 7 2 -3 -2 -3 -1 9 1 -9 -6 -2 4 -12 1 0 -7 -11 -11 -13 -13 -8 -9 -10 -10 -2 -13 -7 -19 -8 -15
4842 -15 -7 -11 -3 -6 6 -4 5 -3 9 11 8 17 14 10 15 18 20 26 14 20 25 16 21 24 30 12 12 20 10 10 10 14 -1 10 -1 6 -6 -14 -13 -17 -5 -15 -7 -23 -8 -19
4888 -19 -23 -20 -11 -14 -16 -17 -14 -19 -6 -16 -9 -11 -6 -2 4 -4 1 6 -2 1 1 2 0 1 15 11 19 6 12 6 14 13 9 7 4 13 11 -3 2 2 5 11 10 -9 6 14 2 -1 4 -1 0 -4
4940 -4 4 4 13 7 4 0 -1 12 4 7 5 6 7 9 8 1 1 0 2 2 2 11 1 1 -4 4 -2 -1 -12 -12 -3 -9 -12 -9 -16 -20 -4 -20 -11 -14 -7 -9 -7 -14 -7 -1 -7 5 -5 -4 5 13 -2
4993 -2 0 13 14 15 14 17 19 0 15 25 24 21 11 11 11 30 23 15 10 6 20 12 6 8 10 13 -1 1 -5 -6 -8 -1 -11 -11 -6 -3 -18 -19 -32 -8 -26 -16 -20 -15 -8 -14 -12
5040 -12 -13 -12 -8 -5 2 7 1 3 6 7 -1 7 -2 10 10 8 -2 11 10 9 1 4 13 8 -2 6 2 13 15 2 2 8 8 1 8 8 3 7 7 8 4 3 12 -1 3 -3 -2 12 8 6 -1 16
5092 16 7 8 9 13 10 9 18 14 5 0 3 4 -7 -5 3 -8 9 -16 -10 -7 -14 -13 -7 -18 -19 -12 -18 -23 -11 -20 -22 -15 -14 -25 -16 8 -14 -3 -8 -2 -6 -9 3 -2 0 6 10 13 6
5141 6 13 21 16 25 15 20 23 22 30 28 19 23 24 15 17 25 20 9 20 9 4 5 1 13 6 -11 12 -8 -8 -7 -11 -4 -7 3 -14 -19 -14 11 3 -7 -2 -4 0 -3 -4 5 -5 -7
5189 -7 8 4 1 5 13 8 5 5 -3 -1 5 3 -1 -4 10 2 1 3 3 -4 0 5 -10 -8 -2 -16 -2 -4 -5 -5 -11 12 0 -6 9 1 0 9 12 7 9 26 15 15 12 16 20 12 19 20 16
5240 16 17 17 20 15 14 19 6 5 0 9 -3 1 2 -5 -1 -6 7 -5 -7 -18 -20 -15 -12 -23 -12 -10 -12 -23 -10 -19 -18 -11 -16 -11 0 -12 -7 9 -3 -3 -4 9 1 3 6 8
5286 8 -7 11 8 4 10 10 13 14 2 15 19 12 9 11 -2 10 9 1 2 4 5 8 4 6 3 5 -4 -12 6 -4 9 -5 -8 2 1 12 1 2 4 4 8 -1 4 9 -7 2 3
5333 3 5 -6 10 5 7 4 3 3 -2 -2 -4 2 2 -9 3 -9 -1 -5 -2 -1 -13 -9 -14 -11 -15 -29 -13 -6 -3 -16 -15 -9 13 8 17 3 11 15 9 7 13 16 16 18 7 19 14 11
5381 11 13 23 17 5 19 21 4 3 12 5 7 -7 -2 6 -2 3 2 -1 -2 -11 -6 -11 -11 -24 -20 -21 -15 -11 -14 -13 -14 -30 -9 -14 -6 -1 -7 -6 5 3 -1 4 3 3 1 12 1 3 8
5430 8 9 14 9 16 15 16 10 12 13 15 0 9 1 3 1 7 5 8 2 -4 6 3 -5 -12 -2 -2 -4 -9 -2 3 1 -1 -7 7 3 1 10 5 6 8 14 11 2 -3 14 7 9 8 1 10 -5 9 11 12
5484 12 -5 -6 -3 -17 -1 -2 -17 -7 -10 -8 2 -13 -12 -14 -16 -10 -6 -6 -10 -10 -9 -15 -6 -1 2 1 -2 1 2 13 6 2 4 8 12 10 9 24 14 24 15 10 22 14 11 13 9 13
5532 13 17 1 5 -8 -1 -3 7 0 -7 -14 -9 -5 -6 -7 -12 -12 -13 -20 -19 -14 -9 -8 -10 -7 -8 -8 -12 -3 -5 18 -8 -2 8 11 10 -2 0 5 5 4 6 -1 11 5 5 7 -5 2 -6 -9 2
5583 2 -10 -10 -10 -9 0 -8 -3 -5 -3 -5 2 9 -9 4 3 -6 -2 -8 1 3 2 10 5 15 13 8 11 12 12 15 9 13 0 5 3 7 8 9 13 4 -5 7 1 5 8 -9 -10 -3 -2 -8 -12 -11 -5 -10
5637 -10 -4 -7 -16 -15 -2 -15 -6 -10 -11 -16 -9 -14 -6 -15 -9 5 -8 0 5 -2 11 2 17 21 9 9 13 7 19 19 10 17 7 2 9 9 10 16 21 6 1 7 -7 -6 -2 8 -1 4
5685 4 9 -5 -6 -4 -7 -4 -8 -6 1 -4 -2 -1 -18 -14 -9 -15 -5 -8 -4 -4 -3 -1 3 -3 -1 -4 -5 -1 -13 7 -3 4 0 -5 9 9 3 -2 7 4 -10 -1 -3 -2 -13 -17 -3 -12 -7 9
5735 9 -3 -7 -8 -6 -4 1 -6 1 -4 17 -4 -2 2 1 7 18 9 9 13 5 7 13 5 4 13 14 0 -4 5 9 9 1 11 14 4 0 1 0 -3 -2 -16 -20 -16 -25 -14 -24 -20 -18 -24 -15 -19
5786 -19 -15 -24 -10 -18 -12 -5 -19 -7 2 -4 -3 3 5 6 10 5 8 5 0 2 6 3 11 15 13 12 0 2 -3 5 2 5 5 7 3 10 1 0 -4 -2 0 0 4 -8 -6 -14 -2 -3 -1 -11 -20 -6
5838 -6 -4 -6 -12 -7 -6 -1 4 -1 15 7 4 8 8 6 4 -1 -10 -3 3 -9 7 5 -6 -8 -5 -3 -18 0 -1 4 -16 -6 -9 -6 -1 -2 -8 -1 -6 -10 -15 -4 -7 -1 -7 -4 -2 3 -10 1
5888 1 -6 3 6 18 1 4 12 20 18 17 18 12 20 10 22 14 17 12 0 14 14 6 -1 1 4 1 -7 -9 -9 -15 -16 -4 -9 -15 -17 -18 -12 -18 -19 -17 -6 -14 -12 -18 -12 -14 0 -30 -7 3
5938 3 -9 2 -7 -6 -6 8 7 8 2 4 7 8 18 15 7 0 5 13 8 0 6 6 -3 -4 2 -1 3 -6 3 2 1 -11 -2 -2 -2 3 -5 1 10 -4 -10 -7 -1 11 -1 -1 -4 -2 9 5 5 3
5990 3 1 9 9 6 5 8 6 -4 -5 8 1 -2 -3 -6 -3 -1 -21 -19 -12 -4 -17 -5 -7 -14 -20 -18 -18 -13 -18 -21 -21 -9 -13 -13 -3 -14 8 -2 8 -5 -2 -2 2 0 6 20 10
6037 10 16 16 7 16 17 11 -2 18 11 2 17 0 8 5 3 10 7 13 1 2 -1 -2 5 -6 -12 1 -15 -6 -15 -24 -20 -8 -16 -9 -10 -16 -8 -13 -3 -12 -10 -15 -16 3 -14 -12 -1
6084 -1 -5 1 13 5 -2 2 6 2 4 -3 3 3 -10 7 -1 5 -4 -11 5 -6 -4 0 -1 -1 -5 -7 2 -13 -6 -5 -4 -2 0 -4 0 5 -1 -8 5 2 12 5 0 1 11 1 4 9 8 2 12
6135 12 4 22 12 8 10 9 12 1 1 -10 -2 -3 -11 -1 -4 -4 -9 -8 -10 -13 -9 -16 -20 -13 -15 -22 -19 -14 -13 -12 -12 -5 -10 -10 0 -6 -7 4 7 -4 7 9 4 -4 3 6 13 13 17 17 22
6186 22 9 9 9 10 15 2 14 10 5 8 9 8 -3 9 2 4 -8 -1 -3 4 -9 -8 -21 -10 -8 -9 -6 -18 -6 -9 2 -9 -4 -4 -2 2 1 -3 7 4 -4 4 -6 2 8
6231 8 4 8 3 3 1 2 -4 -5 -5 -1 -1 2 1 -2 5 -22 6 8 -2 4 -8 -11 -8 -3 -10 -2 -1 -11 -10 -7 1 12 5 16 -2 9 2 6 4 10 11 4 12 12 3 7 12 6 13 17 9 16
6283 16 -2 13 7 5 1 -8 -10 -8 -6 -13 -7 -10 -2 0 -5 -9 -15 -22 -13 -15 -14 -9 -5 -17 -12 -14 -11 -14 -16 -11 -3 -9 0 -2 -7 3 1 3 7 4 13 13 12 3 17 8 15 3 -3 21 3 11
6335 11 -5 1 4 -1 4 6 7 -1 2 -1 3 -1 9 -8 -7 -10 -8 -9 -5 -8 -7 3 2 10 -5 -4 2 4 3 -1 1 -3 -3 -4 -9 -6 7 -6 1 -1 -6 18 2 -6 -7 -4 -6 -9 5 -10
6385 -10 -1 -4 -10 -2 -13 -6 -9 -10 -14 -5 3 -11 -7 -14 -7 -6 -17 -16 -4 5 2 1 1 16 5 15 20 9 10 11 12 17 20 6 14 10 9 7 7 18 16 11 8 9 11 11 13 12 2
6434 2 1 -11 -12 -6 2 -9 -11 2 -8 -16 -6 -14 -23 -19 -16 -15 -8 -7 -7 -6 -11 -10 2 -1 9 5 7 5 -1 11 19 2 7 6 5 12 8 6 4 15 7 1 4 0 8 -5 -2 9 -4
6483 -4 2 -1 1 3 -9 4 -16 -4 -10 -4 -5 -12 -7 -10 -4 -8 -5 -1 -10 -6 -2 4 1 1 5 5 11 -1 4 11 7 1 10 6 0 7 15 5 -5 6 6 7 -13 -13 -4 -5 -5 -14 -7 -1 -14
6534 -14 -12 1 -11 -11 -2 -12 -14 -12 -6 -13 -5 -1 1 1 0 2 4 3 22 21 20 16 7 8 14 3 16 7 10 5 3 7 30 12 10 2 6 14 1 6 5 -7 -3 -12 -5 -11 -13 -8 -8 -15
6584 -15 -18 -10 -20 -9 -1 -14 -16 -18 -13 2 3 -3 -11 7 0 0 -10 5 0 10 3 0 2 8 0 1 2 7 7 3 7 3 12 7 7 5 5 9 -2 8 -4 3 7 3 -10 -5 7
6631 7 -14 -2 -9 6 -3 -2 5 5 0 6 8 0 0 -2 14 2 4 13 18 6 9 17 11 14 7 12 6 15 7 13 4 13 0 -2 -3 -2 -11 -1 5 -13 -1 -5 -9 -3 -7 -2 -11 -10 -11 -1
6681 -1 -10 -9 -3 0 -2 -2 5 -5 -2 -2 0 -3 4 17 8 8 11 18 6 5 16 10 19 16 20 17 19 19 22 4 11 2 10 6 13 10 -3 -3 -5 -2 -5 1 -8 -7 -9 -1 1 -9 -3 -7 -16 -13 -2
6734 -2 -4 -1 -12 -12 -6 4 -8 -3 2 3 7 0 6 11 1 4 -1 10 7 -5 7 0 13 10 2 -3 -4 8 -2 10 2 -10 2 0 -2 -11 -8 -2 -1 -10 -6 1 0 0 1 -6 3 9
6782 9 2 -7 -2 0 12 9 1 8 12 16 8 10 14 19 11 15 14 7 14 3 9 10 -1 9 -8 4 0 -2 3 -8 -2 0 6 -11 1 -10 -13 -4 -13 -16 -20 -12 -19 -8 -7 -6 -9 -5 -1 -4
6832 -4 4 -6 0 9 11 1 13 10 12 8 15 15 20 5 22 7 10 13 11 17 8 4 6 4 10 14 6 6 12 -5 3 6 -6 2 -9 -4 2 -5 -1 -3 0 -2 -4 -4 -5 -16 -9 2 -6 -1
6882 -1 -4 -6 -5 2 5 2 8 10 14 16 9 3 2 -6 3 -5 1 -11 10 4 -6 -17 5 -10 -8 -2 -9 -8 -2 -14 -12 -4 -11 -10 1 0 -5 -2 3 6 -1 8 -1 5 11 7 3 6 -1 16 6
6933 6 7 14 17 12 12 13 10 11 6 14 17 8 10 7 7 -8 5 2 1 -2 -5 -7 -9 -9 -14 -18 -12 -20 -11 -13 -8 -20 -18 -17 -10 -17 -10 -8 -3 1 -7 -15 -3 -8 2 13 2 7 4 9 2 15 8
6986 8 17 5 3 7 18 -2 7 9 16 5 7 8 11 7 13 7 0 5 1 -4 -16 -8 -10 2 -3 0 -7 -7 -7 -6 2 2 -6 3 10 6 6 10 -1 10 3 9 8 -2 9 6 4 8 3 6 -2
7037 -2 5 0 -8 -8 11 1 -7 -1 1 0 -3 -3 0 2 -3 -18 -3 -4 1 -14 -6 -14 -11 -2 -9 -11 5 6 8 6 -2 7 8 -4 4 10 8 19 17 12 7 22 22 19 12 21 21 11 8 11 20
7088 20 20 6 10 0 4 -5 -6 1 -4 -1 -7 5 -12 -5 -5 -5 -13 -12 -2 -7 -11 -16 1 -13 -5 -20 -6 -4 6 -5 -1 6 -2 12 9 5 7 9 6 26 6 3 17 8 19
7133 19 8 10 7 -3 12 -1 1 2 -3 2 -3 2 2 8 8 2 3 9 4 0 -8 0 -6 -3 -4 8 13 15 6 -1 13 6 6 1 9 7 5 8 3 6 13 15 12 17 24 4 -1 4 -3 -3 11 7
7185 7 0 -6 1 8 -5 -9 -5 0 -11 -7 -3 -4 -6 -6 -11 -19 -7 -5 -7 0 -3 -6 -3 -5 7 -1 2 15 13 19 12 9 14 1 17 21 9 22 20 7 27 13 14 24 13 1
7231 1 13 21 4 14 7 7 4 7 -2 5 4 8 1 2 -11 0 -9 -13 -13 -14 -13 -2 1 -1 -2 6 6 3 -4 18 0 3 20 0 12 6 5 12 15 3 9 6 9 -2 3 -5 2 -7
7279 -7 17 8 8 5 1 -5 1 -9 -13 -2 0 -1 5 3 3 -1 -8 -3 1 -6 -14 2 10 0 3 4 14 2 7 16 7 12 14 6 15 18 15 13 17 13 16 21 9 6 9 11 11 7 -4 7 -9
7330 -9 -9 -3 -13 -9 -5 2 -7 -7 -4 -12 -8 -15 -2 0 3 2 -4 -4 -1 -3 1 2 3 -9 3 3 16 19 20 21 7 6 13 1 6 12 15 20 20 7 14 17 6 7 9 5 0 4 4 2 -3 -5
7382 -5 5 -9 3 -3 -11 -4 -6 0 -3 -9 -6 -3 -6 -6 -9 -5 0 4 9 4 3 -2 5 -5 5 3 0 10 4 1 3 -3 -2 8 7 9 13 -3 1 8 -4 -5 1 -5 0 1 -5 7 -5 -8
7432 -8 -11 -7 -8 0 -11 -3 -13 5 -2 -1 1 -6 5 -4 -3 2 11 5 13 14 6 12 16 18 18 14 14 3 11 -3 2 2 12 9 5 1 7 6 -11 2 -11 -6 -7 -5 -4 -4 -19 -4 -14
7481 -14 -6 -13 -10 -7 -9 -4 -19 -7 -9 -15 3 -2 -5 4 6 6 8 -2 0 0 6 10 6 12 -1 9 8 5 17 4 2 8 5 -3 -1 -3 -2 -5 -8 -4 -2 -12 4 1 -10 4 -1 -12
7529 -12 4 -8 -7 3 -1 -2 -5 -6 4 -14 -3 3 -2 5 -2 7 2 -8 2 3 0 -1 -2 -4 0 3 -5 5 -6 0 1 -3 -5 5 -4 -4 4 -6 -10 -14 -10 -10 -13 -14 -13 -19 -14 -12
7577 -12 -8 1 10 -3 8 9 -6 -2 2 5 4 9 7 1 3 3 8 25 11 13 8 21 14 10 2 8 11 9 14 0 2 0 11 8 6 0 -3 -5 -11 -1 -2 -8 -16 -7 -8 -7 -11 -13 -19 -12 -9
7628 -9 -19 -3 -15 -10 -5 -3 -8 -5 -2 2 -6 5 4 14 0 7 11 13 2 7 7 10 2 12 -3 5 -1 -10 0 -4 3 2 11 7 6 4 -1 0 0 -12 -11 2 0 -6 6 1 2 -1
7676 -1 1 -4 0 -11 -4 5 -5 -6 3 -5 4 1 7 4 10 14 7 9 0 5 1 1 -5 11 3 8 -6 -4 -2 -2 -9 -13 7 -1 -6 2 -9 -6 -9 -2 -10 -3 -9 -14 2 -10 -1 4 -6 5 -8
7727 -8 -8 -8 4 3 -3 -2 4 5 1 8 8 22 25 20 8 18 11 7 25 15 21 9 8 16 14 0 3 -2 3 0 -13 1 -1 -1 -9 -13 -11 -5 -11 3 -2 1 1 -9 -22 0 10
7774 10 11 4 -2 -3 -6 -8 2 1 8 -4 4 17 3 7 5 15 8 0 9 10 -2 7 7 12 1 1 14 10 13 11 -1 0 7 -5 -2 0 0 -2 -1 -2 -2 -5 -1 6 -4 3 2 -2 6
7823 6 10 11 9 -6 4 -3 8 19 10 13 15 20 6 9 11 8 6 3 -2 3 -2 -6 -3 -6 11 1 3 3 -2 -5 -8 -10 0 -15 -3 -11 -14 5 -5 -15 -20 4 0 -1 2 11 5
7870 5 10 2 2 7 7 8 15 16 7 18 22 24 14 6 13 10 16 13 6 3 9 7 -3 2 0 5 5 5 -3 7 -2 7 0 1 -5 -5 -6 -14 -6 -9 -7 -4 4 -3 -4 -1 -13 5 -3 -2 0 2 -1 6 -1
7925 -1 -8 6 5 16 2 6 9 4 -2 10 6 5 0 5 1 1 3 -2 -10 -6 -16 -6 -9 -11 -2 -14 3 -8 -4 -1 -11 -8 9 0 -1 -4 3 9 4 19 11 3 6 6 9 18 14 4
7973 4 9 16 13 14 12 11 11 11 8 0 15 1 8 5 0 9 -5 -11 -7 -11 -13 -12 -1 -8 -8 -6 -14 -22 -12 -2 -9 -27 -13 -1 -4 -7 -1 4 0 6 12 5 14 9 1 1 7 7 9 4 7 5
8025 5 15 11 7 13 12 11 22 14 13 18 10 5 8 4 3 10 12 5 -2 8 -3 -1 -5 0 5 6 -3 -7 0 -6 -5 0 -1 10 7 9 8 5 11 13 5 -3 9 10 15 5 14 13 -7 11 3 10
8077 10 7 -1 -2 -11 0 5 1 -6 -3 -6 -7 4 0 3 -6 -6 2 -8 -9 -18 -3 -9 1 4 -1 7 -15 -2 -6 17 11 1 11 13 19 7 11 10 9 5 14 12 21 10 8 20 6
8124 6 12 13 11 7 0 2 -1 -15 0 -6 -9 -4 -6 -12 -13 -1 -6 -15 -16 -5 -12 -6 -4 -13 -6 -2 -8 7 -2 -5 5 12 0 4 0 -1 4 -1 11 19 8 11 16 8 15 14 16 25 9 17 9
8175 9 5 7 10 2 6 -1 -2 1 7 6 7 0 4 3 3 1
8191A
$$ Imaginary data points
##PAGE= N=2
##DATA TABLE= (X++(I..I)), XYDATA
0 0 0 0 0 0 0 0 0 0 0 0 0 0 0 0 0 0 0 -8 8 -8 8 -8 8 -16 16 -16 24 -24 32 -32 40 -40 48 -56 64 -72 80 -88 96
39 96 -112 120 -136 152 -168 184 -203 224 -248 272 -300 331 -364 400 -443 488 -540 600 -668 747
59 747 -840 951 -1087 1260 -1481 1785 -2220 2902 -4140 7073 -28351 5098 63157 -22774
73 -22774 -41109 20591 24221 -29351 -11407 22968 7645 -15156 -6582 -2761 7141 17037 -3356
86 -3356 -25113 3237 23459 -4141 -15319 13183 9878 -17150 -5781 19272 7154 -8889 -4047
99 -4047 -1066 2000 13783 4408 -15785 -3294 16314 -1 -11002 10365 11389 -15153 -10125
112 -10125 16274 10738 -8483 -5730 652 521 5970 4478 -6861 -3397 5403 -3090 -4725 10691
126 10691 4834 -15888 -5755 13463 1100 -8907 5277 1035 -15611 2127 19408 -6943
138 -6943 -19962 9115 11724 -16710 -5676 21295 -1092 -25859 1418 21469 -3374 -14963
150 -14963 3448 4905 -6509 30 6179 -2058 -3567 -138 -3630 1549 10662 -1684 -14060 1679
164 1679 12856 -2473 -7182 6694 2984 -9496 847 11779 -32 -7126 1572 2166 -1361 5630
178 5630 4881 -6970 -3642 7839 2400 -3986 4069 3701 -7249 -2304 9592 3415 -6061 -1482 2140
193 2140 -667 1838 3206 -2714 -2882 1545 -1221 -949 6009 101 -10933 -1132 10808 -1161 -9829
208 -9829 3307 5520 -9108 -4855 10943 2843 -12183 -3576 7581 561 -4485 878 304 -3737
222 -3737 -380 2150 -84 380 -709 -5030 -608 7122 1287 -6980 -978 4682 -1162 -2073 4366 1241
238 1241 -5376 -458 4932 730 -977 1711 -1563 -3075 4387 5449 -3321 -3545 3659 1876 -2425
253 -2425 2129 4124 -2423 -3638 2519 3661 394 -553 -1316 -1436 2237 3100 -1363 -1701 1606 -574
269 -574 -2526 2669 3733 -3376 -4290 2166 2358 -1568 -116 580 -3184 -1774 3266 1022 -3306 -870
285 -870 739 -2366 -886 3305 -26 -4800 -1508 2470 463 -1219 -406 -1237 -1516 655 961 -402
301 -402 -82 -782 -2432 429 3807 123 -3765 -217 2648 -334 -688 2424 481 -2983 74 3613
317 3613 1131 -1167 153 230 -217 1901 2276 -690 -1206 954 988 500 1664 755 -1757 -599 2126
334 2126 1414 -206 -33 -560 -969 1162 1970 -610 -1501 125 -88 -692 1185 1147 -2205 -2363 1076 1370
352 1370 -955 -871 -220 -1409 -1025 1083 589 -1471 -1422 -607 -453 443 699 -1238 -2080 -200 773 -145 -214
371 -214 -170 -1330 -1059 970 1073 -544 -822 -327 -423 458 1519 165 -1487 -343 1133 648 322 708
389 708 -149 -906 558 1839 793 -332 -86 176 485 1347 1169 -266 -599 468 1013 896 693 -68
407 -68 -595 211 1044 699 225 24 -634 -546 1015 1365 -544 -1438 -105 653 -65 -224 127 -513 -1205 -487
427 -487 636 492 -794 -1621 -859 521 428 -855 -1120 -395 -445 -750 29 429 -769 -1550 -547 532 352
446 352 -367 -895 -901 -14 731 168 -611 -327 79 -165 93 886 533 -733 -696 727 1305 493 -298 -248 300
467 300 873 887 257 -3 417 446 82 608 1378 416 -1122 -265 1817 1437 -752 -938 791 1090 -250
486 -250 -418 739 668 -807 -1003 677 1529 -147 -1924 -863 1521 1077 -1570 -1595 1032 907 -1887 -1445
504 -1445 1795 1112 -2759 -2246 1941 1873 -2135 -2415 928 1232 -1369 -1379 760 592 -1280 -1296 374 1089
522 1089 -18 -1422 -1105 845 1422 -616 -1567 483 1396 -689 -1177 1318 1541 -1267 -1395 1495 1753
539 1753 -607 -771 764 595 -55 714 753 -432 -84 1080 388 -391 816 1109 -758 -851 1451 1579
557 1579 -771 -1134 725 1073 -114 -335 115 130 87 -115 -499 202 1055 -506 -2126 118 2493 -300
575 -300 -3248 -241 2786 -501 -3276 350 2697 -1318 -3349 775 2651 -1107 -2783 129 1496
590 1496 -343 -1234 -367 191 208 -288 -1007 -26 1494 -82 -2358 -112 2863 296 -2878 -116 2865
607 2865 49 -2263 673 2355 -568 -1735 1010 1873 -215 -850 339 696 468 450 -36 -222 626
624 626 708 -349 -58 1116 334 -1046 -7 1442 307 -1005 -41 783 -153 -375 594 169 -996 -211
642 -211 964 -127 -1159 177 794 -1004 -1231 1028 962 -1706 -1504 1202 866 -1562 -1033 903 147
659 147 -1310 -401 692 -63 -796 -498 -132 286 398 -653 -1133 488 1162 -800 -1228 1024 1111 -1321
677 -1321 -963 1622 1098 -1381 -784 1340 899 -625 -258 695 476 -46 -5 363 662 324 -425 -71 1072
696 1072 745 -590 -324 929 622 -433 -11 799 156 -555 111 748 118 -478 -76 316 32 -178 51
715 51 59 -378 -388 207 232 -537 -601 131 39 -656 -327 339 -292 -986 -212 489 -231 -822 -300 86 -208 -324 -143
738 -143 -176 -185 -160 -309 -111 337 -58 -715 -157 698 168 -618 -57 554 24 -294 286 473 -10 -143 153 375
760 375 458 173 -214 137 734 347 -257 240 714 45 -273 521 714 -87 -269 375 495 83 8 125 82
781 82 92 107 21 95 94 -196 -198 202 141 -295 -263 9 -113 -210 -11 -146 -433 -239 10 -242 -340 -54 -212 -530 -197
806 -197 133 -268 -539 -183 -45 -267 -207 -28 -193 -317 -130 -13 -46 -30 -142 -227 24 209 -32 -148 148 130
828 130 -119 113 422 95 -177 183 400 149 88 276 169 68 277 361 162 148 233 123 179 388 256 -57
850 -57 84 326 161 12 166 135 -55 -4 161 87 -30 -60 -95 -45 79 -38 -263 -153 -20 -180 -245 -18 -76
873 -76 -380 -270 14 -127 -321 -201 -139 -280 -199 -34 -183 -309 -170 -103 -158 -86 -65 -191 -160 3 -23 -92 23 -20
897 -20 -145 17 236 49 -124 99 184 14 68 293 154 -39 132 291 180 106 181 138 131 258 219 101 175 180
921 180 61 150 310 114 -72 134 244 16 -2 189 34 -160 44 188 -49 -151 -20 -28 -128 -39 -45 -183 -144
944 -144 -61 -185 -186 -1 -146 -388 -190 78 -151 -374 -146 -17 -217 -249 -52 -56 -182 -190 -154 -44 40 -118 -271 -17
968 -17 191 -52 -205 108 211 -102 -109 223 217 -36 -8 154 177 175 123 14 125 307 161 -22 202 358 45 -63
992 -63 273 347 28 -41 172 177 115 104 6 -19 184 137 -171 -60 295 29 -368 -55 320 -26 -403 -140 177 -22
1016 -22 -298 -223 6 10 -255 -343 -26 138 -264 -484 -49 213 -235 -443 -55 86 -171 -246 -95 -5 24 -126 -274
1039 -274 10 323 -97 -485 109 521 -151 -437 296 434 -233 -185 430 245 -160 92 267 46 143 305 -44
1060 -44 -63 439 297 -237 69 546 79 -273 283 446 -103 -132 279 135 -100 134 144 -170 -12 283 -44
1081 -44 -294 93 235 -225 -307 121 163 -271 -350 1 148 -169 -413 -149 155 -139 -458 -137 167 -185 -440
1102 -440 -87 81 -166 -221 -127 -165 -27 87 -268 -342 267 245 -516 -260 623 133 -700 18 758 -66 -557 324
1124 324 524 -242 -133 466 139 -171 304 288 -172 189 531 -110 -253 580 429 -409 14 691 63 -404
1144 -404 335 502 -242 -168 428 114 -282 150 269 -230 -165 268 34 -313 -24 160 -148 -220 -15 -6 -149 -165
1166 -165 -155 -87 -29 -165 -293 -71 14 -231 -245 -31 -94 -211 -86 -103 -189 -22 -12 -320 -130 315 -82 -523 94
1189 94 451 -262 -427 375 322 -417 -123 483 76 -274 203 264 -130 104 352 -97 -80 462 195 -312 227
1210 227 578 -141 -267 520 394 -318 4 531 41 -236 274 282 -188 -2 307 -49 -135 216 76 -252 42
1231 42 215 -174 -204 137 -15 -277 -5 68 -249 -161 83 -139 -270 18 -11 -312 -133 78 -192 -253 15 -80
1253 -80 -285 -24 39 -258 -145 146 -128 -293 122 169 -290 -130 298 3 -250 123 219 -135 -37 273 36 -88
1275 -88 216 158 -104 158 340 -68 -69 373 209 -191 143 398 -65 -131 334 211 -160 76 303 -56 -77 265
1297 265 81 -184 116 199 -153 -70 218 -51 -250 103 138 -247 -141 170 -93 -278 41 67 -275 -140 101
1318 101 -136 -244 35 -32 -279 -76 107 -186 -225 91 -20 -288 -22 130 -182 -191 116 6 -199 28 108 -121
1340 -121 -56 166 -1 -102 142 129 -128 50 257 6 -102 209 183 -80 84 263 30 -25 224 148 -56 134
1362 134 241 -45 -21 261 99 -139 106 229 -77 -81 199 65 -148 47 117 -123 -72 108 -55 -172 55 35
1384 35 -222 -102 98 -124 -234 31 24 -234 -143 46 -112 -203 -3 -47 -197 -65 32 -151 -149 51 -29 -183 -9
1407 -9 88 -116 -105 98 6 -119 45 97 -71 -5 148 18 -52 135 130 -49 48 185 49 -23 137 141 -1 83 172
1432 172 27 30 163 92 -29 112 157 -25 6 168 65 -69 68 114 -49 -31 76 -13 -90 27 22 -103 -25 43
1456 43 -114 -133 28 -21 -200 -74 40 -142 -186 -1 -32 -212 -98 16 -122 -163 -12 -41 -164 -59 20 -123 -94
1479 -94 30 -32 -136 6 56 -79 -73 89 34 -84 40 106 -10 -9 106 76 19 85 117 35 83 130 63 51 140 119 40
1506 40 87 136 51 36 114 94 40 81 92 14 42 92 -2 -22 70 56 -79 -6 68 -48 -97 16 9 -101 -63 22 -81 -120
1534 -120 -14 -40 -155 -70 10 -123 -156 -14 -38 -165 -108 2 -84 -149 -56 -28 -90 -77 -24 -47 -67 -2 -53 -62 29 24 -61 -27
1562 -27 70 36 -35 39 77 28 16 60 60 59 62 45 47 99 93 20 82 135 69 9 103 123 15 44 127 51 -1 84 84 -19 34 114
1594 114 12 -58 58 85 -55 -46 60 13 -79 -24 22 -62 -84 -17 -52 -104 -29 -33 -111 -97 3 -62 -140 -52 16 -122 -147 -33
1622 -33 -14 -107 -109 -26 -16 -83 -81 -32 0 -34 -49 -19 18 2 -17 14 25 13 20 54 24 35 86 60 19 80 108 28 25 135 98 0
1654 0 57 146 45 -4 106 100 -23 30 125 24 -45 94 92 -55 -20 110 11 -109 34 87 -74 -82 54 -1 -107 -32
1680 -32 32 -78 -103 7 -30 -120 -56 2 -97 -119 -10 -20 -116 -73 -24 -49 -98 -45 0 -51 -63 -33 -16 -45 -41 -24 -5 -6 -12 4
1710 4 18 7 14 36 13 6 55 50 7 37 88 45 -7 75 117 21 14 128 91 -7 35 121 31 -19 84 79 -32 21 105 -1 -43
1741 -43 69 45 -57 -6 67 -16 -81 23 33 -81 -58 34 -55 -92 -7 -8 -112 -78 -9 -59 -113 -38 -23 -102 -85 -18 -55 -92
1769 -92 -52 -23 -71 -54 -21 -36 -40 -12 -14 -36 4 0 -27 4 34 4 7 37 35 -1 52 69 26 30 73 49 17 78 71 18 47 91 49 9
1803 9 85 83 -1 46 104 33 -19 74 64 -31 8 66 -6 -58 28 36 -56 -19 38 -40 -70 12 -4 -85 -48 7 -70 -93 -20 -25 -96 -67
1835 -67 -21 -62 -96 -27 -38 -86 -51 -24 -72 -60 -13 -42 -68 -16 -13 -55 -20 11 -17 -31 21 6 -23 17 47 -7 0 60 39 0 69
1866 69 79 12 21 77 64 20 81 85 9 46 112 38 4 85 102 0 26 89 42 -18 50 59 -13 -6 42 8 -37 20 15 -60 -26 5
1898 5 -51 -72 -2 -16 -77 -64 -8 -73 -85 -36 -43 -84 -78 -45 -64 -72 -43 -56 -62 -30 -38 -70 -39 -12 -50 -57 -12 -12 -48 0 11 -27 -14 27
1932 27 16 -17 35 40 -3 6 65 31 3 64 80 21 26 84 47 14 61 78 28 46 76 44 17 48 63 3 20 57 31 3 32 38
1964 38 -10 2 37 -8 -27 17 10 -35 -16 -12 -40 -45 -29 -27 -48 -55 -41 -48 -54 -38 -62 -58 -28 -47 -66 -46 -20 -60 -60 -15 -30 -77 -33 1 -40
1999 -40 -47 1 4 -27 -20 19 -8 -14 21 36 -4 28 35 18 17 47 42 20 45 71 35 23 61 64 34 38 65 29 26 57 54 27 23 30 24 15 15 11 25
2038 25 10 -2 2 14 -1 -20 -13 2 -25 -35 -16 -38 -51 -44 -25 -47 -64 -37 -36 -63 -47 -27 -58 -70 -25 -27 -57 -46 -10 -50 -58 -16 -9 -55
2072 -55 -25 4 1 -25 17 22 -21 -10 18 12 -17 20 40 12 15 46 34 8 24 41 30 30 44 49 36 32 47 44 42 34 38 34 32 25 36 40 8 16
2110 16 24 9 -4 -6 15 -2 -18 -8 -10 -32 -17 -3 -33 -41 -9 -25 -52 -31 -17 -37 -67 -21 -29 -66 -51 -12 -47 -68 -23 -19 -68 -58 -2
2143 -2 -32 -47 -15 12 -32 -31 21 11 -30 -1 38 14 -1 38 34 20 23 39 31 31 48 52 38 44 37 41 26 50 52 42 47 36 43 48 35 22 29 17
2181 17 5 27 27 -14 -11 15 6 -37 -8 15 -30 -43 -11 -10 -61 -38 -1 -30 -68 -22 -17 -65 -59 -15 -30 -71 -24 -18 -56 -52 -8 -30 -50 -18
2215 -18 -11 -42 -33 1 -14 -46 -8 17 -18 -28 28 15 -20 10 28 10 1 28 36 10 27 33 43 34 40 33 41 44 44 33 51 47 25 31 48 35 26
2252 26 52 36 16 35 32 6 13 32 9 -16 24 18 -16 -24 12 -12 -54 -6 8 -39 -45 -8 -28 -67 -27 -13 -55 -55 -32 -30 -77 -37 -14 -52
2286 -52 -46 -13 -27 -62 -23 -8 -45 -32 12 -7 -35 -2 8 -16 -13 27 25 -9 24 31 9 22 35 14 21 41 34 33 53 46 22 46 49 38 14
2321 14 50 50 15 35 43 25 4 33 16 -2 14 28 -8 -16 15 2 -29 4 10 -29 -35 7 -9 -54 -9 -3 -38 -46 -11 -14 -55 -24 -16 -46 -49
2356 -49 -17 -19 -49 -25 -20 -45 -32 -9 -34 -39 -14 -8 -30 -24 2 -10 -18 3 4 -18 -11 20 0 -2 26 21 2 26 40 8 17 44 19 20 40 34 9
2393 9 41 41 25 14 41 46 -6 22 48 18 1 53 32 -21 -8 40 -6 -23 18 4 -34 -13 21 -35 -44 -5 -18 -53 -27 -14 -50 -50 -23
2426 -23 -33 -56 -36 -16 -50 -46 0 -36 -49 -27 -11 -46 -41 -7 -20 -36 -9 -2 -24 -2 13 -10 -5 8 6 -11 18 17 -7 13 29 24 1 19
2460 19 25 6 17 36 22 -2 38 43 2 22 41 13 -3 29 32 3 -1 28 -4 -3 14 24 -21 1 21 -15 -23 -3 -6 -40 -12 8 -31 -44
2494 -44 -13 -22 -46 -28 -3 -29 -52 -21 -29 -47 -42 -9 -45 -38 -13 -29 -32 -22 -14 -44 -33 -11 -26 -35 7 0 -31 -5 18 -5 -3 28 16 -5 18
2529 18 36 7 13 41 20 5 36 43 22 24 57 30 15 36 40 19 29 44 29 12 28 31 -3 4 26 11 -20 10 11 -4 -10 11 -16 -25 -3
2564 -3 -12 -31 -31 -19 -33 -31 -19 -24 -34 -19 -21 -41 -37 -20 -29 -42 -11 -15 -37 -23 -4 -25 -31 -9 -17 -16 -10 7 -8 -8 8 12 -13 3 26 -4 9 30
2602 30 16 1 15 31 16 6 26 34 4 33 42 21 1 26 27 12 23 28 5 6 19 21 8 19 32 -9 11 14 3 -9 5 12 -6 0 4
2637 4 -1 -18 -10 -14 -14 -11 -15 -31 -19 -24 -32 -34 -36 -35 -44 -28 -25 -42 -49 -9 -30 -44 -24 -17 -25 -32 -5 -10 -31 -20 1 -24 -16 11 18 -11 13 25 5 5 19
2678 19 20 10 14 29 9 5 37 42 26 23 40 33 16 39 40 20 17 25 19 6 17 13 2 2 9 11 -5 3 7 -7 -7 -13 -8 -16 -19 -21 -15 -18 -11 -7 -11 -21 -12 -26
2722 -26 -19 -34 -10 -19 -26 -29 -14 -19 -23 -27 -7 -11 -21 -15 -11 -19 -15 1 -7 -10 -2 1 -7 -7 7 9 -10 9 23 13 7 14 15 0 18 24 10 11 29 19 9 31
2764 31 36 26 17 35 29 18 15 25 22 6 12 12 8 10 9 2 -3 5 -3 -1 -6 -3 -18 -6 -17 -11 -28 -29 -15 -15 -24 -18 -14 -19 -18 -22 -30 -23 -24 -27 -31 -18 -33 -33 -30 -31 -26 -16
2812 -16 -11 -10 -23 1 8 -10 -7 4 -2 1 3 7 -2 13 19 5 17 26 26 16 38 20 20 7 22 26 9 15 29 16 9 20 10 6 17 26 5 -8 14
2851 14 -3 -12 -3 -1 -16 -11 -3 -13 -20 -13 -7 -16 -8 -14 -15 -22 -15 -17 -26 -28 -12 -27 -32 -17 -1 -10 -14 -10 -26 -19 -16 -15 -24 -23 -9 -17 -6 -6 -6 -22 -12 -8 1 6 -3 -13 4
2898 4 9 3 6 10 22 14 24 27 18 10 25 23 16 23 32 18 22 37 23 7 31 39 24 11 27 17 0 8 20 5 -13 10 11 -4 -9 7 -19 -21 -6 -4
2938 -4 -23 -18 -1 -23 -27 -20 -19 -32 -27 -14 -29 -23 -27 -19 -19 -34 -16 -10 -19 -7 -4 -7 -9 -23 -8 -8 -10 -9 -9 -4 10 3 16 9 11 14 16 20 10 21 18 4 19 32
2982 32 18 13 28 17 0 28 32 6 7 26 17 -2 4 12 1 -6 8 7 -13 3 14 -1 -7 1 8 -11 -5 2 -9 -22 -5 -4 -25 -22 -4 -11 -23 -11
3020 -11 -15 -32 -29 -14 -18 -18 -6 -23 -21 -17 -14 -17 -17 -17 -20 -4 -7 -20 -11 2 6 -4 -8 8 -2 15 2 5 4 6 11 7 8 30 25 14 13 28 19 13 26 32 19
3063 19 21 32 19 8 26 18 8 10 18 12 -3 16 15 1 9 13 -3 -23 3 3 -18 -19 -8 -17 -32 -8 -15 -12 -5 -3 -13 -27 -14 -27 -24 -18 -17 -17 -4 -13
3103 -13 -19 -15 -23 -9 -2 -9 -12 -13 5 -1 -7 1 19 7 6 12 8 12 0 3 10 1 20 12 9 -1 13 10 3 14 22 17 0 11 24 5 4 20 9 4 13 15 4 -2
3147 -2 14 4 -12 19 16 4 2 13 -5 -11 -7 3 -13 -10 -14 -22 -22 -9 -10 -17 -13 -14 -15 -21 -2 -14 -23 -28 -12 -7 -11 -23 -16 -7 -10 -17 -13 -1 -7 -3 7 14 -7 -13
3191 -13 16 10 -3 3 15 3 14 21 30 9 14 31 27 20 31 24 21 14 16 19 11 31 24 21 4 27 13 3 15 29 3 -8 13 -2 -6 -14 10 4 -15
3230 -15 1 -1 -11 -5 -11 -15 -16 -12 -10 -11 -20 -2 -12 -10 -3 -8 -4 -5 -7 -11 -20 -14 -2 -11 -13 -8 -3 -9 -9 -11 -5 -1 -5 6 2 5 2 9 3 9 9 9 4 1 4 9 4 15 12 2 3 26
3282 26 28 12 6 31 12 5 22 16 5 -3 20 13 9 9 22 7 12 16 11 -2 -3 12 -1 -11 3 1 -15 -21 -3 -8 -8 -12 -23 -25 -20 -24 -22 -25 -14 -13 -26 -23
3324 -23 -21 -18 -1 -22 -14 -9 -15 -6 -13 -9 -3 -5 -1 -5 2 7 10 15 -3 12 6 2 6 15 16 20 17 14 2 21 22 18 24 23 31 6 19 16 13 11 12 11 -1 -1 10 -2 -2 8
3372 8 6 -11 5 2 -5 -13 -5 3 -15 -9 -7 -6 -10 -14 -11 -8 -5 -17 -17 -10 -11 -10 -18 -12 -10 -18 -26 -10 -14 -13 -17 -17 -5 -20 -12 -14 -5 -10 4 -10 -10 9 -4 0 -1 3 -6 1 -3 2
3422 2 15 3 7 10 16 19 10 16 19 5 11 10 9 16 12 24 1 13 15 12 11 24 8 -4 5 3 -1 -4 -6 -1 -12 -11 2 2 -17 -8 -7 -26 -18 -7 -15 -19 -18 -20 -21 -21 -16
3469 -16 -17 -19 -18 -19 -24 -15 -9 -15 -16 -12 -8 -18 -15 2 0 -6 -6 13 1 0 8 6 9 12 13 14 7 15 14 4 13 18 18 24 9 14 12 15 15 14 21 23 12 -2 10 4 0 16 14 -3
3519 -3 5 4 0 3 4 14 0 -7 5 -12 -12 -3 -2 -8 -12 -5 -14 -8 -12 -3 2 -16 -3 -11 -13 -20 -6 -13 -3 -8 -19 -15 -4 -4 -12 -13 -8 -1 -11 2 0 -3 0 0 -1 8 2 19
3567 19 10 3 10 8 20 16 15 24 20 14 19 21 17 21 20 28 18 17 16 16 16 15 20 12 2 19 5 -2 15 9 12 -8 3 4 -15 -9 -7 -2 -15 -6 -12 -3 -2 -7 -18 -16 -16 -9 -11
3616 -11 -7 -3 -15 -15 -6 -1 -9 -5 -9 -21 -8 1 0 -9 -4 9 6 4 16 10 6 10 12 7 11 12 17 14 11 17 22 13 12 20 15 20 19 11 10 20 12 7 17 10 11 24 8 6 11 21
3666 21 17 3 14 7 8 5 9 -7 4 10 4 -4 3 0 -9 -9 10 -15 -5 4 -6 -15 -16 -1 -11 -24 -13 -18 -18 -18 -6 -11 -16 -26 -29 -25 -7 -11 -10 -6 -18 -12 -12 1
3710 1 -11 1 0 -4 5 6 12 6 14 20 10 23 14 21 20 14 22 32 27 12 19 22 7 18 15 8 10 11 10 6 9 4 6 -4 1 5 -4 -6 6 -9 -13 -3 -6 -15 -21 -3 -9 -6
3758 -6 -6 -22 -9 -12 -10 -10 -19 -23 -4 -3 -18 -7 -19 -14 -2 -5 0 -9 -17 -6 -2 -11 -4 14 6 3 -5 -1 -3 0 3 9 2 -5 12 7 4 16 9 1 4 7 8 2 11 20 7 4 18
3807 18 29 12 22 18 2 22 15 16 10 7 15 -1 -1 13 7 6 2 2 -2 -4 -6 -3 -4 -11 -2 -17 -20 -12 -13 -17 -16 4 -6 -13 -9 -5 -5 -12 -10 -14 -12 1 -1 -6 -3 -5 -4 -5 -4
3856 -4 6 2 5 18 10 9 8 12 12 24 10 9 25 12 2 8 20 11 15 12 16 6 7 21 5 7 13 9 6 10 6 5 4 13 2 -5 9 12 -4 -7 2 -1 -6 -9 4 -2
3902 -2 -21 -10 5 -5 -2 2 -4 -8 -9 1 -16 -9 -6 -6 -18 -7 -4 4 5 -7 -3 -3 -2 -5 0 -3 3 -7 1 1 0 -3 0 7 0 7 -4 4 0 9 5 7 17 13 6 21 8
3949 8 7 16 15 24 17 16 25 10 11 19 19 8 15 17 11 16 18 3 6 16 8 3 -12 -2 1 2 -12 -8 -8 -13 -12 -6 -13 -12 -12 -8 -13 -17 -6 -27 -25 -22 -3 -12 -16 -10 -13 -11 -8 -8 1
4000 1 3 7 7 -4 2 9 0 9 14 1 5 5 15 23 11 22 23 28 17 5 13 18 19 20 15 13 10 8 -3 12 10 17 24 11 13 6 3 8 13 0 -5 10 3 8 6 9 6 4 7
4049 7 1 -2 10 -2 6 -2 -6 -4 -19 -5 -8 6 -12 -10 -10 -8 -14 -6 -10 -7 -10 -6 -10 -13 -12 -9 -18 -6 1 -13 -4 -11 -5 14 7 3 12 5 4 4 14 9 21 4 12 21 13 13 27
4098 27 21 16 30 14 13 17 11 10 13 16 14 10 11 4 5 10 12 3 2 -2 -4 -7 -9 -1 -7 0 -10 -12 -15 -8 -8 -11 -10 -15 -11 -14 -5 -16 -15 -15 -2 -8 -18 -10 -12 -15 -13 -6 0 1 0 3 -5 7
4152 7 7 2 8 -3 10 10 0 1 12 14 15 16 6 21 17 8 9 6 1 16 3 14 12 21 14 11 19 17 6 14 3 11 12 1 20 6 10 4 6 4 9 7 3 -3 4 4 -3
4199 -3 -12 -7 -8 -10 -10 3 -12 -21 -2 -3 -9 -10 1 -6 -15 -13 -18 -15 -10 -4 -9 -6 0 -8 -11 -12 -17 0 3 1 3 -3 1 7 3 6 1 9 12 15 21 16 12 17 4 20 8 18 17 28 13
4250 13 12 13 6 -1 0 5 8 -2 7 5 -6 -6 -7 -1 -3 0 0 -6 -3 -13 0 -15 -9 -8 -10 -11 -10 -11 -17 -19 -8 -2 -6 0 -4 -12 -11 -7 2 -7 -19 -7 -6 7 -6 -7 -6 -11 1
4299 1 -6 -7 2 1 -6 3 0 -9 3 7 5 15 2 7 11 5 3 14 9 8 19 17 12 6 11 17 27 20 10 16 10 8 9 8 2 10 13 6 8 0 6 -2 8 6 -14 -14 -6 -11 -17 -2 -10
4350 -10 -5 -14 -16 -7 -12 -7 -8 -5 -30 -18 -13 -13 -16 -8 -1 -8 -20 -7 -6 -17 -3 1 -1 7 -3 2 5 6 -6 -8 1 5 13 6 7 10 9 16 13 8 17 15 14 18 2 9 9 26 10
4399 10 17 10 12 13 8 6 4 4 5 5 14 -3 -1 -5 -6 -6 2 1 -3 2 -1 -5 -2 -2 -11 -14 -5 -6 2 -9 -9 -4 -19 -17 -6 -9 -7 -14 -10 -13 -4 -6 -8 -8 -6 2 -3 1 -1 -7 -1 -10 8 7 4
4454 4 7 7 4 -2 14 3 -6 3 4 9 9 7 18 11 12 17 11 11 13 9 8 7 21 16 8 18 13 13 15 21 5 -4 2 2 0 6 -4 -1 -8 -11 -2 0 -12 -8 -19 -14 -10 -3 -18 -10 -17
4505 -17 -10 -22 -17 -25 -21 -16 -18 -20 -16 -11 -7 -16 -5 0 -15 -14 -8 3 5 0 4 0 3 5 6 14 4 13 12 16 13 10 8 11 4 -2 16 14 0 2 7 -3 12 19 5 6 8 4 9 -1
4555 -1 8 5 22 0 7 6 1 8 7 -15 -4 -2 -6 -10 -3 -2 -4 -10 -5 -6 -15 -5 -8 -10 1 -2 -5 -5 -3 4 -17 -6 -10 -11 -7 -9 -1 6 -2 3 1 3 -2 -8 -9 -9 -4 6 9 4 16
4606 16 10 16 13 4 12 18 19 11 23 17 17 16 5 4 8 14 10 10 7 14 8 5 7 14 -8 6 -2 -7 -7 -15 5 -10 -6 4 -7 -7 -11 -15 -10 -6 -13 -10 -13 -16 -17 -20 -18 -19 -21 -13 -7 -7
4658 -7 -6 -10 -16 -16 -10 -6 -12 -3 -10 -1 -10 -4 5 -4 10 10 3 9 18 13 11 13 9 14 11 4 14 10 4 7 12 10 19 13 9 13 25 11 -7 15 3 0 5 11 15 11 6 19 14 13 12 7 8
4711 8 -2 4 0 3 3 -1 -3 2 1 -11 -5 -3 -14 -7 -10 4 -10 -14 -8 -18 -9 -16 -16 -17 -12 -16 -7 -4 -8 1 3 -9 -1 -2 -1 -5 -5 0 -5 13 0 4 9 6 14 17 18 21 7 13 9
4762 9 25 23 18 26 2 16 12 16 14 26 7 14 12 9 5 3 -2 0 -8 -9 -8 -5 -2 -2 -11 -12 -13 -7 -3 -9 -11 -9 -7 -10 -9 -8 -14 -8 3 -11 -9 -1 -3 2 1 -2 -10 -15 -8 -12 -6 0 -6 -3
4816 -3 11 0 -3 8 5 3 0 -2 12 4 8 2 9 9 3 10 -2 9 12 17 19 6 13 5 10 2 17 13 10 9 14 20 9 9 19 8 18 17 8 -3 1 2 -3 7 4 -7
4862 -7 -6 5 -3 4 -8 -6 -6 3 -10 -8 -6 -6 -3 -13 -12 -15 -19 -14 -12 -5 -10 -11 -14 -15 -5 -4 -13 -10 0 -8 -16 -13 7 0 0 2 10 6 5 10 14 12 14 18 0 22 12 18 19 17 19
4913 19 10 11 20 10 11 6 3 9 -11 12 2 8 12 -4 -1 5 10 3 -4 -2 -4 -6 -3 -7 -11 -15 -5 -6 -2 -11 -4 -10 -13 -4 -7 -6 -9 -6 4 -7 -3 -8 -14 -8 -8 1 -7 -10 -3 -9 1
4964 1 4 -1 -7 -4 -7 -3 -9 -11 -7 -3 10 4 2 4 10 -1 8 7 11 2 9 10 9 7 8 4 12 8 0 0 12 6 5 10 10 4 12 21 7 -1 -1 2 2 5 -2 -1 5 -1 -1 -9 -10 -5 -1 -22 -16 -7
5020 -7 -20 -8 -13 -4 -21 -15 -7 -13 -15 -5 -8 -9 -7 -2 -9 -1 -1 0 3 10 -4 13 1 12 6 15 0 12 9 7 17 3 3 6 7 -1 17 10 -1 6 8 2 7 3 7 1 3
5067 3 2 5 3 15 6 2 8 4 0 10 0 -1 5 -14 6 2 -6 7 0 3 -1 5 1 5 5 -8 4 -3 -1 -1 -6 6 -15 -7 -7 -1 -6 -11 -2 2 -9 -1 1 -9 -1 -1 -2 -6 1
5116 1 -2 2 15 14 11 0 15 17 9 7 19 19 21 21 8 7 18 6 19 3 11 16 23 11 14 15 2 15 5 7 13 4 13 9 -1 8 0 9 2 -3 3 -1 3 1 -5 -8 -15
5163 -15 -12 -19 -10 -23 -9 -11 -6 -15 -12 -13 4 -4 -16 2 -2 -1 -12 0 -3 -7 1 6 4 -13 2 -6 3 8 -4 -1 -10 12 0 4 0 3 5 12 20 16 12 7 -2 8 9 8 16
5210 16 1 7 1 5 -6 4 14 8 2 10 13 2 7 7 7 11 -2 9 5 -3 4 10 11 -7 -8 -2 -7 0 0 -5 -4 -4 -11 -8 -5 -2 -5 -15 -5 0 -9 -14 11 -8 -9 -12 2
5257 2 -7 -3 -11 -9 -4 -6 6 1 -10 5 4 -1 -1 -2 12 18 11 3 3 3 15 21 12 12 7 19 18 10 16 14 14 4 19 14 11 5 3 3 2 0 9 11 4 3 4 -2 1 -4 -2 -13 -4 -8
5309 -8 -15 -6 -12 -9 -13 -8 -8 -2 -6 -7 -7 -4 -7 3 1 -10 -4 5 -5 -3 1 -6 3 5 -5 1 -3 -3 -2 -2 -3 11 1 14 4 -3 8 12 18 2 5 -1 14 5 10 4 9 -1 10
5358 10 4 11 9 9 8 8 8 6 5 7 6 5 4 4 4 7 10 3 9 -1 11 7 -1 5 -2 5 1 6 -1 -8 3 -5 -17 -7 2 -15 -13 -10 -13 -5 -7 -4 -13 -15 1 -14 -9 -8 -8 0 -10
5409 -10 -1 3 7 9 2 15 14 14 8 5 2 0 12 6 11 13 10 13 9 12 8 13 14 -3 7 6 1 2 4 1 11 3 4 1 -1 5 -5 -3 10 -3 -3 -5 -6 0 -3 -14 -3 -9 -9 -3
5459 -3 -5 0 -6 -5 -8 -6 4 0 -8 3 0 -6 3 2 -4 -5 -9 4 7 1 3 4 -3 1 3 0 0 -3 2 -6 -3 7 -1 3 5 -1 12 8 7 9 -5 2 7 10 3 8 8 9 11 13 15 23 10 14
5513 14 8 15 4 13 -3 5 1 17 6 15 8 6 17 12 8 9 2 -1 -6 -4 3 -13 -8 -6 1 -6 -2 -12 -4 -18 -9 -10 4 -19 -12 1 1 -2 -7 3 -7 -5 -6 10 8 8
5559 8 4 -6 5 10 3 1 9 14 19 11 8 0 12 5 12 18 16 11 20 4 4 -5 10 12 10 1 2 -3 -4 -6 17 17 6 4 4 17 -4 -10 7 0 9 4 12 2 5 8 7 14 -2
5608 -2 4 5 11 -5 6 -7 1 5 -2 -7 -4 0 -5 -4 4 -1 -5 -3 1 -6 -11 2 5 -7 7 -6 -1 -4 -6 9 4 3 -7 3 1 2 14 10 12 3 6 11 18 10 27 7 12 11
5656 11 7 14 8 8 7 5 8 2 0 11 3 12 3 8 -5 -4 5 -1 -8 4 2 -3 -3 4 -1 2 -4 -6 -7 -4 -2 -7 -9 -2 -6 -14 -4 -4 -12 9 -15 -3 -9 -3 2 -9 3 2 6 9 4
5707 4 -1 8 4 3 -2 4 -4 5 8 4 13 2 9 -3 3 5 7 2 2 0 5 3 4 14 9 -3 -2 4 6 8 -1 3 7 -1 14 1 2 3 5 2 4 4 -1 5 3 -10 4 -2 1 -6 0 -1 3
5760 3 17 -6 0 -1 1 1 -3 0 0 -6 -10 -2 -10 -9 -12 -4 -16 -4 -18 6 0 -3 0 -6 -5 -6 4 2 -8 3 2 -1 9 9 4 6 13 3 8 19 10 3 10 16 16 1 7 22
5808 22 10 13 11 17 14 9 2 10 8 10 1 -3 -4 3 -9 -4 2 3 -2 1 -5 -4 4 -1 -4 -10 -11 -14 -3 -9 -16 2 0 -6 -2 -6 -8 0 -2 -2 2 -13 -3 -11 1 2 -9 1 5 8 11
5859 11 4 1 2 4 -1 0 13 8 0 -4 -3 1 9 9 7 7 -4 10 -2 8 7 6 8 12 2 3 4 11 9 3 16 6 12 12 13 7 3 5 7 1 -3 -6 0 -3 -6 -7 -2 -9 -4 5 2 -4
5911 -4 -7 0 -5 -5 -7 -7 -3 -3 -9 -4 5 -6 -4 -8 9 -1 2 2 3 1 1 2 -2 6 4 1 7 2 10 9 12 7 14 10 8 16 13 12 9 10 10 17 7 -3 7 3 8 7 7 -1 -3 3 -2 2 14
5966 14 1 -3 -5 -1 3 -4 -2 -4 0 0 -4 1 9 -6 -8 -7 -4 1 0 -12 -3 0 -3 2 3 -3 3 -8 -6 -9 -6 -4 -6 -1 -1 7 6 3 3 0 -9 -7 -3 -1 5 -10 3 5 13 -5 6 4
6018 4 8 7 7 2 -1 2 2 1 13 9 5 0 9 1 8 13 10 9 5 24 17 -9 6 8 7 1 10 2 -2 2 -7 4 1 -2 -13 10 3 -5 -5 -2 -14 -15 -7 -16 -10 -10 -7 -6 2 -10 -4 -1
6070 -1 -5 3 5 -7 4 4 -3 -2 2 15 -2 9 3 5 14 15 20 2 10 9 -3 8 7 14 5 -1 -1 4 0 4 7 2 0 -3 -2 -1 -6 4 -3 -1 -3 -5 -8 -6 -2 -2 -3 7 -4 7
6120 7 -5 -3 -4 1 -6 -2 2 -2 -6 -2 -6 -7 -3 10 1 -1 -2 2 -4 -11 -9 -9 -1 1 0 -15 -8 -7 -6 1 4 3 2 -4 4 6 0 -3 -13 -1 5 7 3 9 8 0 0 8 9 3 19 0 4 7
6174 7 8 11 0 -2 6 5 11 4 5 14 4 5 -1 3 -5 6 -3 -4 5 4 10 -3 -5 -2 -7 -8 -8 -11 -13 -14 -15 -14 0 -10 -7 -2 -7 -10 -13 -8 12 -2 -3 -19 -10 -3 -8 -4 -13 -9 -4 4
6226 4 2 7 2 0 5 6 11 -1 21 15 3 7 -1 7 -7 4 -2 3 2 3 2 8 2 7 4 4 1 -3 7 0 -3 2 9 -5 0 -1 12 6 2 -7 -5 8 -1 -7 -6 -8 -2 0 -3 3 -1 -8
6278 -8 7 -12 4 2 -10 1 -12 -13 -10 -6 -6 1 -12 -9 -11 -13 -2 -3 -2 -14 -6 -2 -4 -4 -12 -15 -1 -5 -13 11 4 -3 9 3 10 11 9 0 9 11 12 6 15 10 12 17 6 21
6326 21 6 2 5 4 16 2 4 0 -2 0 0 -4 -5 4 -6 -9 4 -8 -8 -5 0 -2 -6 -3 -6 -11 -5 -4 -5 -4 -6 -3 4 -1 0 -5 0 -2 0 -2 2 -11 -5 7 7 2 6 -2 0 -7 6
6377 6 4 7 4 1 3 14 8 -2 -6 2 0 -2 -9 5 6 9 9 -2 4 2 2 -3 3 -1 3 0 18 14 3 8 6 2 -2 4 6 9 -1 3 8 0 -4 2 10 4 8 3 5 -3 -7 -15 2 -4 -10
6430 -10 -10 -2 -5 -10 -8 -12 -11 -6 3 -7 -11 -8 -1 -21 3 -11 0 -9 -10 0 3 3 -11 6 9 2 12 11 10 11 19 7 4 16 4 1 13 6 3 8 21 12 5 16 14
6475 14 -2 5 -4 -7 6 5 9 7 -4 -1 3 4 11 -4 -12 -5 -4 1 -3 4 1 -11 -8 -7 0 6 3 4 2 2 0 1 1 -2 -5 -1 7 -3 2 1 -11 0 9 4 8 2 -3 3 3 -3 3 0
6527 0 -1 -8 8 6 13 -2 4 0 7 6 8 8 -1 -1 -9 15 10 1 15 16 16 11 7 2 16 17 -3 6 9 12 3 4 18 1 4 -2 7 -4 8 0 -9 -4 7 2 -7 -9 -13 -4 -7 2
6577 2 3 -6 -3 -16 -8 -9 -9 3 -7 -6 -1 -8 -4 4 -3 0 -1 -9 -7 6 1 3 5 12 6 1 5 -3 14 7 6 5 3 12 10 5 3 3 11 3 6 0 -5 3 3 -1 5 -5 8 9 4 9 -7
6630 -7 -5 1 -12 -1 -7 1 -1 -1 -4 -1 -10 0 6 -3 11 0 1 -1 3 -1 4 1 -4 0 -13 1 -15 -10 0 -9 -6 5 -9 -13 0 -11 -12 -3 -5 7 -7 -6 -2 -9 2
6675 2 4 3 -6 7 -2 3 1 8 10 3 9 13 14 12 11 5 18 12 14 11 24 16 16 13 12 10 0 3 13 7 -1 3 -2 -2 0 9 -1 -5 -12 -10 -3 1 -1 -4 3 -7 -9 -11 6 -6 -4 -5
6727 -5 5 1 -8 4 -1 -3 -8 -5 -1 -17 3 5 -1 7 14 -2 4 12 6 -1 11 2 8 10 0 9 9 11 5 17 17 18 2 7 6 3 2 -4 0 9 8 9 12 7 8 9 -1 9 17 10
6777 10 9 16 11 3 17 -2 -14 7 -1 7 8 14 1 -1 1 12 -1 -2 -5 -3 3 5 0 -1 1 4 7 3 0 -3 -1 -6 -11 -11 -4 -14 -10 -13 -7 0 3 5 6 0 -3 8 11 16 0 1
6827 1 1 15 7 -3 7 13 5 5 20 7 8 7 5 14 9 13 4 2 8 -2 0 -1 11 8 4 4 -6 -2 4 -7 6 -5 -3 0 -11 -5 -8 -3 -5 -2 1 -9 -3 -3 -6 -5 -5 -10
6875 -10 -7 -6 2 0 5 -11 -3 0 16 -1 2 12 8 4 7 9 4 5 5 -1 -3 3 1 8 15 6 11 5 1 6 5 12 7 5 2 3 9 5 7 3 5 10 4 6 5 6 -1 13 0 -1 8 3 -3 17
6929 17 9 4 18 4 8 6 8 11 12 8 -11 0 -2 -4 1 -3 2 -10 8 -4 -15 8 -6 -5 -4 -11 5 -9 -9 -12 3 -7 -4 2 -5 -1 2 -1 -4 7 8 11 10 8 8
6974 8 5 15 11 2 18 15 14 6 6 12 8 9 7 9 2 16 6 0 4 -2 -6 -2 4 3 1 -5 8 4 -8 -13 1 4 -19 -12 -9 -14 -13 -19 -5 -14 2 0 -3 -1 -10 0 -2 9 -8
7023 -8 -4 -16 0 -9 -10 0 -4 -8 -2 1 -9 4 -2 -4 0 -19 -6 1 1 2 2 -9 5 1 -7 2 -2 6 4 0 3 2 2 -9 7 6 14 7 4 9 20 22 4 7 6 7 14 8
7071 8 10 9 7 7 15 11 -1 9 9 -1 0 -2 4 -11 -4 -7 2 -1 14 -2 -8 -5 -7 -10 5 1 2 -8 -10 -13 -19 -8 -8 2 5 -10 -13 5 0 -11 -1 1 8 -2 16
7116 16 8 1 5 2 11 5 18 7 2 3 5 8 11 11 8 8 7 -2 3 -4 -3 3 2 -1 -1 -1 6 3 -7 -6 3 5 6 4 -11 -3 -5 1 -16 -10 -13 -5 4 5 -2 7 1 -5 -12 1 -2 1 -14
7169 -14 0 2 2 -2 6 9 3 -1 8 -6 3 -1 -1 -12 -2 -7 -7 -4 -12 -5 -5 12 4 -6 4 -3 -7 -3 5 -1 2 1 -4 0 -4 5 2 8 4 7 15 13 13 1 2 7 10 11 13 3 6
7220 6 8 0 13 -1 16 9 5 0 -5 -4 2 -2 -10 -4 -7 5 -8 -3 -11 -9 -8 -12 -4 -15 -7 -16 -10 -10 -5 1 0 6 -14 -2 -2 4 -5 3 8 9 6 2 3 9 17 9 3 4 10 3 12 6 6
7273 6 -2 16 0 -3 -4 11 10 6 4 0 4 5 -5 6 9 9 2 9 8 -4 -6 -2 -2 -10 -1 2 -2 -5 7 6 1 2 1 1 7 3 -4 -3 4 -1 -3 6 5 -7 0 7 9 -2 -5 -3 -9 -8
7325 -8 -18 -6 -3 4 -4 -1 -8 -10 1 -7 3 -4 -3 13 -6 4 1 -7 1 -9 11 11 0 3 5 9 5 16 5 12 6 11 6 19 -1 -11 11 13 16 8 5 10 18 10 -2
7370 -2 -2 5 -4 -2 2 3 -3 -9 4 -12 -5 -22 -12 -4 -17 -3 -21 -14 -9 -4 -7 -10 -16 1 -12 7 -5 -3 -1 -1 1 1 0 -2 5 -3 0 1 -2 -1 4 -4 7 13 -2 4 -6
7417 -6 0 -2 15 3 -9 -3 -5 -5 3 4 10 6 2 2 0 0 16 -1 2 1 -3 6 -6 -3 -5 8 0 4 -5 11 1 11 5 5 -2 6 3 12 -5 -4 -10 -4 5 -5 -5 2 -11 -4
7465 -4 -9 -4 -7 -7 -9 -6 -8 -14 -10 -5 -13 -12 -14 -14 -13 -6 3 -6 -4 -4 -13 4 2 9 2 -11 9 -10 3 12 12 9 8 4 3 8 1 -5 5 -3 0 12 0 4 10 9 -9 0 -1 4 -5 7
7517 7 6 -6 -10 -7 -2 -10 1 3 1 7 1 -6 0 4 -11 -14 -3 -5 -14 -15 -11 4 -4 -2 -9 0 0 6 10 -3 4 -2 -9 -5 8 14 3 7 5 -4 6 10 -1 6 7 -5 -6 5 -1
7566 -1 -5 -6 8 11 2 -1 -4 -8 0 3 -1 0 2 8 5 4 2 6 13 5 -1 3 4 9 12 -3 9 6 -1 3 23 11 10 -2 -2 -2 5 -4 -16 2 -2 -4 -8 -8 -5 1 -5 -11 -8 -11 -12 -11 -13
7619 -13 1 1 -7 -1 6 -4 -5 -6 3 -3 1 -7 -2 0 -9 5 12 8 10 7 12 5 -5 11 3 8 11 3 5 15 1 6 7 9 3 -4 10 3 6 4 7 -4 -3 6 -8 -1 2 -7 1 -5
7669 -5 6 2 3 -3 -6 5 1 -9 -8 -7 -7 6 -2 -2 11 5 4 -1 -1 4 1 -8 -3 7 -10 -1 -5 -6 -7 -5 -3 -4 -13 -1 -3 -2 -8 -10 8 -5 -7 -5 -14 2 -5 -2 -5 -11 5
7718 5 4 -3 0 6 -1 -9 -9 -4 6 7 1 8 10 15 6 19 10 12 0 18 16 3 0 13 1 -6 3 1 1 1 1 5 -3 7 -6 3 -1 -5 -15 -11 -10 -13 -6 -9 -4 -7 4 -2 0 -2
7768 -2 4 5 2 -4 -3 -2 12 -12 -7 6 2 2 3 3 4 0 6 7 8 0 4 -3 3 5 9 -3 5 -4 4 -5 -2 6 7 0 -4 -3 -8 -5 -4 -3 -1 -2 4 -9 0 2 -5 -4 -5 5 1 -4 -7 -1 3
7823 3 -3 -1 4 1 10 -16 -2 -1 5 -4 -4 4 -7 -9 -9 5 4 -19 -9 -6 4 -4 1 -4 -11 -6 1 -4 -15 -4 -17 -12 -4 -12 -9 -6 -10 -6 -7 7 1 2 1 3 -3 9 8 7 6
7872 6 9 6 17 3 0 5 4 9 5 10 8 2 -3 -1 4 0 -4 2 6 -4 -12 -13 -7 -4 -2 0 1 -4 -3 -19 -12 -11 -12 -6 -21 -16 -17 -17 -11 -3 -2 -7 -7 0 1 -5 -8 1 -4 -3 -17 6 2 9
7926 9 12 7 1 -4 0 4 4 -7 -3 4 4 -6 -3 -3 -5 2 3 11 -3 1 3 2 3 -2 4 -6 -3 4 -2 5 -12 2 -9 -7 -5 -7 -4 0 3 -1 -1 -2 0 -7 -8 6 -10 -7 3 -8
7976 -8 -11 -2 5 3 0 -6 -7 -14 -3 -5 -13 -5 -4 -10 -3 -9 -2 -12 -11 -4 -11 -10 -12 -11 -7 -7 -11 -7 9 8 3 9 -3 0 5 9 12 5 4 7 -10 4 6 3 5 7 2 4 11 6 13 5 3 1 -1
8031 -1 0 -4 -8 -5 -3 2 -6 -11 -10 -7 -4 4 0 3 -9 -15 11 3 -1 -18 1 -3 -9 0 -5 -10 -9 -9 -3 -12 -4 -8 -14 -10 -6 -11 1 -2 2 3 2 -4 -8 -9 3 10 9 -6 -2 -1 -13 -3
8083 -3 -3 -3 -9 -1 -5 2 -1 1 -5 3 -3 1 3 -5 -9 -6 0 -4 -5 -2 9 5 3 9 3 0 1 -5 2 14 3 1 -2 7 5 -5 3 3 1 5 3 0 -4 -11 -4 -7 -15 -2 -1 -14 -14 -2 -10 -3
8137 -3 -2 0 0 1 1 3 -8 -12 -2 -5 1 0 -7 5 9 2 4 14 7 -2 4 17 17 9 11 13 8 16 12 12 3 7 8 14 4 4 11 9 -2 -8 -5 -12 -1 -9 -3 -7 3 -10 1 -5
8187 -5 -14 -4 -8 -20
8191b0
##END NTUPLES=NMR FID
##END=
