##TITLE=1H_Pr Am-U
 200.13MHz, CDCl3,
 8 sc
 
 8.9.2025
##JCAMPDX= 6.0         $$ Bruker NMR JCAMP-DX V2.0
##DATA TYPE= NMR FID
##DATA CLASS= NTUPLES
##ORIGIN= UXNMR, Bruker Analytische Messtechnik GmbH
##OWNER= pz
$$ XWIN-NMR		Version 3.5
$$ Mon Sep  8 16:08:33 2025 Russian Standard Time (UT+4h)  she@DPX200
##.OBSERVE FREQUENCY= 200.1313
##.OBSERVE NUCLEUS= ^1H
##.DELAY= (6, 6)
##.ACQUISITION MODE= SIMULTANEOUS
##.ACQUISITION SCHEME= undefined
##.AVERAGES= 8
##.DIGITISER RES= 18
##SPECTROMETER/DATA SYSTEM= spect
##.PULSE SEQUENCE= zg30
##.SOLVENT NAME= CDCl3
##.SHIFT REFERENCE= (INTERNAL, CDCl3, 0, 14.3821)
##AUDIT TRAIL= $$ (NUMBER, WHEN, WHO, WHERE, WHAT)
$$ ##TITLE= Audit trail, XWIN-NMR		Version 3.5
$$ ##JCAMPDX= 5.01
$$ ##ORIGIN= Bruker BioSpin GmbH
$$ ##OWNER= she
$$ F:/spectra/data/she/nmr/H-C/1/audita.txt
$$ ##AUDIT TRAIL=  $$ (NUMBER, WHEN, WHO, WHERE, WHAT)
(   1,<2025-09-08 16:07:21.76 +0400>,<she>,<DPX200>,
      <created by zg, POWCHK disabled, PULCHK disabled
       configuration hash MD5:
       00 E9 B6 7A A2 85 ED C7 34 08 36 98 17 FE 4E 26
       data hash MD5: 16K
       2E 2A 71 D3 12 C1 0C 8B 13 F3 3C 01 02 7E B8 B2>)
$$ ##END=
$$ 
$$ hash MD5
$$ CA 0F EB D8 A0 42 6D 89 FF 60 9D 17 61 A0 F0 F6
##$RELAX= 
##$RELAX= 
##$RELAX= 
##$RELAX= 
##$RELAX= 
##$RELAX= 
$$ Bruker specific parameters
$$ --------------------------
##$DU= <F:/spectra>
##$EXPNO= 1
##$NAME= <H-C>
##$PROCNO= 1
##$TYPE= <nmr>
##$USER= <she>
##$AMP= (0..31)
100 100 100 100 100 100 100 100 100 100 100 100 100 100 100 100 100 100 
100 100 100 100 100 100 100 100 100 100 100 100 100 100 
##$AQSEQ= 0
##$AQ_mod= 1
##$AUNM= <au_zg>
##$AUTOPOS= <>
##$BF1= 200.13
##$BF2= 200.13
##$BF3= 200.13
##$BF4= 200.13
##$BF5= 200.13
##$BF6= 200.13
##$BF7= 200.13
##$BF8= 200.13
##$BYTORDA= 1
##$CFDGTYP= 0
##$CFRGTYP= 5
##$CHEMSTR= <none>
##$CNST= (0..31)
1 1 145 1 1 1 1 1 1 1 1 1 1 1 1 1 1 1 1 1 1 1 1 1 1 1 1 1 1 1 1 1 
##$CPDPRG= <>
##$CPDPRG1= <>
##$CPDPRG2= <>
##$CPDPRG3= <>
##$CPDPRG4= <mlev>
##$CPDPRG5= <mlev>
##$CPDPRG6= <mlev>
##$CPDPRG7= <mlev>
##$CPDPRG8= <mlev>
##$CPDPRGB= <>
##$CPDPRGT= <>
##$D= (0..31)
0 0.7 0 0 0 0 0 0 0 0 0 0.03 0 0 0 0 0 0 0 0 0 0 0 0 0 0 0 0 0 0 0 0 
##$DATE= 1757333241
##$DBL= (0..7)
120 120 120 120 120 120 120 120 
##$DBP= (0..7)
150 150 150 150 150 150 150 150 
##$DBP07= 0
##$DBPNAM0= <>
##$DBPNAM1= <>
##$DBPNAM2= <>
##$DBPNAM3= <>
##$DBPNAM4= <>
##$DBPNAM5= <>
##$DBPNAM6= <>
##$DBPNAM7= <>
##$DBPOAL= (0..7)
0.5 0.5 0.5 0.5 0.5 0.5 0.5 0.5 
##$DBPOFFS= (0..7)
0 0 0 0 0 0 0 0 
##$DE= 6
##$DECBNUC= <off>
##$DECIM= 32
##$DECNUC= <off>
##$DECSTAT= 4
##$DIGMOD= 1
##$DIGTYP= 9
##$DL= (0..7)
0 120 120 120 120 120 120 120 
##$DP= (0..7)
150 150 150 150 150 150 150 150 
##$DP07= 0
##$DPNAME0= <>
##$DPNAME1= <>
##$DPNAME2= <>
##$DPNAME3= <>
##$DPNAME4= <>
##$DPNAME5= <>
##$DPNAME6= <>
##$DPNAME7= <>
##$DPOAL= (0..7)
0.5 0.5 0.5 0.5 0.5 0.5 0.5 0.5 
##$DPOFFS= (0..7)
0 0 0 0 0 0 0 0 
##$DQDMODE= 0
##$DR= 18
##$DS= 0
##$DSLIST= <SSSSSSSSSSSSSSS>
$$ [...]
##$SUBNAM0= <"">
##$SUBNAM1= <"">
##$SUBNAM2= <"">
##$SUBNAM3= <"">
##$SUBNAM4= <"">
##$SUBNAM5= <"">
##$SUBNAM6= <"">
##$SUBNAM7= <"">
##$SUBNAM8= <"">
##$SUBNAM9= <"">
##$SW= 18.0517328524113
##$SWIBOX= (0..15)
0 0 2 0 0 0 0 0 0 0 0 0 0 0 0 0 
##$SW_h= 3612.71676300578
##$TD= 16384
##$TD0= 1
##$TE= 0
##$TE2= 300
##$TE3= 300
##$TEG= 300
##$TL= (0..7)
0 120 120 120 120 120 120 120 
##$TP= (0..7)
150 150 150 150 150 150 150 150 
##$TP07= 0
##$TPNAME0= <>
##$TPNAME1= <>
##$TPNAME2= <>
##$TPNAME3= <>
##$TPNAME4= <>
##$TPNAME5= <>
##$TPNAME6= <>
##$TPNAME7= <>
##$TPOAL= (0..7)
0.5 0.5 0.5 0.5 0.5 0.5 0.5 0.5 
##$TPOFFS= (0..7)
0 0 0 0 0 0 0 0 
##$TUNHIN= 0
##$TUNHOUT= 0
##$TUNXOUT= 0
##$USERA1= <user>
##$USERA2= <user>
##$USERA3= <user>
##$USERA4= <user>
##$USERA5= <user>
##$V9= 5
##$VALIST= <valist>
##$VCLIST= <CCCCCCCCCCCCCCC>
##$VD= 0
##$VDLIST= <DDDDDDDDDDDDDDD>
##$VPLIST= <PPPPPPPPPPPPPPP>
##$VTLIST= <TTTTTTTTTTTTTTT>
##$WBST= 1024
##$WBSW= 4
##$XGAIN= (0..3)
0 0 0 0 
##$XL= 0
##$YL= 0
##$YMAX_a= 130497
##$YMIN_a= -196235
##$ZGOPTNS= <>
##$ZL1= 120
##$ZL2= 120
##$ZL3= 120
##$ZL4= 120
##$ABSF1= 10
##$ABSF2= 0
##$ABSG= 5
##$ABSL= 3
##$ALPHA= 0
##$AQORDER= 0
##$ASSFAC= 0
##$ASSFACI= 0
##$ASSFACX= 0
##$ASSWID= 0
##$AUNMP= <proc_1d>
##$AZFE= 0.1
##$AZFW= 0.1
##$BCFW= 1
##$BC_mod= 2
##$BYTORDP= 1
##$COROFFS= 0
##$CY= -3
##$DATMOD= 1
##$DC= 2
##$DFILT= <>
##$DTYPP= 0
##$F1P= 0
##$F2P= 0
##$FCOR= 0.5
##$FTSIZE= 0
##$FT_mod= 4
##$GAMMA= 1
##$GB= 0.15
##$INTBC= 1
##$INTSCL= 1
##$ISEN= 128
##$LB= 0.25
##$LEV0= 0
##$LPBIN= 0
##$MAXI= 10000
##$MC2= 0
##$MEAN= 0
##$ME_mod= 0
##$MI= 1.114404
##$NCOEF= 0
##$NC_proc= 0
##$NLEV= 6
##$NOISF1= 3.799351
##$NOISF2= 2.8
##$NSP= 1
##$NTH_PI= 0
##$NZP= 0
##$OFFSET= 14.38212
##$PC= 1
##$PHC0= -1562.408
##$PHC1= 13.39228
##$PH_mod= 1
##$PKNL= yes
##$PPARMOD= 0
##$PSCAL= 0
##$PSIGN= 0
##$REVERSE= no
##$SF= 200.129724274929
##$SI= 16384
##$SIGF1= 3
##$SIGF2= 2
##$SINO= 400
##$SIOLD= 16384
##$SREGLST= <1H.CDCl3>
##$SSB= 0
##$STSI= 0
##$STSR= 0
##$SW_p= 3205.1282051282
##$SYMM= 0
##$S_DEV= 0
##$TDeff= 0
##$TDoff= 0
##$TI= <>
##$TILT= no
##$TM1= 0
##$TM2= 0
##$TOPLEV= 0
##$USERP1= <user>
##$USERP2= <user>
##$USERP3= <user>
##$USERP4= <user>
##$USERP5= <user>
##$WDW= 1
##$XDIM= 8192
##$YMAX_p= 0
##$YMIN_p= 0
$$ End of Bruker specific parameters
$$ ---------------------------------
##NTUPLES= NMR FID
##VAR_NAME=  TIME,          FID/REAL,        FID/IMAG
##SYMBOL=    X,             R,               I
##VAR_TYPE=  INDEPENDENT,   DEPENDENT,       DEPENDENT
##VAR_FORM=  AFFN,          ASDF,            ASDF
##VAR_DIM=   8192,          8192,            8192
##UNITS=     SECONDS,       ARBITRARY UNITS, ARBITRARY UNITS
##FACTOR=    0.0002768,     1,               1
##FIRST=     0,             0,               0
##LAST=      2.2672688,     0,               0
##MIN=       0,             -196235,         0
##MAX=       2.2672688,     130497,          0
$$ Real data points
##PAGE= N=1
##DATA TABLE= (X++(R..R)), XYDATA
$$ plain form
0 0 0 0 0 0 0 0 0 0 0 0 0 0 0 0 0 0 8 -8 8 -8 8 -8 16 -16 16 -23 24 -30 32 -39 43 -48 55 -63 71 -79 89 -100
38 -100 113 -123 139 -154 171 -189 208 -228 252 -281 306 -338 375 -412 453 -503 557 -617 687 -766
58 -766 859 -972 1108 -1279 1495 -1786 2195 -2812 3857 -5936 11697 -64198 -196235 -56760
72 -56760 51627 18839 -18287 15532 40366 28518 19750 19717 -12133 -30382 -18112 -17175 -16351 -5553
86 -5553 -1110 24862 43077 18380 -20495 -34713 -25880 -8780 3125 25295 25153 -11112 -13557
99 -13557 19497 14154 -3068 3224 1157 -22625 -27070 10916 29532 -3480 -9503 15379 -778
112 -778 -28794 -18611 3013 10886 4955 2419 10186 1765 -8149 4672 14837 7713 -11161 -20667
126 -20667 3383 19167 2681 -2274 6277 679 -12379 -19902 -8567 5518 -625 1542 11826
$$ packed form
0@%%%%%%%%%%%%%%%%Qj6J6j6J6j6K4l2L2l9M7n4O2p1Q2r1J03j18J34j50J68j89
38a00K13k36K62k93L25l60L97m36M80n33N87o44P13p87Q65r56J060j174J304j453
58g66J625j831K080k387K774l281L981n007O669r793J7633p5895j32037J39475
72e6760J08387l2788l7126L3819K4834j1848q768l3l1850j8249J2270R37Q24J0798
86e553M443K5972J8215k4697l8875j4218Q833J7100J1905K2170j42l6265k445
99a3557L3054n343j7222O292k067k3782m445L7986J8616l3012o023K4882j6157
112g78k8016J0183K1624P873n931k536P767q421r914J2821J0165p124j8874r506
126b0667K4050J5784j6486m955Q551n598j3058p523J1335J4085o143K167J0284
$$ plain form
139 11826 2343 -5684 958 5307 2917 -5905 -3601 7897 2797 465 12425 7776 -6917 -11639
153 -11639 -8547 -1199 -4890 -6695 6904 7175 -3550 1784 3167 -4030 -4718 -513 5054 2196 -2527
168 -2527 7538 10652 910 -1898 -5216 -4958 2793 -3318 -8213 1164 2366 -2641 -3180 1321 4772
183 4772 -3915 -5787 5981 2140 -4610 7172 9133 4 -1683 1164 2982 -2294 -3837 4023 -1077
198 -1077 -8794 -1166 -631 -4416 2047 1281 -3405 -2695 -1040 2158 2506 2942 7351 840 -3274 4266
214 4266 1207 -1856 5182 1279 -5469 -3176 -850 -727 -4269 -2676 3555 -2740 -6672 2425 2107 -801
230 -801 4062 3202 -66 -591 -281 3667 3352 1732 3953 -1756 -5384 685 -1607 -3213 688 -2719
246 -2719 -3337 -465 -780 471 -513 -46 2816 -1468 -1685 5098 2511 1437 5106 1191 -1064 -815 -2477
$$ packed form
139A1826r483q027O642M349k390q822K304J1498n100k332J1960m649j4693m722
153a1639L092P348l691j805J3599K71j0725N334J383p197o88M205N567k858m723
168b527J0065L114r742k808l318K58P751o111m895R377J202n007n39M501L451
183D772q687j872J1768l841o750J1782J961r129j687K847J818n276j543P860n100
198a077p717P628N35l785O463p66m686P10J655L198L48M36M409o511m114P540
214D266l059l063P038l903o748K293K326J23l542J593O231o295l932R097l18k908
230h01M863q60l268n25L10L948l15j620K221n709l628O069k292j606L901l407
246b719o18K872l15J251r84M67K862m284k17O783k587j074L669l915k255K49j662
$$ plain form
263 -2477 -981 -1597 -2103 1244 -2763 -3000 1571 -1560 -1719 855 -2108 -33 3207 1117 2644 3097
279 3097 2475 2866 -1284 -1022 1507 -2939 -1426 1589 -2190 -1161 655 -2107 -1362 -1763 -2389 442 -1413
296 -1413 43 3550 664 1843 3797 -39 1094 2221 -1157 -37 197 -894 182 -1894 -795
311 -795 -90 -4322 -1884 113 -3388 -58 2052 -344 1248 1473 1258 2288 -100 1518 2447 -1176
327 -1176 1194 1612 -2027 291 396 -2940 -1522 -1925 -2608 -850 -1490 501 990 -1678 1694 2137 -1504
344 -1504 1939 2774 -93 1855 1438 627 1104 -874 673 -217 -3905 -1139 -1177 -3353 171 388 -2043
361 -2043 490 196 -498 1338 826 2308 1774 -582 2655 1949 -1738 2020 1085 -2227 -274 -1211 -1875
378 -1875 -1022 -1573 -169 -605 -2585 246 -13 -1308 2467 1834 85 1852 653 653 2012 979 1509
$$ packed form
263b477J496o16n06L347m007k37M571l131j59K574k963K075L240k090J527M53
279C097o22L91m150K62K529m446J513L015l779J029J816k762P45m01o26K831j855
296a413J456L507k886J179J954l836J133J127l378J120K34j091J076k076J099
311g95P05m232K438J997l501L330K110k396J592K25k15J030k388J618R29l623
327a176K370M18l639K318J05l336J418m03o83J758o40J991M89k668L372M43l641
344a504L443Q35k867J948m17q11M77j978J547q90l688K766l8k176L524K17k431
361b043K533k94o94J836n12J482n34k356L237p06l687L758r35l312J953r37o64
378a875Q53n51J404m36j980K831k59j295L775o33j749J767j199%J359j033N30
$$ plain form
395 1509 232 -1839 513 -1031 -3028 381 -606 -2520 -642 -933 -1079 326 -134 1541 714 -681
411 -681 2127 1808 629 3071 1404 -802 305 -1161 -469 647 -1171 -583 -1169 -2661 -367 -1079 -1717
428 -1717 974 -152 -6 1628 -124 839 2581 1071 1287 852 -896 1199 540 -132 652 -2056 -2014
445 -2014 -615 -2532 -530 700 -1383 -352 -148 -1174 596 677 1351 2124 -229 1136 2328 -917
461 -917 193 1680 -1286 -619 -475 -1453 -772 -926 70 -61 -3038 -1054 698 -1165 1170 2744 -463
478 -463 643 1601 459 433 234 1892 1650 -2068 -198 1129 -2523 -1101 416 -2329 -1513 -237 275
495 275 -39 -806 1214 1430 -1542 1022 2606 -753 1504 2925 219 -689 -254 -100 -198 -1921 -256
512 -256 -130 -2786 -419 477 -2516 -395 1130 -817 -314 1054 1878 1460 -342 1564 2165 -1019 469
$$ packed form
395A509j277k071K352j544j997L409r87j914J878k91j46J405m60J675q27j395
411f81K808l19j179K442j667k206J107j466O92J116j818N88n86j492K294p12o38
428a717K691j126J46J634j752R63J742j510K16m35j748K095o59o72P84k708M2
445b014J399j917K002J230k083J031K04j026J770Q1O74P73k353J365J192l245
461i17J110J487k966O67J44r78O81j54R96j31k977J984J752j863K335J574l207
478d63J106R58j142k6j99J658k42l718J870J327l652J422J517k745Q16J276N12
495B75l14p67K020K16k972K564J584l359K257J421k706r08M35J54r8j723J665
512b56J26k656K367Q96k993K121J525j947N03J368Q24m18j802J906O01l184J488
$$ plain form
529 469 1669 -1072 -215 604 -861 -1078 -1582 -492 -659 -1974 467 1224 -1018 221 1748 -369 525
546 525 1348 849 1134 301 756 1292 -1212 -130 37 -1741 -361 134 -1682 -667 -313 -793 -212 -1079
564 -1079 44 1364 -273 1032 1961 42 805 820 -224 686 -265 -225 1029 -1044 -825 58 -1991 -1543
582 -1543 113 -1322 -90 364 278 794 -310 474 1996 -344 409 2032 214 149 578 -359 75 -852
600 -852 -995 -266 -1944 -1081 968 -693 -853 288 -953 -370 627 856 818 723 1361 1882 -744 -285 1508
619 1508 -520 -324 356 -1005 -1304 -509 -437 -24 -974 -554 245 -1532 -354 2066 608 577 1333 245
637 245 263 591 679 1070 -672 -284 649 -1734 -1410 905 -824 -648 -72 -1279 -1008 -174 560 1294 222
656 222 736 1519 -625 -66 2168 470 132 417 -423 -599 -642 -126 642 -1158 -1063 -480 -1792 -821 1164
$$ packed form
529D69J200k741Q57Q19j465k17n04J090j67j315K441P57k242J239J527k117Q94
546E25Q23m99K85q33M55N36k504J082J67j778J380M95j816J015L54m80N81q67
564a079J123J320j637J305R29j919P63J5j044R10r51M0J254k073K19Q83k049M48
582a543J656j435J232M54q6N16j104P84J522k340P53J623j818o5M29r37M34r27
600h52j43P29j678Q63K049j661j60J141j241N83R97K29l8r5O38N21k626M59J793
619A508k028J96O80j361k99P95P2M13r50M20P99j777J178K420j458l1P56j088
637B45J8L28Q8L91j742L88R33k383L24K315j729J76N76j207K71Q34P34P34j072
656B22N14P83k144N59K234j698l38K85q40j76m3N16P68j800R5N83j312R71J985
$$ plain form
675 1164 195 389 628 -276 575 29 1081 1841 -18 -252 418 -740 -117 1122 -534 -346 -867 -1672
693 -1672 -625 -896 20 883 -380 -11 727 -715 987 1680 464 901 279 -87 635 201 142 994 -678
712 -678 -714 -648 -1344 -567 -148 -696 171 -486 -608 608 392 527 1151 284 128 826 -136 905 576 -462
732 -462 600 -441 -1238 -238 -1068 -1177 -11 -730 -380 153 -439 824 238 -628 1042 515 143 1291
750 1291 274 204 843 -67 3 140 -1019 -199 -983 -1061 483 -140 -429 679 -389 -787 718 182 825
769 825 756 178 805 321 -72 1324 31 -434 55 -872 -1110 -376 -694 166 37 -835 -113 -1051 -746 793
789 793 493 348 1339 -80 231 953 608 702 142 -585 -361 -708 -966 402 -174 -451 76 -1298 -1203 122
809 122 -517 547 585 -73 599 257 433 1465 272 17 372 -964 -279 -77 -336 448 -456 -969 -1109
$$ packed form
675A164r69J94K39r04Q51n46J052P60j859k34O70j158O23J239j656J88n21q05
693a672J047k71R16Q63j263L69P38j442J702O93j216M37o22l66P22m34n9Q52j672
712f78l6O6o96P77M19n48Q67o57j22J216k16J35O24q67j56O98r62J041l29j038
732d62J062j041p97J000q30j09J166p19L50N33n92J263n86q66J670n27l72J148
750A291j017p0O39r10P0J37j159Q20p84p8J544o23k89J108j068l98J505n36O43
769H25o9n78O27m84l93J396j293m65M89r27k38P34l18Q60j29q72P22r38L05J539
789G93l00j45R91j419L11P22l45R4n60p27K24l47k58J368n76k77N27j374R5J325
809A22o39J064L8o58O72l42J76J032j193k55L55j336O85K02k59P84r04n13j40
$$ plain form
828 -1109 -991 -907 469 -33 -164 802 -444 337 1096 387 829 129 -506 453 48 -12 780 -342 -286 -295 -1578
849 -1578 -405 -294 -711 157 -24 -356 402 170 460 956 -6 179 694 -602 510 617 -45 540 -123
868 -123 -896 -448 -954 -730 -44 -839 -27 96 -530 555 553 -254 410 304 -27 771 117 475 387 -183 244
889 244 -350 -1029 -176 -78 -800 -8 -450 -571 263 -261 -152 148 -203 706 801 254 1025 798 -73 479 109
910 109 -254 -109 -423 -551 -171 -904 3 -135 -908 197 -33 -788 345 434 648 751 76 318 418 -105
930 -105 785 489 -506 354 -12 -901 -118 -559 -307 -307 -783 -184 -367 -693 519 627 81 985 476 32 679
951 679 471 486 515 -61 186 -288 -583 120 -427 -893 89 -501 -707 -64 -84 -190 337 -22 798 248 36
972 36 942 533 -347 550 -121 -381 519 -489 -238 -239 -806 -318 -68 -751 618 -3 -275 182 116 69 568
$$ packed form
828a109J18Q4J376n02j31R66j246P81P59p09M42p00o35R59m05o0P92j122N6rj283
849a578J173J11m17Q68j81l32P58k32K90M96r62J85N15j296J112J07o62N85o63
868a23p73M48n06K24O86p95Q12J23o26J085kq07O64j06l31P98o54L58q8n70M27
889B44n94o79Q53R8p22P92m42j21Q34n24J09L00l51R09R5n47P71k27q71N52l70
910A09l63J45l14j28L80p33R07j38p73J105k30p55J133Q9K14J03o75K42J00n23
930a05Q90k96r95Q60l66q89P83m41K52%m76N99j83l26J212J08n46R04n09m44O47
951F79k08J5K9n76K47m74k95P03n47m66R82n90k06O43k0j06N27l59Q20n50k12
972C6R06m09q80Q97o71k60R00j008K51jn67M88K50o83J369o21k72M57o6m7M99
$$ plain form
993 568 -17 542 679 188 581 463 -200 173 -209 -616 -182 -525 -191 -98 -756 -236 -156 -773 138 303 -310
1014 -310 547 528 215 741 274 600 582 -606 225 69 -731 308 -278 -595 -203 -475 -546 -101 -448 168
1034 168 460 -259 377 364 42 823 390 -18 530 -108 -49 154 -439 -115 37 -920 -92 -215 -618 85 186
1055 186 -8 1 -211 353 692 91 660 381 -394 494 559 -343 249 -4 -205 5 -516 -176 263 -734 121
1076 121 -186 -588 106 531 -129 491 434 25 514 -166 651 330 -70 19 -37 -759 75 -234 -475 -294 -66
1097 -66 -258 -14 -507 -62 184 -267 311 518 -143 519 713 -72 410 8 -181 384 -664 -152 -35 -935
1117 -935 110 -235 -748 62 -168 -243 -80 -151 92 565 86 414 310 -65 393 201 21 159 134 -645 -62
1138 -62 -579 -435 -108 -483 -350 50 -439 305 120 -18 439 141 247 514 -51 45 519 14 87 -73 -570
$$ packed form
993E68n85N59J37m91L93j18o63L73l82m07M34l43L34R3o58N20Q0o17R11J65o13
1014c10Q57j9l13N26m67L26j8j188Q31j56q00J039n86l17L92k72p1M45l47O16
1034A68K92p19O36j3l22P81m33m08N48o38N9K03n93L24J52r57Q28j23m03P03J01
1055A86j94Rk12N64L39o01N69k79p75Q88O5r02N92k53k01K10n21L40M39r97Q55
1076A21l07m02O94M25o60O20n7m09M89o80Q17l21m00Q9n6p22Q34l09k41J81K28
1097f6j92K44m93M45K46m51N78K07o61O62J94p85M82m02j89N65j048N12J17r00
1117i35J045l45n13Q10k30p5J63p1K43M73m79L28j04l75M58j92j80J38k5p79N83
1138f2n17J44L27l75J33M00m89P44j85j38M57k98J06K67n65R6M74n05P3j60m97
$$ plain form
1159 -570 -206 -422 -439 28 -392 -345 121 -440 48 227 -81 306 261 53 437 165 319 372 -51 3 163 -513
1181 -513 -313 -129 -507 -404 -243 -525 -69 -312 -90 407 -274 90 553 -35 200 228 -3 277 477 -96
1201 -96 194 56 -222 -168 -311 -379 206 -598 -257 -83 -415 -31 -37 -50 477 95 171 838 -33 527 486 -293 -12
1224 -12 -102 -358 -77 -391 -526 142 -316 -278 -40 -223 155 471 -63 182 170 -133 527 423 -138 257 -134
1245 -134 -44 222 -59 34 -85 -585 -193 -202 -330 -82 -54 -94 373 0 -90 412 -9 696 172 -219 474 -93
1267 -93 -403 246 -143 -162 81 -484 -241 -209 -371 -61 -112 23 152 135 62 564 430 167 375 -209 271 308
1289 308 -53 100 54 -102 266 -321 -388 -63 -306 -494 226 -141 142 362 16 393 117 -122 450 -148 138
1310 138 632 165 109 347 -392 -249 -68 -398 -139 -104 -214 337 -308 -108 466 -26 161 336 25 464 449
$$ packed form
1159e70L64k16j7M67m20M7M66n61M88J79l08L87m5k08L84k72J54N3m23N4J60o76
1181e13K00J84l78J03J61k82M56k43K22M97o81L64M63n88K35K8k31K80K00n73
1201i6K90j38k78N4j43o8N85q04L41J74l32L84oj3N27l82P6O67q71N60m1p79K81
1224a2r0k56K81l14j35O68m58L8K38j83L78L16n34K45j2l03O60j04n61L95l91
1245a34R0K66k81R3j19n00L92rj28K48K8m0M67l73r0N02m21P05n24l91O93n67
1267i3l10O49l89j9K43n65K43L2j62L10n1J35J29j7p3N02j34k63K08n84M80L7
1289C08l61J53m6j56L68n87o7L25k43j88P20l67K83K20l46L77k76k39N72n98K86
1310A38M94m67n6K38p39J43J81l30K59L5j10N51o45K00N74m92J87J75l11M39j5
$$ plain form
1331 449 181 432 236 -81 243 -389 -624 204 -451 -21 -193 -267 -86 -381 -376 202 -144 -314 825 110 475
1352 475 378 256 322 30 120 246 59 -436 264 -336 -148 268 -196 -201 89 -326 165 233 57 2 338 206
1374 206 204 275 132 263 -122 -70 145 -357 97 211 -600 -343 -482 -600 -22 -110 -86 638 -53 77 334 -6
1396 -6 624 216 -15 69 -235 -239 498 269 213 196 -315 -407 122 -443 -81 -181 98 -79 -51 56 173 390 -119
1419 -119 500 58 -74 272 -241 327 125 -459 -161 -352 -293 147 -183 20 144 -463 162 -102 35 334
1439 334 57 -9 459 -86 27 277 135 -16 172 -220 -274 -278 -629 -62 2 -262 31 -281 -340 -137 -57 -103 374
1462 374 38 118 96 44 417 -134 -97 111 -296 -312 85 -234 0 70 -409 110 -185 -35 58 -277 163 532
1484 532 264 143 367 -59 34 294 -30 -193 -57 -252 44 -60 -283 -68 -130 -284 -113 -306 -89 59 49
$$ packed form
1331D49k68K51j96l17L24o32k35Q28o55M30j72p4J81k95NN78l46j70J139p15L65
1352D75r7j22O6k92R0J26j87m95P00o00J88M16m64nK90m15M91O8j76n5L36j32
1374B06kP1j43J31l85N2K15n02M54J14q11K57j39j18N78q8K4P24o91J30K57l40
1396fO30m08k31Q4l04mP37k29n6j7n11r2N29n65L62j00K79j77K8J07J17K17n09
1419a19O19m42j32L46n13N68k02n84K98j91N9M40l30K03J24o07O25k64J37K99
1439C34k77o6M68n45J13K50j42j51J88l92n4ml51N67O4k64K93l12n9K03Q0m6M77
1462C74l36Q0k2n2L73n51L7K08m07j6L97l19K34P0m79N19k95J50R3l35M40L69
1484E32k68j21K24m26R3K60l24j63J36j95K96j04k23K15o2j54J71j93K17J48j0
$$ plain form
1505 49 41 104 161 309 -165 172 154 250 170 191 -196 -124 -155 3 -81 -202 -315 -114 -113 -213 127 88 -156 222 -24
1530 -24 273 79 273 340 282 101 194 -83 218 -44 -278 -392 -155 -278 -161 104 -162 -188 -195 -202 -105 218 101
1553 101 404 46 175 228 -96 -206 -107 -446 63 80 -338 170 -179 -320 -63 -192 9 -157 -11 91 109
1574 109 178 624 65 185 398 -97 -97 -201 -346 78 70 -288 66 -248 -362 4 -403 -170 201 67 69 320
1596 320 211 128 140 -237 359 226 -190 354 -104 -375 126 -447 -47 -32 -456 -122 32 -433 -124 -17 -162
1617 -162 326 113 213 429 -9 304 396 -172 446 -225 -298 -72 -127 -181 -108 -216 -107 -102 -49 -296 -63 -57 600
1640 600 155 -172 332 -34 118 119 57 112 292 -124 -33 -141 -324 236 -269 -82 73 -233 90 -175 -5 -13
1662 -13 108 145 127 239 31 333 264 -140 64 -256 -86 54 11 -93 20 -260 -163 -178 -263 128 0 -6 24 219
$$ packed form
1505D9qO3N7J48m74L37j8R6q0K1l87P2l1J58q4j21j13K01Jj00L40l9k44L78k46
1530b4K97j94J94O7n8j81R3k77L01k62k34j14K37j23J17K65k66k6ppR7L23j17
1553A01L03l58J29N3l24j10R9l39N09J7m18N08l49j41K57j29K01j66J46J02J8
1574A09O9M46n59J20K13m95%j04j45M24ql58L54l14j14L66m07K33L71j34KK51
1596C20j09q3J2l77N96j33m16N44m58k71N01n73M00J5m24L34J54m65L09J07j45
1617a62M88k13J00K16m38L13R2n68O18o71p3K26n5n4P3j08J09NN3k47K33OO57
1640F00m45l27N04l66J52Jo2N5J80m16R1j08j83N60n05J87J55l06L23k65J70q
1662a3J21L7j8J12k08L02o9m04K04l20J70J40m3j04J13k80R7j5q5L91j28oL0J95
$$ plain form
1686 219 162 171 -174 178 95 -116 269 100 -121 46 -51 -208 104 -314 -180 47 -245 -210 -154 6 251 193 -25
1709 -25 156 -115 -159 280 129 117 177 -44 -178 -229 -173 -14 -3 -178 -61 -394 -54 -30 -259 80 348 84 318
1732 318 -30 237 373 -61 -45 176 -194 -117 -210 -202 -448 -180 -259 -250 100 -180 93 -175 -255 145 -159 280 292
1755 292 -123 176 249 44 212 -45 -35 60 -64 -149 -208 -167 66 -173 -280 60 -35 -20 24 180 -9 586 127
1778 127 -184 161 98 -108 -165 -128 177 -174 -66 -36 -124 7 -216 -227 19 94 -170 107 -95 93 162 118 14
1801 14 -55 -47 43 0 -164 199 -29 -366 95 -288 -7 33 -179 -360 -47 64 -52 29 308 144 -82 0 -13
1824 -13 -60 77 190 -140 82 -41 52 -62 -84 -60 -89 -136 -238 272 119 116 363 -117 190 215 -112 -2 139
1847 139 -5 185 -71 -116 -169 173 -58 -84 -186 51 -78 -226 -36 -53 -198 286 36 -193 152 64 92 243
$$ packed form
1686B19n7Rl45L52q3k11L85j69k21J67r7j57L12m18J34K27k92L5N6J60K45n8k18
1709b5J81k71m4M39j51j2O0k21j34n1N6J59J1j75J17l33L40K4k29L39K68k64K34
1732C18l48K67J36m34J6K21l70P7r3Qk46K68p9RL50k80K73k68q0M00l04M39J2
1755B92m15K99P3k05J68k57J0R5j24q5n9M1K33k39j07L40r5J5M4J56j89N95m59
1778A27l11L45o3k06n7L7L05l51J08L0q8J31k23j1K46P5k64K77k02J88O9m4j04
1801A4o9QR0m3j64L63k28l37M61l83K81M0k12j81L13J11j16Q1K79j64k26Q2j3
1824a3m7J37J13l30K22j23R3j14k2K4k9m7j02N10j53lK47m80L07K5l27J10J41
1847A39j44J90k56m5n3L42k31k6j02K37j29j48J90j7j45M84k50k29L45q8K8J51
$$ plain form
1869 243 -81 272 189 -170 -85 -203 -293 -150 5 -303 -161 -259 -287 108 -170 -158 -68 -209 -69 124 -81 160
1891 160 159 4 72 -61 -28 -270 -86 -90 -191 -149 -257 -133 -39 -249 -22 -110 -117 -87 -182 430 216 125 -8 -54 21
1916 21 57 171 -3 11 -30 -41 10 83 88 -227 -182 160 -269 -54 148 -200 -1 263 198 99 -63 -148 17 -6 -108
1941 -108 162 -77 -143 -183 -39 241 -202 67 -269 28 -56 -18 -108 309 218 -215 340 -174 125 -1 185 -268
1963 -268 103 -99 -26 79 -343 -132 -114 -388 -110 194 -105 -67 198 180 111 -125 165 -74 -20 80 -80 423
1985 423 268 12 -113 -189 -246 -12 49 -243 -96 -9 -50 240 125 54 72 9 39 124 125 47 -56 -100 316 -3 72
2010 72 547 -216 -21 -51 -186 -265 1 -128 -113 39 37 295 5 -221 224 276 -227 218 97 -260 201 -221
2032 -221 -114 97 -188 -322 61 -225 -66 -251 -37 221 -107 -44 128 138 93 216 104 124 -107 -310 -152
$$ packed form
1869B43l24L53q3l59Q5j18r0J43J55l08J42r8k8L95k78J2R0j41J40J93k05K41
1891A60jj55O8j33L3k42J84mj01M2j08J24R4k10K27q8pL0r5O12k14r1j33m6P5
1916B1L6J14j74J4m1j1N1P3Nl15M5L42m29K15K02l48J99K64o5r9j62q5J65k3j02
1941a08K70k39o6m0J44K80m43K69l36K97q4L8r0M17r1m33N55n14K99j26J86m53
1963b68L71k02P3J05m22K11J8k74K78L04k99L8K65j8o9k36K90k39N4J00j60N03
1985D23j55k56j25p6n7K34O1k92J47Q7m1K90j15p1J8o3L0Q5Jp8j03m4M16l19P5
2010G2M75p63J95l0j35p9K66j29J5J52kK58k90k26M45N2n03M45j21l57M61m22
2032b21J07K11k85j34L83k86J59j85K14K58l28O3J72J0m5J23j12K0k31k03J58
$$ plain form
2053 -152 -162 -68 -19 -244 -301 -54 -260 268 2 53 -1 68 180 26 -100 -174 399 -313 -124 303 -196 33 1
2076 1 -198 30 259 -205 151 7 -179 110 -132 302 262 -56 58 -42 14 188 -253 206 197 -204 -56 22
2098 22 74 -88 -22 -203 -270 -4 -104 6 -46 89 100 186 141 247 193 57 167 -67 139 99 21 288 33 53
2122 53 230 -60 -184 32 220 129 164 28 136 -212 -55 -64 -117 -16 28 81 9 54 91 -162 -237 -107 -262 -264 108
2147 108 -41 -234 -159 -31 -170 95 121 -17 -242 155 -88 56 175 41 225 112 -47 -42 6 -268 -62 -102
2169 -102 -206 -339 -50 -114 85 -329 137 215 -116 147 153 195 74 -419 296 -88 158 -1 -71 -98 -4 -170 -218
2192 -218 113 -109 268 -112 -18 6 332 -286 31 117 -99 12 288 162 45 73 234 -26 -185 17 45 -217
2214 -217 -40 -20 -165 131 -77 -7 -92 -7 -103 -14 -80 64 107 91 118 -109 75 308 -127 -18 109 -309 59
$$ packed form
2053a52j0R4M9k25n7K47k06N28k66N1n4O9J12j54j26p4N73p12J89M27m99K29l2
2076Aj99K28K29m64L56j44j86K89k42M34m0l18J14j00N6J74m41M59rm01J48P8
2098B2N2j62O6j81o7K66j00J10n2J35J1Q6m5J06n4j36J10k34K06m0p8K67k55K0
2122E3J77k90j24K16J88r1L5j36J08l48J57rn3J01M4N3p2M5L7k53p5J30j55kL72
2147A08j49j93P5J28j39K65K6j38k25L97k43J44J19j34J84j13j59NM8k74K06m0
2169a02j04j33K89o4J99m14M66P8l31K63OM2j21m93P15l84K46j59p0k7R4j66m8
2192b18L31k22L77l80R4K4L26o18L17Q6k16J11K76j26j17K8J61k60j59K02K8k62
2214b17J77K0j45K96k08P0q5Q5r6Q9o6J44M3j6K7k27J84K33m35J09J27m18L68
$$ plain form
2237 59 -69 -6 -162 -97 -62 91 -106 47 85 -80 52 112 -163 -75 33 -229 386 117 -1 29 113 -175 63
2260 63 -230 -15 96 -14 164 -62 -238 168 65 82 93 46 6 -5 -110 -54 -311 -153 94 -78 -120 45 -174
2283 -174 -163 -174 37 -33 34 249 -69 -44 -62 164 117 14 -318 445 -108 43 -230 111 31 -142 50 7 40
2306 40 57 172 -142 229 166 78 56 -13 193 188 86 47 35 66 209 -155 -14 256 28 -105 -207 -235 90 -240
2330 -240 -101 -185 97 54 -182 161 79 149 106 29 103 -26 -170 -17 -114 -54 -72 48 -133 -41 -52 93 -35 22
2354 22 45 33 -78 201 179 144 -139 70 317 -26 13 -75 -53 137 25 -5 -77 -122 22 -293 -147 62 251 -148
2378 -148 -202 148 137 380 409 -63 -39 -24 -62 56 -58 -61 -40 -227 0 -37 -54 107 50 -281 -170 120 -140 145
2402 145 0 -11 210 -69 235 206 -6 -107 -48 -138 -191 -131 230 1 -24 124 35 -196 -47 -101 85 65 -114
$$ packed form
2237E9j28O3j56O5L5J53j97J53L8j65J32O0k75Q8J08k62O15k69j18L0Q4k88K38
2260F3k93K15J11j10J78k26j76M06j03J7J1m7m0j1j05N6k57J58K47j72m2J65k19
2283a74J1j1K11p0O7K15l18K5j8K26m7j03l32P63n53J51k73L41q0j73J92m3L3
2306D0J7J15l14L71o3q8k2o9K06nj02l9j2L1J43l64J41K70k28j33j02k8L25l30
2330b40J39q4K82m3k36L43q2P0m3p7P4j29j44J53r7O0j8J20j81R2j1J45j28N7
2354B2K3j2j11K79k2l5k83K09K47l43L9q8K2J90j12l0p2m5J44l15J46K09J89l99
2378a48n4L50j1K43K9m72K4J5l8J18j14lK1j87K27l7j7J61n7l31J11K90k60K85
2402A45j45j1K21k79L04k9k12j01N9r0n3O0L61k29k5J48q9k31J49n4J86k0j79
$$ plain form
2425 -114 -21 -83 -59 314 130 -162 348 297 -23 288 31 -201 103 13 44 -79 -201 -93 59 112 93 89 -162
2448 -162 -97 173 22 -19 -118 -25 102 87 -173 77 -74 -182 181 -82 25 71 -75 334 -57 -64 119 86 127
2471 127 261 199 -43 280 18 49 -22 -129 177 137 -61 -113 -105 -125 66 -265 -24 103 -118 -6 168 102 -122
2494 -122 -38 -13 -63 207 70 76 63 -93 26 -168 41 26 -41 62 -167 105 286 -69 86 187 -151 60 -96
2517 -96 -93 -26 -116 81 303 -72 181 32 -47 -71 158 96 178 -79 111 131 -34 -41 -148 -52 63 -86 -266 167
2541 167 -69 -273 56 -127 224 -23 -87 163 -341 32 -19 24 156 -140 -83 148 7 156 40 72 -141 258
2563 258 -167 218 -65 326 75 -130 -32 -111 -134 -204 -111 170 187 -78 7 -41 -35 143 -174 26 -96 144 68 -20
2587 -20 54 74 -72 -170 45 145 47 -20 -248 112 -117 -166 189 -438 158 -199 71 -163 195 -215 267 74
$$ packed form
2425a14R3o2K4L73j84k92N10n1l20L11k57k32L04r0L1j23j22J08J52N3j9mk51
2448a62O5K70j51m1r9R3J27j5k60K50j51j08L63k63J07M6j46M09l91pJ83l3M1
2471A27J34o2k42L23k62L1p1j07L06m0j98n2Qk0J91l31K41J27k21J12J74o6k24
2494a22Q4K5n0K70j37Oj3j56J19j94K09j5o7J03k29K72J81l55J55J01l38K11j56
2517i6LO7r0J97K22l75K53j49p9k4K29o2Q2k57J90K0j65pj07R6J15j49j80M33
2541A67k36k04L29j83L51k47o4K50n04L73n1M3J32k96N7K31j41J49j16L2k13L99
2563B58m25L85k83L91k51k05R8p9k3p0R3K81J7k65Q5m8OJ78l17K00j22K40p6q8
2587b0P4K0j46r8K15J00r8o7k28L60k29m9L55o27N96l57K70k34L58m10M82j93
$$ plain form
2609 74 146 132 389 -132 85 -39 151 -70 133 -32 78 -54 8 -5 61 -40 139 200 -43 -126 -96 68 251
2632 251 -169 237 -239 167 77 73 101 -183 177 -177 -78 -12 -35 166 -136 16 99 -33 -14 -67 301 98 30 57
2656 57 -67 21 208 -300 -32 -20 -64 148 6 -134 77 252 216 229 195 148 163 -183 81 70 -74 140 -141
2679 -141 -37 78 107 -66 199 35 -157 -77 97 219 -61 -148 -24 38 -77 58 9 210 5 220 115 -2
2701 -2 -21 17 237 -24 -63 -12 43 92 -262 6 2 -270 -141 -26 113 1 -189 99 180 -91 -197 -170 101 209
2725 209 256 15 -156 126 59 -105 -306 214 152 -146 -199 -136 156 -191 -22 210 81 243 -134 215 79 -198
2747 -198 36 62 197 -119 -53 23 -12 -167 270 32 4 46 -20 32 -197 29 108 36 154 264 158 -116 -3
2770 -3 -164 155 -128 76 -100 179 118 24 -152 77 -53 -126 -193 229 127 205 194 -48 169 217 88 -194 228
$$ packed form
2609G4P2j4K57n21K17j24J90k21K03j65J10j32O2j3O6j01J79O1k43q3L0J64J83
2632B51m20M06m76M06r0mK8k84L60l54R9O6k3K01l02J52Q3j32J9n3L68k03o8K7
2656E7j24Q8J87n08K68J2m4K12j42j40K11J75l6J3l4m7J5l46K64j1j44K14k81
2679a41J04J15K9j73K65j64j92Q0J74J22k80q7J24O2j15J35m9K01k05K15j05j17
2701bj9L8K20k61l9N1N5M9l54K68mk72J29J15J39j12j90K88Q1k71j06K7K71J08
2725B09M7k41j71K82o7j64k01N20o2k98n3O3K92l47J69K32j29J62l77L49j36k77
2747a98K34K6J35l16O6P6l5j55M37k38k8M2o6N2k29K26P9p2J18J10j06k74J13
2770cj61L19k83K04j76K79o1r4j76K29j30p3o7M22j02P8j1k42K17M8j29k82M22
$$ plain form
2793 228 -73 -246 -37 68 -142 -75 -138 -152 -88 -14 -101 -94 -11 -9 -25 244 -150 189 -123 -38 -42 40 -102 -250 -102
2818 -102 70 -96 43 -56 -15 211 4 190 7 332 20 90 43 216 149 75 -73 -471 -68 2 -21 17 -109
2841 -109 -176 136 -34 -30 -169 27 28 -14 -51 53 41 37 48 -92 362 288 158 -252 -76 -32 146 64 118 -156 -29
2866 -29 -223 14 -99 -275 117 48 -43 -10 -90 182 48 -129 -55 97 222 -13 49 15 77 1 -54 -22 -138 80
2890 80 -207 174 144 15 96 11 -280 -114 -13 80 78 -178 -18 -129 283 67 164 57 -140 -90 -37 96 -2 -51
2914 -51 -95 76 -128 -70 61 4 273 -68 -1 249 -276 205 -8 -136 67 -199 111 8 179 -109 12 -94
2936 -94 79 55 -52 -86 -32 -222 136 -7 -289 22 67 90 50 -36 -185 13 218 -2 54 -96 -50 28 28 -35 197
2961 197 179 86 -169 -85 152 -71 164 -73 44 18 -19 -45 -75 -142 55 -126 -69 -182 -226 -324 111 -224 189 147
$$ packed form
2793B28l01j73K09J05k10O7o3j4O4P4q7PQ3Kj6K69l94L39l12Q5mQ2j42j48J48
2818a02J72j66J39r9M1K26k07J86j83L25l12P0m7J73o7p4j48l98M03P0k3L8j26
2841a09o7L12j70Mj39J96Jm2l7J04j2mJ1j40M54p4j30m10J76M4J78q2N4k74J27
2866b9j94K37j13j76L92o9r1L3q0K72j34j77P4J52J25k35O2l4O2p6n5L2j16K18
2890H0k87L81l0j29Q1q5k91J66J01R3kk56J60j11M12k16R7j07j97N0N3J33r8m9
2914e1m4J71k04N8J31n7K69l41O7K50n25M81k13j28K03k66L10j03J71k88J21j06
2936i4J73k4j07l4N4j90L58j43k82L11M5K3m0q6j49J98K05k20N6j50M6P8%o3K32
2961A97j8r3k55Q4K37k23K35k37J17k6l7k6l0o7J97j81N7j13m4r8M35l35M13m2
$$ plain form
2985 147 56 100 -24 53 -172 -105 192 111 11 28 22 -113 70 213 16 54 -139 -115 -233 83 -105 -53 133 -143
3009 -143 244 41 -70 -21 33 -18 138 175 85 203 -40 -30 -78 33 250 -19 72 245 -24 -126 -101 55 -97
3032 -97 263 -202 32 -2 183 114 57 217 109 -71 61 0 -233 -149 31 78 -79 -87 147 -129 -188 -186 -269 166
3056 166 -34 41 164 155 52 95 -64 -426 64 -41 -237 137 35 -106 -234 -84 -46 -105 -125 -8 -172 12
3078 12 144 99 161 110 18 -72 -284 170 24 95 -20 -366 -9 -232 81 -42 242 282 -78 60 95 -63 -18
3101 -18 192 128 117 74 -25 -251 89 10 151 -42 164 169 -56 -119 57 -78 -181 49 -71 47 132 24 35 99
3125 99 -29 -75 -10 160 -25 -122 -27 -136 19 -120 9 -47 -64 87 26 -235 -49 -117 232 18 -54 -183 49
3148 49 267 -86 -98 197 72 -146 -140 -2 -238 -75 105 -23 44 -99 162 -85 -13 22 -124 -27 -148 -133 -9
$$ packed form
2985A47r1M4j24P7k25O7K97q1j00J7oj35J83J43j97L8j93K4j18L16j88N2J86k76
3009a43L87k03j11M9N4n1J56L7r0J18k43J0m8J11K17k69R1J73k69j02K5J56j52
3032i7L60m65K34l4J85o9n7J60j08j80J32o1k33Q4J80M7j57qK34k76n9Kq3M35
3056A66k00P5J23rj03M3j59l62M90j05j96L74j02j41j28J50L8n9k0J17j64J84
3078A2J32m5O2n1r2r0k12M54j46P1j15l46L57k23L13j23K84M0l60J38L5j58M5
3101a8K10o4j1m3r9k26L40p9J41j93K06Nk25o3J76j35j03K30j20J18Q5j08J1O4
3125I9j28m6O5J70j85r7R5j09J55j39J29n6j7J51o1k61J86o8L49k14p2j29K32
3148D9K18l53j2K95j25k18OJ38k36J63J80j28O7j43K61k47P2L5j46R7j21J5J24
$$ plain form
3171 -9 173 217 -42 -18 6 -58 -212 -49 -67 -117 39 57 129 22 84 -16 -69 147 120 196 -86 113 125 -67 77
3196 77 282 -131 108 47 207 -195 -20 -253 181 1 -126 -150 -139 -29 109 56 -4 188 -124 -38 45 -7 46
3219 46 -277 162 -169 -58 -22 58 69 -73 -37 -138 127 -191 -133 69 275 161 157 59 -142 46 3 -75 -42 33
3243 33 41 -169 -103 -50 -243 74 242 211 -46 -21 80 -42 -46 -52 73 1 -106 -110 -70 -277 33 -129 -253 -103 -89
3268 -89 -3 -28 -144 239 -252 -71 -94 -71 -153 272 -49 43 -103 98 210 47 172 -60 38 51 444 118 18
3291 18 25 29 9 12 -19 1 -151 -109 -8 166 131 -20 -94 5 54 72 -116 62 24 3 -158 56 -1 -3 133 -96 139
3318 139 -87 224 -14 -83 -48 109 70 109 54 262 -21 -194 74 -25 215 4 -5 -277 48 159 163 3 37 -35
3342 -35 20 -212 117 -44 122 -80 247 -40 211 -193 116 92 13 192 -129 30 -51 -176 -147 -159 -240 7 -148
$$ packed form
3171iJ82M4k59K4K4o4j54J63j8n0J56J8P2j07O2j00n3K16k7P6k82J99J2j92J44
3196G7K05m13K39o1J60m02J75k33M34j80j27k4J1J10J38n3o0J92l12Q6Q3n2N3
3219D6l23M39l31J11L6Q0J1j42L6j01K65l18N8K02K06j14mr8k01J88m3p8L3P5
3243C3Qk10O6N3j93L17J68l1k57K5J01j22moJ25p2j07mM0k07L10j62j24J50J4
3268h9Q6k5j16L83m91J81k3K3q2M25l21R2j46K01J12j63J25k32R8J3L93l26j00
3291A8PMk0Ll1K0j52M2J01J74l5j51p4R9M9J8j88J78l8k1j61K14n7kJ36k29K35
3318A39k26L11k38o9L5J57l9L9n5K08k83j73K68r9K40k11rk72L25J11Mj60L4p2
3342c5N5k32L29j61J66k02L27k87K51m04L09k4p9J79l21J59q1j25K9j2q1K47j55
$$ plain form
3365 -148 -11 7 -172 -201 133 40 133 -257 -22 -239 -209 77 -58 -121 44 306 33 -153 66 -160 97 226
3387 226 130 104 -234 -139 -13 -185 87 34 30 -149 -106 12 154 -76 52 -32 -14 -179 104 241 237 203 -32 6
3411 6 7 75 -160 299 -181 124 110 57 28 59 197 -75 -77 -133 -108 88 163 -19 48 92 -61 41 71 46 19 40 15
3438 15 -24 17 79 145 -45 211 -295 -77 -158 28 -260 169 30 27 47 32 54 -138 -160 -101 6 13 91 -227 78
3463 78 204 -51 -38 -10 68 87 -91 -122 115 39 -169 -131 -53 -89 97 501 7 192 170 32 -112 -83 -300 27
3487 27 110 -59 -195 -67 48 -105 -202 -62 7 -157 20 -20 -2 -133 -49 88 -31 8 245 231 208 52 21 -308
3511 -308 64 135 233 216 -8 -42 74 -65 -43 192 -22 62 194 35 140 1 -76 308 5 -33 278 -158 -33
3534 -33 151 -31 143 136 13 -107 -156 -123 -187 43 -12 239 -160 42 -25 -48 -52 -200 57 -52 201 85 95 39
$$ packed form
3365a48J37J8j79k9L34r3R3l90K35k17L0K86j35o3J65K62k73j86K19k26K57J29
3387B26r6k6l38R5J26j72K72n3mj79M3J18J42k30J28q4J8j65K83J37ml4k35L8
3411FJO8k35M59m80L05j4n3k9L1J38k72kn6K5J96P5j82O7M4j53J02L0k5k7K1k5
3438A5l9M1O2O6j90K56n06K18q1J86k88M29j39lK0j5K2j92k2N9J07PP8l18L05
3463G8J26k55J3K8P8J9j78l1K37p6k08L8P8l6J86M04m94J85k2j38j44K9k17L27
3487B7Q3j69j36J28J15j53r7J40O9j64J77m0J8j31Q4J37j19L9K37j4k3j56l1l29
3511c08L72P1R8j7k24l4J16j39K2K35k14Q4J32j59J05j39p7L84l03l8L11m36J25
3534c3J84j82J74pj23j20m9L3o4K30n5K51l99K02o7k3mj48K57j09K53j16J0n6
$$ plain form
3558 39 130 52 63 -87 -28 167 -128 -161 32 106 -130 54 -164 -113 330 232 -87 -163 -81 -99 -128 90 128 -131 28
3583 28 -81 -91 55 29 -30 -62 91 -183 -208 -68 -64 -19 54 2 -51 -189 -17 -118 155 -22 -97 -11 -2 38 -78 -46
3609 -46 -77 -1 -91 -221 -156 191 138 -227 93 83 -32 269 79 91 -52 -101 -13 25 21 84 -26 -165 -33 -159 -92
3634 -92 209 220 180 57 27 37 -121 -329 163 184 -236 140 -21 -36 -230 138 41 90 -167 263 -106 6 -180
3657 -180 79 -45 45 -14 203 34 67 -11 20 -129 -288 -59 20 -6 183 89 143 183 -257 143 187 -33 -207 -149
3681 -149 20 70 6 2 -86 105 119 106 -140 195 -170 -33 104 -13 -443 -150 -9 -37 138 146 185 201 20 228
3705 228 180 -104 112 -277 -16 -65 -124 -94 -56 24 -62 79 -29 -202 84 -101 127 -43 -32 -79 58 182 -113
3728 -113 14 -168 24 32 96 -205 174 76 6 -135 42 -59 -233 70 81 -70 -195 -29 38 -10 131 -277 131
$$ packed form
3558C9R1p8J1j50N9J95k95l3J93P4k36J84k18N1M43r8l19p6Q2j8k9K18L8k59J59
3583B8j09j0J46k6n9l2J53k74k5J40MM5P3n2n3j38J72j01K73j77p5Q6RM0j16L2
3609d6l1P6r0j30O5L47n3l65L20j0j15L01j90J2j43m9Q8L8mO3j10j39J32j26O7
3634i2L01J1m0j23l0J0j58k08M92K1m20L76j61j5j94L68r7M9k57M30l69J12j86
3657a80K59j24R0n9K17j69L3p8L1j49j59K29P9k6J89r4N4M0m40M00M4k20j74N8
3681a49J69N0o4mq8J91J4j3k46L35l65J37J37j17m30K93J41k8J75QL9J6j81K08
3705B28m8k84K16l89K61m9n9L0L8Q0q6J41j08j73K86j85K28j70J1m7J37J24k95
3728a13J27j82J92QO4l01L79r8p0j41J77j01j74L03J1j51j25J66O7m8J41m08M08
$$ plain form
3751 131 35 -35 152 214 179 23 32 196 196 54 187 120 -22 -171 30 -69 3 -45 1 17 51 358 19 46 -84
3776 -84 -151 -60 268 289 -316 -13 -9 -227 197 8 -280 -24 99 -190 -114 187 -236 -145 130 219 192 -284 -89
3799 -89 12 -83 18 -118 -71 -140 80 -180 1 -49 -66 -131 -217 16 -87 80 -109 76 209 17 80 48 -27 -98
3823 -98 46 -67 15 -22 -328 -188 -5 -204 -38 -3 -108 -126 -48 -99 7 -183 129 -101 103 162 47 -170 85
3846 85 114 45 -60 -217 133 -59 -41 -101 -24 252 166 -165 115 348 -127 -85 -80 30 230 10 162 83 -159 168
3870 168 102 88 -44 57 -29 -67 -76 281 18 26 -153 108 147 -248 -272 -8 -171 50 102 125 -231 -30 69 105 -68
3895 -68 101 136 -346 -32 -101 -295 -50 83 3 -228 22 87 -89 -151 97 42 30 100 29 -183 -113 10 -220 -83
3919 -83 94 -21 -56 90 135 -216 -14 -40 -31 -90 -159 -74 -42 337 -125 335 -78 158 109 122 71 180 -144 -42
$$ packed form
3751A31r6p0J87O2l5j56RJ64%j42J33o7j42j49K01r9P2m8M6J6L4L07l39K7j30
3776h4o7R1L28K1o05L03Mk18M24j89k88K56J23k89P6L01m23R1K75Q9k7m76J95
3799h9J01r5J01j36M7o9K20k60J81n0j7o5q6K33j03J67j89J85J33j92O3l2p5p1
3823i8J44j13Q2l7l06J40J83j99J66L5j05j8P8n1J06j90L12k30K04N9j15k17K55
3846H5K9o9j05j57L50j92J8o0P7K76q6l31K80K33m75M2NJ10K00k20J52p9k42L27
3870A68o6j4j32J01q6l8rL57k63Qj79K61L9l95k4K64j63K21N2K3l56K01R9L6j73
3895f8J69L5m82L14o9j94K45J33q0k31K50O5j76o2K48n5j2P0p1k12P0J23k30J37
3919h3J77j15l5J46M5l51K02k6Rn9o9Q5L2L79m62M60m13K36m9J3n1J09l24J02
$$ plain form
3943 -42 -85 -241 10 -296 -61 -185 37 -203 67 43 16 69 46 5 10 113 -193 -129 -57 -184 186 77 -45 5
3967 5 39 40 -52 192 168 94 -79 25 145 46 -126 -88 -68 89 -100 -88 299 26 -49 168 -111 218 -53 -275
3991 -275 -99 135 -87 18 59 298 117 95 264 265 -97 -53 -53 100 112 70 -167 33 -375 -57 -117 58 222
4014 222 -98 -104 191 -155 151 53 19 60 -294 72 23 131 -70 -64 22 98 -146 64 54 21 -5 196 -23 -15 150
4039 150 -105 -47 -75 -35 5 39 5 130 37 -207 39 124 58 -18 348 -67 -30 -252 96 -221 -40 205 -26 -21
4063 -21 -54 27 -231 -33 -222 -73 -7 36 292 -67 72 126 27 -155 -54 125 -190 267 -196 165 -281 44
4085 44 75 86 -224 8 -219 -21 118 -17 -268 123 -351 133 -56 -206 162 195 -90 -183 -208 125 205 242 -67
4108 -67 -47 -117 -101 15 -101 -74 -7 0 80 73 292 77 -112 -42 -53 -274 259 152 -3 -10 140 130 53 45 222 162 239
$$ packed form
3943d2m3j56K51l06K35j24K22k40K70k4k7N3k3m1NJ03l06O4P2j27L70j09j22N0
3967EL4Jr2K44k4p4j73J04J20r9j72L8K0J57j89J2L87k73p5K17k79L29k71k22
3991b75J76K34k22J05M1K39j81k2J69Jl62M4%J53J2m2k37K00m08L18o0J75J64
4014B22l20oK95l46L06r8l4M1l54L66m9J08k01OQ6P6k44K10j0l3k6K01k19QJ65
4039A50k55N8k8M0M0L4l4J25r3k44K46Q5o6p6L66m15L7k22L48l17J81K45k31N
4063b1l3Q1k58J98j89J49O6M3K56l59J39N4r9j82J01J79l15M57m63L61m46L25
4085D4L1J1l10K32k27J98J39j35k51L91m74M84j89j50L68L3k85r3k5L33Q0L7l09
4108f7K0p0J6J16j16K7O7PQ0pK19k15j89P0j1k21N33j07j55pJ50j0p7qJ77o0P7
$$ plain form
4135 239 -92 -127 53 -44 120 -199 -28 37 7 -161 39 -4 -168 129 -78 -204 -133 -100 -129 17 22 88 -90 47
4159 47 -19 -159 119 -85 206 -168 226 -4 128 -10 -46 -179 -176 -197 149 -265 187 76 133 39 -292 -148 76
4182 76 19 30 170 -79 36 -29 -104 -86 207 -206 170 -124 -52 14 -45 144 95 -1 22 233 88 347 83 -129
4206 -129 -168 -130 32 -109 68 55 -195 236 314 87 72 186 24 -129 46 16 46 231 168 -242 -16 -14 -194
4229 -194 111 -29 -240 74 -150 23 -139 -46 -104 47 -165 131 -59 -442 -112 -108 53 110 -83 -78 52 181
4251 181 -67 237 -7 -241 104 -80 -84 60 149 44 -307 -50 0 -178 155 -62 29 -146 -37 -28 173 190 45
4274 45 -50 -136 -251 12 46 -110 -55 -123 54 117 -17 237 89 68 -73 139 -15 -347 214 3 -69 4 -25 -160
4298 -160 39 -239 -48 -116 148 -149 -85 -117 53 -167 109 -324 -95 -119 81 -87 95 138 59 -67 369 39
$$ packed form
4135B39l31l5J80r7J64l19J71O5l0j68K00m3j64K97k07j26P1L3k9J46NO6j78J37
4159D7o6j40K78k04K91l74L94k30J32j38l6j33Lk1L46m14M52j11N7r4l31J44K24
4182G6n7J1J40k49J15o5p5J8K93m13L76k94P2O6n9J89m9r6K3K11j45K59k64k12
4206a29l9L8J62j41J77j3k50M31P8k27j5J14j62j53J75l0L0J85o3m10K26Kj80
4229a94L05j40k11L14k24J73j62R3n8J51k12K96j90l83L30MJ61N7j93NJ30J29
4251A81k48L04k44k34L45j84mJ44Q9j05l51K57N0j78L33k17R1j75J09RK01J7j45
4274D5r5q6j15K63L4j56N5o8J77O3j34K54j48k1j41K12j54l32N61k11p2P3k9j35
4298a60J99k78J91o8K64k97O4l2J70k20K76m33K29k4K00j68J82M3p9j26M36l30
$$ plain form
4320 39 -2 -8 116 -34 125 -22 -179 -7 -271 -38 -136 -1 -154 -82 23 14 188 44 27 24 -111 76 -104 83
4344 83 -120 210 54 225 -55 49 -367 -165 -73 60 170 -129 101 162 -60 -153 225 -62 260 -377 -39
4365 -39 -296 -70 131 -28 7 184 100 -253 47 27 -134 -50 116 -138 170 115 264 99 48 -43 25 -193 160
4388 160 202 -94 92 134 -87 63 13 58 120 184 127 -11 -58 -38 15 -64 96 -59 80 -158 -154 -91 -45 -134 48
4413 48 -22 -162 191 -98 -76 -181 -42 -146 56 27 189 141 -37 -19 93 378 -161 105 -222 -24 -212 135
4435 135 206 34 -175 188 -90 67 -8 -267 163 -79 22 113 -158 -132 -159 -26 30 120 123 141 6 -125 300
4458 300 84 165 117 -20 14 216 -122 -64 -115 -4 -54 191 -22 43 219 -304 226 -37 35 83 -64 206 -219
4481 -219 64 -199 -7 -80 -44 245 6 169 -24 143 28 71 30 52 -146 -41 -163 145 -56 -3 -42 -49 -118
$$ packed form
4320C9m1oJ24j50J59j47j57J72k64K33r8J35j53P2J05rJ74j44j7lj35J87j80J87
4344H3k03L30j56J71k80J04m16K02R2J33J10k99K30O1k22r3L78k87L22o37L38
4365c9k57K26K01j59L5J77q4l53L00k0j61Q4J66k54L08n5J49j65n1r1O8k18L53
4388A60M2k96J86M2k21J50n0M5O2O4n7j38m7K0N3p9J60j55J39k38MO3M6q9J82
4413D8p0j40L53k89K2j05J39j04K02k9J62m8j78J8J12K85n39K66l27J98j88L47
4435A35P1j72k09L63k78J57p5k59M30k42J01R1k71K6k7J33N6R0LJ8j35j31M25
4458C00k16Q1m8j37L4K02l38N8n1J11n0K45k13O5J76n23N30k63P2M8j47K70m25
4481b19K83k63J92p3L6K89k39J63j93J67j15M3m1K2j98J05j22L08k01N3l9po9
$$ plain form
4504 -118 232 33 -101 -87 485 45 5 -159 -160 30 -22 347 -168 -23 271 -69 -226 59 -326 124 144 4
4526 4 -213 -16 237 -32 -82 -73 -15 10 138 -76 293 -21 -38 122 -86 43 -42 15 112 -15 -185 73 -54 16
4550 16 272 -105 193 46 -207 66 112 127 -172 321 -6 -64 92 62 -102 31 -55 31 171 -52 -163 25
4572 25 -162 10 204 -197 80 -59 320 140 -67 122 179 117 -67 56 -32 -199 4 144 148 19 -9 217
4594 217 14 75 41 115 -35 -94 8 -18 179 -41 182 119 242 95 154 63 132 1 -85 43 354 225 -81
4617 -81 15 -330 -98 119 137 -195 -44 -244 -3 306 82 -105 173 18 100 -136 24 38 10 -44 -22 -30 34 -328
4641 -328 -111 -63 -88 21 -198 -201 140 -221 -120 11 120 -37 -65 -227 -3 150 -339 81 77 -6 36 -388 46
4664 46 -66 145 288 71 26 -29 -16 85 -195 103 134 -216 -119 -15 160 206 -151 -132 -269 79 238 -237 340
$$ packed form
4504a18L50j99j34J4N72m40m0j64jJ90n2L69n15J45K94l40j57K85l85M50K0j40
4526Dk17J97K53k69n0RN8K5J28k14L69l14j7J60k08J29q5N7R7j27j70K58j27P0
4550A6K56l77K98j47k53K73M6J5k99M93l27n8J56l0j64J33q6Q6J40k23j11J88
4572B5j87J72J94m01K77j39L79j80k07J89N7o2j84J23q8j67K03J40Mj29k8K26
4594B17k03O1l4P4j50n9J02k6J97k20K23o3J23j47N9r1O9j31q6J28L11j29l06
4617h1R6l45K32K17J8l32J51k00K41L09k24j87K78j55Q2k36J60J4k8n4K2qO4l62
4641c28K17M8k5J09k19lL41l61J01J31J09j57k8j62K24J53m89M20mq3M2m24M34
4664D6j12K11J43k17m5n5J3J01k80K98L1l50R7J04J75M6l57J9j37L48J59m75N77
$$ plain form
4687 340 -182 234 -11 -32 1 -110 187 -175 7 73 244 134 66 258 -244 -83 -126 -290 175 -119 -95 -11
4709 -11 257 -57 -111 -363 -274 124 116 82 79 -28 19 -116 67 -137 78 174 20 153 -80 192 -91 -238 -141 -218
4733 -218 17 -36 -106 120 -19 -95 -71 -47 -233 -111 -156 115 -208 136 139 -271 259 -27 -26 -176 246 -73 -75 -100
4757 -100 14 -130 -151 120 -9 68 92 -4 0 226 -147 -17 121 227 -175 75 -72 -112 -60 -32 -44 190 -59
4780 -59 -138 65 50 146 -130 -24 43 81 -22 -169 80 -14 101 73 -60 -135 27 -214 -27 56 99 102 -280 137
4804 137 35 -175 57 -86 -277 -82 205 -111 -2 -14 124 148 214 83 -52 28 -95 -9 -57 -136 -370 -161
4826 -161 174 227 -217 165 -56 13 -56 188 147 -186 -349 -230 -26 76 -169 95 206 240 31 25 -50 114 224
4849 224 -44 87 -167 117 -309 273 -138 -43 70 164 -24 227 -65 -139 -68 377 -5 31 178 -54 -49 26 146
$$ packed form
4687C40n22M16k45k1L3j11K97l62J82O6J71j10o8J92n02J61m3j64M65k94K4Q4
4709a1K68l14n4k52Q9L98ql4lj07M7j35J83k04K15R6j54J33k33K72k83j47R7p7
4733b18K35n3p0K26j39p6K4K4j86J22m5K71l23L44Lm10N30k86Jj50M22l19kk5
4757a00J14j44k1K71j29P7K4r6MK26l73J30J38J06m02K50j47m0N2K8j2K34k49
4780e9p9K03j5R6k76J06O7L8j03j47K49r4J15k8j33p5J62k41J87Q3M3Ll82M17
4804A37j02k10K32j43j91J95K87l16J09j2J38K4O6j31j35Q0j23Q6m8p9k34K09
4826a61L35N3m44L82k21O9o9K44m1l33j63J19K04J02k45K64J11L4k09op5J64J10
4849B24k68J31k54K84m26N82m11R5J13R4j88K51k92p4P1M45l82L6J47k32NP5J20
$$ plain form
4872 146 26 111 59 137 -246 58 -76 -31 104 -9 64 49 -27 -59 -65 -88 -107 87 189 -183 159 72 1 175 18
4897 18 -144 -321 -279 -162 -8 -136 -242 42 -101 78 -43 -247 -68 -140 12 144 -118 277 -160 245 -124
4918 -124 -76 168 108 -13 -12 -4 -134 57 -9 156 -182 13 72 9 -150 -47 158 -229 247 116 -160 59 -33
4941 -33 -66 -55 33 -37 -193 44 -87 -30 213 -115 -150 188 -161 98 73 -11 215 -36 -291 -166 102 75 202
4964 202 162 32 231 -214 -24 42 14 58 -66 104 -45 -77 27 -55 6 254 -213 242 -59 -99 260 -141 297
4987 297 113 -131 172 1 -93 -1 -141 63 -68 -122 -79 1 48 8 -81 -67 116 16 135 70 172 313 -48
5010 -48 -61 -62 36 111 86 -212 -73 184 -41 92 17 -144 -41 -291 64 140 105 -121 166 200 -33 -28 -52 183 103
5035 103 46 15 47 146 -21 -197 -149 -82 -117 68 41 221 15 169 -20 -104 311 288 -257 144 -257 151 251
$$ packed form
4872A46j20Q5n2P8l83L04j34M5J35j13P3j5p6l2ok3j9J94J02l72L42q7p1J74j57
4897A8j62j77M2J17J54j28j06K84j43J79j21k04J79p2J52J32k62L95m37M05l69
4918a24M8K44o0j21JQj30J91o6J65l38J95N9o3j59J03K05l87M76j31k76K19r2
4941c3l3J1Q8p0j56K37j31N7K43l28l5L38l49K59k5q4K26k51k55J25K68k7J27
4964B02m0j30J99m45J90O6k8M4j24J70j49l2J04q2O1K48m67M55l01m0L59m01M38
4987B97j84k44L03j71r4R2j40K04j31n4M3Q0M7m0q9J4J83j00J19o5J02J41l61
5010d8j3jR8P5k5k98J39K57k25J33p5j61J03k50L55P6l5k26K87L4k33Nk4K35q0
5035A03n7l1L2R9j67j76M8O7l5J85k7J80k06J54j89q4M15k3n45M01m01M08J00
$$ plain form
5058 251 151 65 52 -5 -25 -118 -85 -80 -72 123 -192 0 -90 110 4 -204 130 -56 -117 -245 22 -14 -41 -107 17
5083 17 -52 -59 -86 -44 -4 -265 152 -42 3 112 153 114 147 -115 -224 -25 146 -25 184 386 262 -23 203 -34
5107 -34 -122 191 250 253 -12 -143 -302 52 63 -14 -179 -149 91 130 133 -36 94 -344 -175 131 146 -176 -91 -204
5131 -204 -87 -71 -68 -155 -195 -28 -117 275 66 -141 57 -267 302 32 -206 -377 -167 -36 -72 -16 -149 -76 -198
5154 -198 -175 44 -99 91 -434 19 -62 179 159 256 -103 -113 230 -27 202 129 -92 -126 -18 163 -105 167
5176 167 124 -81 -99 128 -149 107 43 35 16 122 297 57 -50 -79 293 -335 71 -5 -143 28 6 59 -73
5199 -73 10 201 275 174 -235 266 -185 -52 3 119 -293 -214 -143 -88 81 58 189 -73 120 -22 -70 -87 -97 -112
5223 -112 179 -230 153 354 47 90 -149 -159 -84 171 158 -209 16 -155 84 93 19 -35 11 -253 84 170 -115
$$ packed form
5058B51j00q6j3n7k0r3L3NQJ95l15J92r0K00j06k08L34j86o1j28K67l6k7o6J24
5083A7o9pk7M2M0k61M17j94M5J09M1l9L3k62j09J99J71j71K09K02j24k85K26k37
5107c4q8L13N9Lk65j31j59L54J1p7j65L0K40L9Lj69J30m38J69L06J5l22Q5j13
5131b04J17J6Lq7m0J67q9L92k09k07J98l24N69k70k38j71K10J31l6N6j33P3j22
5154a98K3K19j43J90n25M53q1K41k0R7l59j0L43k57K29p3k21l4J08J81k68K72
5176A67m3k05j8K27k77K56o4qj9J06J75k40j07k9L72o28M06p6j38J71k2N3j32
5199g3Q3J91P4j01m09N01m51J33N5J16m12P9P1N5J69k3J31k62J93j42m8j7j0j5
5223a12K91m09L83K01l07M3k39j0P5K55j3l67K25j71K39Rp4n4M6k64L37Q6k85
$$ plain form
5246 -115 -53 74 -23 -175 -58 -121 37 -11 132 -55 168 101 22 226 -14 -65 -85 60 63 204 108 196 181 -33
5270 -33 -102 -20 -227 256 -83 346 -138 -275 -69 130 63 -36 41 84 -235 -226 93 49 217 -23 148 -91 140
5293 140 9 30 -17 -145 -5 -16 114 130 -104 9 -117 -9 97 -30 48 -226 107 58 -275 -156 101 -231
5315 -231 -294 -176 132 -71 23 49 101 -125 -243 -8 51 5 0 -4 130 -124 28 -75 89 177 12 43 -1 106
5339 106 -78 -46 67 -277 -66 141 -25 9 -110 7 -48 -14 105 -114 250 -44 -125 107 -328 52 -296 -77
5361 -77 -104 -186 -95 -143 129 -76 -94 -39 232 -70 25 -76 -92 21 42 -78 51 17 -157 -99 -23 -77 23 214 -18
5386 -18 -113 -161 125 -1 103 -34 266 42 273 272 -82 107 176 68 -162 114 -100 97 205 -22 63 -215
5408 -215 -196 31 -96 -84 167 -32 337 -131 -29 -209 -106 -8 197 9 -102 169 58 -115 -267 167 100
$$ packed form
5246a15O2J27r7j52J17o3J58m8J43j87K23o7p9K04k40n1k0J45LJ41r6Q8j5k14
5270c3o9Q2k07M83l39M29m84j37K06J99o7r9P7M3l19RL19m4J68k40J71k39K31
5293A40j31K1m7j28J40j1J30J6k34J13j26J08J06j27P8k74L33m9l33J19K57l32
5315b31o3J18L08k03R4K6N2k26j18K35N9m6nmJ34k54J52j03J64Q8j65L1m4J07
5339A06j84L2J13l44K11K07j66L4j19J17n5L4J19k19L64k94q1K32m35L80l48K19
5361g7k7q2R1m8K72k05j8N5K71l02R5j01j6J13K1j20J29l4j74N8P6n4J00J91k32
5386a8r5m8K86j26J04j37L00k24K31jl54J89O9j08k30K76k14J97J08k27Q5k78
5408b15J9K27j27J2K51j99L69m68J02j80J03R8K05j88j11K71j11j73j52M34o7
$$ plain form
5429 100 -28 -1 -236 172 105 254 79 110 123 -44 8 129 -117 -17 -51 104 -58 0 -190 21 -52 12 -32
5452 -32 89 -108 -265 292 245 -139 -281 -12 213 -6 261 45 -93 88 -68 -21 -102 76 107 -65 233 100
5474 100 -5 289 176 111 -23 -63 102 -227 -194 81 -239 67 361 -175 169 -63 -50 18 -33 -14 67 -200 36
5497 36 -17 -117 19 -27 -65 152 127 -88 -63 137 171 -27 103 -59 -119 -124 33 36 -158 -39 -3 -49 4 -156 4
5522 4 36 -102 -168 -151 124 -171 31 -150 6 -262 48 63 137 125 14 -49 -63 15 45 -277 224 199 -37 194
5546 194 51 132 -30 -105 116 -184 -80 -118 -70 43 63 -98 -132 -134 -63 131 188 282 -210 19 58 6 162 -178
5570 -178 132 -139 45 -54 58 185 71 -107 83 215 147 5 115 59 -99 -71 -55 -135 -75 -253 10 202
5592 202 -28 -44 -101 11 202 101 56 -5 -32 94 -4 -60 1 12 -119 -112 36 146 185 -132 171 -44 2 227
$$ packed form
5429A00j28K7k35M08o7J49j75L1J3j67N2J21k46J00l4J55j62N8j90K11p3O4m4
5452c2J21j97j57N57m7l84j42K69K25k19K67k16j38J81j56M7q1J78L1j72K98j33
5474A00j05K94j13o5j34m0J65l29L3K75l20L06K94n36L44k32J3O8n1J9Q1k67K36
5497C6n3j00J36m6l8K17k5k15K5K00L4j98J30j62o0nJ57Lj94J19L6m6N3j60J60
5522DL2j38o6J7K75k95K02j81J56k68L10J5P4j2j11o3j4P8L0l22N01k5k36K31
5546A94j43Q1j62p5K21l00J04l8M8J13K0j61l4kP1J94N7R4m92K29L9n2J56l40
5570a78L10k71J84r9J12J27j14j78J90J32o8j42J10n6j58K8J6q0O0j78K63J92
5592B02k30j6n7J12J91j01m5o1k7J26r8n6O1J1j31PJ48J10L9l17L03k15M6K25
$$ plain form
5616 227 -15 -239 99 -278 249 6 89 68 58 -121 104 247 55 -22 133 49 56 108 -276 105 -140 176 -123
5639 -123 -98 252 -55 91 20 33 50 -108 105 -133 251 78 -196 -289 -117 271 -56 -30 93 177 -144 50
5661 50 -107 2 191 -18 -66 -18 361 -88 7 -112 116 307 38 109 15 123 90 133 -209 144 64 -362 170
5684 170 86 -2 21 152 75 326 151 94 39 243 -39 -297 35 -90 185 -124 -67 -11 -47 264 13 78 -106
5707 -106 58 -443 291 111 -56 -119 -109 141 -148 97 -149 -136 -35 -21 -157 -81 -137 -3 143 245 -184 174
5729 174 236 -156 14 197 -204 305 13 51 192 184 -149 79 48 -188 171 108 33 -24 -314 -126 -85 -44 263
5752 263 61 55 -74 -72 -35 36 -17 -110 -7 -92 -171 -144 -152 83 91 142 -239 162 -116 -156 -68 151 306 118 33 340
5778 340 -64 -1 -30 -84 72 -51 -150 -55 -193 -202 35 -157 -94 -13 -324 15 12 14 83 -29 29 -175 200 127 -132
$$ packed form
5616B27k42k24L38l77N27k43Q3k1j0j79K25J43j92p7J55q4PN2l84L81k45L16k99
5639a23K5L50l07J46p1J3J7j58K13k38L84j73k74r3J72L88l27K6J23Q4l21J94
5661E0j57J09J89k09m8M8L79m49R5j19K28J91k69P1r4J08l3M3l42L53q0m26N32
5684A70q4q8K3J31p7K51j75n7n5K04k82k58L32j25K75l09N7N6l6L11k51O5j84
5707a06J64n01P34j80j67o3J0K50k89K45k46J3J01J4j36P6n6J34J46J02m29L58
5729A74O2l92J70J83m01N09k92L8J41ql33K28l1k36L59o3p5n7k90J88M1M1L07
5752B63k02oj29KL7P1n3r3J03q5p9K7qK35QN1l81M01k78m0Q8K19J55j88q5L07
5778C40m04O3k9n4J56j23r9R5j38rK37j92O3Q1l11L39lKO9j12N8k04L75p3k59
$$ plain form
5803 -132 -68 53 -142 43 -253 -178 160 -61 128 0 51 -128 32 -202 -315 9 -132 141 -332 105 33
5824 33 93 108 -50 4 -83 29 -115 -11 -103 127 41 44 435 17 -36 13 170 234 -62 109 47 50 112 52 15 -172
5850 -172 -20 30 22 -76 177 93 -53 -44 -12 -5 94 -147 -8 -2 15 -10 68 -149 -153 -61 73 198 0 167 -37 163
5876 163 -103 -53 -174 -49 147 118 -114 -9 -215 -161 -101 235 145 103 1 -68 408 41 39 -156 -61 -23 8 171
5900 171 141 -125 181 -118 57 217 -31 70 -107 -16 252 152 12 -45 28 -227 -92 -96 -48 -213 23 44 -103
5923 -103 -238 -63 48 84 26 -106 171 222 -20 55 386 -231 72 5 70 200 97 -53 202 83 -184 224
5945 224 -313 -28 6 -82 -108 -164 75 -27 130 6 34 -2 -98 8 -77 15 119 -97 -123 62 -44 -117 105 233
5969 233 36 -240 16 150 -15 62 158 69 41 187 66 69 182 -160 -133 -2 -229 125 -9 31 -129 307 106
$$ packed form
5803a32O4J21j95J85k96P5L38k21J89j28N1j79J60k34j13L24j41K73m73M37p2
5824C3O0J5j58N4q7J12j44J04r2K30q6LL91m18n3M9J57O4k96J71o2LO2o0l7j87
5850a72J52N0qr8K53q4j46RL2PR9k41J39OJ7k5P8k17mR2J34J25j98J67k04K00
5876A63k66N0j21J25J96k9k32J05k06N4O0L36r0m2j02o9M76l67kj95R5L8L1J63
5900A71l0k66L06k99J75J60k48J01j77R1K68j00j40n7P3k55J35mM8j65K36K1j47
5923a03j35J75J11L6n8j32K77N1k42P5L31o17L03o7O5J30j03j50K55j19k67M08
5945B24n37K85L4q8k6n6K39j02J57j24K8l6r6J06q5R2J04k16k6J85j06p3K22J28
5969B33j97k76K56J34j65P7R6q9k8J46j21LJ13l42K7J31k27L54j34M0j60M36k01
$$ plain form
5992 106 -149 -119 95 -52 120 -51 0 170 37 223 104 226 31 52 -100 45 -162 -51 56 64 47 80
6014 80 167 -114 76 26 213 -23 13 -6 53 -31 56 126 -207 -126 -280 -46 140 -138 186 12 -65 9 -52 -284
6038 -284 211 108 -56 -9 -2 -62 101 -46 -140 178 -261 33 -87 -18 -108 108 22 96 42 77 -89 65 195 -77
6062 -77 -183 -163 37 95 35 -164 147 -20 -101 233 71 -13 -8 29 -144 -90 3 -1 44 -7 95 64 129 -122 -44 40
6088 40 45 -15 -227 118 255 281 -96 -42 -121 -87 227 -44 21 45 -25 -303 -35 58 107 -156 -103 -296 122 48 -106
6113 -106 25 -159 -90 345 -6 43 -73 -149 -251 -176 306 35 -330 95 -14 144 37 25 -7 -71 89 -95
6135 -95 201 54 128 216 -225 -167 262 -67 55 18 210 72 21 4 -291 156 -131 -11 -92 -64 79 -176 -44
6158 -44 -135 57 115 -239 -284 122 -232 -13 -137 -224 89 -144 96 252 -204 268 248 -164 7 -156 148 -6
$$ packed form
5992A06k55L0K14j47J72j71N1J70j33J86j19J22j95K1j52J45k07J11J07Qj7L3
6014H0Q7k81J90n0J87k36L6j9N9q4Q7P0l33Q1j54K34J86k78L24j74p7P4o1k32
6038b84M95j03j64M7Po0J63j47r4L18m39K94j20O9r0K16q6P4n4L5j66J54J30k72
6062g7j06K0K00N8o0j99L11j67q1L34j62q4NL7j73N4R3mM5n1J02l1O5k51P8Q4
6088D0No0k12L45J37K6l77N4p9L4L14k71O5K4p0k78K68R3M9k63N3j93M18p4j54
6113a06J31j84O9M35l51M9j16p6j02P5M82k71l65M25j09J58j07j2l2o4J60j84
6135i5K96j47P4Q8m41N8M29l29J22l7J92j38n1j7k95M47k87J20q1K8J43k55J32
6158d4r1J92N8l54m5M06l54K19j24q7L13k33K40J56m56M72k0m12J71j63L04j54
$$ plain form
6180 -6 -282 -111 45 87 3 0 41 -267 -129 33 149 146 -262 -103 83 4 -35 -62 86 -38 -95 -99 76 -12 15 42
6206 42 -121 -37 37 -129 53 -5 17 -68 2 -6 133 -60 -135 -78 7 -145 50 59 -59 8 16 -59 172 82 -19 67 119
6233 119 -56 -136 224 -82 159 158 -90 57 -236 -11 -14 -142 -179 151 -23 78 -102 -202 125 6 -64 -176
6255 -176 249 -362 -139 -165 -5 176 -226 180 -192 62 158 43 -282 286 142 -198 88 -339 85 -7 46
6276 46 200 119 334 26 181 35 -38 -52 250 -36 -162 -164 200 -105 156 18 204 -106 87 87 89 94 43 -39 -1
6301 -1 183 -39 167 389 -4 118 -43 -247 -259 -69 101 67 15 67 195 90 -75 26 13 -115 -47 17 -49
6324 -49 -156 -111 -47 -33 100 206 -318 -34 -35 -176 -278 -100 9 -112 -108 169 -32 -58 -206 -76 -23 -57 129 -81
6348 -81 141 116 -30 -146 124 75 38 5 241 -121 -283 223 20 1 -103 151 -122 150 -62 -50 90 106 -128
$$ packed form
6180fk76J71J56M2q4lM1l08J38J62J16lm08J59J86p9l9k7J48j24n7mJ75q8K7K7
6206D2j63Q4P4j66J82n8K2q5P0qJ39j93p5N7Q5j52J95Rj18O7Qp5K31r0j01Q6N2
6233A19j75q0L60l06K41jk48J47k93K25lj28l7L30j74J01j80j00L27j19p0j12
6255a76M25o11K23k6J60J81m02M06l72K54R6j15l25N68j44l40K86m27M24r2N3
6276D6J54q1K15l08J55j46p3j4L02k86j26kL64l05K61j38J86l10J93%KNn1q2L8
6301aJ84k22K06K22l93J22j61k04j2J90J70l4n2N2J28j05j65J01j3j28O8O4o6
6324d9j07M5O4J4J33J06n24K84jj41j02J78J09j21MK77k01k6j48J30N3l4J86k10
6348h1K22k5j46j16K70m9l7l3K36l62j62N06k03j9j04K54k73K72k12J2J40J6k34
$$ plain form
6371 -128 -33 336 52 -124 38 -178 -136 -80 -26 95 -76 -91 256 -47 266 -107 -157 -204 -43 124 161 -81 -92
6394 -92 -212 -13 53 -43 -168 97 69 55 201 10 -101 97 218 8 -125 -51 89 -72 -9 -145 -36 184
6416 184 -67 -20 76 172 74 -99 13 -119 98 225 61 263 -28 139 29 -78 -39 81 -85 -113 -79 109
6438 109 126 -169 198 85 -70 177 16 194 -43 -77 -93 -198 375 91 -140 -99 -5 -40 156 95 230 -116
6460 -116 54 -52 39 151 -83 -266 42 21 -6 4 33 -251 140 -109 -172 34 23 117 -106 -153 -301 21 -4
6483 -4 -138 15 -10 -358 -107 59 73 -232 181 -174 -127 121 -142 -293 25 299 -92 191 13 94 -171 -235
6505 -235 -32 -12 -235 196 -85 -24 99 -78 83 -3 181 31 53 -48 57 38 -52 11 274 218 -96 -185 -275
6528 -275 181 104 95 15 78 207 -45 -79 80 46 -113 192 -288 31 259 158 -68 156 92 97 -27 17 260 114
$$ packed form
6371a28R5L69k84j76J62k16M2N6N4J21j71j5L47l03L13l73n0m7J61J67L7k42j1
6394i2j20J99O6r6j25K65k8j4J46j91j11J98J21k10j33P4J40j61O3j36J09K20
6416A84k51M7R6R6r8j73J12j32K17J27j64K02k91J67j10j07L9J20j66k8L4J88
6438A09J7k95L67j13j55K47j61J78k37l4j6j05N73k84k31M1R4l5J96o1J35l46
6460a16J70j06R1J12k34j83L08k1k7J0K9k84L91k49o3K06j1R4k23m7j48L22k5
6483dj34J53k5l48K51J66J4l05M13l55M7K48k63j51L18K74l91K83j78Q1k65o4
6505b35K03K0k23M31k81O1J23j77J61q6J84j50K2j01J05j9r0O3K63n6l14q9r0
6528b75M56p7rq0O3J29k52l4J59l4j59L05m80L19K28j01k26K24o4Nj24M4K43j46
$$ plain form
6552 114 -58 121 -24 -59 -59 147 -96 -209 -244 -224 44 -21 -195 -29 -37 -241 59 -94 -30 178 -16 -141 118
6575 118 -102 -150 66 -213 79 59 -13 165 80 -221 -134 -92 198 133 -34 18 -59 -179 -51 -147 -42 -237 53
6598 53 100 -111 9 -57 305 160 -85 125 64 -2 -18 19 -88 -191 -202 -17 -77 -39 -273 105 -32 92 -111
6621 -111 91 -129 172 -181 4 -1 -93 -80 -136 -370 147 -170 -168 -134 9 -62 -126 68 243 56 166 144 189 -217
6645 -217 -35 -62 135 -109 96 39 -4 -30 166 52 -149 -156 9 31 -100 -86 337 50 82 -46 -144 41 -95
6668 -95 107 -147 154 20 41 -142 213 15 -41 -33 -247 -152 -6 -13 11 -114 79 13 -88 30 178 119 244 188
6692 188 -59 244 -42 -66 66 -21 -14 146 -127 178 -49 -134 -49 -80 8 47 -45 53 -100 -152 -26 138 -51 180
6716 180 109 -13 134 -260 29 38 -17 -249 205 178 125 92 -214 -253 38 -63 -62 -25 149 -121 224 93 -18 92
$$ packed form
6552A14j72J79j45l5%K06k43j13l5K0K68o5j74J66qk04L00j53O4K08j94j25K59
6575A18k20m8K16k79K92k0p2J78q5l01Q7M2K90o5j67N2p7j20J28r6J05j95K90
6598E3M7k11J20o6L62j45k45K10o1o6j6L7j07j03j1J85o0L8k34L78j37J24k03
6621a11K02k20L01l53J85nr2J3n6k34N17l17KL4J43p1o4J94J75j87J10k2M5m06
6645b17J82k7J97k44K05n7m3k6J96j14k01pJ65K2j31J4M23k87L2j28r8J85j36
6668i5K02k54L01j34K1j83L55j98n6Qk14R5J46pK4j25J93o6j01J18J48n9J25n6
6692A88k47L03k86k4J32q7PJ60k73L05k27q5Q5l1Q8L9r2R8j53n2J26J64j89K31
6716A80p1j22J47l94K89Rn5k32M54k7n3l3l06l9K91j01JL7J74k70L45j31j11J10
$$ plain form
6740 92 -15 -151 211 285 -79 -11 113 -36 -20 43 20 -14 -5 -210 -66 21 -58 -201 -5 -142 93 86 20 82 97
6765 97 31 343 -45 188 60 5 16 56 -121 -200 166 -47 81 -253 223 -94 158 -63 -30 229 172 115 -329
6788 -329 65 7 48 -183 -32 -115 7 -67 92 -67 -61 -122 211 64 200 264 21 -241 -76 11 -26 -44 -80 -189
6812 -189 -262 -73 3 127 111 118 -66 14 52 -190 8 116 109 -52 -27 -12 -138 -37 -99 84 91 249 -343 99 -148
6837 -148 -64 -105 49 149 256 -86 353 -93 90 131 -202 179 247 50 -181 9 84 115 162 15 274 113
6859 113 -207 -142 -52 177 14 13 -11 -81 -9 -70 60 -109 147 92 118 312 -33 143 77 -100 -106 54 -111 -47 104
6884 104 53 24 -76 -65 50 -139 -92 -144 -15 244 100 -61 68 -217 34 6 246 -132 156 1 -54 -98 -1
6907 -1 -164 -170 -152 -107 -77 -13 235 -72 -130 81 -102 -48 216 -44 -353 -17 -46 -62 170 49 117 44 -150 11 -169
$$ packed form
6740I2j07j36L62P4l64O8J24j49J6O3k3l4Rk05J44Q7p9j43J96j37K35po6O2J5
6765I7o6L12l88K33j28n5J1M0j77p9L66k13J28l34M76l17K52k21L3K59n7n7m44
6788c29L94n8M1k31J51q3J22p4J59j59Oo1L33j47J36O4k43k62J65Q7l7j8l6j09
6812a89p3J89P6J24j6Pj84Q0L8k42J98J08pj61K5J5j26J01o2J83PJ58n92M42k47
6837a48Q4m1J54J00J07l42M39m46J83M1l33L81O8j97k31J90P5L1M7j47K59j61
6859A13l20O5R0K29j63jk4p0P2o1J30j69K56n5K6J94l45J76o6j77oJ60j65O4J51
6884A04n1k9j00J1J15j89M7n2J29K59j44j61J29k85K51k8K40l78K88j55n5m4R7
6907aj63oJ8M5L0O4K48l07n8K11j83N4K64k60l09L36k9j6K32j21O8p3j94J61j80
$$ plain form
6932 -169 107 157 -199 -27 -43 -268 54 -160 -79 15 -131 95 95 345 -32 -141 85 -92 -104 170 -96 -31 4
6955 4 -42 -185 149 -80 -101 52 -111 -35 34 32 113 -103 233 -185 -171 -52 -32 98 -169 114 143 -178 -15 117
6979 117 88 5 -94 47 -35 256 277 132 -56 -71 111 -235 -93 135 9 -63 -342 22 -192 92 -128 241
7001 241 78 -27 3 -171 185 38 145 -92 -30 -3 268 110 37 327 79 -77 249 112 -122 14 -54 -97
7023 -97 -68 -179 39 61 3 -76 180 9 -279 -131 6 -143 26 24 -9 -218 -94 -129 -124 64 366 22 -22 -391
7047 -391 80 48 -44 93 -63 108 -184 -74 -244 -239 -103 -206 -203 -182 -60 -46 -11 -157 31 354 -5 -280 -241
7070 -241 -143 -185 67 92 -280 -6 78 -10 -162 -232 94 143 164 35 209 28 -97 -21 -247 16 1 -293 102
7093 102 -188 -114 32 85 -3 57 43 -91 112 -25 -171 66 10 128 144 -174 -194 -35 42 -223 180 14 -106
$$ packed form
6932a69K76N0l56J72j6k25L22k14Q1R4j46K26%K50l77j09K26j77j2K74k66O5L5
6955Dm6j43L34k29k1J53j63P6O9kQ1k16L36m18J4J19K0J30k67K83K9l21J63J32
6979A17k9q3r9J41q2K91K1j45j88j5J82l46J42K28j26p2k79L64k14K84k20L69
7001B41j63j05L0j74L56j47J07k37O2K7K71j58p3K90k48j56L26j37k34J36o8m3
7023i7K9j11K18K2n8p9K56j71k88J48J37j49J69kl3k09J24l5NJ88L02l44m4l69
7047c91M71l2r2J37j56J71k92J10j70NJ36j03LK1J22J4L5j46J88L23l59k75L9
7070b41R8m2K52K5l72K74Q4q8j52p0L26M9K1j29J74j81j25P6k26K63j5k94L95
7093A02k90P4J46N3q8O0j4j34K03j37j46K37n6J18J6l18k0J59P7k65M03j66j20
$$ plain form
7116 -106 1 0 91 11 -71 -72 174 221 195 -30 -77 17 -34 -17 -30 -199 -225 -66 -112 -33 -259 -108 -348 20 8 -163
7142 -163 -235 -175 208 -127 90 -69 -197 -78 -199 -88 -79 229 521 -65 161 -188 7 99 129 71 129 113 -336
7165 -336 -93 -188 68 15 125 -146 303 10 -67 -198 215 -152 -55 -54 27 -71 42 -50 34 51 -6 -67 -218 127
7189 127 206 34 -30 -29 -48 -121 -259 -64 -221 -80 133 -295 -184 38 -217 -122 251 227 2 -184 -27 242 164
7212 164 11 -98 -148 -124 -168 -94 57 -9 -223 48 -14 -132 -158 55 23 -45 -66 -101 99 -72 -109 34 -269 172
7236 172 -45 -164 126 -296 -190 85 -134 115 -200 -130 119 -239 -128 53 -298 -191 185 -259 -115 -154 107
7257 107 -327 -95 154 -69 93 105 2 50 -75 -66 87 -254 -87 66 17 -67 74 56 16 38 -129 34 63
7280 63 -82 42 4 -40 -44 -95 -78 -58 90 19 10 -75 -42 -401 144 -48 -181 259 -83 -84 180 -253 -47 -96 125
$$ packed form
7116a06J07jR1q0q2jK46M7k6k25m7R4n1J7j3j69k6J59m6P9k26J51k40L68j2j71
7142a63p2O0L83l35K17j59j28J19j21J11RL08K92n86K26l49J95R2L0n8N8j6m49
7165c36K43r5K56n3J10k71M49k93p7j31M13l67R7JQ1r8J13r2Q4J7n7o1j51L45
7189A27P9j72o4Jj9p3j38J95j57J41K13m28J11K22k55R5L73k4k25j86J57K69p8
7212A64j53j09n0K4m4P4J51o6k14K71o2j18k6K13l2o8k1l5K00j71l7J43l03M41
7236A72k17j19K90m22J06K75k19K49l15P0K49l58J11J81l51J07L76m44J44l9K61
7257A07m34K32K49k23J62J2j03M8j25RJ53l41J67J53m9q4J41j8m0K2j67J63K9
7280F3j45J24l8m4mn1J7K0J48p1rq5L3l59N45j92j33M40l42jK64m33K06m9K21
$$ plain form
7305 125 87 -32 61 107 -94 -46 72 -168 109 -121 195 8 -67 196 159 -194 158 -37 190 -122 -274 83
7327 83 -25 -118 -152 15 -263 -306 174 0 -19 59 238 -75 -183 -256 -16 100 -62 -111 -38 -198 -104 249 -71
7350 -71 159 102 208 -20 100 -86 -426 -69 -83 -33 -217 -60 -82 -276 132 38 159 93 -162 114 -150 7
7372 7 111 -191 39 241 -43 -323 58 112 107 54 187 42 -128 -81 167 130 160 278 53 265 173 54 85 74
7396 74 -16 160 42 9 56 84 27 -51 2 200 20 109 12 90 102 -90 -86 -19 -101 154 144 -118 -205 -294 -65 64
7422 64 246 98 -62 248 -60 -106 -206 -102 150 90 29 109 -89 124 -65 -103 -80 -50 143 18 38 -58 -17 63
7446 63 69 6 -106 -224 182 169 121 213 62 119 -23 144 -36 -69 -10 -10 42 -61 -78 -63 -109 -111 304 226 96 -319
7472 -319 86 51 194 173 59 -191 -56 182 -55 -14 69 229 130 51 58 42 32 37 -175 138 -187 -48 -118 -28 116
$$ packed form
7305A25l8j19R3M6k01M8J18k40K77k30L16j87p5K63l7l53L52j95K27l12j52L57
7327H3j08r3l4J67k78m3M80j74j9P8J79l13j08p3K40J16j62m9P3j60R4L53l20
7350g1K30n7J06k28J20j86l40L57j4N0j84J57k2j94M08r4J21o6k55K76k64J57
7372GJ04l02K30K02k84k80L81N4nn3J33j45j70M7K48l7L0J18k25K12r2j19L1j1
7396G4r0J76j18l3M7K8n7p8N3J98j80Q9r7P8J2j92MO7q2K55j0k62q7q9K29J29
7422F4J82j48j60L10l08m6j00J04K52o0o1Q0j98K13j89l8K3L0J93j25K0r6M1Q0
7446F3Oo3j12j18M06j3m8R2j51N7j42J67j80l3N9%N2j03j7J5m6kM15p8j30m15
7472c19M05l5J43k1j14k50J35K38k37M1Q3J60r9p9Pj6j0Nk12L13l25J39p0R0J44
$$ plain form
7497 116 -136 -23 30 55 210 23 -227 61 116 138 188 8 -65 14 17 -93 -59 63 34 -86 22 -102 -106 41
7521 41 -52 209 -55 -140 79 -44 96 29 -181 199 14 -119 221 -142 159 -185 58 -104 -134 -27 48 32
7543 32 105 -96 79 -74 1 -5 -124 -213 60 180 47 -7 -88 94 11 55 114 -21 -281 -192 17 -106 -60 -21 -35
7568 -35 87 -340 392 -83 67 94 55 158 -175 -210 -81 -152 -237 142 -65 -67 7 194 -36 78 -168 -288 96
7591 96 -26 31 -204 -237 36 -65 -113 -341 271 120 -40 0 70 41 87 85 -100 212 111 -78 -167 -53 62 -178
7615 -178 -191 122 51 106 -199 28 -46 -5 -141 75 -295 17 -83 -147 110 51 27 64 -81 -206 33 -142 110
7638 110 -93 -51 6 9 94 123 66 123 -8 -36 -121 54 -71 136 87 -40 -8 181 128 -204 1 -279 85 96 -60
7663 -60 -221 -40 44 166 -119 31 109 296 312 126 87 -20 59 24 -90 116 -15 38 -152 43 -219 -118 -52
$$ packed form
7497A16k52J13N3K5J55j87k50K88N5K2N0j80p3P9Lj10L4J22k9j20J08j24mJ47
7521D1r3K61k64q5K19j23J40o7k10L80j85j33L40l63L01l44K43j62l0J07P5j6
7543C2P3k01J75j53P5oj19q9K73J20j33n4q1J82q3M4N9j35k60Q9K09j23M6L9j4
7568c5J22m27P32m75J50K7l9J03l33l5J29p1q5L79k07kP4J87k30J14k46j20L84
7591I6j22N7k35l3K73j01m8k28O12j51j60M0P0k9M6kj85L12j01j89q9J14J15k40
7615a78j3L13p1N5l05K27p4M1j36K16l70L12j00o4K57n9k4L7j45j25K39j75K52
7638A10k03M2N7LQ5K9n7N7j31k8q5J75j25K07m9j27L2J89n3l32K05k80L64J1j56
7663f0j61J81Q4J22k85J50P8J87J6j86l9j07P9l5j14K06j31N3j90J95k62J01O6
$$ plain form
7686 -52 -354 -192 98 -287 -6 247 0 27 154 -79 73 -78 45 -6 178 -3 151 -74 96 -88 -28
7707 -28 68 -107 -181 -75 -43 -45 111 -80 161 102 73 79 171 8 -185 108 375 12 -59 73 -143 178 -25 97
7731 97 40 168 -115 88 -63 -158 -117 -117 -122 -38 -102 -135 121 101 230 -3 263 81 40 21 11 -247 -16 -150 47
7756 47 -168 48 -32 77 144 218 -141 11 -276 38 60 -25 207 -32 62 -98 -27 0 11 -165 67 -21 -6 177
7780 177 -26 -168 -104 -128 183 -67 -124 33 231 -16 -159 -250 12 -216 67 -118 87 74 23 314 -285 -84
7802 -84 50 -252 160 -65 123 -130 -37 119 206 78 -199 383 66 161 -191 -80 241 174 -142 20 -173 -121
7824 -121 -63 -126 -122 27 -214 -168 24 -396 220 -94 76 46 95 61 -66 -19 -49 339 -196 -390 111 -49 238
7847 238 -31 -183 77 42 11 291 -179 125 -78 91 274 76 -19 159 42 27 -5 -273 1 281 22 37
$$ packed form
7686e2l02J62K90l85K81K53k47K7J27k33J52j51J23n1J84j81J54k25J70j84O0
7707b8R6j75p4J06L2kJ56j91K41n9k9OR2j63j93K93K67l63p1J32k16L21k03J22
7731I7n7J28k83K03j51r5M1%nQ4o4l3K56k0J29k33K66j82m1j9j0k58K31j34J97
7756D7k15K16q0J09O7P4l59J52k87L14K2q5K32k39R4j60P1K7J1j76K32q8J5J83
7780A77k03j42O4k4L11k50n7J57J98k47j43r1K62k28K83j85K05j3n1K91n99K01
7802h4J34l02M12k25J88k53R3J56Q7j28k77N82l17R5l52J11L21o7l16J62j93N2
7824a21N8o3MJ49k41M6J92m20O16l14J70l0M9l4j27M7l0L88n35j94N01j60K87
7847B38k69j52K60l5l1K80m70L04k03J69J83j98r5J78j17j5l2k68K74K80k59J5
$$ plain form
7869 37 -34 -143 11 -116 95 -388 228 144 -35 -361 -184 -130 34 -88 -33 -76 73 175 32 -276 132 134 -208
7892 -208 224 -67 499 -69 -157 116 1 -66 -100 -26 -118 215 160 147 194 -107 55 -194 -30 40 40 185 76 -234
7916 -234 -53 -167 167 67 222 -90 137 -41 73 123 -9 139 41 116 -37 60 -38 52 58 -65 -161 -66 -47 87
7940 87 91 56 -92 -8 113 -122 -118 -1 -205 -5 -278 329 3 5 50 85 44 90 135 315 -88 274 -44 -113 -109 227
7966 227 118 -209 145 78 44 -86 61 160 179 67 42 17 -117 101 -22 -131 -93 -177 2 -184 -132 -107 -147 32
7990 32 -103 -129 44 48 24 40 80 66 -38 95 299 289 181 -39 254 127 16 0 3 79 58 -43 69 10 44
8015 44 -129 -51 180 9 -42 -40 42 223 36 -112 -77 153 39 65 -65 100 -26 92 -161 60 93 -263 27
8038 27 -177 345 200 162 1 -163 363 97 87 208 262 141 -74 -1 -171 13 -111 -96 15 -163 57 -184
$$ packed form
7869C7p1j09J54j27K11m83O16q4j79l26J77N4J64j22N5m3J49J02j43l08M08Kl42
7892b08M32k91N66n68q8K73j15o7l4P4r2L33n5j3M7l01J62k49J64P0%J45j09l10
7916b34J81j14L34j00J55l12K27j78J14N0j32J48r8P5j53R7r8R0Oj23r6R5J9J34
7940H7Ml5j48Q4J21k35MJ17k04K00k73O07l26KM5L5m1M6M5J80m03L62l18o9ML36
7966B27j09l27L54o7l4j30J47R9J9j12k5k5j34K18j23j09L8q4J79j86N2K5m0J79
7990C2j35k6J73Mk4J6M0j4j04J33K04j0j08k20K93j27j11j6LP6k1j01J12n9L4
8015D4j73P8K31j71n1KQ2J81j87j48L5K30j14K6j30J65j26J18k53K21L3l56K90
8038B7k04N22j45l8j61j64N26k66j0J21N4j21k15P3j70J84j24J5J11j78K20k41
$$ plain form
8060 -184 -66 -80 -28 78 -131 -182 -12 9 181 -199 -120 -301 74 -132 -240 -172 -108 1 55 61 -238 -70 141
8083 141 263 41 -260 -82 -262 83 -59 -124 -229 238 -50 -133 -14 -5 -219 128 -27 -75 112 -94 69 -51
8105 -51 -61 -32 121 213 149 52 -140 82 45 63 12 88 114 242 238 -6 -79 -14 98 -137 -152 107 4 97 -43 86
8131 86 -319 -359 80 -200 -44 -133 -39 117 160 276 -33 67 -185 91 230 18 16 -155 127 -143 22 81 2
8154 2 -100 -254 -87 86 55 -68 -33 104 -19 51 -63 -117 -133 30 -163 -83 194 13 98 -3 67 -195 12
8177 12 39 -103 52 75 -2 204 35 -49 -42 112 220 41 -140 0
$$ packed form
8060a84J18j4N2J06k09n1J70K1J72l80P9j81L75k06j08O8O4J09N4Ok99J68K11
8083A41J22k22l01J78j80L45j42o5j05M67k88q3J19Rk14L47j55m8J87k06J63j20
8105e1j0K9J53R2o4r7j92K22l7J8n1P6K6J28mk44p3O5J12k35j5K59j03R3j40J29
8131H6m05m0M39k80J56q9R4J56M3J16l09J00k52K76J39k12kj71K82k70J65N9p9
8154Bj02j54J67J73l1j23L5J37j23P0j14n4j6J63j93Q0K77j81Q5j01P0k62K07
8177A2K7j42J55K3p7K06j69q4PJ54J08j79j81J40
8191@
$$ Imaginary data points
##PAGE= N=2
##DATA TABLE= (X++(I..I)), XYDATA
$$ plain form
0 0 0 0 0 0 0 0 0 0 0 0 0 0 8 -8 8 -8 8 -16 16 -16 24 -26 32 -40 48 -56 64 -72 80 -96 111 -127 144 -160
34 -160 183 -206 231 -257 288 -321 358 -398 441 -488 542 -599 662 -727 802 -886 974 -1075
52 -1075 1185 -1306 1442 -1597 1770 -1971 2206 -2479 2808 -3208 3712 -4367 5255 -6540 8569
67 8569 -12283 21344 -95822 -44274 130497 39126 -13141 6646 46164 10526 -6938 -12229
79 -12229 -21548 -37186 -6676 5104 11013 17424 24289 26315 31351 -8221 -43421 -40838 -12881 7613
93 7613 14984 17699 12578 -21374 -21941 16103 14953 -12238 -5918 1101 -11911 -9829 23883 37703
107 37703 -317 -18163 8927 960 -27327 -11991 13693 13808 703 -7800 -1035 -3756 -12289
120 -12289 225 10987 883 -12351 -12736 11751 27358 5365 -6880 3957 316 -11355 -11689
$$ packed form
0@%%%%%%%%%%%%Qj6J6j6J6k4L2l2M0n0N8p2Q8j04J20j36J52j76K07k38K71l04
34a60L43l89M37m88N45o09O79p56Q39r29J030j141J261j389J529j688J860k049
52a075K260k491K748l039L367l741M177m685N287o016O920q079R622j1795J5109
67H569k0852L3627j17166N1548J74771r1371n2267J9787L9518l5638j7464n291
79a2229r319j5638L0510J1780N909O411O865K026N036l9572l5200K583K7957K0494
93G613P371K715n121l3952n67L8044j150k7191O320P019j3012K082L3712J3820
107C7703l8020j7846K7090p967k8287J5336K5684J15j3105q503O765k721q533
120a2289J2514J0762j0104j3234l85K4487J5607k1993j2245J0837l641j1671l34
$$ plain form
133 -11689 670 13368 4303 -3457 4322 -3354 -13724 -4035 1940 -1192 -6069 -3016 10030 7744
147 7744 291 9158 6860 -8603 -8314 -72 6530 4503 -2082 5491 5621 -8809 -7241 -1251 -7918
162 -7918 -6979 -13 4098 2403 -2715 3793 8695 -2109 -4641 -714 876 8233 4572 -3040 4452
177 4452 5555 -3535 -5033 -1411 69 -6199 -8843 2674 2776 -6774 2678 6997 -4187 -4976 1399
192 1399 4172 1810 -80 6677 5226 -4661 1772 5135 -2847 80 476 -7066 -5587 -1933 622
207 622 1013 -857 1582 -1502 -6007 2457 3543 -1606 5051 4402 -2897 802 4609 2810 -391 -1742
223 -1742 2560 -2065 -8357 -10 2309 -4202 -989 -63 -3970 -2415 -614 2782 3888 783 2636
238 2636 832 -2629 4110 4646 -435 2506 708 -2896 -66 -1179 -2144 -2202 -3327 -782 -2154 -4187
$$ packed form
133a1689J2359J2698r065p760P779p676j0370R689N975l132m877L053J3046k286
147G744p453Q867k298j5463K89Q242O602k027o585P573J30j4430J568N990o667
162g918R39O966M111j695n118O508M902j0804k532L927J590P357l661p612P492
177D452J103r090j498L622J480o268k644J1517J02r550R452M319j1184p89O375
192A399K773k362j890O757j451r887O433L363p982K927L96p542J479L654K555
207F22L91j870K439l084m505Q464J086n149O657o49p299L699L807j799l201j351
223a742M302m625o292Q347K319o511L213R26l907J555J801L396J106l105J853
238B636j804l461O739N36n081K941j798l604K830j113r65n8j125K545j372k033
$$ plain form
254 -4187 3129 2646 -1645 2898 1178 -2067 1150 1321 2464 3288 1401 2756 205 -2605 1346 -805
270 -805 -3971 -1122 -2963 -2749 998 -1251 -1084 1041 -638 486 -784 -663 3911 1944 798 4975
286 4975 1245 -327 2336 -1183 -2023 -1221 -2447 -467 -1607 -2105 1510 -1752 -2619 1229 -2048 -1321
302 -1321 2467 -160 1372 3560 2073 2660 1481 280 1517 -2131 -1855 1224 -2158 -1415 1577 -2132
318 -2132 -2258 -457 -1945 -866 -1613 -485 2211 -70 795 4265 668 1361 3314 -744 -196 698 -1113
335 -1113 220 -232 -1007 -431 -2934 -2089 197 -3157 -1193 1312 -1383 70 2101 804 1832 1723
351 1723 1208 2441 -782 563 2112 -1302 250 1123 -2713 -1710 -857 -2502 -891 -971 -616 198 -1836
368 -1836 494 2005 -549 2308 3189 -438 1722 2358 160 895 574 399 -265 -2655 -1329 225 -2809
$$ packed form
254d187P316m83m291M543j720l245L217J71J143Q24j887J355k551k810L951k151
270h05l166K849j841K14L747k249J67K125j679J124j270J21M574j967j146M177
286D975l730j572K663l519q40Q02j226J980j140m98L615l262q67L848l277P27
302a321L788k627J532K188j487N87j179j201J237l648K76L079l382P43K992l709
318b132j26J801j488J079p47J128K696k281Q65L470l597O93J953m058N48Q94j811
335a113J333m52p75N76k503Q45K286l354J964K505k695J453K031j297J028j09
351A723n15J233l223J345J549l414J552Q73l836J003Q53j645J611q0L55Q14k034
368a836K330J511k554K857Q81l627K160O36k198P35l21j75o64k390J326J554l034
$$ plain form
385 -2809 -296 47 -3076 -939 -47 -548 1747 1198 1060 1706 -172 1817 1979 -682 2025 1609 -1704
402 -1704 -235 -108 -1722 -461 -1403 -1464 -1040 -2765 -356 982 -1030 1215 1132 -909 1049 1333 1171
419 1171 3060 943 434 1016 -970 278 464 -1807 -58 -851 -2647 -363 -1356 -1441 1216 -509 -413
436 -413 984 -471 1618 2516 991 1562 -174 -495 1774 228 -508 1671 -1406 -1955 -757 -2164 -1090
453 -1090 -427 -717 90 -1255 -433 2019 -76 144 2753 490 -186 1798 510 615 813 129 -210 -2349
471 -2349 -1569 1047 -1760 -1009 1075 -1778 -2274 115 -660 23 718 1746 2251 -635 139 2935 146
488 146 -242 1843 -574 -1090 845 -4 -848 -1674 -1189 -93 -2961 -1287 1961 -1054 -390 2722 52
505 52 -928 1110 1491 1300 313 1305 1744 -947 -478 1302 -1777 -1390 656 -1632 -1961 -397 131 -437
$$ packed form
385b809K513L43l123K137Q92n01K295n49j38O46j878J989J62k661K707m16l313
402a704J469J27j614J261r42o1M24j725K409J338k012K245q3k041J958K84j62
419A171J889k117n09N82j986J248J86k271J749p93j796K284r93q5K657j725R6
436d13J397j455K089Q98j525N71j736l21K269j546p36K179l077n49J198j407J074
453a090O63k90Q07j345Q22K452k095K20K609k263o76J984j288J05J98o84l39k139
471b349P80K616k807P51K084k853m96K389p75O83O95J028N05k886P74K796k789
488A46l88K085k417n16J935q49q44q26M85J096k868J674L248l015O64L112k670
505E2r80K038L81j91r87R92M39k691M69J780l079L87K046k288l29J564N28n68
$$ plain form
523 -437 -1663 -180 1486 -909 62 2689 397 494 2291 215 -233 281 389 651 -1188 -528 717
540 717 -2199 -1839 543 -1801 -1350 449 -240 84 206 452 1536 -175 402 1750 347 661 1582 -600
558 -600 -504 322 -851 -726 -1272 -1289 423 -921 -1524 422 -586 -385 626 -36 673 1095 1042 2130 500
577 500 -198 1096 -373 -655 1020 -517 -725 -130 -989 -776 -1335 -1392 419 -675 -737 1634 795 -148 1377
596 1377 795 785 873 355 1135 -141 -506 1743 -137 -2070 -568 -1183 -1781 147 -201 -288 -307 -74 806
615 806 -717 -553 2017 567 -89 1586 969 -15 901 639 290 -678 -1070 145 -1747 -1659 1073 -179
633 -179 -1416 -35 -552 -1048 527 1002 1206 -105 54 1668 -47 -292 2205 866 -720 225 -1105
650 -1105 -1429 -110 -142 150 -1192 -973 284 -948 -765 1660 663 -339 793 327 506 1511 1142 1623
$$ packed form
523d37j226J483J666k395R71K627k292R7J797k076m48N14J08K62j839O60J245
540G17k916L60K382k344M51J799o89L24J22K46J084j711N77J348j403L14R21k182
558f00R6Q26j173J25n46j7J712j344o03J946j008K01J011o62P09M22n3J088j630
577E00o98J294j469k82J675j537k08N95q59K13n59n7J811j094o2K371q39r43J525
596A377n82j0Q8n18P80j276l65K249j880j933J502o15n98J928l48q7j9K33Q80
615H06j523J64K570j450o56J675o17r84R16k62l49r68l92J215j892Q8K732j252
633a79j237J381n17m96J575M75K04j311J59J614j715k45K497j339j586R45j330
650a105l24J319l2K92j342K19J257j232J83K425r97j002J132m66J79J005l69M81
$$ plain form
668 1623 -93 -1240 212 -1005 -562 1021 -194 -1339 -551 -1551 -499 -170 27 751 -153 -627 1101
685 1101 341 747 1997 95 28 276 -688 -50 363 -50 715 -981 -1539 -654 -988 -810 817 -566 -227
704 -227 261 -261 936 1331 468 975 299 -632 469 113 131 630 -479 -533 -558 -1403 -503 -376 -1100 -242
724 -242 -476 -522 207 1 666 1443 19 503 828 -367 520 458 -82 244 -380 -749 -74 -910 -308 -174
744 -174 -1517 -356 -77 -613 736 661 -128 1028 832 555 728 141 451 676 -91 984 681 -886 11
763 11 -930 -1541 -585 -166 -671 255 -625 95 361 -407 801 579 -129 864 251 -92 1178 708 349 276
783 276 -957 -761 -711 -971 585 -21 -712 266 -553 -813 375 314 512 410 91 568 803 258 1418 712
803 712 -476 -134 -470 -1065 151 -178 -168 -99 -1133 -708 -115 -450 849 -51 -577 768 -180 436 1504
$$ packed form
668A623j716j147J452j217M43J583j215j145P88j000J052L29J97P24r04m74J728
685A101p60M06J250j902o7K48r64O38M13m13P65j696n58Q85l34J78J627j383L39
704b27M88n22J197L95q63N07o76r31J101l56J8M99j109n4k5q45R00J27p24Q58
724b42k34m6P29k06O65P77j424M84L25j195Q87o2n40L26o24l69O75q36O02J34
744a74j343J161K79n36J349p5p89J156j96k77J73n87L10K25p67J075l03j567Q97
763A1r41o11R56M19n05R26q80P20K66p68J208k22p08R93o13l43J270m70l59p3
783B76j233J96N0k60J556o06o91R78q19k60J188o1J98j02l19M77K35n45J160p06
803G12j188L42l36n95J216l29J0O9j034M25N93l35J299r00n26J345r48O16J068
$$ plain form
822 1504 848 715 447 -911 -190 -226 -763 544 -415 -823 -257 -922 -840 314 -318 -326 -160 -306 591 546 534
843 534 1288 334 -236 339 -457 -301 641 -271 -10 -373 -1072 -596 -287 -419 -51 -282 -615 493 -164 214
863 214 939 229 653 443 -160 130 602 -6 429 -216 -410 186 -707 -529 -82 -859 -371 56 -700 302
883 302 220 121 746 10 423 584 51 296 980 -66 303 160 -642 -321 -556 -816 -106 -695 -396 286 -432
904 -432 8 248 -371 225 721 -63 361 521 359 686 149 188 314 -477 -155 -281 -1045 -83 252 -537 65
925 65 -403 -208 305 -94 560 864 -267 726 974 -117 695 268 -223 -14 -242 -473 -47 -837 -204 -166
945 -166 -928 -449 -58 -590 342 243 -22 488 145 239 589 140 694 518 -613 132 -33 -470 143 -51 -557
966 -557 -367 -746 -316 -149 -338 216 332 -104 579 553 245 639 428 49 383 -134 -50 527 -470 -42 -109
$$ packed form
822A504o56j33k68j358P21l6n37J307r59m08N66o65Q2J154o32qJ66j46Q97m5j2
843E34P54r54n70N75p96J56R42r12K61l63o99M76L09j32L68k31l33J108o57L78
863B14P25p10M24k10o03K90M72o08M35o45j94N96q93J78M47p77M88M27p56J002
883C02q2r9O25p36M13J61n33K45O84j046L69j43q02L21k35k60P10n89K99O82p18
904d32M40K40o19N96M96p84M24J60j62L27n37L9J26p91L22j26p64R62L35p89O02
925F5m68J95N13l99O54L04j131R93K48j091Q12m27m91K09k28k31M26p90O33L8
945a66p62M79L91n32R32r9k65N10l43R4L50m49N54j76j131P45j65m37O13j94n06
966e57J90l79M30J67j89N54J16m36O83k6l08L94k11l79L34n17Q4N77r97M28o7
$$ plain form
987 -109 -954 -634 -413 -767 50 -319 -181 206 -189 216 791 80 674 510 -132 397 255 -32 277 -400
1007 -400 -379 -192 -790 -446 -2 -755 -240 -126 -486 131 -295 221 635 -268 112 871 256 473 588 -306
1027 -306 262 39 -532 16 -402 -758 96 -840 -274 181 -598 104 305 -153 59 313 171 410 52 351
1047 351 600 -468 21 564 -386 -192 -41 -600 -349 -360 -444 -160 -241 -271 -18 -563 326 928 -41 418 863
1068 863 146 397 249 76 209 -165 -136 179 -716 -433 206 -657 -143 166 -390 225 -314 80 410 4
1088 4 243 674 -91 238 964 -241 -28 199 -498 -272 -409 -315 30 -614 -211 86 -221 37 363 -318 240
1109 240 168 -17 713 23 190 530 -279 162 428 -378 -204 -64 -436 -144 -490 -462 -66 -470 -325 87 -304
1130 -304 175 278 154 346 343 -54 551 154 -171 94 -222 -234 -11 -438 -731 21 -455 54 -75 -336 371
$$ packed form
987a09q45L20K21l54Q17l69J38L87l95M05N75p11N94j64o42N29j42k87L09o77
1007d00K1J87n98L44M44p53N15J14l60O17m26N16M14r03L80P59o15K17J15q94
1027c06N68k23n71N48m18l56Q54r36N66M55p79P02K01m58K12K54j42K39l58K99
1047C51K49j068M89N43r50J94J51n59K51j1q4K84q1l0K53n45Q89O02r69M59M45
1068H63p17K51j48j73J33l74K9L15q95K83O39q63N14L09n56O15n39L94L30m06
1088DK39M31p65L29P26j205K13K27o97K26j37R4L45o44M03K97l07K58L26o81N58
1109B40p2j85P30o90J67L40q09M41K66q06J74J40l72K92l46K8L96m04J45M12l91
1130c04M79J03j24J92ll97O05l97l25K65l16j2K23m27k93P52m76N09j29k61P07
$$ plain form
1151 371 204 -85 497 -113 213 710 -36 297 446 -236 106 112 -317 203 -659 -753 51 -565 -294 65 -537
1172 -537 301 -76 -248 151 29 64 743 379 -44 756 119 -115 217 -233 -149 -333 -440 -221 -304 -357 256
1193 256 -223 -264 411 -451 220 424 39 369 92 -118 577 54 140 371 -203 -69 461 -282 -451 -47 -828
1214 -828 118 -64 -72 148 -64 -226 642 154 15 852 78 337 314 51 -20 -105 -217 205 -293 -300 305 -293
1236 -293 -346 226 -435 112 119 39 -5 161 4 475 27 43 642 -161 175 196 -316 90 -191 -403 101 -111
1258 -111 -696 127 -259 102 168 -69 83 187 73 524 507 -68 490 96 -108 371 -117 -67 -215 -596 -128
1279 -128 8 -336 114 -237 -325 169 -281 139 404 416 377 338 87 175 84 -5 316 133 -314 281 -320 -373 -35
1302 -35 -331 -300 -43 -653 -32 344 -125 388 253 116 184 -23 196 315 64 131 499 -554 155 -171 -514
$$ packed form
1151C71j67k89N82o10L26M97p46L33J49o82L42Om29N20q62r4Q04o16K71L59o02
1172e37Q38l77j72L99j22L5O79l64m23Q00o37k34L32m50Q4j84j07K19q3n3O13
1193B56m79m1O75q62O71K04l85L30k77k10O95n23Q6K31n74J34N30p43j69M04p81
1214h28R46j82qK20k12j62Q68m88j39Q37p74K59k3k63p1q5j12M22m98pO05n98
1236b93n3N72o61N47Pq0m4J66j57M71m48J6N99q03L36K1n12M06k81k12N04k12
1258a11n85Q23l86L61O6k37J52J04j14M51j7n75N58l94k04M79m88N0j48l81M68
1279a28J36l44M50l51q8M94m50M20K65J2l9l9k51Q8r1q9L21j83m47N95o01n3L38
1302c5k96L1K57o10O21L76m69N13j35j37O8k07K19J19k51O7L68j053P09l26l43
$$ plain form
1323 -514 -24 -158 -390 182 -108 -174 331 -105 97 298 -140 122 256 117 388 210 28 214 -173 -86 -137
1344 -137 -710 -232 -137 -197 51 8 -250 -43 66 -109 193 -34 75 340 153 460 164 -56 65 -298 -408
1365 -408 188 -246 -78 238 -422 -170 9 -401 -350 -133 -176 160 -126 234 410 224 185 519 -433 133 150
1386 150 -149 -271 35 -121 237 -264 -322 -47 -368 -21 266 -217 11 105 307 366 456 278 101 -59 -87 241
1408 241 -88 115 283 -482 -248 -252 -429 -125 -60 -168 -62 33 -194 179 -92 78 369 356 129 110 -90 40
1430 40 -222 -19 235 -175 -190 -185 -307 -104 10 -184 174 -121 -170 222 208 81 -47 -65 36 451 46 180
1452 180 348 -359 64 -229 -251 -97 -83 -103 69 -200 -250 -11 -255 44 236 211 204 33 54 537 425 130 156
1475 156 -136 48 -118 -225 -98 -27 -174 55 -251 -439 -57 -125 167 208 -73 195 296 -96 153 313 -254
$$ packed form
1323e14M90j34k32N72k90o6N05m36K02K01m38K62J34j39K71j78j82J86l87Q7n1
1344a37n73M78R5o0K48m3k58K07J09j75L02k27J09K65j87L07k96k20J21l63j10
1365d08N96m34J68L16o60K52J79m10N1K17m3L36k86L60J76j86l9L34r52N66J7
1386A50k99j22L06j56L58n01n8K75l21L47K87m83K28R4K02N9R0j78j77j60k8L28
1408B41l29K03J68p65K34mj77L04O5j08J06R5k27L73k71J70K91j3k27j9k00J30
1430D0k62K03K54m10j5Nj22K03J14j94L58k95m9L92j4j27j28j8J01M15m05J34
1452A80J68p07M23k93k2J54J4k0J72k69n0K39k44K99J92k5pj71K1M83j12k95K6
1475A56k92J84j66j07J27P1j47K29l06j88L82o8K92M1k81K68J01l92K49J60n67
$$ plain form
1496 -254 251 -276 -157 -145 -30 193 -366 -120 15 -162 -431 -47 -52 -246 370 263 -219 239 112 196 392
1517 392 191 -31 3 -126 280 110 -141 24 -42 -281 -69 -287 -191 166 9 158 230 -382 47 -104 59
1538 59 226 -105 -121 129 43 84 238 -338 -233 -268 -438 -175 -37 11 117 -34 101 320 43 226 174 158 564
1561 564 261 -10 380 199 185 251 -415 -123 -117 -329 -138 -216 -324 39 -161 -250 160 53 169 432 -13 92
1583 92 -2 258 542 -101 -367 -49 154 -330 -49 -201 -235 37 -82 -44 -19 -314 -28 316 -151 338 146 0
1605 0 199 -291 90 181 34 -55 -235 -96 65 24 -263 -164 -304 -302 -140 -252 69 309 -183 72 6 42 88 304
1629 304 57 460 13 -167 -209 -198 -111 13 -76 -234 -391 -263 6 40 49 217 -251 -185 261 75 121 173 -22
1652 -22 209 160 -64 -39 -232 48 -80 -121 69 14 -327 -158 304 -184 155 307 320 28 88 -10 142 -75 389
$$ packed form
1496b54N05n27J19J2J15K23n59K46J35j77k69L84nj94O16j07m82M58j27Q4J96
1517C92k01k22L4j29M06j70k51J65o6k39K12k18R6L57j57J49P2o12M29j51J63
1538E9J67l31j6K50q6M1J54n76J05l5j70K63J38M8J06j51J35K19k77J83n2j6M06
1561E64l03k71L90j81j4O6o66K92Ok12J91p8j08L63k00q9M10j07J16K63m45J05
1583I2r4K60K84o43k66L18K03m84K81j52l4K72j19L8K5k95K86L44m67M89j92j46
1605@J99m90L81R1j47q9j80J39J61m1k87R9j40KJ62j12L21K40m92K55o6L6M6K16
1629C04k47M03m47j80m2J1Q7J24q9j58j57J28K69L4RJ68m68O6M46j86M6N2j95
1652b2K31m9k24K5j93K80j28m1J90n5l41J69M62m88L39J52J3k92O0r8J52k17M64
$$ plain form
1675 389 276 -235 117 203 -231 124 -67 -133 51 -108 -144 194 -351 4 152 -268 197 115 87 436 338 44
1697 44 90 267 -97 -34 -105 -139 73 -29 -246 -297 -221 104 -317 -103 124 35 -62 435 210 115 448 270 44
1720 44 -156 154 -92 105 -262 -125 -245 -154 169 -70 -26 28 -33 202 73 107 154 158 -139 446 8 365 101
1743 101 -96 15 -176 -350 -258 -102 -233 -89 -47 -75 -54 147 -87 84 123 24 251 144 30 260 6 516
1765 516 49 -89 16 -178 -147 76 -224 -131 6 -92 45 -299 -81 18 248 112 181 -109 92 337 209 124
1787 124 261 -9 182 -41 -82 -188 -310 -157 -115 -113 -184 285 9 30 -73 226 53 -1 48 398 78 -170 -19
1810 -19 -23 187 196 -220 -156 -194 -188 -32 -291 -225 8 -421 -3 183 14 251 374 175 391 -22 -11 182 -88 -76
1834 -76 50 -240 -160 127 -223 62 -269 -237 43 176 58 -63 162 -134 157 -422 -169 253 18 123 -14
$$ packed form
1675C89j13n11L52Q6m34L55j91o6J84j59l6L38n45L55J48m20M65q2k8L49r8k94
1697D4M6J77l64O3p1l4K12j02k17n1P6L25m21K14K27q9r7M97k25r5L33j78k26
1720D4k00L10k46J97l67J37j20R1L23k39M4N4o1K35j29L4M7Mk97N85m38L57k64
1743A01j97J11j91j74R2J56j31J44M2k8K1K01k34J71L9r9K27j07j14K30k54N10
1765E16m67j38J05j94L1K23l00R3J37r8J37l44K18R9K30j36O9k90K01K45j28q5
1787A24J37k70J91k23m1j06j22J53M2Kp1M69k76K1j03K99j73n4M9L50l20k48J51
1810a9mK10Rm16O4l8OJ56k59O6K33m29M18J86j69K37J23j99K16m13J1J93k70J2
1834g6J26k90Q0K87l50K85l31L2K80J33j18j21K25k96K91n79K53M22k35J05j37
$$ plain form
1855 -14 295 158 -123 -309 169 -140 -86 -248 -12 -173 93 -140 -133 17 0 23 48 117 202 60 264 0 -147
1878 -147 -163 8 -105 145 -280 -417 270 -300 -215 -4 67 -43 174 45 169 53 -41 268 184 -114 7 -28
1900 -28 -25 50 -45 170 53 -298 156 -303 132 -61 88 180 -2 47 7 23 -88 -336 145 -92 100 303 -167
1923 -167 47 -182 -99 -51 -78 28 -232 -146 -196 177 -76 40 -30 -52 -120 -4 -64 246 -2 4 261 -44 106 -184
1947 -184 -176 113 -325 -81 -109 -150 -52 -431 -219 -173 198 -107 -192 143 -10 356 182 134 133 -155 71 125 -152 108
1971 108 268 -131 -16 -208 -30 -79 -85 -119 61 190 233 252 -127 198 -24 14 142 17 -171 19 -36 -381 -1
1994 -1 -169 -101 153 -267 -332 78 106 16 268 73 -45 272 -239 8 160 248 100 -10 220 -86 -63 -120 -128 -58
2018 -58 -146 12 -229 -166 -50 -165 -123 -20 -47 79 -208 221 62 2 429 -23 293 -83 -245 -56 202 -105
$$ packed form
1855a4L09j37k81j86M78l09N4j62K36j61K66k33PJ50j7K3K5O9Q5j42K04k64j47
1878a47j6J71j13K50m25j37O87n70Q5K11P1j10K17j29J24j16r4L09q4k98J21l5
1900b8LP5r5K15j17l51M54m59M35j93J49R2j82M9m0J6j11k48M81k37J92K03m70
1923a67K14k29Q3M8k7J06k60Q6n0L73k53J16p0k2o8J16o0L10k48OK57l05J50k90
1947a84QK89m38K44k8m1R8l79K12M6L71l05q5L35j53L66j74m8jk88K26N4k77K60
1971A08J60l99J15j92J78m9ol4J80J29M3J9l79L25k22L8J28j25j88J90n5l45L80
1994aj68O8K54m20o5M10K8r0K52j95j18L17n11K47J52Q8j48j10K30l06K3n7qP0
2018e8q8J58k41O3J16j15M2J03k7J26k87M29j59o0M27m52L16l76j62J89K58l07
$$ plain form
2040 -105 -150 -20 -323 -298 -318 -290 164 -220 169 123 24 190 114 -96 202 56 20 211 -230 -96 -136 -189 -27
2063 -27 86 -200 -81 150 -112 164 59 -29 81 198 -73 -36 445 18 133 236 125 -34 123 97 -334
2084 -334 -128 61 -59 160 180 -123 127 -351 -110 188 206 -156 90 -161 -189 115 2 -214 12 -70 -149 166
2106 166 217 -71 -2 -91 103 -338 -120 125 -171 11 -13 156 179 263 -92 -103 47 -128 -9 106 -43 -252
2128 -252 -41 -123 -46 159 127 100 -187 206 -144 -285 251 211 -103 133 113 162 -93 -151 -95 -149 -263 42 144
2151 144 -142 -114 -213 -20 -313 -63 -20 36 186 -40 -58 -43 84 138 52 -188 -20 -109 168 283 -225 177 -233
2174 -233 112 -85 -299 -71 -149 162 101 160 117 74 218 81 128 -226 -71 260 48 115 -255 70 64 -246 -174
2197 -174 18 -203 -94 9 115 33 -237 -64 353 -114 -42 -130 37 32 -105 -91 -72 87 190 69 -334 -173
$$ packed form
2040a05m5J30l03K5k0K8M54l84L89m6r9J66p6k10K98j46l6J91m41J34m0n3J62
2063b7J13k86J19K31k62K76j05q8J10J17k71L7M81m27J15J03j11j59J57k6m31
2084c34K06J89j20K19K0l03K50m78K41K98J8l62K46k51k8L04j13k16K26q2p9L15
2106A66N1k88O9q9J94m41K18K45k96J82k4J69K3Q4l55j1J50j75J19J15j49k09
2128b52K11q2P7K05l2k7k87L93l50j41N36m0l14K36k0M9k55n8N6n4j14L05J02
2151A44k86K8r9J93k93K50M3N6J50k26j8J5J27N4q6k40J68q9K77J15n08M02m10
2174b33L45j97k14K28p8L11o1N9m3m3J44j37M7l54J55L31k12O7l70L25ol10P2
2197a74J92k21J09J03J06q2k70J73M17m67P2q8J67nj37J4J9J59J03j21m03J61
$$ plain form
2219 -173 -179 -416 -240 257 -289 82 36 -76 134 -23 119 -24 21 202 206 -13 23 135 -143 -62 9 -50 85
2242 85 -186 -212 -253 -152 -173 -62 -17 -18 -122 65 160 195 129 114 -120 -129 -161 -260 -7 21 83 74 -81 -176 81 90 -46
2269 -46 161 21 -277 317 156 -36 6 -69 408 130 -26 -41 -43 -24 -95 -162 -98 -104 -11 -39 -76 78 16 113 -22 -114
2295 -114 62 39 112 157 47 -312 50 134 14 24 83 -88 -29 51 -309 97 -63 -412 -25 77 -32 105 -156
2318 -156 -156 -34 -57 433 118 107 88 -84 284 -140 41 -4 18 -20 -297 -157 38 238 17 60 9 235 130
2341 130 217 -46 48 32 -31 59 72 -108 -112 84 -200 76 -75 11 17 -85 -48 21 -224 -67 -88 -61 -27 -118 -15 187
2367 187 98 52 -48 -120 24 56 27 -235 58 -136 145 -127 167 -127 80 -75 -229 145 -68 160 141 -100
2389 -100 15 -116 -94 -50 -86 -377 -258 -228 109 -89 170 -208 -25 48 -135 -66 20 -226 -220 315 86 115 -163
$$ packed form
2219a73ok37J76M97n46L71m6j12K10j57J42j43M5J81Mk19L6J12k78Q1P1n9J35
2242H5k71k6m1J01k1J11M5jj04J87R5L5o6j5k34rl2r9K53K8O2rj55r5K57Rj36
2269d6K07j40k98N94j61j92M2p5M77k78j56j5kJ9p1o7O4oR3k8l7J54o2R7j35r2
2295a14J76k3P3M5j10l59L62Q4j20J0N9j71N9Q0l60M06j60l49L87J02j09J37k61
2318a56%J22k3M90l15j1j9j72L68m24J81m5K2l8k77J40J95K00k21M3n1K26j05
2341A30Q7k63R4j6o3R0J3j80mJ96k84K76j51Q6Oj02L7O9k45J57k1K7L4r1J03K02
2367A87q9m6j00p2J44L2k9k62K93j94K81k72K94k94K07j55j54L74k13K28j9k41
2389a00J15j31K2M4l6k91J19L0L37j98K59l78J83P3j83O9Q6k46ON35k29K9k78
$$ plain form
2412 -163 114 -383 188 -48 92 166 194 -9 42 92 -4 -38 -14 64 -91 -240 32 -12 127 57 101 86 -212 -62
2436 -62 158 65 -70 -18 98 -44 -65 200 -5 52 258 -124 116 -169 -1 13 117 142 -245 -72 -67 122 -120
2459 -120 224 -129 -239 102 -232 -14 -142 -101 92 -11 -117 38 -176 66 103 -53 245 93 -36 -43 113
2480 113 -63 199 184 79 -191 -164 20 234 -269 -128 7 -386 -122 26 -69 -246 184 40 -148 -109 81
2501 81 -91 -90 85 -176 26 -62 -77 -54 -92 47 -111 -225 -260 43 95 -54 172 198 24 -102 -83 -208 -13 -147
2525 -147 -172 151 218 -91 -12 -196 193 63 -161 161 -266 125 -53 -229 16 -299 136 70 -30 144 -178
2546 -178 115 180 97 191 -5 11 -205 -3 244 -97 118 89 96 142 -51 -269 162 -65 137 19 107 -53 131
2569 131 -248 -30 137 143 -88 55 179 76 -86 245 84 -297 -15 -344 -210 -171 -168 226 61 223 -187 4
$$ packed form
2412a63K77m97N71k36J40P4K8k03N1N0r6l4K4P8j55j49K72m4J39p0M4j5k98J50
2436f2K20r3j35N2J16j42k1K65k05N7K06l82K40k85J68J4J04K5l87J73NJ89k42
2459a20L44l53j10L41l34K18j28M1J93j03j06J55k14K42L7j56K98j52j29pJ56
2480A13j76K62j5j05k70K7J84K14n03J41J35l93K64J48r5j77M30j44j88L9J90
2501H1j72JJ75k61K02q8j5K3l8J39j58j14l5L03N2j49K26K6j74j26J9j25J95j34
2525a47k5L23O7l09P9j84L89j30k24L22m27L91j78j76K45l15M35o6j00J74l22
2546a78K93O5q3R4j96J6k16K02K47l41K15k9PM6j93k18M31k27K02j18Q8j60J84
2569A31l79K18J67Ok31J43J24j03j62L31j61l81K82l29J34L9LL94j65J62m10J91
$$ plain form
2591 4 58 -222 167 15 156 -49 -288 58 -146 -225 -52 18 -120 -153 -107 -180 -89 38 22 -13 -317 106 98 -404
2615 -404 -86 -108 0 -79 -10 -62 116 -14 -144 -31 -174 -116 -169 77 -59 24 -288 -4 -49 9 113 -310 171
2638 171 14 284 68 222 86 89 -214 79 -25 -231 204 49 -2 92 216 229 -73 -237 -39 37 -197 -63
2660 -63 48 167 140 -194 -17 -136 5 18 -258 -83 -185 169 -260 10 225 109 -50 -157 -158 76 -210 -156
2682 -156 64 -30 27 -65 72 -134 63 -77 7 108 -149 -64 173 -152 121 -38 -25 73 -46 3 -64 136 10
2705 10 -87 141 167 188 98 -40 -136 77 -25 -140 188 -71 100 288 -236 -155 189 -78 -80 -163 -109 135 -108 47
2729 47 152 154 9 208 -29 275 151 -109 -125 34 -571 -158 -138 70 -36 206 -271 177 61 -5 153 180
2751 180 95 8 62 -118 -144 50 -134 -152 80 56 37 85 6 -173 -125 86 16 -179 29 -27 -8 56 2 42 -173
$$ packed form
2591DN4k80L89j52J41k05k39L46k04p9J73P0j38l3M6p3R1J27j6l5l04M23qn02
2615d04L18k2J08p9O9n2J78j30j30J13j43N8n3K46j36Q3l12K84m5N8J04m23M81
2638A71j57K70k16J54j36Ll03K93j04k06M35j55n1R4J24J3l02j64J98P6k34J34
2660f3J11J19k7l34J77j19J41J3k76J75j02L54m29K70K15j16j59j07jK34k86N4
2682a56K20r4N7r2J37k06J97j40Q4J01k57Q5K37l25K73j59J3R8j19M9o7K00j26
2705A0r7K28K6K1r0j38r6K13j02j15L28k59J71J88n24Q1L44k67kq3N4K44k43J55
2729D7J05Kj45J99k37L04j24k60j6J59o05M13K0K08j06K42m77M48j16o6J58K7
2751A80q5q7N4j80k6J94j84j8K32k4j9M8p9j79M8K11p0j95K08n6J9O4n4M0k15
$$ plain form
2776 -173 -179 142 42 150 -21 -124 3 -128 -35 -378 21 -125 25 -173 12 43 -97 22 195 32 16 -124
2798 -124 137 113 -144 -51 -160 10 -172 68 -25 124 98 -342 131 74 286 185 -39 24 11 77 -85 -80 -157 84
2822 84 285 -38 -190 128 -153 10 -43 -148 122 72 -140 36 125 253 -210 98 -85 -28 -222 -26 139 102
2844 102 7 -108 83 138 -32 100 -128 146 87 -92 -141 103 10 -42 205 227 154 80 -153 -272 -30 -9 -157
2867 -157 -87 27 -11 -106 -47 -3 159 230 -134 222 122 126 102 -292 -149 -22 125 220 -124 88 94 -96 -52 -248
2891 -248 -53 -168 -97 111 283 -209 -90 6 -16 139 114 -41 -37 43 248 -87 54 170 -14 -10 -34 -153 76
2914 76 18 -129 -141 117 -103 -28 -5 214 25 201 -62 242 44 -85 45 -147 9 -112 -2 8 40 -245
2936 -245 105 -110 -104 -34 -22 -215 57 8 182 65 38 102 127 116 -39 166 -363 -216 13 -187 23 -255 276
$$ packed form
2776a73oL21j00J08j71j03J27j31R3l43L99j46J50j98J85L1j40J19J73j63j6j40
2798a24K61k4k57R3j09J70j82K40r3J49k6m40M73n7K12j01k24O3j3O6j62Np7K41
2822H4K01l23j52L18k81J63n3j05K70n0k12J76Q9J28m63L08j83N7j94J96J65l7
2844A02r5j15J91N5j70J32k28K74n9j79m9K44r3n2K47K2p3p4k33j19K42K1j48
2867a57P0J14l8r5N9M4J62P1l64L56j00Mk4l94J43J27J47R5l44K12Oj90M4j96
2891b48J95j15P1K08J72m92J19R6k2J55k5j55MQ0K05l35J41J16j84Mk4j19K29
2914G6n8j47j2K58k20P5K3K19j89J76k63L04j98j29J30j92J56j21J10J0L2k85
2936b45L50k15OP0J2j93K72m9J74j17k7O4K5j1j55K05n29J47K29k00K10k78N31
$$ plain form
2959 276 -330 -229 -115 -30 -31 102 -237 184 82 -157 101 207 126 -12 -51 89 57 -126 -339 -103 -65 -52 174
2982 174 100 32 -102 -326 94 -19 24 77 163 150 -112 -149 -33 138 57 -96 -57 49 -40 -67 -271 1 15 33
3006 33 -129 -195 -75 189 183 -85 41 -25 -227 120 26 -495 2 -222 99 -33 -32 120 -124 75 44 60 62 -208
3030 -208 -169 -159 10 198 -201 -141 -320 -23 33 62 150 72 44 -18 -79 -128 37 -188 -40 116 113 -255 56 84 58
3055 58 -26 138 -237 142 115 86 -135 -72 -147 178 121 -67 -64 -57 12 -150 -319 -72 69 86 227 -80 10 -42 218
3080 218 -17 154 175 -73 42 -244 186 60 -85 232 152 -82 -139 -183 -103 -87 194 -119 -124 82 -173 -236 -54
3103 -54 61 59 36 29 -50 64 57 349 35 -79 256 -209 -21 71 272 -36 6 149 -99 -160 -82 10 -99 101 -129
3128 -129 -106 61 229 41 299 -69 42 64 -192 -117 -218 -307 -59 -40 -117 -167 220 30 -62 30 -187 -151 -111 -224
$$ packed form
2959B76o06J01J14Q5jJ33l39M21j02k39K58J06q1j38l9J40l2j83k13K36L8J3K26
2982A74p4o8j34k24M20j13M3N3Q6j3k62l7J16J71q1j53L9J06q9k7k04K72J4J8
3006C3j62o6J20K64ok68J26o6k02L47r4n21M97k24L21j32JJ52k44J99l1J6Kk70
3030b08L9J0J69J88l99O0j79K97N6K9Q8p8k8o2o1m9J65k25J48J56ll68L11K8k6
3055E8q4J64l75L79k7k9k21O3p5L25n7j88LPO9j62j69K47J41J7J41l07R0n2K60
3080B18k35J71K1k48J15k86M30j26j45L17q0k34n7m4Q0J6K81l13nK06k55o3J82
3103e4J15kk3pp9J14pK92l14j14L35m65J88R2K01l08M2J43k48o1P8R2j09K00k30
3128a29K3J67J68j88K58l68J11K2k56P5j01q9K48J9p7n0L87j90r2R2k17L6M0j13
$$ plain form
3152 -224 -132 400 66 -347 35 -241 -92 227 53 20 -279 -207 -43 199 97 -91 -35 32 -45 152 124 245
3174 245 377 -17 46 -28 -228 192 -198 -118 -390 -122 -239 -203 -162 -160 -160 -1 58 83 -7 11 40 237 222 121 330
3199 330 22 -95 68 74 210 -157 -55 -149 168 -30 9 -402 5 104 -6 34 45 176 -104 210 140 -160 43
3222 43 -211 -160 -40 229 -176 71 -46 -171 39 -136 -86 15 -98 -49 142 88 -267 202 244 -33 333 -68
3244 -68 -187 82 39 -40 -298 162 -302 -9 71 57 118 -62 143 35 153 -9 -422 119 -1 -1 7 -110 -14 111
3268 111 -90 -148 47 104 -209 -36 -97 -138 -203 -170 147 -116 181 47 -6 51 -16 149 160 156 56 111 -47 54
3292 54 141 210 43 162 -23 165 -419 -134 -21 -92 93 -71 145 115 -162 12 44 62 38 -146 33 15 -30
3315 -30 -168 170 66 59 71 56 99 -208 -40 4 -19 251 15 -213 -109 -5 122 52 102 166 157 -3 -217 -193 134
$$ packed form
3152b24R2N32l34m13L82k76J49L19j74l3k99P2J64K42j02j88N6O7p7J97k8J21
3174B45J32l94O3p4k00M20l90Q0k72K68j17L6M1K%J59N9K5r0J8K9J97j5j01K09
3199C30l08j17J63OJ36l67J02r4L17j98L9m11M07R9j10M0J1J31k80L14p0l00K03
3222D3k54N1J20K69m05K47j17j25K10j75N0J01j13M9J91n4l55M69M2k77L66m01
3244f8j19K69m3p9k58M60m64K93Q0j4O1j80K05j08J18j62m13N41j20%Qj17R6J25
3268A11k01n8J95N7l13J73o1m1o5L3L17k63K97j34n3N7o7J65J1mj00N5j58J01
3292E4Q7O9j67J19j85J88n84K85J13p1J85j64K16l0k77J74L2J8k4j84J79j8m5
3315c0j38L38j04pJ2j5M3l07J68M4k3K70k36k28J04J04J27p0N0O4rj60k14K4L27
$$ plain form
3340 134 49 44 -124 -18 -181 40 89 -99 -127 120 283 14 59 185 41 -2 -79 -66 -26 71 -209 -54 28 141
3364 141 206 101 -8 1 22 120 55 -23 132 84 134 30 15 226 270 83 297 140 -2 -20 97 -155 347 137
3388 137 16 91 61 230 -275 38 -57 -205 63 311 34 -140 136 -199 -20 11 246 -134 -231 -215 58 -326
3410 -326 -157 -92 10 71 55 153 26 -11 100 -219 -122 72 -220 266 60 35 47 -112 133 45 37 37 65 56 118 -37
3436 -37 -275 -56 80 181 160 33 43 244 -7 68 -176 45 135 -47 -36 -156 -22 260 2 146 -45 50
3458 50 -269 140 -67 99 75 -11 7 31 47 31 44 -17 227 -199 -86 -7 154 -65 176 27 84 -77 -55 -35
3482 -35 -140 -11 -39 -150 248 93 76 50 281 -51 -10 -51 100 -45 -144 5 -127 41 -95 53 39 -200 177
3505 177 -107 -96 138 28 86 -54 17 -248 -102 -277 22 21 -24 -162 -170 -62 142 397 -282 -24 143 -54 24
$$ packed form
3340A34q5nj68J06j63K21M9j88k8K47J63k69M5J26j44m3p7J3M0R7k80J55Q2J13
3364A41O5j05j09RK1R8o5p8J55m8N0j04j5K11M4j87K14j57j42j8J17k52N02k10
3388A37j21P5l0J69n05L13r5j48K68K48k77j74K76l35J79L1K35l80r7J6K73l84
3410c26J69O5J02O1j6R8j27l7J11l19R7J94k92M86k06k5J2j59K45q8q%K8rO2j55
3436c7k38K19J36J01k1j27J0K01k51P5k44K21R0j82J1j20J34K82k58J44j91R5
3458E0l19M09k07J66k4q6J8K4J6j6J3o1K44m26J13P9J61k19K41j49N7j61K2K0
3482c5j05J29k8j11L98j55j7k6K31l32M1m1J51j45r9J49j32J68j36J48j4k39L77
3505A77k84J1K34j10N8j40P1k65J46j75K99jm5j38qJ08K04K55o79K58J67j97P8
$$ plain form
3528 24 -43 209 -42 -53 -131 -293 102 -66 3 -54 348 -104 16 229 -295 -115 -26 -261 -51 151 95 -150 -38
3551 -38 214 190 -191 5 -152 -78 40 70 12 193 30 -310 -319 -174 -65 0 -111 -188 -5 188 94 -110 199
3574 199 -36 -28 -94 -162 -43 -246 -145 -164 -20 -37 83 -79 -157 -218 -23 116 -58 -91 -188 25 -193 222 -43
3597 -43 8 -32 -217 205 346 174 41 -228 -247 228 91 -53 22 88 -26 2 186 145 1 -202 -61 52 -59
3620 -59 168 197 75 -11 73 235 87 -183 227 90 238 174 -64 56 171 -35 -260 403 44 -82 -326 209
3642 209 213 56 242 16 95 -328 80 -71 80 8 -70 56 71 42 -16 23 154 -153 -349 -30 97 -156 -29
3665 -29 22 -52 271 -166 -105 -130 -113 -12 -125 -159 -62 92 -225 3 -184 -3 -13 -163 -1 -184 94 39 10 206
3689 206 127 222 7 -58 -142 -33 101 -73 -64 -156 -141 297 -102 211 -1 -187 113 252 212 55 111 107 -19 217
$$ packed form
3528B4o7K52k51j1p8j62L95j68O9n7M02m52J20K13n24J80Q9k35K10K02n6k45J12
3551c8K52k4l81J96j57P4J18L0n8J81j63l40rJ45J09O5j11p7J83J93r4k04L09
3574A99k35Qo6o8J19k03J01j9J44j7J20j62p8o1J95J39j74l3r7K13k18M15k65
3597d3N1m0j85M22J41j72j33k69j9M75j37j44P5O6j14K8J84m1j44k03J41J13j11
3620e9K27K9j22q6Q4J62j48k70M10j37J48o4k38J20J15k06k25O63l59j26k44N35
3642B09Mj57J86k26P9m23M08j51J51p2p8J26J5k9n8L9J31l07j96L19J27k53J27
3665b9N1p4L23m37O1k5J7J01j13l4R7J54l17K28j87J81j0j50J62j83K78n5k9J96
3689B06p9R5k15o5q4J09J34j74Rr2J5M38l99L13k12j86L00J39m0j57N6mj26K36
$$ plain form
3713 217 -160 47 205 64 -20 -62 291 -54 15 127 -140 310 -100 -37 114 46 103 114 345 -32 -88 -46 28
3736 28 64 -39 -57 53 -59 177 5 -85 162 202 -2 190 171 392 174 -111 -44 362 124 80 -148 -262 -64
3759 -64 154 126 172 162 77 148 25 -82 48 -36 -135 -135 426 255 -11 69 -107 -180 153 119 -104 -4 -2 42 -44 -267
3785 -267 -44 122 -238 199 -136 76 -115 139 63 -94 15 14 188 105 -42 25 -160 -195 -107 -101 185 271 346 208
3809 208 -10 -98 -83 -54 -8 22 238 301 213 67 111 -130 34 16 52 258 148 319 -36 -85 -154 -57 98 -338
3833 -338 -136 175 116 -37 -96 41 302 141 7 39 72 -73 -17 172 251 -216 29 -102 -260 10 -183 -32
3855 -32 213 46 -11 124 -226 -14 112 -290 45 67 -124 -68 30 26 231 -81 10 254 -90 2 -325 141 84
3878 84 60 346 -108 -32 252 -169 -180 -167 169 53 31 61 -392 128 135 122 136 27 31 -98 95 -106 28 59 -54
$$ packed form
3713B17l77K07J58j41q4m2L53l45O9J12k67M50m10O3J51o8N7J1K31l77n6M2P4
3736B8L6j03j8J10j12K36j72r0K47M0k04J92j9K21k18k85O7M06k38m4k28j14J98
3759f4K18k8M6j0q5P1j23j07J30q4r9%N61j71k66Q0j76p3L33l4k23J00KM4q6k23
3785b67K23J66l60M37l35K12j91K54p6j57J09jJ74q3j47O7j85l5Q8OK86Q6P5j38
3809B08k18q8J5K9M6L0K16O3q8j46M4k41J64j8L6K06j10J71l55m9o9R7J55m36
3833c38K02L11n9j53n9J37K61j61j34L2L3j45N6J89P9m67K45j31j58K70j93J51
3855c2K45j67n7J35l50K12J26m02L35K2j91N6R8mK05l12R1K44l44R2l27M66n7
3878H4k4K86m54P6K84m21j1J3L36j16k2L0m53N20Pj3J4j09Mj29J93k01J34L1j13
$$ plain form
3903 -54 -308 -81 -50 3 220 -25 163 268 -21 66 97 67 -128 258 -290 -75 197 -39 49 -113 145 -136
3925 -136 283 38 -240 116 98 -207 -162 72 -13 38 19 -98 35 -119 144 -297 56 -94 37 -46 37 130 -40
3948 -40 -97 -138 -184 -233 -117 -44 -194 -55 -34 -103 98 263 -108 108 113 -228 2 -31 -84 12 -81 -170 -62 -75 144
3973 144 78 -188 -66 -71 36 12 26 -152 -59 400 -65 -99 27 161 -16 35 -133 178 130 -139 75 -88 68
3996 68 -47 -143 10 25 176 -112 -43 8 -120 -82 244 212 -85 -125 78 234 -109 415 -18 -161 -18 -528 4
4019 4 60 29 204 -3 5 158 26 -195 -164 157 -227 -39 -38 31 18 -212 -155 -47 -81 -103 -219 359 -239 9 170
4044 170 180 -75 -134 126 77 -349 -6 74 28 -102 -82 5 -50 -114 -32 -127 70 -53 -271 -83 15 212 -72 201
4068 201 125 -61 -2 -75 98 20 -152 35 -59 -30 31 146 27 -106 2 -169 -187 -125 -118 -67 -25 113 150 -263 -135
$$ packed form
3903e4k54K27L1N3K17k45J88J05k89Q7L1l0j95L86n48K15K72k36Q8j62K58k81
3925a36M19k45k78L56j8l05M5K34q5N1j9j17J33j54K63m41L53j50J31q3Q3R3j70
3948d0n7m1m6m9J16P3j50J39K1o9K01J65l71K16Nl41K30l3n3R6r3q9J08j3K19
3973A44o6k66J22nJ07k4J4j78R3M59m65l4J26J34j77N1j68L11m8k69K14j63J56
3996F8j15r6J53J5J51k88O9N1j28L8L26l2k97m0K03J56l43N24m33j43J43n10N32
4019DN6l1J75k07QJ53j32k21L1L21l84J88JO9j3k30N7J08l4k2j16N78n98K48J61
4044A70J0k55n9K60m9m26L43Q0m6j30K0Q7n5o4Q2r5J97j23k18J88R8J97k84K73
4068B01p6j86N9p3J73p8j72J87r4K9O1J15j19j33J08j71j8O2PN1M2J38L7m13J28
$$ plain form
4093 -135 -34 16 100 126 5 119 29 159 -111 57 -54 248 191 -89 176 -193 49 172 -255 61 -28 -40
4115 -40 74 -10 122 -276 -130 -117 -24 100 -213 77 40 -204 48 -186 -66 -112 37 36 4 -124 57 -170 72
4138 72 4 -85 158 26 97 95 -61 208 -14 -66 338 42 2 85 3 -193 -128 -45 48 77 185 -92 -107 96 -127
4163 -127 -1 298 292 -4 146 136 115 -130 72 -220 -107 12 -313 209 -37 101 71 -26 66 150 -75 -99 -1
$$ packed form
4093a35J01N0Q4K6j21J14r0J30k70J68j11L02n7k80K65l69K42J23m27L16q9j2
4115d0J14q4J32l98J46J3R3J24l13K90l7k44K52k34J20m6J49jl2j28J81k27K42
4138G2o8q9K43j32P1kj56K69k22n2M04k96m0Q3q2j96O5Q3R3K9J08k77j5K03k23
4163a27J26K99ok96J50j0k1k45K02k92J13J19l25N22k46J38l0r7R2Q4k25k4R8
$$ [...]
8191a30
##END NTUPLES=NMR FID
##END=
