##TITLE=1H_Pr Am-U-N
 200.13MHz, CDCl3,
 8 sc
 
 4.9.2025
##JCAMPDX= 6.0         $$ Bruker NMR JCAMP-DX V2.0
##DATA TYPE= NMR FID
##DATA CLASS= NTUPLES
##ORIGIN= UXNMR, Bruker Analytische Messtechnik GmbH
##OWNER= pz
$$ XWIN-NMR		Version 3.5
$$ Thu Sep  4 14:22:53 2025 Russian Standard Time (UT+4h)  she@DPX200
##.OBSERVE FREQUENCY= 200.1313
##.OBSERVE NUCLEUS= ^1H
##.DELAY= (6, 6)
##.ACQUISITION MODE= SIMULTANEOUS
##.ACQUISITION SCHEME= undefined
##.AVERAGES= 8
##.DIGITISER RES= 18
##SPECTROMETER/DATA SYSTEM= spect
##.PULSE SEQUENCE= zg30
##.SOLVENT NAME= CDCl3
##.SHIFT REFERENCE= (INTERNAL, CDCl3, 0, 14.3821)
##AUDIT TRAIL= $$ (NUMBER, WHEN, WHO, WHERE, WHAT)
$$ ##TITLE= Audit trail, XWIN-NMR		Version 3.5
$$ ##JCAMPDX= 5.01
$$ ##ORIGIN= Bruker BioSpin GmbH
$$ ##OWNER= she
$$ F:/spectra/data/she/nmr/H-C/1/audita.txt
$$ ##AUDIT TRAIL=  $$ (NUMBER, WHEN, WHO, WHERE, WHAT)
(   1,<2025-09-04 14:21:35.76 +0400>,<she>,<DPX200>,
      <created by zg, POWCHK disabled, PULCHK disabled
       configuration hash MD5:
       00 E9 B6 7A A2 85 ED C7 34 08 36 98 17 FE 4E 26
       data hash MD5: 16K
       B0 AE 5D 2E 88 5D 07 8D 35 A2 71 2B 41 C1 ED 85>)
$$ ##END=
$$ 
$$ hash MD5
$$ 6A B3 D8 E7 11 F2 23 94 1F AA 85 E4 57 2B 3F 9E
##$RELAX= 
##$RELAX= 
##$RELAX= 
##$RELAX= 
##$RELAX= 
##$RELAX= 
$$ Bruker specific parameters
$$ --------------------------
##$DU= <F:/spectra>
##$EXPNO= 1
##$NAME= <H-C>
##$PROCNO= 1
##$TYPE= <nmr>
##$USER= <she>
##$AMP= (0..31)
100 100 100 100 100 100 100 100 100 100 100 100 100 100 100 100 100 100 
100 100 100 100 100 100 100 100 100 100 100 100 100 100 
##$AQSEQ= 0
##$AQ_mod= 1
##$AUNM= <au_zg>
##$AUTOPOS= <>
##$BF1= 200.13
##$BF2= 200.13
##$BF3= 200.13
##$BF4= 200.13
##$BF5= 200.13
##$BF6= 200.13
##$BF7= 200.13
##$BF8= 200.13
##$BYTORDA= 1
##$CFDGTYP= 0
##$CFRGTYP= 5
##$CHEMSTR= <none>
##$CNST= (0..31)
1 1 145 1 1 1 1 1 1 1 1 1 1 1 1 1 1 1 1 1 1 1 1 1 1 1 1 1 1 1 1 1 
##$CPDPRG= <>
##$CPDPRG1= <>
##$CPDPRG2= <>
##$CPDPRG3= <>
##$CPDPRG4= <mlev>
##$CPDPRG5= <mlev>
##$CPDPRG6= <mlev>
##$CPDPRG7= <mlev>
##$CPDPRG8= <mlev>
##$CPDPRGB= <>
##$CPDPRGT= <>
##$D= (0..31)
0 0.7 0 0 0 0 0 0 0 0 0 0.03 0 0 0 0 0 0 0 0 0 0 0 0 0 0 0 0 0 0 0 0 
##$DATE= 1756981295
##$DBL= (0..7)
120 120 120 120 120 120 120 120 
##$DBP= (0..7)
150 150 150 150 150 150 150 150 
##$DBP07= 0
##$DBPNAM0= <>
##$DBPNAM1= <>
##$DBPNAM2= <>
##$DBPNAM3= <>
##$DBPNAM4= <>
##$DBPNAM5= <>
##$DBPNAM6= <>
##$DBPNAM7= <>
##$DBPOAL= (0..7)
0.5 0.5 0.5 0.5 0.5 0.5 0.5 0.5 
##$DBPOFFS= (0..7)
0 0 0 0 0 0 0 0 
##$DE= 6
##$DECBNUC= <off>
##$DECIM= 32
##$DECNUC= <off>
##$DECSTAT= 4
##$DIGMOD= 1
##$DIGTYP= 9
##$DL= (0..7)
0 120 120 120 120 120 120 120 
##$DP= (0..7)
150 150 150 150 150 150 150 150 
##$DP07= 0
##$DPNAME0= <>
##$DPNAME1= <>
##$DPNAME2= <>
##$DPNAME3= <>
##$DPNAME4= <>
##$DPNAME5= <>
##$DPNAME6= <>
##$DPNAME7= <>
##$DPOAL= (0..7)
0.5 0.5 0.5 0.5 0.5 0.5 0.5 0.5 
##$DPOFFS= (0..7)
0 0 0 0 0 0 0 0 
##$DQDMODE= 0
##$DR= 18
##$DS= 0
##$DSLIST= <SSSSSSSSSSSSSSS>
$$ [...]
##$SUBNAM0= <"">
##$SUBNAM1= <"">
##$SUBNAM2= <"">
##$SUBNAM3= <"">
##$SUBNAM4= <"">
##$SUBNAM5= <"">
##$SUBNAM6= <"">
##$SUBNAM7= <"">
##$SUBNAM8= <"">
##$SUBNAM9= <"">
##$SW= 18.0517328524113
##$SWIBOX= (0..15)
0 0 2 0 0 0 0 0 0 0 0 0 0 0 0 0 
##$SW_h= 3612.71676300578
##$TD= 16384
##$TD0= 1
##$TE= 0
##$TE2= 300
##$TE3= 300
##$TEG= 300
##$TL= (0..7)
0 120 120 120 120 120 120 120 
##$TP= (0..7)
150 150 150 150 150 150 150 150 
##$TP07= 0
##$TPNAME0= <>
##$TPNAME1= <>
##$TPNAME2= <>
##$TPNAME3= <>
##$TPNAME4= <>
##$TPNAME5= <>
##$TPNAME6= <>
##$TPNAME7= <>
##$TPOAL= (0..7)
0.5 0.5 0.5 0.5 0.5 0.5 0.5 0.5 
##$TPOFFS= (0..7)
0 0 0 0 0 0 0 0 
##$TUNHIN= 0
##$TUNHOUT= 0
##$TUNXOUT= 0
##$USERA1= <user>
##$USERA2= <user>
##$USERA3= <user>
##$USERA4= <user>
##$USERA5= <user>
##$V9= 5
##$VALIST= <valist>
##$VCLIST= <CCCCCCCCCCCCCCC>
##$VD= 0
##$VDLIST= <DDDDDDDDDDDDDDD>
##$VPLIST= <PPPPPPPPPPPPPPP>
##$VTLIST= <TTTTTTTTTTTTTTT>
##$WBST= 1024
##$WBSW= 4
##$XGAIN= (0..3)
0 0 0 0 
##$XL= 0
##$YL= 0
##$YMAX_a= 354100
##$YMIN_a= -380384
##$ZGOPTNS= <>
##$ZL1= 120
##$ZL2= 120
##$ZL3= 120
##$ZL4= 120
##$ABSF1= 10
##$ABSF2= 0
##$ABSG= 5
##$ABSL= 3
##$ALPHA= 0
##$AQORDER= 0
##$ASSFAC= 0
##$ASSFACI= 0
##$ASSFACX= 0
##$ASSWID= 0
##$AUNMP= <proc_1d>
##$AZFE= 0.1
##$AZFW= 0.1
##$BCFW= 1
##$BC_mod= 2
##$BYTORDP= 1
##$COROFFS= 0
##$CY= -3
##$DATMOD= 1
##$DC= 2
##$DFILT= <>
##$DTYPP= 0
##$F1P= 0
##$F2P= 0
##$FCOR= 0.5
##$FTSIZE= 0
##$FT_mod= 4
##$GAMMA= 1
##$GB= 0.15
##$INTBC= 1
##$INTSCL= 1
##$ISEN= 128
##$LB= 0.25
##$LEV0= 0
##$LPBIN= 0
##$MAXI= 10000
##$MC2= 0
##$MEAN= 0
##$ME_mod= 0
##$MI= 1.114404
##$NCOEF= 0
##$NC_proc= 0
##$NLEV= 6
##$NOISF1= 3.799351
##$NOISF2= 2.8
##$NSP= 1
##$NTH_PI= 0
##$NZP= 0
##$OFFSET= 14.38212
##$PC= 1
##$PHC0= -1561.996
##$PHC1= 12.99228
##$PH_mod= 1
##$PKNL= yes
##$PPARMOD= 0
##$PSCAL= 0
##$PSIGN= 0
##$REVERSE= no
##$SF= 200.129724274929
##$SI= 16384
##$SIGF1= 3
##$SIGF2= 2
##$SINO= 400
##$SIOLD= 16384
##$SREGLST= <1H.CDCl3>
##$SSB= 0
##$STSI= 0
##$STSR= 0
##$SW_p= 3205.1282051282
##$SYMM= 0
##$S_DEV= 0
##$TDeff= 0
##$TDoff= 0
##$TI= <>
##$TILT= no
##$TM1= 0
##$TM2= 0
##$TOPLEV= 0
##$USERP1= <user>
##$USERP2= <user>
##$USERP3= <user>
##$USERP4= <user>
##$USERP5= <user>
##$WDW= 1
##$XDIM= 8192
##$YMAX_p= 0
##$YMIN_p= 0
$$ End of Bruker specific parameters
$$ ---------------------------------
##NTUPLES= NMR FID
##VAR_NAME=  TIME,          FID/REAL,        FID/IMAG
##SYMBOL=    X,             R,               I
##VAR_TYPE=  INDEPENDENT,   DEPENDENT,       DEPENDENT
##VAR_FORM=  AFFN,          ASDF,            ASDF
##VAR_DIM=   8192,          8192,            8192
##UNITS=     SECONDS,       ARBITRARY UNITS, ARBITRARY UNITS
##FACTOR=    0.0002768,     1,               1
##FIRST=     0,             0,               0
##LAST=      2.2672688,     0,               0
##MIN=       0,             -380384,         0
##MAX=       2.2672688,     354100,          0
$$ Real data points
##PAGE= N=1
##DATA TABLE= (X++(R..R)), XYDATA
0 0 0 0 0 0 0 0 0 0 0 0 0 0 2 -8 8 -8 8 -8 16 -16 16 -24 24 -32 37 -42 48 -56 64 -75 84 -95 108 -123 140
35 140 -156 172 -193 216 -240 266 -294 325 -362 398 -441 483 -534 589 -646 713 -785 867 -957
54 -957 1061 -1176 1311 -1467 1648 -1867 2134 -2469 2905 -3488 4320 -5589 7742 -12079 24110
69 24110 -128731 -380384 29802 209723 -1092 -28465 52939 -102491 -98342 171615 152678
80 152678 -182704 -149050 109574 51271 -48798 51411 -6666 -148536 24017 213937 -10413
91 -10413 -218454 -34439 111404 -9869 13149 109511 -70630 -152386 99573 167526 -83819
102 -83819 -133261 66075 56356 -55614 52815 80138 -131254 -98720 166225 99875 -153205
113 -153205 -91173 83902 28657 -32540 78939 38996 -143658 -51270 151446 54974 -104504
124 -104504 -30573 42051 -7666 15582 58115 -47481 -110333 50911 117522 -55717 -94157
135 -94157 30670 15752 -33701 57416 62674 -95057 -90762 97511 95568 -75904 -54878 53720
147 53720 -5777 -25857 68222 19815 -101381 -26838 100905 17589 -89185 -4219 46329
158 46329 -36017 -1212 84082 -19833 -101933 21199 89559 -13806 -50431 30167 14219
169 14219 -40715 37986 61127 -66625 -67771 60775 44098 -43717 -13400 15813 -37173 -10114
181 -10114 83271 16081 -106451 -20236 85723 4337 -43118 27990 17537 -44059 7281 61160
193 61160 -17026 -64485 22182 43325 -33911 -13217 32231 -24379 -31855 44636 29659 -54731
205 -54731 -34112 43214 19377 -26839 15651 23004 -34189 -7927 44720 987 -35964 3538
217 3538 23977 -7988 -12559 14794 -5941 -27593 15955 23977 -25447 -16676 21960 3821 -14863
230 -14863 9056 19711 -11413 -20295 17082 19736 -11731 -2587 9988 -7708 -6713 6069 901
243 901 -8642 -4783 8217 2173 -13255 -1352 6692 -4658 1143 6725 -2181 -4760 1031 12033
257 12033 7138 -10036 -2336 9318 -2999 -6612 1217 1774 -219 -5025 -3227 767 -2749 2692
271 2692 925 -9748 2945 11860 -5120 -5250 10511 8162 -4439 -5705 8060 4431 -10760 2561
285 2561 9653 -9794 -5883 7985 -1688 -8849 -2748 2934 -378 -3226 4494 1961 -5874 7978
299 7978 7238 -10031 -293 11468 -685 -5882 1369 5459 -853 -6182 1023 -1200 -6419 3506 -942
314 -942 -10214 4548 7889 -6593 -4083 6728 5679 -3559 -2151 8129 807 -5805 6921 3882
328 3882 -6957 1480 2254 -4402 -1217 -928 -3100 -2178 1813 2378 -6612 -1918 11281 -1378 -10125
343 -10125 6327 8113 -2565 -1582 2687 3383 -494 -760 1462 -4350 -2557 5038 -4506 -6432 4473
358 4473 100 -5916 -507 2485 1604 -2448 -14 5936 124 -1472 4508 865 -766 1202 -842
373 -842 2622 1018 -6529 -822 2959 -2020 -2963 -3382 -230 2336 -1240 -990 -1655 -142 8137 616
389 616 -7417 6311 8074 -6445 -3527 7386 2794 -8713 -2682 8797 -3801 -10003 6981 1254
403 1254 -13032 3446 10032 -8189 -7036 10358 6094 -9488 1853 14449 -7818 -10856 18590
416 18590 7134 -20727 -351 17595 -5763 -14995 7901 8515 -15045 -4586 15728 -7207 -14471
429 -14471 16382 7419 -19633 2588 21567 -6331 -17067 14056 15981 -18053 -7435 22329
441 22329 -4158 -21625 12515 12905 -19839 -7431 18560 -1379 -20034 7507 17017 -14989 -8279
454 -8279 22553 -1475 -20982 14042 20086 -16432 -12943 19788 6643 -22268 802 21110 -11465
467 -11465 -17322 15962 4756 -19787 3111 17289 -10746 -15433 16201 13247 -18631 -2864 23403
480 23403 -5499 -19518 15420 15085 -18556 -8725 18485 2348 -19639 4035 15210 -16701 -12844
493 -12844 22017 5093 -22401 2167 17097 -7642 -10012 16761 7006 -22450 1805 28366
505 28366 -8640 -23694 15480 14422 -19200 -5904 17924 -6587 -22250 14341 20927 -22333
517 -22333 -14488 23789 923 -21149 14363 19146 -21314 -12832 28358 9565 -26985 1672 22850
530 22850 -16310 -15257 26087 3044 -32407 4184 30565 -11009 -26493 13099 12791 -19956 4739
543 4739 27488 -17136 -24838 26388 19320 -25570 -7055 23853 -5555 -20676 19904 16965 -31795
556 -31795 -11561 32165 -488 -27575 8640 15221 -18192 -3824 27921 -2798 -31484 9452
568 9452 27430 -14613 -12809 22415 -487 -23072 12483 22038 -21266 -22049 22386 14485 -23436
581 -23436 -3647 16964 -12074 -10765 23542 5903 -27878 -3096 25069 772 -13997 11968
593 11968 7246 -22810 54 28207 -5479 -25503 6744 16411 -9505 -7479 11364 -4672 -18079
606 -18079 12455 20066 -16608 -15947 15960 9003 -9253 3699 7818 -12943 -7852 21177 9114
619 9114 -22174 -5084 18137 -3569 -12794 7800 3133 -15713 129 20098 -1428 -20169 3293
632 3293 13918 -6667 -1338 13785 -6845 -15804 11706 18627 -9873 -15079 8798 5158 -12571
645 -12571 4149 12106 -13374 -10989 16442 7107 -17217 -5548 12726 894 -6891 9875 3794
658 3794 -15806 2225 19637 -4371 -14801 5857 6251 -9631 287 14427 -5619 -18564 7285
671 7285 14048 -11702 -8107 10643 -35 -7276 8399 7697 -11271 -6317 13729 4051 -12005 2502
685 2502 8238 -8180 -1767 11324 -3053 -13751 2488 10388 -4950 -8489 6452 3739 -7372
698 -7372 3163 7226 -6816 -5042 7268 3683 -3676 1165 4452 -4413 -4748 7515 3025 -10109
712 -10109 -2520 6008 -755 -2916 1635 968 -3659 -1278 4299 419 -4270 2307 4553 -965 41
727 41 1484 -959 -313 1410 554 -2708 -2673 2613 1556 -3812 -672 1645 -1635 -2185 932 2999 289
744 289 -2917 1361 3606 -44 494 1131 -1601 -393 1674 436 -1413 -1388 1660 303 -3729 376
760 376 2037 -3311 -1121 2595 -365 -2062 1105 3722 158 -2873 1585 2252 -2056 733 2114 -2194
776 -2194 -647 1502 -1291 -1812 1310 1758 -2985 -3655 3135 1788 -3680 689 3464 -1117 -621 1979
792 1979 578 -278 615 1409 -1279 -1360 2274 -97 -3123 1259 363 -3569 -398 1525 -521 -1712 850
809 850 2575 -989 -2104 2065 1164 -923 1789 806 -945 1737 942 -1917 -1174 714 302 -2632 -1691
826 -1691 2483 -101 -1466 1339 359 -1605 -19 -175 315 1490 1947 1105 -781 222 1408 -1162
842 -1162 -700 1380 -1545 -2171 1158 537 -314 -1066 -518 556 -1367 -1764 588 1069 1718 718 -1097
859 -1097 1169 1712 -1335 -102 745 -651 62 -490 -361 649 -119 -489 -1563 -1696 1632 -248 -2399
876 -2399 1683 2051 -1205 577 1843 -816 -1466 1083 3063 -1023 -2239 2116 380 -1964 1562 58
892 58 -4277 -501 2867 -730 -3211 1264 3287 -2805 -1856 5660 205 -5097 2423 3947 -1359 -695
908 -695 2241 -695 -3059 2044 3048 -5615 -3727 5093 453 -4716 1996 2466 -4213 -641 6011 1122
924 1122 -6204 600 6782 -1279 -3048 4054 -86 -4879 2485 4028 -4056 -4013 3153 1620 -4134 811
940 811 4397 -4932 -4110 7150 3247 -6205 -1584 4868 738 -1735 2760 1439 -5854 -99 6796
955 6796 -1578 -5896 1976 2178 -3201 -306 3118 -2377 -5433 3674 6054 -3946 -4750 5007 1962
970 1962 -2652 2377 3102 -3475 -3506 4591 3955 -4632 -2696 2741 -1591 -1910 4088 -419 -6955 -461
986 -461 7213 652 -6232 41 4895 -2061 -808 5862 -1579 -6710 2983 7122 -2214 -5282 2038
1001 2038 2082 -4154 1297 4909 -5697 -5844 6550 3854 -5818 -1198 4760 -1606 -3474 6397 4018
1016 4018 -8824 -2242 10057 293 -6777 2339 2281 -5035 138 6951 -2848 -9028 3708 7716 -5496
1031 -5496 -3884 6128 -1075 -5744 5781 6456 -6756 -5151 7974 3748 -6900 550 5516 -5516
1045 -5516 -3471 7633 447 -8969 -87 6354 -2254 -4224 4764 486 -7428 3017 9251 -4676
1059 -4676 -6921 5909 4792 -4660 -1067 4730 -2194 -5146 4950 4488 -7578 -3067 5913 -1202
1073 -1202 -4432 3149 2123 -5313 -580 7349 381 -6968 1964 5699 -3411 -1776 5184 -421 -5201
1088 -5201 1796 5132 -2963 -4838 2436 2331 -3641 533 3257 -4155 -3233 4704 2849 -4423 -1681
1103 -1681 4627 977 -3315 2412 3382 -4420 -1836 4708 166 -4533 165 3050 -1961 -2729 3009
1118 3009 723 -5219 647 5134 -2571 -2883 3652 1676 -3184 468 4597 -1868 -4836 3839 4185
1133 4185 -5029 -2077 4370 -1173 -3713 1999 2160 -4095 -1684 4728 454 -4759 2271 3899 -3971
1148 -3971 -1163 5121 5 -4012 1734 4253 -2430 -2991 3400 472 -5010 1010 3902 -3053 -2456
1163 -2456 3575 578 -3660 260 2935 -2134 -2249 4036 1889 -4306 850 4261 -1669 -2562 2300
1178 2300 1218 -2645 -820 2936 -355 -2636 1700 577 -3447 303 2757 -511 -1118 1673 1279
1193 1279 -1747 -446 2583 -121 -2681 1349 1497 -2064 -322 1286 -81 -1520 -569 757 -755
1208 -755 -1351 889 472 -1085 1093 720 -1182 -331 1041 652 -372 -103 1040 144 -1637 83 510
1225 510 -853 -386 -76 -409 -520 -607 751 299 -998 300 624 -946 591 1268 77 -171 119 291
1243 291 -568 -879 1675 797 -2174 -233 904 -1105 -972 725 669 -626 -403 875 360 -315 1480
1260 1480 500 -1840 602 1379 -732 -594 954 338 -1097 -672 959 -581 -1391 834 593 -1399 52
1277 52 895 -622 -446 936 837 -428 -11 1403 -362 -930 1754 561 -1635 -72 84 -803 -850 500
1295 500 654 -575 -537 89 -750 -361 1624 211 -730 1057 832 -675 204 635 620 -725 -435 694
1313 694 -649 -623 969 -254 -820 -415 -733 -412 587 205 379 133 351 444 -389 42 1178 -33 -481
1332 -481 645 -47 194 -290 -628 117 -75 -518 -399 -581 171 245 -703 301 474 -385 287 454 -233 651
1352 651 846 -216 -268 -170 -234 -12 -183 640 -823 -1384 640 398 -881 113 670 -338 -469 130 880
1371 880 147 192 1180 -361 -858 1407 -342 -1543 572 1097 -981 -1467 415 712 -1374 -146 1091
1388 1091 -771 -1198 1305 522 -1178 913 1322 -405 -448 1116 612 -1583 334 2145 -1132 -1743 1189
1405 1189 277 -2076 375 1280 -967 -1703 967 1455 -1032 71 1742 -1098 -768 2067 154 -1755
1421 -1755 644 1815 -478 -1916 582 753 -2079 199 1976 -1257 -2291 898 1039 -744 -259 1014
1437 1014 94 -855 1438 1510 -1500 -561 1648 190 -983 478 482 -1387 -682 1121 326 -2022 -774
1454 -774 1765 4 -659 619 -148 -906 601 1803 99 -1462 513 1523 -887 -446 1183 -1044
1470 -1044 -1562 1106 1593 -1464 -1858 869 1201 -1150 -89 1303 -858 -828 2174 1100 -1868 -507
1486 -507 1308 328 -1004 870 247 -2466 -6 2857 -713 -2830 379 1400 -864 -836 1227 -380
1502 -380 -2158 1219 2629 -1655 -1397 2140 312 -1126 1011 1070 -2047 -1471 2789 634 -3201 -278
1518 -278 2161 -1388 -1076 2132 -59 -2719 402 3122 -45 -2297 1176 1261 -1569 845 2183 -2545
1534 -2545 -2054 2491 1487 -2337 -1050 1617 -556 -1597 2049 1157 -3234 -817 2848 263 -1588
1549 -1588 546 722 -1048 70 2167 -645 -2640 1174 2309 -1357 -929 987 -915 -1492 1528 1536
1565 1536 -2205 -2244 1957 1399 -1445 57 803 -1221 -412 1384 -105 -1564 -311 1759 70 -976
1581 -976 1027 -25 -1801 509 1853 -940 -1906 394 1297 -223 -926 674 3 -1298 1142 1575
1597 1575 -1186 -1426 855 959 -478 -365 424 -1074 -1002 1499 802 -2292 -832 1482 186 -894 541
1614 541 779 -1213 -363 2266 662 -1863 233 1445 -665 -51 920 -832 -1218 740 1419 -1026 -1521
1631 -1521 1180 725 -1575 612 1191 -1424 -964 1544 682 -1374 -344 1508 -190 -859 1225 206
1647 206 -1688 588 1358 -995 -1130 882 412 -1103 165 1480 -598 -1285 1466 1107 -1347 -118
1663 -118 851 -353 -405 639 555 -1212 -274 1396 -44 -1034 631 207 -1243 270 949 -647 -1020 302
1681 302 905 -357 -573 714 356 -419 643 344 -376 91 373 112 -367 -296 137 -158 -238 844 -334
1700 -334 -774 -46 203 8 -22 -138 318 84 -130 405 260 -436 -188 215 142 -401 -416 18 -256 -278 208
1721 208 -77 -523 443 366 -347 128 332 323 -133 -66 867 -77 -532 871 622 -646 -132 214 -204 0 -92
1742 -92 66 -540 -292 316 -173 -591 434 43 -555 400 584 41 -234 285 308 -496 -589 420 -58 -278
1762 -278 528 320 -466 176 115 -259 -522 407 277 -657 12 695 -196 -373 633 185 -395 -49 323 38
1782 38 -299 245 -12 -392 -178 87 -562 -302 554 -132 -363 118 42 -190 -124 428 228 -121 -84 274 -77
1803 -77 -277 423 -289 -249 -70 -202 -173 -150 116 123 -135 -333 360 9 64 65 100 506 -23 -125 72 16 -272 90
1827 90 -105 -105 -263 -333 180 -162 -242 16 -139 250 142 59 -294 416 305 -96 -66 375 148 -160 -207 534 -271
1850 -271 -412 -23 61 -64 -174 -10 -137 -234 155 313 -115 13 758 -105 -246 478 233 -370 67 304 194
1871 194 -395 129 521 -539 -25 497 -209 -535 743 103 -248 339 486 -20 -590 524 639 -555 -118
1890 -118 421 -199 -333 589 331 -354 -257 282 -194 -382 417 284 -600 245 471 -232 -2 454 95 -394
1910 -394 37 440 75 -457 338 371 -414 -199 338 -393 -421 333 24 -220 -107 508 110 -360 308 594 -180
1931 -180 -36 649 33 -198 288 407 -53 -529 72 39 -337 -93 404 32 -260 204 97 -218 -136 352 72
1952 72 -403 337 54 -327 -96 273 0 -361 -69 64 -55 -450 285 29 -523 -33 31 -293 -180 559 355
1973 355 -217 -165 504 112 -415 591 561 -384 -154 430 11 -460 -179 443 -259 -421 704 204 -670 35
1993 35 566 -375 -65 857 -59 -351 136 592 -197 -613 674 353 -958 -40 405 -522 -702 649 94
2012 94 -724 -103 704 -195 -826 559 258 -642 10 1076 -274 -658 696 498 -526 -355 627 -243 -863
2031 -863 237 324 -863 -52 378 -67 -203 409 -34 -671 -10 792 124 -560 528 503 -276 -105 520 -175
2051 -175 -785 289 404 -286 -592 36 -196 -289 223 405 -111 -350 174 493 -309 -64 622 124 -191 493
2071 493 -34 -418 -28 411 19 -347 -93 418 -203 -614 268 251 -262 421 621 -121 -169 161 -1 -78 -46
2092 -46 565 -31 -589 361 449 -528 -222 390 -301 -522 -17 394 -403 -388 281 52 -432 -41 268 -324 -129
2113 -129 419 45 -780 2 549 -347 -837 194 -148 -718 330 348 -336 -528 474 356 -133 -101 598 -232
2133 -232 29 857 284 -699 72 397 -250 -440 260 278 -489 -325 381 -235 -449 402 151 -243 104 113 111 -112
2155 -112 409 122 -262 -117 460 92 -349 194 159 -207 -231 187 49 -361 -344 201 -166 -82 200 -213 -241 331
2177 331 -346 40 232 186 182 -119 -232 232 -78 -518 -47 104 2 -246 -65 -99 125 39 218 -27 161 351
2199 351 325 -156 -316 120 340 127 -266 59 -315 -77 152 -117 -239 115 95 154 -190 -56 150 -469 -123
2220 -123 637 -50 -164 377 109 -179 41 76 -153 -289 85 103 -409 -300 292 -109 -47 289 95 -367 -114
2241 -114 208 -174 -387 66 78 -323 149 466 9 -206 181 -92 -239 -54 294 -286 -457 188 59 -20 167
2262 167 258 117 -131 299 37 254 -17 87 -101 -31 26 37 -313 102 441 -282 -20 -45 -88 -446 -276 -83
2284 -83 -84 -70 185 90 -210 62 265 -503 351 66 56 78 -88 -131 -149 -128 97 -35 -175 235 82 -186 105
2307 105 -7 187 123 -63 8 -2 188 72 150 -109 207 -246 -207 244 -94 22 99 -102 43 200 -516 -219
2329 -219 39 10 68 -189 -73 330 -219 -19 151 -274 1 204 35 -199 119 42 -242 -195 137 106 -324 67
2351 67 39 179 -11 262 -105 -88 -110 195 50 16 88 154 -145 -237 319 -419 -240 122 103 -138 -12 197 -32
2374 -32 -232 331 -1 -185 181 148 69 -30 78 -12 -262 166 153 -250 -624 495 182 -126 197 133 -485 -84
2396 -84 265 32 -290 1 428 114 -490 237 140 -320 31 319 -214 -51 20 -7 -199 -256 224 -47 57 313
2418 313 0 -157 0 415 -51 -87 -7 285 313 -204 595 -219 -162 119 -58 -99 -145 -106 105 -135 -62 276 -12
2441 -12 -342 -51 247 8 -328 416 288 -79 109 178 -355 -238 148 14 -422 -286 75 47 -252 215 189
2462 189 -265 -290 365 263 -323 102 306 -142 -247 243 2 -36 -269 309 65 -218 224 -79 -278 123 555
2483 555 -271 -357 118 180 -299 85 281 -80 -141 353 285 -487 455 228 -147 110 162 -106 -468 -22 355 -105
2505 -105 -537 328 139 -504 12 193 -9 -52 515 84 -342 -54 390 227 -231 201 149 -326 104 175 -60
2526 -60 -437 1 20 -135 -86 166 -118 63 463 291 -230 -58 279 -56 -182 10 -209 -249 -266 240 -295 92
2548 92 73 91 18 -238 -112 124 -84 7 474 -33 96 87 182 54 238 110 71 -239 -227 163 -207 -79 -71 -126
2572 -126 -308 6 -171 42 -72 26 225 -51 48 221 -11 -34 205 -3 -90 -209 147 90 -2 380 55 -411
2594 -411 -186 282 -51 -310 -54 372 -40 -10 117 171 -233 -89 384 -389 -188 359 25 -264 -8 20 -165
2615 -165 -220 212 124 -368 -155 458 -344 -241 183 -278 -33 221 411 -146 -156 217 94 -592 -169 153 -252
2636 -252 -419 -216 153 -338 32 -114 234 -97 -164 13 -194 101 92 -63 -175 265 112 -107 -78 146 -65
2657 -65 26 -55 -149 -375 15 -20 101 50 44 -147 61 -54 7 65 -67 59 196 -32 124 232 -52 99 -183
2680 -183 63 61 63 -77 -62 -242 -52 250 34 -16 291 122 86 245 181 399 -120 -54 258 -141 -162 168 30
2703 30 -3 -31 45 314 -280 -7 370 32 -57 -6 88 -138 48 23 168 10 353 335 -204 17 106 -251 -199 -99
2727 -99 24 -204 -181 73 187 -202 -54 137 -183 8 -43 -202 45 -171 -111 -144 -158 93 -77 92 -57 74
2749 74 -162 -19 -12 -155 -154 145 154 -235 -204 235 -115 21 134 -32 -8 -120 204 -36 -38 -240 82 -286 -210 2
2773 2 115 -44 132 -93 -184 -38 48 0 97 204 146 21 -6 61 117 -230 -1 -37 25 -133 -221 50 -59 -24 -311
2798 -311 -76 -302 -12 197 -20 283 -132 -102 2 -140 -1 -130 -152 -326 291 -192 -87 -13 -40 -153 -98 357
2820 357 305 -99 -80 -1 122 202 -12 40 -217 27 111 -40 -113 9 -26 -168 220 202 -88 -58 220 150 33 126
2844 126 148 -80 -271 64 184 -251 392 63 -192 -114 -92 -265 -70 -69 135 -96 -202 -36 192 -219 240 -263
2866 -263 -180 48 -59 -369 7 217 144 -186 158 102 -17 -245 181 374 -316 5 -122 44 -190 176 -150
2887 -150 85 -51 82 108 -221 330 77 58 347 275 -122 25 -173 -127 17 -137 -101 -146 -48 72 -84 106
2909 106 123 0 -44 -218 68 50 51 -122 292 306 28 -291 53 -153 72 16 -27 -87 -120 -150 49 -183 29 -7
2933 -7 -164 6 -249 80 -97 -173 172 0 -292 56 101 -216 -20 304 63 -160 -89 228 180 47 -107 95
2955 95 -123 303 -17 95 -312 162 113 54 61 130 -162 -72 319 -81 108 -197 181 112 -74 120 177 -285 91
2978 91 139 -106 -371 354 124 -236 -72 24 -29 -367 111 133 -385 -8 212 131 -229 182 229 -210 164 58
3000 58 -163 81 1 -83 -155 -199 214 -376 -48 285 195 197 -285 -285 80 -110 160 -21 -13 -17 289 -19 -85 -15 -19 63
3026 63 15 285 367 -255 -1 223 -208 -221 -91 -169 -182 -182 82 -56 -163 96 39 40 135 -89 58 50 -248 -22 83
3051 83 -78 88 -56 -140 -332 134 -178 -205 254 83 -310 -185 -51 87 -32 -157 53 12 141 103 97 -151
3073 -151 -208 114 253 -21 217 316 -212 -81 257 -205 7 117 -4 -366 195 19 102 -144 27 32 -61 -105
3095 -105 -74 -183 -172 373 -54 -177 106 156 -76 -141 -30 -7 -47 3 162 -3 -113 232 38 -92 76 206
3117 206 -67 -252 276 117 -166 163 100 -2 -155 -36 -79 126 31 -7 58 -228 144 79 -154 394 -20 -223
3139 -223 150 -67 176 -122 271 154 211 25 50 -71 -180 -76 38 98 -104 -181 293 16 -389 -190 -184 79
3161 79 61 57 -37 -381 102 44 37 -148 -90 38 131 -90 -80 -39 30 228 -27 209 -101 -88 -127 -76 -146 86 10 367
3187 367 -153 -75 -76 -127 172 159 -99 -83 60 -134 99 -41 64 -14 69 -59 131 91 133 -26 -75 11 59 -95
3211 -95 80 129 -154 24 84 -121 30 41 -55 -12 49 237 -16 -46 57 16 23 -59 -44 -51 258 28 38 -159 -137 38
3237 38 84 -388 142 140 -161 102 12 16 -314 -75 48 408 -174 108 -67 -221 -79 -79 -12 78 -99 -139 121 -172
3261 -172 199 -242 -57 56 -146 169 -34 -79 -82 57 179 206 -60 183 58 220 -290 -42 -21 -39 -78 -145 -161
3284 -161 6 -14 53 51 -148 157 -113 -295 -87 48 21 223 -215 28 -38 -80 162 -79 14 162 29 121 273
3307 273 -26 205 -150 -328 84 -55 -63 -302 196 -9 238 21 40 -71 -46 92 132 236 2 -211 -153 -175
3329 -175 25 -138 -108 0 135 -256 318 5 104 101 72 -294 14 167 97 20 -110 -132 -28 -124 -335 173 -67
3352 -67 -222 173 8 -284 245 -218 52 174 -159 105 -138 -271 -261 -56 9 -111 46 -24 22 36 -189 -149
3374 -149 124 111 252 57 171 199 -204 3 -7 -22 247 146 113 -43 -86 82 -37 -7 -120 132 92 12 20 -172
3398 -172 102 -168 -200 -174 -67 -303 -48 168 105 124 134 51 -318 -6 193 -77 -183 -24 44 90 109 238 -42
3421 -42 -166 -105 -54 -303 -132 3 -53 219 65 -46 114 -147 -169 -108 148 194 100 66 331 -6 23 -76 -258 137
3445 137 70 -18 -250 269 90 268 -155 93 -166 3 88 21 -67 166 -10 273 -99 -294 147 10 -171 -213
3467 -213 18 -133 -66 369 85 10 -49 -229 85 -132 -22 152 207 60 167 -136 -229 96 -127 219 28 26
3489 26 9 206 128 -8 -29 -212 -268 24 96 -12 -22 -179 -219 -18 14 95 182 -78 -312 -170 202 -73 73 -23
3513 -23 72 102 29 86 42 -38 262 -191 73 136 114 47 -110 37 119 -147 58 109 123 -158 227 -247 204 -57
3537 -57 184 385 229 -81 39 313 -139 200 111 -2 -308 -178 26 -1 125 -353 99 174 -249 35 -215
3558 -215 -299 3 148 19 -113 322 169 -316 -53 175 -53 -36 149 -102 -131 38 137 -242 40 11 -111 -13
3580 -13 88 124 210 -142 146 103 -86 -157 -208 258 44 44 278 0 -126 -85 -22 37 11 -38 -92 -44 73 -52 -61 120
3606 120 37 247 -121 54 -38 90 -51 -63 125 -199 19 -404 -21 -192 35 91 166 87 -31 135 22 29 -207
3629 -207 1 -177 197 -4 -119 -63 -276 59 -46 -111 53 43 82 12 313 170 85 -105 192 83 -279 249
3651 249 -83 148 194 289 10 -18 179 26 -205 2 127 130 128 -12 224 -188 -25 75 14 -116 -12 -14 -2 -10
3675 -10 52 95 40 169 -56 116 -12 6 -231 -71 -5 88 39 -243 58 102 -36 -120 -139 20 229 -26 111 -56
3699 -56 -116 71 120 -322 -44 78 236 -98 -233 -152 -141 -178 -198 -207 60 -30 123 11 -188 -518 -52 -53 51 97
3723 97 -138 -49 -11 50 -2 7 282 61 -84 -43 45 -220 90 -208 -383 -278 -37 -2 291 89 106 218 -220 141
3747 141 14 -235 -224 69 8 132 11 -122 -59 -44 190 112 -83 -1 119 95 6 -76 -345 -14 -13 -109 239 -79
3771 -79 6 149 52 -235 -73 -230 -161 -13 98 78 101 32 -102 -256 -109 120 21 -39 144 -118 -9 -52 161
3794 161 -104 -67 132 -82 162 29 62 -210 -228 144 98 118 -105 -102 -15 -66 44 88 -88 49 230 29 23 222
3818 222 -26 -96 55 274 -123 -137 20 -249 -86 69 57 -114 -112 -60 139 -107 -141 64 -146 -101 -145 30 122
3841 122 -71 -88 -80 -138 -90 -219 91 150 -183 36 -39 151 -50 -129 -2 18 64 171 282 -239 -84 157 133 58
3865 58 -110 18 85 201 124 -19 -69 222 27 73 -152 -40 49 38 -13 -29 159 143 86 260 -161 -60 100 32
3889 32 14 -231 14 -122 56 4 -214 136 170 -117 -126 -81 -143 120 -138 -105 -22 171 -84 -38 50 32 -10 -216 45
3914 45 -3 -274 -198 96 13 -28 136 179 -63 -171 -177 -101 -225 -262 22 -149 192 -146 -54 72 159 -310 318 -32
3938 -32 -518 -55 162 -17 -362 -242 -2 214 106 -17 197 37 13 -54 -36 -163 107 -127 -243 -192 -2 -10
3960 -10 -20 19 -244 93 -32 24 -17 -152 -272 4 286 184 -99 -115 101 162 176 16 -312 197 -97 -123 -13
3983 -13 -12 -64 -240 -105 -250 -186 164 9 229 21 152 101 -85 22 -44 25 99 -91 130 33 -102 108 252
4006 252 -231 9 24 -47 -205 108 -128 119 -83 -224 -41 -120 131 5 90 90 83 -38 -55 -69 -251 -116 -66 -85
4030 -85 273 54 -157 -160 -22 -188 191 13 87 -252 78 68 -270 166 133 -155 -119 70 -279 -164 -125 7 35
4053 35 221 -76 269 -35 -212 184 2 -260 -6 173 -148 -295 397 189 161 -29 249 -87 -19 -6 -58 -59
4075 -59 1 -151 254 116 -205 -174 28 -123 63 277 -89 69 -324 -7 -94 158 168 -135 4 5 -201 270
4097 270 -255 18 -81 -128 -162 -280 -206 -80 174 61 -168 196 -79 -87 32 -283 52 -13 -17 -59 -140 171 -81 -68
4121 -68 118 153 74 23 -159 -19 212 117 3 108 -6 18 -273 -1 312 161 125 78 21 -158 -117 -114 -94 -83 96
4146 96 173 -22 120 63 -180 158 -88 -205 86 173 -79 280 120 -51 250 17 155 -221 156 243 -54 114
4168 114 -57 249 39 8 -72 -19 134 -83 -19 -122 -238 93 68 33 -46 -206 -147 -143 -231 -109 23 -57 -195 131
4192 131 185 -15 -72 -242 250 138 80 22 73 -115 25 118 -416 155 145 -308 -212 -18 -49 -140 -23 -109 -44 -114
4216 -114 27 107 129 274 -246 41 -174 31 148 -44 -34 58 73 -56 -168 73 -123 49 108 -74 157 100
4238 100 194 -13 -94 117 177 141 -186 283 -39 72 113 75 -271 -38 194 163 126 104 126 179 -99 -31 93 187
4262 187 59 -58 -60 22 350 -174 -150 -203 13 83 -6 -18 -103 -274 -118 -382 -66 -140 -47 -217 124 80 193 -17
4286 -17 -107 -215 -35 -92 55 -283 249 76 -255 59 -123 -6 -244 -75 -136 131 -56 111 -80 95 -269
4307 -269 78 -43 -43 -52 13 20 122 -108 -333 -138 84 -66 -48 -112 -35 58 63 -293 -76 -23 20 -151 27 85 122 265
4333 265 -474 105 -65 -1 -35 89 -230 11 69 -175 121 -52 58 93 212 -127 42 -47 75 53 -57 -154
4355 -154 -141 186 -165 41 9 -101 -28 -5 -134 -3 66 -83 -134 -156 9 100 93 202 14 50 -16 -125 181 -164
4379 -164 -31 8 -239 66 34 -159 171 14 -40 147 -286 -171 -279 -48 16 10 52 -13 39 58 15 85 142 55 -213
4404 -213 -104 245 -57 128 -96 -147 131 173 2 -108 -124 -214 311 117 -145 244 -118 -434 84 38 68 -162
4426 -162 -58 74 -28 -11 120 -53 30 276 -27 65 210 56 -115 -260 -68 175 -31 273 64 -39 -37 162
4448 162 94 -368 -102 -78 -115 -299 -47 164 147 202 25 12 302 131 25 193 -65 41 122 -278 209 -249
4470 -249 -107 96 -168 163 -121 125 -24 -23 -5 -311 -15 144 -116 -88 -204 188 -33 -69 74 -187 -212 169
4492 169 -97 -362 19 136 -152 -235 28 98 72 168 -116 -113 -202 -352 1 -232 -47 -26 74 248 65 231 -5
4515 -5 77 152 -141 -334 -307 66 -194 -301 145 103 8 40 84 -288 -17 26 169 83 -118 -170 -13 -81 -41 -179 29
4540 29 -28 43 43 -37 -28 -60 132 186 -186 126 -55 29 118 -70 308 122 -203 -165 189 61 -23 252 97 -360 -238
4565 -238 85 -142 -77 131 57 -37 -27 -92 -251 -159 -17 58 9 14 378 161 171 106 -66 99 151 70 -64 -114 -37
4590 -37 -35 -202 -96 344 78 -36 218 -44 144 278 179 153 31 71 63 88 97 -77 181 -78 -448 73 -228 216
4614 216 -62 100 -121 -76 -51 -455 -31 -73 -58 205 -72 84 179 -227 134 -34 -61 -92 -11 14 87 21 -54 -12
4638 -12 20 -48 59 173 175 84 196 19 -37 -195 -74 -164 151 -49 117 18 109 -265 -315 48 -79 -103 50 154
4662 154 -27 -161 90 -269 10 -351 45 -150 128 367 66 -61 45 -256 -112 -45 16 75 -267 -155 122
4683 122 -325 137 184 -143 39 25 248 320 291 -72 28 -41 80 169 62 -59 176 -206 5 -24 14 -150 -215
4706 -215 191 -62 3 120 -72 -6 -7 26 -27 7 -150 -33 143 -215 131 -220 -75 -265 50 -154 -32 78
4728 78 118 -89 -235 -150 -91 -226 167 111 -160 90 41 103 -249 49 -97 -97 -56 -97 27 122 51 82 116 14 48
4753 48 40 -155 -30 68 194 74 -238 63 -183 168 73 -70 1 8 -129 -99 -18 -380 -50 -5 -115 202 36 24
4777 24 89 -31 274 110 -24 74 126 55 129 43 31 145 71 -71 174 -155 366 -19 -46 120 -101 -98 305 -176
4801 -176 -42 44 17 102 81 -98 -338 -80 85 205 -33 -268 88 -339 -85 -220 -248 219 -120 117 -220 -4
4823 -4 -72 197 -68 212 136 297 -166 -100 -108 -37 -45 67 7 101 61 -72 -39 136 -48 -10 99 142 246 62 -100
4848 -100 0 64 -85 142 73 56 -4 50 -240 -114 -10 -74 271 -234 -56 -138 -157 -6 25 90 -79 -79 60 286
4872 286 -149 60 83 22 -4 -201 -133 226 -220 78 -42 15 28 92 -25 -54 133 -128 -92 -89 230 -171 -38 -145
4896 -145 211 -104 -54 53 84 40 72 -87 76 -167 -104 -89 -183 20 49 68 -194 -25 33 -51 287 -99 -231 -247
4920 -247 18 -81 -137 -18 -100 -40 56 58 6 303 320 -98 237 -54 209 220 -288 126 127 -109 -202 23 -197 -18
4944 -18 -410 118 113 -107 -33 -273 -139 161 105 83 338 6 19 -18 24 25 -172 59 88 94 -47 -136 -160 145 -222
4969 -222 44 -76 54 -168 -106 82 -75 -213 -29 47 -18 27 -51 -5 201 -213 -76 151 -236 30 53 199
4991 199 36 -290 71 99 340 149 -97 21 32 13 91 2 135 -99 -41 -327 44 114 71 157 -286 170 -228
5014 -228 -67 -46 -17 10 137 -10 -34 30 73 -131 67 177 9 -56 46 244 151 73 -160 75 -95 266 -54
5037 -54 -39 125 200 -76 193 -87 -45 -181 -333 140 -40 -68 -209 192 73 -21 -74 -34 221 -45 36 -178 -320
5060 -320 -15 33 211 -101 -306 113 -78 -72 265 -2 252 102 -247 25 -176 -318 285 -81 -71 142 -169
5081 -169 -182 32 -219 -137 111 75 196 -39 -24 256 16 50 252 -91 -2 37 56 102 28 -165 58 84 42 282
5105 282 0 -30 174 19 69 159 202 217 261 254 -313 79 169 26 -118 146 154 -225 66 261 55 202 39 -22
5129 -22 183 -122 -44 17 -24 -272 -401 -67 250 56 166 87 172 -87 33 170 7 -103 -199 -133 -138 107 132 -10
5153 -10 233 -193 -85 14 -82 -51 -142 -103 -145 -71 163 75 -114 24 -208 -227 129 81 86 -374 150 30 -175 148
5177 148 60 -67 153 80 195 -12 33 -155 22 -76 313 83 56 -20 -96 -2 -1 139 37 -316 -147 68 -35
5200 -35 111 73 -57 -10 -174 151 -82 -31 -180 -196 190 136 -121 -122 44 77 -144 -244 175 122 -92 -102 -93 35
5224 35 136 239 189 -46 -204 155 63 -267 235 -146 59 144 2 -173 144 -73 1 -51 -32 -246 -49 -86 -20
5247 -20 105 -38 -193 -111 14 -40 70 74 -181 -232 79 -149 -44 182 -70 124 -75 -284 225 37 159 72
5269 72 209 -7 225 -113 -122 91 204 -59 67 -129 -31 -70 67 -66 -85 -306 93 -59 46 12 -74 243 94
5292 94 -16 118 184 159 -30 -290 -196 -127 -115 144 -72 -224 70 -159 -36 -75 23 -46 -119 -109 -53 6 -206 -100
5316 -100 -18 384 71 -60 -110 112 -106 26 73 104 61 -246 -1 207 -272 75 175 27 -29 -263 163 45
5338 45 -158 -57 385 17 -53 -165 -49 239 -37 -74 -58 -152 -60 -6 86 45 -103 409 -52 255 222 -93 -34 -291
5362 -291 -106 16 -65 -203 174 -350 244 24 29 2 -102 -13 -135 67 44 0 113 -102 -224 34 27 -132 168
5385 168 -43 118 257 -114 135 190 -68 -178 218 110 -150 -27 39 222 -162 108 91 124 -275 -71 -78 40
5407 40 232 -29 87 80 -147 112 155 -103 218 15 -43 244 66 247 112 4 34 52 12 59 146 83 -75 -3
5431 -3 -133 130 22 -109 -142 -48 57 -126 -238 76 332 125 306 24 145 236 -211 149 6 -198 -66 -248
5453 -248 -143 -77 -120 21 11 -202 182 -173 -16 82 7 -108 199 -91 -63 -25 -138 -63 8 40 66 59 64 50 -85
5478 -85 43 390 -394 -192 100 -20 115 116 -158 76 -70 -125 -283 47 -168 -113 267 -4 -49 -7 87 -36 101
5501 101 -356 -18 30 -52 -20 46 137 9 150 106 -81 154 -47 -32 -99 -39 84 110 -60 34 89 14 128 -164
5525 -164 -153 32 3 179 41 197 -114 89 311 -8 -42 -45 -347 42 208 -285 78 78 262 33 -172 -10
5547 -10 207 67 -169 -192 10 291 104 -240 -23 -9 200 82 40 152 73 -136 -9 -51 79 -35 -320 -177
5569 -177 46 -138 -169 -172 74 197 -211 64 -82 56 254 165 30 2 48 -158 -299 -65 -15 231 70 -116
5591 -116 -311 -73 166 -278 -76 -131 72 49 -71 261 -177 -300 198 -15 -34 -107 119 -127 -43 194 235 -392
5613 -392 -109 -234 132 176 93 95 105 11 57 91 7 73 -26 -170 136 -118 67 11 121 -52 26 168 173 186 60
5638 60 9 -111 -149 -277 -34 -235 74 -61 -54 22 161 -145 -78 578 -189 26 106 -17 9 -69 -49 -176 -70 -257
5662 -257 55 313 -8 237 -95 -41 46 270 -101 23 -17 -91 0 -62 -16 -366 118 62 271 105 144 48 246
5685 246 -75 -189 97 -83 33 -153 -61 57 54 -296 77 8 -67 156 -144 -298 69 150 20 98 96 -131 22
5708 22 96 -188 143 -212 36 531 124 -49 -71 75 -2 -157 22 27 -35 -210 212 266 282 126 -98 141 207
5731 207 34 132 -51 -69 -139 -37 55 87 127 173 55 12 8 172 -121 104 70 21 -219 -181 -12 41 -258 112 -334
5756 -334 -228 -119 52 -161 -79 10 -276 -99 -14 16 -217 80 233 40 -132 26 -138 135 18 -91 -149 157
5778 157 38 -88 -43 -102 76 106 126 -61 4 68 -71 97 97 -185 -177 -231 -157 -63 -13 46 -35 83 -122 -148 -52 139
5804 139 10 -236 -105 149 370 204 11 -149 -45 -106 82 40 42 -182 174 -85 -148 170 -34 -17 37 174
5826 174 -79 212 -196 -35 -108 -122 -22 11 -90 40 -119 -151 49 -131 174 245 132 84 36 -80 232 79
5848 79 -331 -14 -100 -228 36 8 -79 279 64 77 353 -113 -206 -84 35 5 -69 281 118 -8 32 214 145
5871 145 69 -39 327 -17 -172 205 2 -136 23 9 87 -12 229 -60 -138 10 10 47 91 262 -234 -30 -30 -18
5895 -18 -47 -171 89 63 -213 -101 297 -307 -69 222 -233 -124 6 -160 69 -27 -121 153 187 0 272 -99
5917 -99 -202 32 -35 199 -137 -123 31 60 -283 86 107 102 -59 52 332 -81 -189 12 -355 -73 48 -128
5939 -128 -128 -24 -150 222 -98 -198 -190 309 -13 -142 -108 166 -57 245 -165 -216 -73 -86 -77 -52 -125 -93 -35 4 -145
5964 -145 -119 -40 41 -199 139 -6 21 8 154 250 -82 -193 218 43 113 205 27 -251 132 -125 160 73 83
5987 83 66 91 -46 -141 -106 -348 -9 -54 323 69 -132 -43 -48 -167 118 -80 -246 -21 -117 -28 -54 -235 49 268
6011 268 262 34 -217 -161 -19 -274 -35 -118 -106 -162 62 -147 -109 -106 52 -27 73 57 19 -360 159 -55 -277 -78
6035 -78 42 -15 164 -94 -10 20 -464 -242 -44 312 111 9 -132 -98 165 -145 152 73 121 252 -17 70 -254
6058 -254 -89 20 26 114 63 120 66 95 119 230 44 26 21 300 94 161 -269 162 -162 -110 70 -172 -20 -62 58
6083 58 321 -329 41 -53 8 -206 132 32 96 273 136 -1 -56 22 -92 167 95 124 120 135 205 -29 -30 244 -98
6108 -98 -47 -176 -39 -174 70 289 11 42 147 -100 -185 101 -7 85 -206 30 -162 303 -1 -147 -124 32
6130 32 -143 -130 7 -45 -114 -214 306 104 -77 82 14 5 -69 -76 53 225 12 108 -36 12 -98 -59 -88 -108 -205
6155 -205 -303 0 127 146 71 11 133 -245 -61 -58 -75 60 -398 25 62 -87 -33 28 -203 -140 -231 77 -106 -122
6179 -122 103 -7 15 -217 16 51 -197 -104 362 90 243 70 157 124 155 -158 350 46 -39 40 61 16 -50 -122
6203 -122 -189 119 -219 -161 -90 82 132 32 78 -57 -13 -16 54 -66 98 23 139 57 -64 -252 -262 222 131 19
6227 19 100 99 -21 -42 21 18 -128 60 -100 -49 -166 -108 203 115 43 241 99 -4 -209 210 -86 -241 207 56
6251 56 81 137 -3 -67 -54 -37 190 75 195 96 -3 -49 -162 -85 155 -99 48 67 -42 141 110 288 129 217
6275 217 -183 180 -175 -17 181 82 183 -220 -185 259 -35 -163 94 -53 45 67 -118 -6 -122 -186 184 -147
6297 -147 -174 103 171 -278 61 -127 -139 59 -105 282 266 9 202 -237 39 -140 -80 366 -226 -16 -47 129
6319 129 106 -45 122 37 57 -100 60 -132 106 -150 -139 -45 -104 125 -89 76 -171 301 3 62 -214 350
6341 350 184 99 295 -64 127 86 -117 66 54 -251 99 198 200 -58 25 58 -181 -140 28 15 -58 341 -2 -59
6365 -59 -8 37 -88 115 167 -115 -16 -255 7 -173 -112 -86 -5 -175 -98 57 -31 -144 -73 63 139 -36 87 -108
6389 -108 4 -129 179 219 110 25 -106 38 139 -36 -213 258 -37 -55 -58 213 116 214 -309 -22 81 109 4
6412 4 -37 -16 -242 -240 136 -153 -4 -244 -124 212 -117 -134 182 192 112 155 315 244 -98 48 26 -207 45 -190
6436 -190 108 -49 -36 122 -166 -131 285 286 237 349 64 -130 0 -64 93 50 -92 40 -20 -68 7 30 70 -55
6460 -55 10 -120 112 81 -153 68 -10 79 59 15 -27 15 -247 123 -144 -105 80 -128 -100 -147 68 -60 79 56
6484 56 -51 139 56 -144 -134 6 -124 -237 -137 58 302 -116 -43 -6 370 204 51 123 120 82 50 -247 -376
6507 -376 -94 -14 52 26 226 -40 -127 -22 21 14 120 119 7 101 98 -67 -44 -6 -250 -72 122 -122 68 -58 -9
6532 -9 57 -154 84 -34 -101 52 -196 -84 -150 -140 -3 -255 -48 65 266 120 -10 73 -63 -107 -180 -52 177
6555 177 77 -36 78 77 -86 -106 -10 94 -307 -93 -70 55 -147 166 -61 -103 -39 127 -63 -58 -107 -61 242 -75
6579 -75 -16 -7 -146 -245 -29 -69 -62 240 -156 -22 11 1 154 241 33 43 261 -133 133 139 321 -52 152 228 -10
6604 -10 -343 136 -230 -30 8 -144 59 -137 104 -98 16 126 -79 25 306 -163 -63 83 134 -83 -133
6625 -133 45 50 -62 -46 177 59 195 -1 151 -32 -64 -242 -87 -87 -82 262 -76 166 -180 106 -209 -161 -66
6648 -66 58 -267 159 192 177 194 138 -245 174 55 -360 34 27 48 193 60 123 130 67 -103 91 -285 187 37
6672 37 -138 314 -158 -170 -39 -88 -149 27 -387 48 114 120 -213 93 -4 -75 157 -71 -65 8 -53 0 -121 141 -100
6697 -100 -62 -182 -163 -68 77 160 151 114 135 158 53 36 92 -40 -112 241 -180 -144 -52 168 -264 219 -94 -300 109
6722 109 130 -123 7 -217 12 -54 -37 0 9 78 -157 -142 235 126 18 140 -74 -159 -236 -23 -273 -112 66
6745 66 -34 -12 -17 -25 198 -37 -92 -114 152 51 -74 -77 -106 -101 86 62 14 -55 -62 -47 -14 -48 214 16 -91 -34 -121 28
6773 28 -60 329 -183 -42 -17 -3 2 -65 13 -93 -112 55 -132 168 225 153 192 22 -43 -12 -123 126 94 -43 183
6798 183 -224 -157 36 19 -118 -98 179 117 -29 -267 -115 81 -70 -24 395 99 -95 -2 2 138 -186 -103 96
6821 96 -87 18 -148 -151 -85 20 -139 135 -5 155 47 -150 -42 10 325 -430 -84 -87 92 167 183 -59 329
6844 329 -78 -59 -132 51 165 -49 150 -160 20 141 46 264 160 44 294 41 -45 321 -102 102 83 -112
6866 -112 -166 46 -80 79 266 -81 15 -150 88 -84 60 -55 -112 3 -46 105 -248 89 263 -106 -118 235
6888 235 -269 251 48 -197 15 168 209 120 95 248 -114 -41 -38 244 -115 -108 -49 80 -119 98 -71 -248 -14
6911 -14 120 243 -47 -1 42 180 -69 100 74 -80 -27 28 -127 -3 79 -68 -68 113 -121 -18 -174 -30 163
6934 163 125 191 70 -223 143 -129 128 160 110 116 166 66 99 182 -142 -176 -234 -194 -76 74 129 112 114 131 -52 -11
6960 -11 -95 116 -144 -72 86 -137 -94 -10 -245 -57 68 -127 -9 -118 121 -36 -33 117 -10 194 99 33 -32
6983 -32 123 172 178 -12 -281 20 -116 -111 57 -131 157 215 31 169 239 -95 -205 31 -25 -111 84 -97 -181 463
7007 463 188 22 24 -22 167 132 96 -16 170 -222 142 23 157 -132 -245 -218 71 26 -180 9 65 10 41
7030 41 133 -41 69 -42 -135 130 140 73 -40 -2 -119 122 -96 -231 -285 -106 -137 -145 -37 -43 282 36 -143 -136 -95
7055 -95 -20 -11 -252 -140 -6 44 -165 102 31 142 306 -100 59 121 107 184 -33 -116 97 81 166 142 19 -164
7079 -164 -10 76 -133 -46 -53 -5 111 -259 139 181 -116 84 -140 129 167 87 -171 109 221 185 -107 0 -54
7102 -54 139 29 -218 48 -158 149 -168 36 275 -121 -106 -30 151 109 -120 -131 -122 53 227 5 90 44 -9
7125 -9 72 119 118 121 -136 9 40 -190 -100 -132 28 137 107 101 -9 199 -19 217 -327 -39 -94 191 -1 -116 -411
7150 -411 -91 -151 26 233 129 14 -68 227 58 127 4 -89 116 -15 -105 -87 -40 81 -9 -40 -116 -127 -223 -218 -143
7175 -143 180 -67 173 30 -110 -233 -83 -79 151 3 334 -234 -214 18 -12 183 -106 -34 258 209 -62 131
7197 131 65 -166 -90 -102 -229 94 -233 49 -45 -55 58 48 207 -76 145 183 200 -20 -57 -12 104 101 27 50 -227
7222 -227 108 44 -30 311 291 27 -28 -67 55 -78 -172 -132 -19 -8 132 235 1 18 103 72 50 -198 95 -92
7246 -92 10 -35 -66 -242 81 -21 256 -117 72 156 119 65 116 -16 -69 -154 -223 98 234 185 -233 323 -154 -77
7270 -77 -193 -181 -36 -50 -175 -43 -344 82 72 354 95 -25 9 -90 62 31 -408 -204 250 -14 -219 214
7292 214 -31 32 -138 208 17 -90 45 -184 53 140 -108 -8 199 -83 182 -159 -48 -12 -7 -58 163 -10
7314 -10 -191 84 -151 277 -242 -75 -96 -85 -28 294 -174 -115 -10 -71 150 -178 258 -140 164 120 -91 237
7336 237 -64 -65 -189 245 155 69 -164 98 14 -114 55 65 80 -297 37 56 281 9 56 157 122 -11 -118
7359 -118 -86 -1 28 46 174 251 -59 -2 -5 -77 79 -181 -152 141 -18 -20 29 -169 -134 63 63 -249 202 32 123 -65
7385 -65 176 -64 -7 -100 -109 -178 -231 34 88 -37 -10 -174 104 -73 -56 71 -108 188 -88 -391 153 -49 -77 -76
7409 -76 186 182 53 7 144 63 164 -24 84 -112 -209 107 17 172 -67 109 -209 -119 131 -144 8 -74 -40
7432 -40 176 40 -228 -103 132 -55 82 -263 -25 55 -39 44 -203 -4 15 73 -133 -172 -62 49 157 -98
7454 -98 157 31 -231 45 -50 -41 -84 -140 -2 239 -145 150 -141 41 -115 -110 151 -245 -64 -39 192 -126 94
7477 94 -47 -67 -139 148 75 -154 -33 -87 -3 121 110 -126 144 -89 30 121 266 202 130 -9 6 144 -122 -67
7501 -67 84 45 -66 -129 -193 339 264 84 -29 -86 74 22 26 95 133 -107 153 -64 -79 34 -234 -18 -73 244
7525 244 132 171 29 151 307 -422 104 26 64 45 -107 -4 -147 80 -173 -228 137 286 7 -6 69 17 -180
7548 -180 -191 -187 109 45 78 165 13 83 39 32 19 6 254 -13 167 -59 -235 -16 91 -166 -97 123 220 -40 97
7573 97 -270 -102 -230 146 -159 -156 -119 -170 20 -51 -86 -184 -158 179 -309 -111 139 -34 -201 -204 -61 -126 -66 10 6
7598 6 47 104 182 -253 125 60 -76 4 -98 -110 -55 -264 270 97 -18 284 80 121 115 21 -74 73 152 61 -146
7623 -146 -18 78 -137 -37 72 -184 -103 -91 -170 -229 -74 -124 -344 -130 84 -303 -311 169 78 -70 -103 139 -41
7646 -41 -205 121 201 -20 -38 107 -17 91 243 -268 120 78 -147 -295 126 -9 101 -45 58 255 -409
7667 -409 156 201 249 -311 -19 41 -143 -193 42 -44 14 299 1 -358 77 46 -104 86 -52 -78 -44 -33 130
7690 130 100 -475 133 -16 -131 34 308 -183 -368 115 -5 92 -62 133 73 -44 153 -71 86 195 -230
7711 -230 14 72 -341 -68 -72 55 37 -140 -44 -26 -268 67 -259 -13 125 -52 -153 172 139 66 49 -17 17 27
7735 27 -110 37 -119 -42 -163 347 -86 -233 38 -21 -2 -239 6 148 -179 129 60 -3 166 -50 32 -192
7757 -192 -52 -86 -109 -182 111 -120 166 -42 -212 37 -149 132 130 -147 104 101 51 -25 31 30 104 136 -80 -60 -136
7782 -136 -81 102 -119 -282 -224 -61 38 98 -116 -27 -72 -23 107 -242 150 195 -9 128 -138 -141 70 270 209 21
7806 21 -71 -415 15 -198 -72 19 2 -222 -223 300 13 -35 -80 -78 -14 -12 -136 -116 -111 52 24 -73 51 -199 130 -45
7832 -45 116 -319 113 16 185 -34 -207 50 15 -2 238 -185 88 32 371 -46 93 -270 -36 -188 -61 1
7854 1 -96 308 -4 68 -245 488 -313 275 31 -146 -251 15 94 -85 230 -93 94 -93 -199 -24 -40 192
7876 192 273 -298 -185 -37 -29 15 173 -18 -108 64 294 67 102 2 -57 -365 70 -40 -232 -74 103 -155
7898 -155 44 -120 250 27 321 -58 -174 58 -140 -70 87 -22 158 29 -204 -74 219 -125 153 37
7918 37 -35 -293 -89 236 127 120 -193 -158 -85 46 56 102 152 -50 -104 348 -4 52 93 -252 66 -171 95 58
7942 58 -140 -87 -61 -108 94 -218 -227 12 45 -141 -97 213 169 56 31 21 -231 -38 -117 -31 -5 31 129 -76 -426
7967 -426 152 70 -1 -111 -280 70 -203 5 -23 -165 -105 61 96 42 44 -44 -63 37 35 121 150 -111 -131 -239 -154
7992 -154 120 24 58 172 -159 -63 41 78 -267 -168 247 17 107 56 67 22 80 82 149 -295 99 30 -69 154 325
8017 325 129 3 136 48 -14 -206 90 158 181 -135 74 185 -64 183 181 -194 -263 18 40 -221 179 108 -278
8040 -278 26 -91 -50 20 -306 46 -141 94 -220 -51 122 -1 -138 -99 -58 -37 -53 31 -111 -205 93 66 19
8063 19 -169 -27 50 38 -54 173 74 139 185 -140 140 108 145 -50 -10 3 -74 -193 -53 24 -52 337 19 -2 142
8088 142 112 13 194 -171 -125 -85 -84 -107 15 6 90 -86 127 243 171 -169 185 151 -140 -124 -247 -131 51 -32 -103
8113 -103 -47 86 -50 216 182 -132 -105 -187 -100 -40 -84 71 79 55 136 -309 -131 72 -14 -32 24 -34 -196 156 64
8138 64 149 96 106 -65 27 2 92 58 15 44 110 168 -11 -219 -140 -73 -111 91 66 -26 -97 -54 215 303 -84 -122 -119 183
8166 183 -176 -12 -301 -318 277 -282 -232 25 85 125 227 -30 1 -130 -140 -7 10 158 145 112 -118 32 -161
8189 -161 136 195
8191A95
$$ Imaginary data points
##PAGE= N=2
##DATA TABLE= (X++(I..I)), XYDATA
0 0 0 0 0 0 0 0 0 0 0 0 8 -8 8 -8 16 -16 24 -24 32 -40 48 -56 68 -80 96 -112 128 -147 168 -195 224 -255
32 -255 288 -327 370 -417 468 -524 587 -653 728 -809 897 -993 1097 -1215 1338 -1476 1628
49 1628 -1793 1972 -2174 2397 -2643 2922 -3232 3585 -3994 4464 -5020 5686 -6501 7524 -8854
64 -8854 10661 -13264 17359 -24782 42484 -177913 10753 354100 -26995 -131950 15965
75 15965 -8629 -103539 129159 145511 -170670 -184418 151230 138359 -69441 -16900 38861
86 38861 -85089 9644 166947 -2823 -223447 -36783 174093 41665 -50743 39911 -42685
97 -42685 -122692 74946 160480 -78153 -145637 63307 106076 -37306 -4095 58051 -86657
108 -86657 -80710 146184 93096 -156583 -104105 105538 64479 -46709 15879 16439 -114548 -45576
120 -45576 143040 51710 -123815 -42115 66752 20690 -24 30094 -38123 -80877 56168
131 56168 110898 -56055 -104702 42680 52016 -29453 25126 35611 -89919 -76564 99295
142 99295 93783 -88118 -71680 66298 24430 -31897 45473 21008 -87971 -14912 108028
153 108028 21399 -96538 -11169 68106 -18469 -22058 61774 -18792 -101755 20970 96374 -22158
165 -22158 -71794 24433 33817 -33115 18047 55894 -55974 -66302 71415 59007 -53962 -27853
177 -27853 31318 -11999 -14471 59889 8390 -105826 -24171 98937 13169 -67704 12392 29076
189 29076 -38220 -3794 55450 -9836 -63096 23948 61617 -25849 -28086 35349 -5458 -33756
201 -33756 35081 29325 -53938 -35585 47512 27615 -37803 -5390 23927 -26807 -15321 42894
213 42894 6691 -38882 4038 33704 -2419 -15546 12702 5445 -21300 9899 25903 -24323
225 -24323 -23940 22073 7997 -19354 674 14226 -12619 -21880 13774 22342 -12724 -9142 14222
238 14222 -887 -5739 9654 4814 -6043 -1995 8352 3471 -12257 -4017 7506 -4858 -5609
251 -5609 3536 -4382 -6137 2356 8339 4319 -10310 -4662 12035 2037 -4657 5941 6643 1530 -2448
266 -2448 -2525 1785 -1213 -1358 821 -8022 -1585 9813 -6555 -10270 6502 5541 -7387 -5958 7734
281 7734 7894 -6824 1419 12979 -4932 -6346 10466 2183 -8792 -1252 3807 -972 -5562 -74
295 -74 1082 -7322 1146 5950 -10084 -3911 11918 576 -6870 3899 8311 1608 -3795 2388 3801
310 3801 -3934 2240 3150 -8359 1796 7438 -8788 -7977 4562 2785 -6216 -4507 5680 2927
324 2927 -5958 4659 6596 -5881 1248 6682 -1543 -166 2710 -557 -753 718 423 -6060 -4747
339 -4747 7445 -1252 -12951 3308 8511 -5440 -4238 3392 3517 628 -347 3317 367 -1013 6545
354 6545 342 -5905 5388 2750 -6935 -1728 1764 -1257 -3987 -2942 3200 -27 -4273 3240 1611
369 1611 -2474 1807 1144 2076 3507 -2662 743 6268 -68 -2956 -1424 134 1801 -2285 -3714 -1661
385 -1661 -2061 3160 -310 -9037 2731 8870 -5598 -3826 8698 4261 -6353 -1799 10221 1149
399 1149 -9218 6070 5907 -11367 -350 9958 -7921 -10768 7599 5284 -10789 -3155 11769
412 11769 -4317 -12662 14804 11187 -19001 -1802 21309 -1605 -15044 7628 11916 -11394 -7410
425 -7410 15323 -2333 -17646 10370 9285 -20458 -3675 20006 -5108 -19129 10553 18230 -14959
438 -14959 -10927 22270 3430 -21220 10120 18693 -16073 -10048 19143 2037 -20579 2693 17297
451 17297 -12837 -14780 17869 2724 -23064 8186 21068 -14975 -15190 19784 11506 -19841 -1858
464 -1858 23097 -5350 -19601 13907 11124 -19155 -1564 17476 -8882 -18119 12031 13477 -18534
477 -18534 -9240 21359 -1165 -21547 12129 18492 -16229 -10125 20168 6823 -18409 1067 17986
490 17986 -10504 -14793 19771 8192 -24256 -2845 18454 -6055 -14492 11250 8189 -19839 -2039
503 -2039 27339 -4330 -25590 13645 20469 -16731 -9258 19632 241 -20212 10296 21116 -20370
516 -20370 -20205 22152 7027 -23737 6040 19209 -18966 -16579 25252 12172 -27274 -3346 27131
529 27131 -7665 -18253 23174 9803 -29896 1039 31892 -8483 -30315 10806 19242 -17486
541 -17486 -5436 22802 -12689 -27747 22426 22799 -26332 -12585 25819 2323 -20747 14413
553 14413 20334 -25761 -14277 33548 5384 -31303 4130 20805 -14768 -10112 22093 -1073
565 -1073 -31694 5493 30666 -11820 -20461 19859 6954 -22046 7833 23836 -16509 -21343 23044
578 23044 19166 -23235 -10050 19996 -5118 -15231 17207 6542 -27973 -5192 26998 2484
590 2484 -19531 5184 10696 -17108 -2264 27672 -2079 -26656 7681 22086 -7717 -12226 9610
603 9610 696 -15638 8033 18561 -16172 -19853 15878 11860 -12992 -2971 8306 -8151 -6900
616 -6900 18683 10281 -21352 -6438 21988 1281 -14990 6313 7862 -11978 -1463 16714 -1830
629 -1830 -21936 770 17112 -5396 -8001 9953 -3145 -14469 10511 18290 -10162 -16464 9960
642 9960 11205 -9554 195 12990 -8987 -12082 14745 7884 -18299 -7636 14201 2888 -10377
655 -10377 3998 5217 -13491 -305 19144 -3115 -17121 5948 11777 -6151 -1903 12671 -3039
668 -3039 -17109 6312 16147 -10684 -12185 10865 3420 -9742 3473 6509 -10571 -7283 13055
681 13055 5805 -12748 -93 11494 -4479 -4398 10918 -521 -12664 3342 12201 -3352 -10168
694 -10168 4748 5286 -8439 -1390 6435 -6148 -6486 7661 4200 -5204 -613 4577 -2207 -3852
708 -3852 6987 4687 -8564 -2371 9001 914 -4789 845 643 -3616 -2471 2871 365 -5149 506
723 506 4488 -1499 -1909 1465 -381 225 2087 1250 -1186 -1126 3497 3301 -3378 -1408 2261 -1650 -2536
740 -2536 744 1511 -745 -3584 -287 3486 -740 -1817 976 -821 -68 2765 1143 -679 -359 1834
756 1834 1217 -2961 245 2914 -2446 -2507 2409 -416 -3148 161 2040 -621 -3898 535 3203 -1518
772 -1518 -58 2958 -693 -708 2521 31 -1362 1107 1372 -2218 -3411 2620 2557 -4271 -1192 3036
788 3036 -2121 -2844 1174 486 -564 369 1751 87 -926 2313 1638 -2267 834 2127 -2469 -73
804 -73 2443 -608 -2078 -315 1111 -1590 -3567 1365 1424 -1682 616 1102 -906 1207 1433 -1310 -249
821 -249 1820 1219 -1700 -1244 2925 615 -2514 567 220 -2750 -599 143 -571 834 566 -106 -847
838 -847 -441 1730 80 -663 2059 140 -1394 2250 1541 -939 -821 -932 -97 -952 -2379 638 896
855 896 258 -331 -1865 -250 1535 -1149 -413 1758 338 766 648 210 1382 532 -791 -794 -1053 1256
873 1256 152 -2778 395 2011 -2268 -1272 1048 -970 -1641 1065 2878 -464 -2014 2679 2194 -1899
889 -1899 1087 1236 -2944 -266 3340 -629 -3631 734 2531 -2716 -3418 3805 720 -5714 1200 4773
905 4773 -1798 -2041 2508 864 -1832 2099 3698 -3446 -3499 5290 2126 -5613 550 2767 -4077 -2027
921 -2027 4672 322 -6693 -480 7051 -638 -4913 3423 2004 -4260 2001 5065 -2844 -3704 3872
936 3872 3213 -4060 -1003 3831 -3486 -4820 5940 3312 -7647 -2926 5440 1229 -3039 1022 1784
951 1784 -4056 -466 7104 221 -6363 2217 4315 -2450 -1224 2706 -1695 -4748 2304 5439 -4319
966 -4319 -6149 4381 3088 -3914 223 2735 -2847 -2562 4782 4460 -4174 -2777 4472 900 -2445
981 -2445 2730 540 -5946 -304 6617 320 -7605 -1313 5354 -1260 -2950 3993 -604 -6260 3009
996 3009 7609 -1989 -5837 2619 4539 -2589 -357 4728 -3728 -5819 6372 4617 -7204 -3034 4540
1011 4540 -564 -4519 3580 3683 -7683 -3054 9999 1689 -7982 1310 5020 -2955 -768 6425 -1051
1026 -1051 -8222 3064 8499 -5191 -6402 5292 638 -6327 3429 5829 -6847 -5643 7663 4983
1040 4983 -7398 -1257 6969 -2365 -4040 7235 2111 -8217 -95 7503 -1272 -6011 2815 2105
1054 2105 -6649 747 8001 -4312 -8732 5480 6244 -4864 -2367 5049 -163 -4571 4592 5336 -6533
1069 -6533 -3622 6910 798 -5508 1641 2601 -4694 -1868 5650 535 -7437 608 6342 -2369 -3408
1084 -3408 4806 932 -4739 1411 5385 -1670 -4973 2593 3920 -2914 -841 3566 -2937 -4008 4304
1099 4304 2569 -5180 -2727 4027 1452 -4185 778 3915 -3233 -2490 5298 1564 -4213 372 3911
1114 3911 -963 -3054 2037 1651 -4447 -533 4631 -2308 -4585 2893 1932 -3690 -767 4101 -811
1129 -811 -4314 3075 5123 -3858 -3162 4754 463 -4002 1701 2565 -3184 -2298 3986 647 -5422 563
1145 563 4018 -3670 -3060 4567 633 -4372 1141 4392 -1520 -3197 3241 2109 -4315 307 4784
1160 4784 -2136 -3290 3336 870 -3943 -660 2632 -1388 -2993 2845 1658 -4536 -368 4648 -821
1175 -821 -3281 2142 1987 -2423 -577 2879 395 -3151 940 1476 -2870 -670 2626 -934 -2560 1115
1191 1115 960 -1627 -1068 1778 304 -2544 1060 2215 -1243 -495 2289 349 -1394 -53 1153 -124
1207 -124 -1161 710 426 -1618 -517 575 -1572 -689 992 53 -414 -292 1047 822 -991 88 1611
1224 1611 -219 -294 147 -426 -145 -335 312 14 -1400 -480 497 -973 -57 1153 -372 -912 70 637
1242 637 42 -307 1305 1318 -1706 -211 1835 -359 -1123 567 232 -1060 -987 261 624 -891 576
1259 576 345 -1782 -3 1603 -392 -421 1508 1101 -902 -568 1142 141 -1449 721 1295 -1679 -412
1276 -412 700 -868 -1022 385 505 -821 -383 562 61 -943 1482 990 -1334 -2 1471 -252 -276
1293 -276 861 485 -547 -1029 212 -390 -507 962 154 -1520 232 534 -715 25 736 630 -590
1310 -590 -326 1024 326 -419 1072 18 -973 101 -63 -275 328 31 -656 -445 -158 41 -551 -285 1183
1329 1183 -339 -379 738 638 380 254 66 295 468 -287 -71 -67 124 396 -794 -601 -95 -1065 -330 475
1349 475 -83 533 321 -590 -298 128 488 634 115 500 -153 -1031 646 828 -1224 -271 476 -763 -900
1368 -900 -84 500 -56 -188 859 -185 -926 1435 544 -910 667 1666 -600 -899 701 1100 -876
1385 -876 -643 1311 -550 -1767 1117 702 -1550 -78 1131 -682 -633 945 1095 -1001 248 2500
1401 2500 -423 -1643 1224 1163 -1634 164 1212 -1011 -1925 781 1367 -1365 -1153 1206 -722 -1586
1417 -1586 1522 573 -1847 293 2247 -94 -1744 495 1509 -997 -749 1634 -614 -2397 710
1432 710 1246 -804 -1036 462 -41 -1080 794 1170 -1349 -1113 1886 451 -1321 763 1110 -552 -247
1449 -247 1225 736 -1981 -713 2036 146 -1506 -107 289 -1111 257 1014 -498 -1537 303 1913
1465 1913 -589 -480 1094 127 -918 1185 1579 -1030 -1506 881 1437 -1174 -1189 867 -1114 -1547 1661
1482 1661 858 -1926 -712 1541 704 -641 474 1052 -1495 49 3019 -351 -2908 605 2212 -913
1498 -913 -1355 844 12 -1789 611 2377 -1747 -2676 1840 1023 -1464 427 1056 -1405 -775 2927 1359
1515 1359 -3037 -783 2678 -273 -1511 1695 119 -2982 63 3126 -642 -2895 591 1639 -1337
1530 -1337 -87 1872 -1575 -1970 2811 2151 -2209 -1058 2074 299 -1534 1214 1099 -2917 -1286 2796
1546 2796 251 -2725 -47 1136 -1023 -340 1776 -211 -2308 1223 2546 -1286 -1512 1273 -147
1561 -147 -1350 1362 1404 -1813 -1921 1743 1836 -1685 -1034 732 -629 -316 1575 24 -1460 -186 1857
1578 1857 453 -964 387 696 -1153 220 1978 -735 -2219 443 1718 -97 -1522 465 70
1593 70 -978 629 1533 -1002 -1298 1326 873 -344 -498 694 84 -664 1304 925 -2086 -975 1853
1610 1853 -28 -1360 -77 725 -902 -649 1333 346 -2279 119 1835 -540 -637 962 -353 -1075
1626 -1075 598 1499 -968 -1594 1033 722 -1635 -240 1234 -1375 -1076 1376 579 -1591 -887 1748
1642 1748 479 -1065 834 516 -1159 197 1922 -570 -1217 920 647 -1202 -184 981 -259 -1832
1658 -1832 668 1072 -1505 -856 1146 63 -802 747 495 -586 -260 1500 291 -1092 472 833
1674 833 -1008 133 819 -392 -829 0 743 -482 -798 756 434 -512 145 363 -686 238 631 168
1692 168 -144 -66 570 -42 -24 594 213 -1052 -290 406 33 -228 -69 -32 -38 -383 83 269 -376 277 488
1713 488 101 -96 -141 206 146 -164 497 124 -416 304 309 -684 -478 100 136 -560 -23 564 164 -728 398
1734 398 746 -433 -201 634 148 -79 327 91 -374 -506 430 -281 -770 325 484 -764 -34 380 -197
1753 -197 -275 128 771 -368 -374 588 460 -470 650 234 -669 79 92 -365 -224 -174 265 -629 -398 607 190
1774 190 -940 165 278 -567 128 729 -106 -22 73 129 -188 -4 263 -4 -458 493 270 -528 48 57 -516
1795 -516 -261 -67 340 -190 -7 432 33 87 251 -10 -297 448 -1 -45 52 266 -97 -513 -133 301 -206
1816 -206 -120 295 128 -238 65 -139 287 357 -74 14 168 50 272 -127 -152 441 -278 58 178 -303 -30
1837 -30 -193 -353 203 96 -307 31 238 124 -108 -53 676 237 -538 28 322 -292 -157 28 33 -292 -364 154
1859 154 -193 29 237 2 -661 445 466 -297 -113 362 -11 -367 144 525 -67 -142 721 -33 -685 385
1879 385 -31 -406 -122 346 -116 -413 200 653 -563 -160 940 19 -479 437 578 -310 173 397 234
1898 234 -548 249 362 -619 -343 396 -336 -554 370 284 -350 118 434 112 -592 297 738 -609 -256 243
1918 243 158 -433 293 -1 -395 -59 417 -276 -569 -7 450 -395 -282 444 70 -329 149 312 41 -284
1938 -284 53 390 -21 -133 563 -242 -98 48 18 -313 -37 281 -32 -332 83 549 -323 -93 489 316
1958 316 -241 52 256 -143 -356 230 465 -114 -84 556 9 -245 205 134 -389 -280 310 49 -627 297 399
1979 399 -291 -214 751 133 -484 159 554 -166 -563 533 474 -573 29 466 -462 -569 488 173 -818 59
1999 59 431 -158 -646 641 759 -743 -162 1103 -322 -472 664 570 -758 -314 478 97 -904 233
2017 233 262 -957 -136 676 -402 -564 391 455 -468 -361 879 8 -447 485 575 -543 -443 539 36 -422
2037 -422 21 64 -517 -627 751 -4 -663 201 507 -149 59 434 123 -519 -112 631 -86 -362 162 322
2057 322 -558 32 273 -298 -475 112 78 -204 -427 376 264 -169 -50 223 -444 -59 807 -68 -76 -159 246
2078 246 -159 -130 136 385 -762 9 418 -118 -357 10 27 -219 -21 633 -216 -333 480 523 -119 -23 196
2099 196 25 -63 7 262 -556 -447 286 189 -778 -103 108 -379 -254 440 127 -371 -161 682 -157 -537 295
2120 295 225 -415 55 469 -121 -384 517 465 -896 -259 239 -184 -440 338 259 -508 -96 626 -183 -217 478
2141 478 476 -225 -128 588 -86 -647 402 152 -218 -245 64 -355 24 147 223 -321 -200 236 172 -274 296 257
2163 257 -369 4 144 251 -384 -8 16 105 -187 78 -201 -346 -61 -224 -250 102 97 147 -131 332 24 -7
2185 -7 52 317 97 -63 28 297 47 24 -164 125 -90 -309 76 -273 3 -56 -5 54 90 -124 -153 -1 -89 274
2209 274 99 -195 -154 30 216 91 -70 19 -101 -181 255 -136 -154 179 181 -33 357 62 -13 37 -39 325 -377
2232 -377 -9 332 108 -246 154 172 -229 153 -93 -141 -63 -220 188 -223 -115 644 293 -511 224 145 -128
2253 -128 -124 344 -22 -292 241 2 -304 -448 303 54 -295 65 130 -36 27 -157 153 42 -139 58 -285
2274 -285 141 188 97 -375 181 -122 13 -165 226 141 -167 -247 -86 -120 89 221 -40 171 161 8 54 155
2296 155 -166 -3 45 -226 179 -43 -137 118 -136 97 99 -48 116 -68 -156 -24 -66 48 -51 -167 -146 2 -140
2319 -140 63 38 92 -35 -104 -55 -110 31 -172 -148 40 19 -163 -129 165 -57 -319 146 -136 -24 309 42 67
2342 67 8 148 140 -288 140 367 -470 -16 231 -439 -453 161 -274 37 -246 110 -105 -298 12 324 -337 122
2364 122 272 -171 -185 397 115 -335 39 313 -155 -461 -6 222 -220 -134 457 -61 -391 107 267 -224 -186
2385 -186 375 -84 -41 510 229 -71 73 255 -392 -209 313 -152 -249 -357 177 130 -349 204 302 -105 -10 198
2407 198 -226 -65 361 296 -384 -258 487 237 -363 78 -45 -284 19 257 7 5 -72 -56 61 -121 271 250
2429 250 -251 95 525 130 29 -65 239 75 -252 259 -232 -226 84 333 -586 -436 183 -103 -161 118 214 74
2451 74 -61 71 264 -11 86 494 61 -137 68 -72 -165 -103 80 -90 -272 -4 168 45 -84 273 72
2472 72 -326 48 492 63 -152 277 277 -452 82 538 -323 -428 389 228 -393 -97 170 -273 -243 137 167 -453
2494 -453 57 469 13 5 200 314 -262 -129 347 -409 -158 264 -26 -361 110 140 -163 -277 98 331 -127
2515 -127 -295 126 54 -91 24 272 -401 140 271 -214 38 103 358 -268 -346 17 227 -641 241 99 -207
2536 -207 -46 72 246 -158 198 192 -64 -435 262 283 -116 -55 153 -228 -174 -8 97 -70 -233 491 13 -243
2558 -243 -234 29 -434 4 109 3 -245 -336 126 266 -182 86 25 -139 -63 133 -317 -213 38 127 -118 -58
2580 -58 274 88 36 -61 233 -138 60 341 67 -272 48 355 -5 -140 372 -220 -449 -64 79 -173 -123
2601 -123 208 -93 -151 44 402 -288 89 113 185 -115 9 180 -243 -207 19 177 -262 0 314 -243 -193 466
2623 466 186 -97 171 293 -96 -209 429 242 -9 -102 295 -19 -148 173 -115 -455 206 175 112 -263 28
2644 28 122 -286 -157 168 -312 -103 260 406 -244 472 139 48 167 -53 66 -207 -33 12 152 -10 -56 -185
2666 -185 -202 -158 -190 118 -105 258 174 -161 171 180 55 227 -46 84 189 -181 -87 230 123 -252 -36 -87 93
2689 93 -241 33 -117 -84 294 119 -214 95 205 125 -25 296 -155 -40 -194 138 -59 -535 -40 62 -416
2710 -416 -352 214 96 -5 -15 87 -98 -136 252 388 -182 -69 467 -191 -67 175 -95 -292 131 27 115
2731 115 85 -42 184 -210 81 418 -54 -47 63 63 125 -104 -202 -63 -245 238 102 -370 -257 173 -199 -161 -120
2754 -120 43 -262 71 201 -49 64 167 145 -197 131 286 43 29 121 -173 145 45 -161 99 -349 -142
2775 -142 -32 128 -207 254 -29 -15 289 152 -133 -3 87 -28 -39 195 152 -203 254 191 127 219 -291 -18
2797 -18 126 -228 -301 49 -88 -9 32 -264 288 -185 91 404 218 -216 258 -78 -100 -90 9 -34 -160 154 61
2820 61 -246 6 0 -230 -233 214 162 10 69 -78 32 -183 164 27 -167 -268 282 155 -431 -21 -171 -19
2842 -19 53 177 -114 -54 322 211 -193 198 147 -192 -49 52 -33 330 -82 207 -10 -181 408 -198 -120 219
2864 219 149 -354 97 166 -376 195 -137 17 -393 8 113 252 92 444 182 116 -93 461 283 -61 -187
2885 -187 -147 -23 -270 282 -111 -229 46 370 76 95 93 -51 -14 25 145 204 -235 121 -179 -173 345 -17 35
2908 35 -193 57 82 53 -21 111 -63 264 62 -158 62 288 59 180 372 6 64 41 -59 252 -118 56
2930 56 11 45 -67 -111 -234 173 97 -31 363 -254 -89 -173 77 3 -133 330 91 14 -19 87 -239 -539 209
2953 209 13 -128 -133 -61 -159 -108 -12 128 -136 -107 58 -84 61 211 138 -212 371 420 -171 -142 241 191 -280 1
2977 1 205 -91 10 63 226 -352 57 -124 53 -44 62 4 -178 243 294 -267 -214 308 -22 -42 155 169 -169
3000 -169 -213 346 49 -214 15 226 -2 -34 -17 192 -54 -305 259 234 -67 165 79 91 174 78 -19 -25 203 183
3024 183 -135 109 -122 -4 -207 175 156 -177 -357 -11 251 264 -22 77 66 139 173 199 -11 -86 230 -166 -56
3047 -56 -184 41 70 -167 102 137 -6 -296 -79 37 -139 97 75 -15 -170 49 262 -297 -194 223 -22 -38
3069 -38 156 -138 -87 -57 51 -99 -158 -23 238 -225 -5 345 264 -273 83 74 108 -62 307 -49 -240 -40 177
3092 177 7 -360 409 -10 -28 155 125 236 43 175 153 -238 -237 191 -211 52 58 -200 -175 196 -47 -453 -256
3115 -256 -274 -77 -163 -128 219 -98 -68 -146 -101 -134 -117 190 -146 -85 230 275 -162 -21 -143 -326 -54 24 -124 88
3139 88 -46 117 90 4 418 -77 39 208 -170 72 -112 46 -96 58 28 -62 -46 -223 176 -183 -224 31
3161 31 118 51 169 -125 -76 -64 40 -1 185 88 74 75 -222 -144 129 -147 -113 11 -146 212 26 21 99 -230 -179
3186 -179 -63 -71 -101 41 56 114 9 80 69 70 144 19 144 -108 -99 33 147 -127 -118 31 41 -23 129 173 157 81
3212 81 -103 31 207 -138 61 36 -41 -110 -312 288 -2 -100 120 12 172 -120 -85 51 105 85 223 -10 -88
3235 -88 294 30 -162 26 76 -49 253 -73 -139 -5 2 125 322 73 -106 48 -109 -19 -38 176 2 64 82
3258 82 35 -152 -42 -95 -65 -76 92 90 -16 273 -175 24 -214 -21 -69 -211 144 -101 17 12 -123 -115 32 -147
3282 -147 78 -328 161 103 173 -254 -219 107 211 -115 -208 -166 99 -185 33 37 -66 96 -90 -96 -159 171 -93
3305 -93 -117 -35 9 -154 -240 109 69 108 -182 142 -16 19 -198 -30 -140 -232 59 31 148 -215 155 -91 44
3328 44 -16 15 -4 96 -153 -51 -105 95 -120 -184 -35 132 -72 -36 -12 31 -57 32 23 141 122 153 77 -30 20 -143
3354 -143 1 288 172 -291 -66 48 63 142 140 47 -30 -217 -141 3 108 46 -86 345 163 -89 -51 34 -91
3377 -91 35 -128 -113 -9 -79 61 -107 -47 191 -7 33 -25 -62 239 200 61 82 42 66 122 -53 105 -91 182
3401 182 55 -117 -287 -128 23 94 7 -91 -72 225 -240 47 289 -198 -64 64 -55 181 40 16 89 79
3423 79 -340 58 -51 -283 -293 -205 -160 -107 -163 -42 -99 -264 120 -28 -38 8 -32 82 40 177 -127 66 -171 -115
3447 -115 27 -15 26 139 -97 207 -89 -260 34 -39 282 4 -108 -29 -61 1 80 -33 -174 -97 -35 52 303
3470 303 -155 -103 29 233 -85 22 -79 217 110 -124 7 24 -67 -82 35 -262 -72 222 160 -193 134 6
3492 6 -213 298 154 69 -148 -75 80 -118 -149 187 0 -99 142 280 -18 12 114 155 -72 53 -1 -105 -217
3515 -217 248 219 -316 118 104 -2 -63 12 -349 88 -20 -41 -176 -50 200 -136 112 162 45 -290 -24 84
3537 84 107 -123 -122 93 -16 -5 -104 102 -68 107 93 -74 187 -11 208 74 145 286 161 -280 -23 163 -181
3560 -181 -110 -262 194 -69 100 -220 134 -31 -96 -15 98 80 287 165 91 172 138 -217 -5 -28 5 -36 -206
3583 -206 58 -266 58 27 63 204 166 119 -77 -186 -68 178 27 -71 98 -233 -153 -102 -197 -226 36 -116 -5
3606 -5 -91 -212 67 -148 18 -77 91 -121 -197 127 218 -208 -23 -69 64 -9 3 -22 -57 -93 -180 -30 160 -40
3630 -40 6 -133 118 -59 141 -140 -172 -64 -47 69 -119 8 179 -14 -25 226 5 -66 -31 88 -44 -94 130
3653 130 20 66 132 -73 -112 79 66 108 8 -146 9 93 -26 104 302 -28 -124 -47 -95 99 237 215 186 -102
3677 -102 -194 -31 79 65 19 166 74 66 61 -3 -237 4 94 -77 -181 203 -62 -63 79 -27 -21 -40 -15 214 -398
3702 -398 129 212 -40 -244 -159 -90 -2 -168 -7 -86 -77 183 -155 -194 -181 -284 -33 59 258 -75 151 -307 53
3725 53 -72 -42 -94 125 229 65 -121 -30 -30 -146 -123 117 -129 -74 -19 48 -8 64 -23 1 -271 72 320 62 255
3750 255 37 -10 77 -59 28 -55 -58 -208 177 -16 105 -198 177 -114 183 -343 -249 -14 -93 162 -102 -202 -4
3773 -4 -51 -170 -37 -126 151 7 160 79 -65 -84 -68 4 405 -84 -153 -180 -130 77 252 -29 85 153 -179 8
3797 8 60 -35 50 -109 91 -34 -79 -168 -4 435 107 75 296 55 -131 5 20 27 40 78 -56 -42 81 53 6
3822 6 -163 121 65 -297 87 -37 -34 -116 150 130 121 -118 -272 -11 -276 23 -1 98 -219 260 152 55 -223 101
3846 101 68 261 74 -77 153 72 -40 -62 210 241 -179 -319 11 157 73 -37 149 -32 28 64 -87 284
3868 284 169 161 -74 -191 -298 -150 342 -64 -75 -174 168 264 -146 -289 123 115 -11 160 161 56 -119 -10 -135
3891 -135 -245 149 -191 -82 148 -148 49 59 -76 -68 231 7 108 74 206 177 -15 13 18 -37 84 7 -402
3914 -402 36 -120 -124 -53 48 207 -271 165 -60 224 -23 -141 -95 27 93 -231 185 11 -180 -93 -91 -109 -367
3937 -367 98 173 -93 9 29 158 -90 -25 -160 -228 -8 -200 -18 -132 53 198 -227 84 -167 -64 183
3958 183 -141 8 25 -181 176 103 -61 -116 50 11 21 23 52 -65 -75 -28 42 -18 -19 -242 222 26 -216 -70 143
3983 143 94 -6 137 -24 -257 -60 -56 -148 -35 -28 302 40 12 -202 82 -134 -48 157 -117 41 21 -77 -72 121
4007 121 335 -144 38 94 39 203 -114 -46 -46 -174 253 -5 214 155 -142 -124 169 -49 241 343 27 4 -46
4030 -46 259 -26 -265 206 124 64 -10 -107 -69 -49 -58 -13 -58 -202 9 -57 230 -85 39 -129 -237 -74 -142 -39
4054 -39 23 49 -146 -352 224 -92 -89 271 247 -156 170 112 -142 27 -99 -33 -332 124 170 -98 245 -158 27
4077 27 33 -242 223 -43 242 135 57 -273 -49 26 -24 -19 -138 -245 32 26 -76 -23 -259 -56 -151 138 136 8 28
4102 28 -198 -84 -71 -44 24 223 37 28 -105 167 -306 -175 -49 7 -19 -36 32 -85 124 -18 -269 -34 182
4125 182 -309 -33 -104 -79 -228 -86 -7 239 -237 48 215 -155 -94 13 -154 120 -204 20 -96 -69 19 -243
4147 -243 -77 -57 -26 -56 5 -89 -155 -61 -162 56 257 -109 80 -386 245 84 -77 -27 153 99 160 55 -60
4170 -60 -69 22 12 15 -65 -214 212 -380 -32 83 60 132 -144 136 -63 477 218 -158 -211 115 105 -112 3 -29
4194 -29 29 89 311 24 166 37 18 -213 -118 10 239 -74 -139 -2 -238 141 -40 237 -171 348 120 -125
4216 -125 -45 -168 -301 -198 104 -69 107 -241 -305 -93 21 58 0 -75 92 -141 12 -106 -57 -125 -229 -115
4238 -115 -50 214 141 12 219 -245 -49 349 137 -98 226 203 -125 149 30 62 -89 79 119 155 136 91 -65
4261 -65 -50 128 349 169 -47 73 95 -54 -151 -114 59 -282 -91 244 -13 -158 99 9 164 30 -4 148
4283 148 24 11 -62 -3 -13 -105 117 -21 154 189 -285 -166 -165 125 62 -1 245 204 -42 113 76 17 -47 31 224
4308 224 -23 111 -72 111 -241 33 -230 156 -184 -156 13 231 -219 -261 112 137 -18 -142 -111 -192 32 -132
4330 -132 -51 -28 -81 -143 104 217 8 -25 -9 122 93 274 -19 103 111 -3 34 -323 230 23 182 -93 116
4353 116 -155 -16 45 -14 45 -333 63 168 -141 112 -134 -150 73 -136 40 125 -207 -143 -6 183 -113 -78
4375 -78 47 -72 35 90 117 -36 75 -210 42 -47 -25 -21 124 40 -138 -88 -65 186 280 168 -70 -72 -158 89 46
4400 46 -353 -146 49 245 -208 -251 -47 -131 111 -22 -126 -237 -213 -159 -281 102 253 129 80 60 143 -51 316
4423 316 -60 -33 -109 513 -327 -6 72 -135 -186 135 251 -36 195 282 -8 -287 191 256 -195 -175 18 75 -235
4446 -235 335 224 -14 58 -3 106 166 114 40 -111 112 -4 -94 -51 -3 89 -301 -171 -149 -16 -73 -219 -62 -131
4470 -131 387 -23 4 100 10 249 191 -16 165 -253 132 116 30 137 69 -126 3 -43 -100 56 -83 -192 -36
4493 -36 -126 -106 164 -64 -28 -20 -74 -252 -99 76 180 -177 60 53 28 -69 -157 10 -183 51 -339 17 -119 180
4517 180 -3 99 135 -173 114 -71 320 -200 -200 8 33 -70 178 -316 17 -312 91 114 -40 169 242 55
4539 55 162 188 -442 -107 -95 116 222 38 -6 -194 -270 -157 30 -176 -270 118 149 46 -171 145 -1 9 -94
4562 -94 -170 13 190 -41 226 -270 23 -194 205 247 -137 138 -99 203 -27 -36 236 82 11 317 -272 117
4584 117 -3 107 -326 214 10 53 -141 164 51 157 1 -88 -131 -217 85 -28 7 -138 -15 -83 181 23
4606 23 271 22 68 -116 28 -113 86 -90 23 82 -97 -107 -87 -233 86 -2 -146 -17 21 226 92 101 179
4629 179 -225 90 47 129 -198 12 40 -319 124 215 4 147 -81 -122 48 -172 -21 269 120 -243 -45 88
4651 88 234 -114 127 -144 79 75 160 219 58 -184 -164 -317 -113 111 -101 6 74 -26 -179 -48 153 -184
4673 -184 59 -113 -28 25 224 -142 8 0 83 183 -31 -192 56 201 187 -142 -293 31 61 138 -52 -6 -58
4696 -58 -167 -169 201 -133 45 -183 35 115 266 -180 -182 -150 -142 35 -54 -87 70 -122 -93 260 164 -36 203 -38
4720 -38 -12 -160 87 323 -12 -8 6 120 134 -75 172 -4 -67 -76 -287 192 94 201 71 -72 262 24 -7 292
4744 292 -172 28 -81 107 -208 63 138 33 -153 -113 18 -90 74 37 49 -6 -166 -44 190 90 126 63
4766 63 280 118 -35 -81 399 -160 -83 -72 66 -50 103 -6 -174 -74 -50 193 16 -5 158 -90 117 298
4788 298 82 106 -235 194 -37 115 111 71 17 -39 96 -124 -159 41 0 -79 162 -80 -4 -273 16 -47 -163 50
4812 50 159 -18 -187 103 -3 33 69 -247 121 -148 288 10 -52 237 21 -519 -76 -59 -104 113 -31 -27 -105
4835 -105 221 78 -22 143 74 87 -30 205 3 -72 -73 -309 29 112 -305 -92 46 -212 -171 -103 -25 7 -86 -113
4859 -113 301 64 -145 155 -166 -270 -164 35 133 -104 -48 23 72 -160 -151 -25 20 87 244 -354 -179 -395 -45
4882 -45 -171 -17 328 43 146 222 193 124 106 88 107 94 -205 217 171 -57 42 21 63 160 27 38 -91 -367 21
4907 21 170 -44 -102 102 -220 42 -2 59 -50 125 51 81 133 -102 185 35 214 -100 -63 127 274 -15 -188
4930 -188 -86 -266 271 79 3 33 121 62 -52 142 60 118 -47 60 86 -89 -21 -51 -44 -357 -117 -96 -114 38
4954 38 -182 -166 71 101 155 -43 -3 83 13 -76 34 146 -162 72 231 -352 -84 -63 -209 11 42 256 -26
4977 -26 115 133 -36 -114 34 7 -83 5 86 -45 129 -62 69 185 -68 73 -96 -1 -102 233 66 -62 -129
5000 -129 82 50 -32 -17 156 43 229 3 19 127 89 -39 -85 83 265 98 -324 -36 -52 -94 -69 -137 -104 225
5024 225 -213 -181 -80 -274 0 70 114 -95 160 7 186 147 -34 135 197 103 71 -97 -58 215 -108 -166 3
5047 3 20 -45 70 -106 112 -77 -14 -151 4 -32 141 150 21 -58 226 -180 282 -6 -34 -17 59 55 21 -35 91
5072 91 0 -105 -30 -159 107 38 50 -101 -230 134 -129 56 303 -188 -75 166 245 -58 35 -219 33 110 27
5095 27 137 73 189 -34 52 105 106 -60 9 -75 217 -49 -197 -40 -157 182 12 141 294 -82 -140 167 -200
5118 -200 -43 -86 -70 -35 -149 154 -229 -22 59 -93 -222 139 -41 205 68 3 -391 -211 -137 226 -17 -37
5140 -37 235 -325 196 129 147 156 56 94 68 -72 -85 -33 -23 -142 62 -18 49 -206 36 240 -182 189 -96 182
5164 182 22 8 0 -85 -74 -57 435 59 27 -110 81 113 199 39 92 -135 346 274 -134 -64 -34 131 -113 117
5188 117 97 323 -12 98 147 -205 -146 343 -89 -251 -224 -258 -124 -176 -60 -205 -273 -105 -134 -29 153 136 -160
5211 -160 -38 163 -160 -3 32 68 -225 151 229 26 -36 128 -159 11 -180 54 -29 -276 -175 43 -99 -81
5233 -81 -38 100 92 12 150 97 -162 62 56 -40 137 -182 -112 175 -57 -4 100 142 225 -272 -6 225 -92 -251
5257 -251 36 -57 -84 -120 -89 2 176 -79 -268 -112 -145 245 -179 -134 -84 33 -67 -207 117 -32 246 -102 -6
5280 -6 60 42 117 168 35 -25 48 -46 40 52 -178 288 66 29 92 21 69 325 -60 57 167 -188 -7 106 81
5305 81 78 -235 -41 -76 -159 -32 -236 74 -222 -47 131 130 -137 489 75 -62 153 -51 245 -76 23 173 -119
5328 -119 -113 115 -211 157 -24 -140 21 51 -180 -106 -67 187 15 -50 -215 -49 -228 -91 185 329 -24 -326
5350 -326 -153 -52 -58 54 78 21 -57 -12 78 100 -79 14 24 201 -41 114 103 23 -123 -10 98 -25 -192 98
5374 98 -18 -361 -160 -20 173 -118 106 45 40 87 -97 -166 -3 -334 48 157 -214 92 -54 23 -177 -360
5396 -360 -22 -126 -79 -39 -55 161 161 -214 13 -32 165 -150 44 -276 150 226 -67 112 129 82 -18 85 15
5419 15 -163 202 -91 -31 203 -45 209 -20 -72 38 134 -163 -227 -229 -2 -178 -109 -47 -64 -159 116 70 -49 -201
5443 -201 68 43 -104 -90 -199 60 168 242 140 -181 10 112 -110 170 -55 8 59 -87 231 -118 -52 -463
5465 -463 21 -184 -56 144 -173 -274 -176 -97 -95 142 78 -141 148 -96 358 -119 -15 58 -167 -298 -61 -219
5487 -219 87 -108 11 -27 -32 82 73 -100 189 43 211 -156 -266 -25 -73 -149 54 -1 50 -72 -4 21 141 23
5511 23 324 -116 139 -8 173 -100 -73 372 -24 239 -54 -62 84 -165 178 -131 152 314 64 112 69 10
5533 10 146 45 29 332 266 17 55 102 -65 -3 113 -129 -26 -109 -131 -154 96 85 80 38 -165 -202 -178 -258 94
5558 94 -80 97 185 -224 121 -16 26 -242 45 121 159 74 218 12 -32 -107 24 287 -124 98 51 24 156
5581 156 -104 -87 -199 -163 20 39 80 -184 -125 113 -149 -93 -23 -217 169 90 1 -208 8 -218 -112 -59 131
5604 131 -76 -36 -373 24 -33 -97 152 193 122 13 -3 -183 -36 -57 87 -86 165 -177 13 -252 -200 -170 -41
5627 -41 -121 -137 -27 -153 117 50 -51 108 -110 -154 -121 -157 -150 65 -224 -101 -134 -46 16 -15 -159 -38 76 -144
5651 -144 -150 -72 34 252 -56 -86 -48 4 -65 8 51 71 -14 -70 -54 112 173 -159 -306 187 95 -130 -173 230 100
5676 100 69 -261 58 102 -139 -38 -10 -145 394 -114 -175 -50 21 -23 -271 -3 216 -39 -80 178 69 -63
5698 -63 -29 67 -25 -5 -4 36 -71 181 87 -155 -245 117 -58 139 -85 -149 92 53 68 100 -234 53 382 -180 -28
5723 -28 304 47 -137 -9 7 67 -156 100 103 -232 -151 -54 -191 -183 -25 -117 31 -176 -79 192 -388 6 -6 25
5747 25 -1 28 -43 -116 5 133 76 159 44 -79 -40 -73 -115 143 -82 -33 -51 38 -14 132 46 -190 -64 -137 93
5772 93 -169 303 -58 76 -11 33 182 117 6 24 4 150 110 -76 -205 305 122 -150 -105 -22 -232 -57 -94
5795 -94 13 -215 64 -34 15 106 -97 5 42 -133 -79 -89 -18 -144 -101 -349 91 -6 -5 -1 118 72 82 -8 -144 167
5821 167 260 232 130 27 4 42 -17 -10 77 -74 -110 -110 43 -16 -166 168 -12 94 -29 259 -37 36 279 -24
5845 -24 -96 20 -172 169 382 9 231 104 -8 -265 22 288 -276 -299 573 -74 88 -166 -32 -54 260
5866 260 113 -92 346 -418 -72 153 111 79 123 82 -320 140 113 -192 -92 -98 322 -192 -36 -77 233 -200 93
5889 93 255 84 -220 -111 -185 -106 -19 -411 39 -115 -23 92 -49 -271 -27 160 137 -2 -103 -247 48 -55
5911 -55 120 -51 157 -143 -100 -276 213 76 -125 -118 -83 89 -134 -168 112 94 -123 -6 -303 -55 -99 89 108
5934 108 73 -168 -38 136 -13 -218 -74 -35 152 64 120 -23 145 -189 -90 -214 -30 13 44 -217 -54 -48 -73
5957 -73 -264 -189 -137 -81 49 -251 -242 70 -61 -180 196 172 113 -27 -3 111 71 -99 -233 235 73 159 -144 -136
5981 -136 -18 -78 -161 -21 -69 38 154 -239 12 -100 -138 21 -197 -75 1 45 10 313 51 -71 -84 -22 165
6004 165 -16 38 -13 -331 67 23 242 192 239 168 131 49 131 343 -17 -9 24 -88 -101 19 -21 135 -202 -12 72
6029 72 -208 -48 -123 138 29 286 -154 -165 -386 172 15 -98 186 -155 7 -2 -41 -162 -33 -109 -68 143 143
6052 143 -231 -77 -136 -120 -283 -161 81 18 -1 -206 194 68 239 -184 73 108 -56 7 -149 -202 108 -86
6074 -86 21 -36 -40 -100 -76 -86 -163 -44 49 -122 -340 -66 -1 -1 43 122 139 112 -13 80 40 -138 -74 -217 92 -121
6100 -121 52 83 53 -26 -142 282 -17 12 -5 53 -60 -82 -66 -224 9 136 177 -54 11 53 -91 -207 147 243
6124 243 -18 -276 -245 153 -84 149 43 143 105 115 211 214 -21 89 164 271 23 -20 -218 -77 120 347 -102
6147 -102 58 68 -359 -190 -277 -119 -36 -131 -123 -132 -154 22 -60 -93 -144 -72 -36 -19 -24 80 23 112 46 18 -55 -122 128 -122
6175 -122 217 -42 40 97 89 -18 -20 -39 246 81 -82 -96 -233 192 170 49 257 80 -83 -161 -27 174 -251
6198 -251 135 -140 -42 95 -74 26 -190 167 -88 107 -186 140 -11 20 34 -113 228 -86 216 -76 124
6219 124 148 81 -109 -166 20 46 -52 58 167 68 -126 214 -63 -200 -21 121 -134 11 -118 -202 10 237
6241 237 36 76 17 59 102 -115 547 202 23 65 4 4 -185 -275 -70 -146 -140 82 333 -270 -121 3 316 -156
6265 -156 -111 -200 -63 -109 -3 57 -224 94 126 256 -11 -103 7 -21 -189 -186 -6 343 -149 101 -160 27 281
6288 281 184 -111 296 135 -140 252 41 121 -163 -122 -235 66 -123 -51 184 -35 40 -114 118 -2 -123 -41
6310 -41 47 -82 -57 -19 40 74 -200 60 34 141 -245 -196 62 136 -130 63 -9 222 67 -282 -191 98 10 -282
6334 -282 -167 252 70 -105 134 246 -68 -156 -27 -14 -165 73 33 -56 265 123 -150 36 -57 57 45 46 63
6357 63 -35 115 102 58 -248 147 216 151 -51 -75 -36 -47 87 -112 -189 -88 181 121 133 -259 118 100 120 -132 -53
6382 -53 -163 6 -132 -111 154 -31 -186 33 -243 -87 28 208 113 -229 148 -70 243 85 293 219 -74
6403 -74 146 -93 -283 314 -103 110 152 -13 164 12 -141 -267 56 43 -116 -63 116 -166 72 253 -219
6424 -219 116 146 -39 140 31 -94 -9 45 150 215 -36 22 -12 66 51 -104 -14 140 78 19 123 36 -131 96
6448 96 -11 89 -269 -188 6 113 -127 156 -182 12 60 56 -44 88 39 -18 82 -103 -39 -171 132 136 -86
6471 -86 -194 56 -276 -57 88 85 -36 -11 39 260 -71 -262 94 -30 -8 132 -114 225 -85 117 224 -46
6493 -46 -121 -255 170 220 65 140 83 -25 -61 143 -39 -54 -250 93 133 96 -83 -11 32 70 159 294 20 115 5
6518 5 56 30 127 -225 -259 34 -22 176 -23 171 196 107 241 306 -175 27 105 82 47 15 88 136 170 154 87 -265
6544 -265 -177 -111 -130 -4 509 192 290 -118 80 39 153 -63 36 -188 92 97 57 -52 -72 -134 -27 44 215 253
6568 253 -38 21 19 48 -72 34 95 1 -250 -146 30 -59 27 -194 -100 157 10 -200 14 111 -27 -189 -174 -69
6592 -69 1 -2 110 174 -76 -25 252 16 -80 95 142 19 -221 -107 212 -73 21 -215 -1 24 76 169 -83 -232
6616 -232 -68 -43 -67 -27 244 -43 0 130 -128 -385 -69 166 -80 -214 78 103 -132 200 69 5 42 117 -154
6639 -154 135 -62 -96 35 274 -92 -194 148 118 -25 -161 -163 -63 -185 15 -101 -75 -98 -82 58 -92 -130 113
6662 113 259 -32 -101 -30 59 -94 -29 429 -263 -145 11 -83 258 -200 52 78 -13 325 182 205 -54 -106 69
6685 69 109 332 213 -19 -74 142 38 162 108 185 71 22 -104 90 -44 -70 -117 -47 -77 35 86 257 -66 11
6709 11 -3 164 -51 316 114 -64 -5 -232 66 -9 -142 -126 -59 -74 173 47 26 64 22 -262 116 -98 -46 -140
6733 -140 106 -219 105 -47 -173 11 -71 -174 75 -159 110 -74 -197 -105 -41 -212 155 76 85 21 202 -87
6755 -87 -13 225 157 45 -115 -89 -28 -4 -265 223 164 164 38 -305 64 -43 104 -225 292 -54 117 -55 -174
6778 -174 -7 -64 167 243 -17 -10 30 -30 -199 233 -55 -294 3 464 -19 -247 115 -424 -96 -148 88 244
6800 244 213 91 41 95 128 -167 65 13 -305 -7 21 -298 -44 -13 304 -337 -42 43 -80 107 125 28 60 47
6824 47 -330 -121 125 -13 27 59 205 102 -30 21 21 -313 -4 -93 -341 92 30 109 -222 27 19 -161 309 75
6848 75 -16 -27 205 -43 26 160 -200 175 109 305 -142 -121 -43 -206 126 -189 27 -75 57 208 -3 238
6870 238 139 -65 35 -179 -89 8 5 -64 43 -257 48 83 -24 -57 240 -213 39 -1 222 183 131 -100 -89 197
6894 197 232 -117 -37 -8 -107 322 -77 -140 -38 213 205 -137 15 398 -18 -4 -92 -32 118 91 -178 -47 102 -162
6918 -162 10 147 -42 -79 -53 11 -196 -378 -34 128 -219 118 48 294 -109 -104 294 -5 -39 -162 -127 -80 125
6941 125 113 -60 -72 -65 13 116 -107 29 -185 376 -57 -120 168 -126 -7 44 310 251 -23 -3 42 -133 99
6964 99 274 23 183 -48 7 65 72 -313 17 257 298 -140 193 61 16 297 -123 -183 124 155 28 34 -76 16
6988 16 54 352 172 25 161 49 -101 -44 -17 143 93 223 -115 -49 -69 50 62 -101 -79 -152 198 58 -113
7011 -113 -115 -127 -8 -69 128 -27 -125 -185 -188 -103 70 -31 2 162 -50 37 -224 108 103 -62 24 -233 125 -34 -224
7036 -224 130 -11 -111 111 158 87 -168 22 83 17 330 -188 -21 215 143 143 312 -134 99 368 -23 -103 186
7059 186 -38 89 194 159 -108 362 -85 -34 -98 -82 218 -183 34 -67 -48 52 114 -210 156 -185 59 193
7081 193 -119 -169 6 157 138 -260 50 -68 120 -239 -108 -73 89 168 -96 -22 121 70 -26 67 85 7 277
7104 277 22 12 -297 -50 -196 -13 83 81 -79 -53 -31 89 318 -43 135 99 -60 -51 21 -84 35 147 -152
7127 -152 61 -171 138 -19 -302 93 -139 8 20 -48 -64 214 -7 -75 23 1 67 95 303 13 220 -92 4
7150 4 -80 103 40 240 102 -49 -94 43 -278 59 -162 62 -172 132 2 144 116 -172 83 -17 -250 -23
7172 -23 -288 -101 62 -103 -184 32 5 -181 -133 150 -255 -68 250 -22 116 -49 -9 64 -41 47 1 37 -260
7195 -260 52 -95 -199 205 -68 109 90 -153 76 -227 -168 115 43 169 274 -155 -287 40 -61 108 -152
7216 -152 124 -153 122 236 229 73 35 165 -291 214 -109 -14 -119 -187 122 -16 -147 -220 -47 -284 62 -36
7238 -36 54 26 -18 94 -9 36 221 -21 90 107 -103 -149 57 -361 -85 -309 -62 -7 -55 152 -141 115 73
7261 73 111 -108 20 -57 237 -50 348 15 -112 -92 -187 72 70 272 30 -106 66 -82 -183 -13 36 -110 -74
7284 -74 148 186 239 -91 53 -89 40 -35 -322 119 229 50 -71 160 -65 -57 -210 -18 -2 -112 -42 136 -202
7307 -202 -158 216 11 -6 -4 117 -69 86 93 64 -108 -79 61 -35 -152 -149 -34 128 65 74 101 23 -86 194 -282
7332 -282 -427 -208 213 -192 267 -31 161 -111 42 186 4 -56 -33 -114 138 -103 -74 -109 193 52 90 -8
7354 -8 -23 -22 -167 -1 74 -38 -158 267 381 163 -121 71 -92 221 -188 -130 -4 -16 184 -13 -126 -2 -129
7377 -129 93 -6 -279 173 92 154 -138 26 -96 -168 125 109 37 -92 129 -364 -70 -106 -263 6 88 -307 68
7400 68 303 -19 -164 -167 102 40 151 -114 -6 -145 -109 92 0 -37 124 -74 -200 -3 -153 305 -171 -13
7422 -13 18 -392 173 -197 100 -253 -195 -63 -47 108 53 78 -120 -266 -268 68 212 -42 -1 30 175 132 -192 85
7446 85 261 420 130 -57 73 -65 225 -124 74 -169 -93 -140 172 25 -17 -35 79 -63 -66 -36 29 -16 82 -38
7470 -38 -224 42 -144 -27 123 -169 -164 147 288 65 107 -112 144 -9 93 123 35 73 -191 -177 -93 -249 104
7493 104 169 -347 -236 -13 97 -75 218 27 24 -12 -226 -35 -57 43 112 -50 -81 176 162 69 -230 -69 -49
7516 -49 -130 123 100 250 63 -145 121 -242 -64 -27 -115 -72 -252 -95 -132 36 -135 59 272 28 -285 82
7538 82 -20 92 -46 77 29 125 -115 32 -22 151 -9 66 -259 -1 145 19 202 -7 -40 73 124 -74
7560 -74 52 -25 63 177 -167 209 168 -11 -51 -46 -65 89 -354 -269 5 159 80 -50 108 260 149 88 309 119
7584 119 204 228 -78 -217 0 -28 67 69 -269 -130 -38 -314 -71 -18 -9 200 11 101 -160 48 -125 206 -64 -26
7608 -26 32 83 -98 -158 -337 -31 -122 159 67 44 83 -59 -57 136 193 12 52 -62 146 10 -118 -98 192 -33
7632 -33 56 34 -173 -346 -32 110 211 370 -48 38 24 -143 210 -54 -77 131 -213 79 -161 -132 45 249
7654 249 296 -89 -81 96 53 130 -132 15 6 129 -151 -131 -152 -16 120 107 -152 70 276 -247 -8 40 118 -68
7678 -68 -9 5 39 98 -88 13 -230 22 230 -96 0 86 -198 62 7 261 27 132 177 161 121 -4 112 -59
7702 -59 -68 -35 23 -34 -136 -48 221 -78 63 -131 67 93 -188 -80 -12 -301 2 -59 -31 112 -11 -157 -93 -103
7726 -103 7 -32 74 2 -65 85 224 69 15 229 -148 -294 116 28 -266 407 -31 -72 -214 164 -253 96
7748 96 -4 35 198 -219 -65 64 -168 -190 167 -196 96 -147 145 261 192 -51 46 104 -26 184 -55 7
7770 7 109 -108 190 -171 298 39 -52 82 -188 -65 -100 65 -159 -89 -89 41 103 4 3 193 -85 107 -18 -214
7794 -214 -124 -85 40 275 198 194 -39 200 -74 39 -69 153 133 -18 253 -47 -153 83 -162 -132 -49 -270 135
7817 135 -8 304 -36 -133 62 -33 43 -6 43 -24 102 -55 -163 3 162 -72 -139 32 209 261 142 241 138
7840 138 -259 -88 -28 -73 29 69 169 -66 -55 -19 37 -1 126 -189 22 107 130 37 2 -4 -123 -139 -14 -28 -55
7865 -55 65 271 133 362 -83 -135 -167 -186 -170 -24 337 104 -316 48 -146 72 -22 126 -89 -103 163 -32
7887 -32 -97 -135 158 320 -65 10 1 244 199 30 75 199 121 -260 -359 -28 -188 72 -126 -88 -96 -37 76 -234 7
7912 7 -106 -45 74 -21 99 95 -228 -16 -112 -96 -12 71 224 -239 130 87 -54 -3 -100 284 -196 129 131 -60 31
7937 31 30 -69 -38 -200 33 -200 -46 -76 31 401 147 -59 21 -99 50 -116 34 109 143 157 335 -70 320
7960 320 -6 291 177 31 -156 120 0 -236 -12 -35 116 -6 295 -278 230 182 25 156 -125 33 -118
7981 -118 213 77 -30 -45 -32 -36 -149 -165 -158 -41 -76 -8 197 -35 -151 118 140 -19 -113 55 -228 18 -35 73
8005 73 -113 98 -12 307 1 17 83 90 -10 37 130 156 -145 141 165 13 103 -25 27 196 217 -2 25 79 -15
8030 -15 -217 -98 95 -156 267 54 -205 12 -92 -349 311 27 74 141 -19 117 108 120 -130 17 -151 -179
8052 -179 207 -121 3 202 -94 -100 204 -103 12 -36 164 -8 205 -43 69 -22 127 -38 -112 -12 242 30
8074 30 -16 -190 172 101 -20 -19 -119 -314 -307 199 -214 -271 47 -227 178 -21 -65 -162 101 46 -10 -106 81 123 -26
8099 -26 157 -210 -129 -92 -84 -92 -97 -120 -40 73 -79 41 -106 116 10 -6 -227 -200 289 -104 -115 -121 -179 221 -7 -3
8125 -3 -12 311 113 24 -137 42 -37 -246 -133 -26 116 196 250 139 86 -2 54 168 26 -195 -192 82 80 30 -173
8150 -173 -156 104 53 -25 141 86 6 -52 -74 259 -262 117 -126 54 111 -80 218 213 -11 30 -65 23 -66 182 -102
8175 -102 -271 -18 3 113 -42 165 238 173 -290 -164 151 -167 33 -1 80 -168
8191a68
##END NTUPLES=NMR FID
##END=
