##TITLE=1H_Pr Am-Q
 CDCl3, 8 sc, 
 29.07.2021
##JCAMPDX= 6.0         $$ Bruker NMR JCAMP-DX V2.0
##DATA TYPE= NMR FID
##DATA CLASS= NTUPLES
##ORIGIN= UXNMR, Bruker Analytische Messtechnik GmbH
##OWNER= root
$$ XWIN-NMR		Version 3.5
$$ Thu Jul 29 12:24:47 2021 Russian Standard Time (UT+4h)  she@DPX200
##.OBSERVE FREQUENCY= 200.131506
##.OBSERVE NUCLEUS= ^1H
##.DELAY= (6, 6)
##.ACQUISITION MODE= SIMULTANEOUS
##.ACQUISITION SCHEME= undefined
##.AVERAGES= 8
##.DIGITISER RES= 18
##SPECTROMETER/DATA SYSTEM= spect
##.PULSE SEQUENCE= zg30
##.SOLVENT NAME= CDCl3
##.SHIFT REFERENCE= (INTERNAL, CDCl3, 0, 15.7039)
##AUDIT TRAIL= $$ (NUMBER, WHEN, WHO, WHERE, WHAT)
$$ ##TITLE= Audit trail, XWIN-NMR		Version 3.5
$$ ##JCAMPDX= 5.01
$$ ##ORIGIN= Bruker BioSpin GmbH
$$ ##OWNER= she
$$ F:/spectra/data/she/nmr/H-F/1/audita.txt
$$ ##AUDIT TRAIL=  $$ (NUMBER, WHEN, WHO, WHERE, WHAT)
(   1,<2021-07-29 12:23:35.79 +0400>,<she>,<DPX200>,
      <created by zg, POWCHK disabled, PULCHK disabled
       configuration hash MD5:
       00 E9 B6 7A A2 85 ED C7 34 08 36 98 17 FE 4E 26
       data hash MD5: 16K
       2E 2F 28 35 EA B5 91 8F 0B 98 7A 33 70 E5 6F FA>)
$$ ##END=
$$ 
$$ hash MD5
$$ 38 51 D8 9D 9F 88 A7 23 28 12 6B 05 E3 86 83 18
##$RELAX= 
##$RELAX= 
##$RELAX= 
##$RELAX= 
##$RELAX= 
##$RELAX= 
$$ Bruker specific parameters
$$ --------------------------
##$DU= <F:/spectra>
##$EXPNO= 1
##$NAME= <H-F>
##$PROCNO= 1
##$TYPE= <nmr>
##$USER= <she>
##$AMP= (0..31)
100 100 100 100 100 100 100 100 100 100 100 100 100 100 100 100 100 100 
100 100 100 100 100 100 100 100 100 100 100 100 100 100 
##$AQSEQ= 0
##$AQ_mod= 1
##$AUNM= <au_zg>
##$AUTOPOS= <>
##$BF1= 200.13
##$BF2= 200.13
##$BF3= 200.13
##$BF4= 200.13
##$BF5= 200.13
##$BF6= 200.13
##$BF7= 200.13
##$BF8= 200.13
##$BYTORDA= 1
##$CFDGTYP= 0
##$CFRGTYP= 5
##$CHEMSTR= <none>
##$CNST= (0..31)
1 1 145 1 1 1 1 1 1 1 1 1 1 1 1 1 1 1 1 1 1 1 1 1 1 1 1 1 1 1 1 1 
##$CPDPRG= <>
##$CPDPRG1= <>
##$CPDPRG2= <>
##$CPDPRG3= <>
##$CPDPRG4= <mlev>
##$CPDPRG5= <mlev>
##$CPDPRG6= <mlev>
##$CPDPRG7= <mlev>
##$CPDPRG8= <mlev>
##$CPDPRGB= <>
##$CPDPRGT= <>
##$D= (0..31)
0 1.2 0 0 0 0 0 0 0 0.06 0 0.03 0 0 0 0 0.0002 0 0 0 0 0 0 0 0 0 0 0 0 
0 0 0 
##$DATE= 1627547015
##$DBL= (0..7)
120 120 120 120 120 120 120 120 
##$DBP= (0..7)
150 150 150 150 150 150 150 150 
##$DBP07= 0
##$DBPNAM0= <>
##$DBPNAM1= <>
##$DBPNAM2= <>
##$DBPNAM3= <>
##$DBPNAM4= <>
##$DBPNAM5= <>
##$DBPNAM6= <>
##$DBPNAM7= <>
##$DBPOAL= (0..7)
0.5 0.5 0.5 0.5 0.5 0.5 0.5 0.5 
##$DBPOFFS= (0..7)
0 0 0 0 0 0 0 0 
##$DE= 6
##$DECBNUC= <off>
##$DECIM= 32
##$DECNUC= <off>
##$DECSTAT= 4
##$DIGMOD= 1
##$DIGTYP= 9
##$DL= (0..7)
0 120 120 120 120 120 120 120 
##$DP= (0..7)
150 150 150 150 150 150 150 150 
##$DP07= 0
##$DPNAME0= <>
##$DPNAME1= <>
##$DPNAME2= <>
##$DPNAME3= <>
##$DPNAME4= <>
##$DPNAME5= <>
##$DPNAME6= <>
##$DPNAME7= <>
##$DPOAL= (0..7)
0.5 0.5 0.5 0.5 0.5 0.5 0.5 0.5 
##$DPOFFS= (0..7)
0 0 0 0 0 0 0 0 
##$DQDMODE= 0
##$DR= 18
##$DS= 0
##$DSLIST= <SSSSSSSSSSSSSSS>
$$ [...]
##$SUBNAM2= <"">
##$SUBNAM3= <"">
##$SUBNAM4= <"">
##$SUBNAM5= <"">
##$SUBNAM6= <"">
##$SUBNAM7= <"">
##$SUBNAM8= <"">
##$SUBNAM9= <"">
##$SW= 20.0188882624521
##$SWIBOX= (0..15)
0 0 2 0 0 0 0 0 0 0 0 0 0 0 0 0 
##$SW_h= 4006.41025641026
##$TD= 16384
##$TD0= 1
##$TE= 0
##$TE2= 300
##$TE3= 300
##$TEG= 300
##$TL= (0..7)
0 120 120 120 120 120 120 120 
##$TP= (0..7)
150 150 150 150 150 150 150 150 
##$TP07= 0
##$TPNAME0= <>
##$TPNAME1= <>
##$TPNAME2= <>
##$TPNAME3= <>
##$TPNAME4= <>
##$TPNAME5= <>
##$TPNAME6= <>
##$TPNAME7= <>
##$TPOAL= (0..7)
0.5 0.5 0.5 0.5 0.5 0.5 0.5 0.5 
##$TPOFFS= (0..7)
0 0 0 0 0 0 0 0 
##$TUNHIN= 0
##$TUNHOUT= 0
##$TUNXOUT= 0
##$USERA1= <user>
##$USERA2= <user>
##$USERA3= <user>
##$USERA4= <user>
##$USERA5= <user>
##$V9= 5
##$VALIST= <valist>
##$VCLIST= <CCCCCCCCCCCCCCC>
##$VD= 0
##$VDLIST= <DDDDDDDDDDDDDDD>
##$VPLIST= <PPPPPPPPPPPPPPP>
##$VTLIST= <TTTTTTTTTTTTTTT>
##$WBST= 1024
##$WBSW= 4
##$XGAIN= (0..3)
0 0 0 0 
##$XL= 0
##$YL= 0
##$YMAX_a= 252285
##$YMIN_a= -332002
##$ZGOPTNS= <>
##$ZL1= 120
##$ZL2= 120
##$ZL3= 120
##$ZL4= 120
##$ABSF1= 10
##$ABSF2= 0
##$ABSG= 5
##$ABSL= 3
##$ALPHA= 0
##$AQORDER= 0
##$ASSFAC= 0
##$ASSFACI= 0
##$ASSFACX= 0
##$ASSWID= 0
##$AUNMP= <proc_1d>
##$AZFE= 0.1
##$AZFW= 0.1
##$BCFW= 1
##$BC_mod= 2
##$BYTORDP= 1
##$COROFFS= 0
##$CY= 11.3945322036743
##$DATMOD= 1
##$DC= 2
##$DFILT= <>
##$DTYPP= 0
##$F1P= 2.36226072786647
##$F2P= -0.459571619588291
##$FCOR= 0.5
##$FTSIZE= 0
##$FT_mod= 4
##$GAMMA= 1
##$GB= 0.15
##$INTBC= 1
##$INTSCL= 1
##$ISEN= 128
##$LB= 0.24
##$LEV0= 0
##$LPBIN= 0
##$MAXI= 10000
##$MC2= 0
##$MEAN= 0
##$ME_mod= 0
##$MI= 1.114404
##$NCOEF= 0
##$NC_proc= 0
##$NLEV= 6
##$NOISF1= 3.799351
##$NOISF2= 2.8
##$NSP= 1
##$NTH_PI= 0
##$NZP= 0
##$OFFSET= 15.70392
##$PC= 1
##$PHC0= -13004.65
##$PHC1= 23.80099
##$PH_mod= 1
##$PKNL= yes
##$PPARMOD= 0
##$PSCAL= 0
##$PSIGN= 0
##$REVERSE= no
##$SF= 200.130013532006
##$SI= 16384
##$SIGF1= 3
##$SIGF2= 2
##$SINO= 400
##$SIOLD= 16384
##$SREGLST= <1H.CDCl3>
##$SSB= 0
##$STSI= 0
##$STSR= 0
##$SW_p= 3612.71676300578
##$SYMM= 0
##$S_DEV= 0
##$TDeff= 0
##$TDoff= 0
##$TI= <>
##$TILT= no
##$TM1= 0
##$TM2= 0
##$TOPLEV= 0
##$USERP1= <user>
##$USERP2= <user>
##$USERP3= <user>
##$USERP4= <user>
##$USERP5= <user>
##$WDW= 1
##$XDIM= 8192
##$YMAX_p= 0
##$YMIN_p= 0
$$ End of Bruker specific parameters
$$ ---------------------------------
##NTUPLES= NMR FID
##VAR_NAME=  TIME,          FID/REAL,        FID/IMAG
##SYMBOL=    X,             R,               I
##VAR_TYPE=  INDEPENDENT,   DEPENDENT,       DEPENDENT
##VAR_FORM=  AFFN,          ASDF,            ASDF
##VAR_DIM=   8192,          8192,            8192
##UNITS=     SECONDS,       ARBITRARY UNITS, ARBITRARY UNITS
##FACTOR=    0.0002496,     1,               1
##FIRST=     0,             0,               0
##LAST=      2.0444736,     0,               0
##MIN=       0,             -332002,         0
##MAX=       2.0444736,     252285,          0
$$ Real data points
##PAGE= N=1
##DATA TABLE= (X++(R..R)), XYDATA
0 0 0 0 0 0 0 0 0 0 0 0 0 8 -8 8 -8 16 -16 24 -24 32 -40 48 -56 64 -72 88 -100 116 -135 153 -176 200 -228
33 -228 258 -292 328 -369 414 -463 516 -576 638 -708 786 -869 960 -1059 1169 -1288 1418
50 1418 -1563 1721 -1898 2093 -2313 2559 -2840 3161 -3532 3970 -4495 5132 -5934 6972 -8377
65 -8377 10384 -13525 19137 -32215 129946 -85701 -313837 129786 210867 -86494 -138319
76 -138319 105202 73933 -74576 -57426 41785 45973 36146 -34971 -98070 -3279 137387 30138
88 30138 -134921 -45949 109228 18956 -87552 6098 73761 -30150 -72196 11986 47015
99 47015 8387 -9393 -41875 -50608 41604 82723 -43397 -95196 31814 66918 -49529 -45127
111 -45127 60876 21868 -74633 -26835 50004 24649 -14287 -23353 -33256 2801 55603 7641
123 7641 -62613 -5282 51846 -24085 -45928 57775 44970 -81137 -42989 84797 27047 -71000
135 -71000 11390 59670 -51848 -49511 86360 51241 -89836 -38033 83207 20682 -60968
146 -60968 14466 54268 -30493 -42745 38149 40011 -17368 -15819 1915 -6057 16989 33443 -16287
159 -16287 -35203 22048 27934 -24715 -5380 42999 -5751 -53229 13292 54473 -11325 -34487
171 -34487 15287 9879 -22166 11273 30260 -19676 -29824 16463 14190 -12362 5866 10192 -23826
184 -23826 -15636 24751 12221 -20140 -5949 6441 -14195 -4698 23735 683 -29643 -4396
196 -4396 15102 -7976 -4728 18312 -12687 -36960 15135 36682 -24096 -32728 28451 14704 -45335
209 -45335 -6574 53971 -1390 -59615 -1438 47368 143 -31794 1849 14992 -6523 -6752
221 -6752 5170 4536 5301 -3344 -19861 527 34719 8538 -38033 -11083 38033 10844 -28392
234 -28392 2822 26922 -9458 -20939 17649 21730 -9429 -9330 6031 -617 3903 19441 -1495
247 -1495 -22996 4726 25875 -1342 -15171 9932 12942 -12639 -6582 17001 9982 -7871 -7193
260 -7193 -703 4725 12744 3270 -17919 -7635 19119 5760 -18844 1173 19160 -10462 -24004
273 -24004 12508 23662 -13915 -21923 7348 8912 -8313 -810 5202 -9252 -9035 6041 2967
286 2967 -7162 -498 466 -11296 -4327 10789 2036 -12720 -5952 3113 -1878 -1069 4398 -5059 -11352
301 -11352 2919 7707 -5633 -4641 7738 -1747 -14431 4334 18336 -4588 -17531 4245 12584
314 12584 -3694 -5105 7368 2711 -7690 152 8487 3285 -44 -848 -3366 2674 10521 2805
328 2805 -7452 61 8944 692 -3539 8146 6591 -7405 -3868 10710 7442 -4154 -862 4022
342 4022 -1714 789 8185 1491 -6784 164 6097 -115 -1889 5114 842 -7379 -355 7512 1440
357 1440 -4584 -2119 -476 -776 1630 1727 -3572 -4490 876 -140 -2839 1243 1488 -6499 -6589 3988 4122
374 4122 -5910 -5923 1480 -1659 -4790 999 2357 -4639 -5640 352 1044 -1442 -1083 -1725 -4600 -521
390 -521 2754 -1097 -3298 -786 -258 -2253 36 3263 -216 -3897 -1544 2277 2328 420 -516 -1075 -805
407 -805 2938 3486 -1306 -449 3203 1004 -2249 2651 6602 251 -5249 1165 7555 3318 -1814 -1246
423 -1246 2886 4531 933 -1154 2722 4901 -122 -4515 2428 8746 1462 -6577 -1386 7702 4356
438 4356 -4333 -2548 4436 2634 -2947 -1234 3299 2257 -2727 -3429 -26 3050 1682 -3450 -4774
453 -4774 782 3535 -828 -4308 -1821 1709 -825 -3740 -1068 1811 -1125 -4489 -3205 1205 1182 -2589
469 -2589 -3654 -2331 -482 1161 -610 -3562 -3210 645 1918 -3203 -4089 1851 2764 -4352 -5670 2652
485 2652 5766 -3251 -7470 158 5873 1489 -4361 -3152 2536 4227 -727 -4212 280 6956 2758
500 2758 -7053 -3158 10472 7743 -8819 -8658 10830 12776 -7314 -10489 8762 12770 -5200 -9650
514 -9650 6967 11950 -2224 -8430 1814 9485 3431 -4957 -3846 4478 7415 394 -6621 -646
528 -646 8863 3388 -8571 -3567 10248 5555 -9964 -6855 9337 7658 -8443 -7573 6216 5734
542 5734 -5678 -5279 4142 1803 -4903 -2408 2010 -853 -2884 551 -812 -4664 -770 4311 -2245
557 -2245 -7592 -630 4734 -2048 -6333 213 2074 -3871 -2628 1828 -1743 -3860 2015 1909 -7025
572 -7025 -3479 9580 1878 -13523 -2514 14632 1887 -15583 -2098 15367 1434 -13960 -515
585 -515 13575 1806 -10475 -1747 9019 4165 -3617 -2911 1308 5308 4029 -3064 -4559 4937 9311
600 9311 -2649 -8982 5478 13179 -3290 -11692 4095 14417 -267 -11749 414 12904 2662
613 2662 -9211 -1382 9100 3498 -6577 -2074 6024 3102 -2971 -2232 830 2301 1852 -1775 -4347
628 -4347 495 5702 -1059 -7273 359 6707 -2505 -7998 1411 6277 -4158 -7212 3236 3518 -6532
643 -6532 -2864 5608 -1872 -9054 1972 7927 -6102 -9975 5182 6997 -7910 -8215 5973 5302
657 5302 -7452 -6217 4831 4277 -3957 -4602 537 2611 934 -1935 -3643 269 5178 400 -6937
672 -6937 -690 8004 2137 -7752 -1991 8714 4340 -6796 -3808 6691 6556 -3814 -5659 4786
686 4786 8137 -1300 -5816 1977 7740 1427 -5231 -782 5595 4192 -2271 -3425 2927 6278 230
701 230 -5289 530 7018 2293 -6345 -1624 8063 3204 -6858 -2697 7160 3306 -6295 -1830 5231
716 5231 918 -4005 -756 2403 -915 -1739 366 -341 -1760 464 256 -2511 -1497 1516 116 -2595
732 -2595 -1593 816 -441 -2085 -989 -73 -791 -1191 -1257 -1096 -358 -6 -1182 -2063 -259 389 -1141 -1747
750 -1747 -56 -73 -1100 -701 146 -248 -718 325 -45 -714 238 555 -293 -650 838 1096 181 -71 640
769 640 710 977 517 49 890 1504 395 71 1326 2237 -65 -686 2401 2551 -622 -304 2744 1744
787 1744 -901 56 2680 1118 -843 557 2328 801 -414 239 1375 751 -235 -160 827 1066 -363
804 -363 -1031 691 1275 -515 -1461 -274 827 -587 -1192 -121 173 -1220 -1175 -181 -51 -979 -1393 -298
822 -298 -916 -1031 -363 -582 -1305 -942 -295 -542 -1214 -1105 -370 -376 -1093 -1027 -400 95 -978 -1321 -158 552 -640
843 -640 -1506 -256 865 -39 -1203 85 1131 -268 -425 303 607 170 71 392 351 482 922 676 -11
862 -11 668 1291 903 -254 597 1743 669 -58 925 1349 1011 260 398 1633 1226 249 412 1027 1597
881 1597 48 -337 1240 1585 39 -445 924 1570 -460 -1272 584 1266 -125 -956 481 808 -345
898 -345 -995 130 285 -185 -1017 -819 147 211 -1190 -1491 -364 -86 -1099 -1744 -317 -136 -1626 -1360 -494
917 -494 -118 -765 -1146 -1008 -682 -928 -327 -850 -863 -329 -422 -910 -890 190 66 -903 -490 336 -55 -86 -485
938 -485 -53 250 266 44 -482 -68 723 260 -245 282 976 -127 132 711 717 476 534 821 3 708 1819
959 1819 666 -477 965 1910 644 -805 1160 1961 281 -534 1328 1506 636 -115 680 863 758
976 758 531 -570 -200 1375 693 -1132 -245 1574 429 -1546 -111 1270 64 -912 -242 4 -476
993 -476 -227 -598 -1035 -304 402 -741 -2057 4 697 -1220 -1606 234 180 -1162 -646 -389 -1225 -741 863
1012 863 -737 -2346 -2 1310 -1695 -2603 1169 1634 -1989 -2204 1360 1197 -1387 -1275 598 838 -468
1029 -468 -254 -407 -172 1307 647 -1543 -490 2461 1198 -2042 -803 2782 1573 -1341 -544 2303
1045 2303 1829 -369 -1249 1155 2464 830 -1639 164 2896 1419 -1789 99 2765 1027 -1185
1060 -1185 -52 1380 596 139 -19 -538 483 2087 -81 -1983 594 3045 -627 -3134 1250 3074
1076 3074 -1824 -3117 2018 2140 -2735 -1252 2034 -398 -2567 776 1245 -2791 -1438 2290 -366
1091 -366 -3596 -264 2646 -1304 -3520 657 1885 -1855 -2054 712 479 -1593 -639 158 -1470 -769
1107 -769 1516 -510 -2654 255 2141 -1209 -2551 517 2120 -676 -1829 16 1985 576 -1639
1122 -1639 -1121 2381 1949 -2203 -1282 2540 2389 -1685 -924 2226 1430 -856 398 1276 280 667 1244
1139 1244 -513 -755 2271 2041 -2706 -692 4502 1657 -3990 161 5247 -235 -4145 1821 4043
1154 4043 -1748 -2244 2724 1229 -2484 112 2552 -1401 -1857 2293 1271 -3017 -378 2491 -616
1169 -616 -3085 673 1819 -2073 -1852 1563 224 -2609 -267 1186 -1266 -1623 844 20 -2570 -755
1185 -755 1081 -511 -1277 -458 -81 -400 -300 -729 -1043 18 417 -1720 -755 1731 -3 -1879 -186
1202 -186 1483 -268 -1656 176 874 -721 -101 698 -697 -560 1842 187 -1890 499 3217 -780
1218 -780 -2556 2401 2943 -2218 -1898 3512 1862 -2687 227 3315 -21 -1070 1914 1182 -1117 377
1234 377 1767 -304 -852 2078 1485 -1647 155 2659 273 -1922 1100 2263 -1079 -671 1812 457
1250 457 -1793 462 1404 -1056 -828 977 -223 -1521 434 943 -1405 -920 1303 -585 -1716 297
1266 297 373 -1594 -1093 648 -200 -1714 -241 519 -1675 -1132 771 -118 -1525 -245 550 -1585 -678
1283 -678 995 -298 -1842 344 1342 -1485 -1417 1228 529 -2096 193 1882 -793 -1126 1200 778 -1287
1300 -1287 17 1648 -436 -949 1108 883 -1006 75 2049 152 -997 1042 1332 -845 -16 2112
1316 2112 214 -1264 1394 1930 -704 -311 2164 569 -1112 988 1624 -699 -482 1872 455 -1017
1332 -1017 718 1571 -475 -543 1557 420 -1238 392 1491 -466 -1116 696 423 -943 -173 638 -699
1349 -699 -1025 691 -163 -1268 -386 633 -1158 -1172 985 210 -1842 -426 1109 -818 -1555 316 250
1366 250 -1398 -792 782 -942 -1494 384 307 -1430 -541 1066 -440 -1358 586 912 -1279 -634 910
1383 910 147 -1268 610 794 -1084 -326 1271 -157 -937 572 1339 -784 -442 1445 803 -1141 100
1400 100 1583 -275 -408 1123 868 -380 535 1137 30 129 1172 760 -629 290 1230 16 -360 1012
1418 1012 907 -737 -117 1331 -109 -441 959 881 -488 0 935 -162 -1042 257 836 -803 -640
1435 -640 730 -68 -1028 107 436 -832 -844 403 -61 -957 -214 336 -861 -732 155 -448 -1309 -336 210
1454 210 -847 -727 413 -444 -1208 -34 -176 -1275 -767 395 -61 -1132 -211 604 -900 -908 653 424
1472 424 -965 -49 575 -216 -830 221 597 -526 12 1034 98 -386 462 620 -212 -217 831 372 -401
1491 -401 547 1188 -348 212 753 469 -307 -109 1048 350 -158 678 471 135 476 320 51 83 818 300
1511 300 -37 285 638 -250 -63 297 136 -25 -41 213 -96 -74 266 -9 -521 157 126 -689 -358 306 -77
1532 -77 -660 -249 -17 -565 -642 -210 -165 -817 -609 154 -305 -578 -251 -58 -593 -580 76 -231 -713 -642 253 -158
1554 -158 -697 -412 340 -119 -343 159 360 -133 -127 -112 65 276 26 74 32 312 284 301 35 -58 204 441 78
1577 78 213 769 620 39 -128 918 800 -348 289 897 518 208 177 399 401 -234 285 235 118 134 486
1598 486 204 31 216 560 214 -215 359 463 -171 -296 238 364 -351 -514 329 385 -247 -117 345 58
1618 58 -715 -36 336 -645 -545 165 -221 -943 -295 222 -144 -969 -307 5 -536 -921 41 96 -548 -614 43
1639 43 -200 -593 6 -95 -363 -618 77 -73 -1103 -220 274 10 -776 -5 671 -19 -563 122 506 -333
1659 -333 -327 416 525 -339 -263 446 475 -14 183 432 250 137 360 561 167 158 1003 745 -154 127 873 506
1681 506 -38 118 1136 639 -416 666 1041 -229 -68 697 571 -161 -197 752 165 -394 50 569 -214
1700 -214 -716 272 487 -669 -201 421 -94 -635 0 -24 -581 -606 44 -56 -522 -193 236 -299 -943 -127
1720 -127 104 -483 -709 -171 -85 -705 -435 -27 -318 -531 -298 -3 -9 -671 -215 166 -182 -494 25 -306 -221
1741 -221 -119 46 93 -31 3 -204 72 -77 -46 437 229 -409 226 566 -11 -94 641 858 -145 478 828
1762 828 240 -39 462 624 244 -69 632 389 -68 189 623 116 -277 47 549 6 -116 653 408 -178
1782 -178 210 528 10 -148 388 163 -444 2 286 224 -222 50 177 -319 -92 -179 38 -313 -386 134 -247
1803 -247 -322 0 -151 -816 -290 -119 -482 -613 -245 -356 -386 -391 -336 -646 -246 194 -609 -118 -309 -489 -240 58
1825 58 66 -327 -217 89 223 -152 -357 230 -157 -104 392 421 -124 -290 562 64 -378 167 392 -172 -299 764
1847 764 527 -148 395 391 34 -1 112 355 58 167 533 254 275 459 162 6 -39 394 715 -121 198 300
1869 300 125 -13 372 376 -123 277 471 23 -66 1 75 -283 -100 32 -75 -188 -289 -189 -338 268 -171 -597
1891 -597 58 -26 -190 -410 -301 -154 -206 -520 -69 -178 -741 -20 -17 -280 -562 -262 -163 -400 -353 198 -462 -538
1913 -538 -27 -272 -424 -308 193 -189 -242 -75 434 -25 -154 -76 115 -197 -86 11 -71 106 287 191 -53 169
1935 169 282 37 454 110 362 344 106 256 191 350 458 364 74 212 136 226 165 333 121 -20 255 254 -42
1958 -42 193 -48 1 -26 166 74 -122 -14 423 -137 -46 103 118 -210 -198 -333 -195 -195 -255 -161 -89 -243 -432 7
1982 7 -210 -654 -240 -117 -316 -335 -26 -274 -85 -79 -159 -170 -142 -171 -275 -464 83 -192 -396 -3 -218 -249 91
2005 91 -255 -74 -313 -98 -133 -219 -61 -113 61 -13 -133 -52 -59 194 302 83 132 428 385 340 -174 173 455 124
2029 124 133 384 305 -107 303 481 60 138 424 207 180 205 685 338 108 425 249 205 -35 420 403 230 -72
2052 -72 313 233 -9 111 250 -145 61 -87 42 -47 201 -139 -151 -3 -441 -105 64 -118 -11 -110 -263 -316
2074 -316 -362 -130 -165 -317 -226 -228 -199 -263 -336 -5 -284 -489 -79 -58 -224 -359 130 32 -498 2 219 -105 -422
2097 -422 154 89 -322 64 -1 -110 -288 110 251 -176 58 152 280 -212 -336 118 339 122 339 482 93
2118 93 487 193 305 156 52 122 303 -12 -210 74 517 642 201 318 195 57 230 470 67 115 233
2139 233 384 -37 -121 86 126 -258 247 351 -245 -366 84 369 130 -128 -134 -8 -282 -286 -10 222 -408 -381
2161 -381 124 -138 -407 -223 -112 -99 -303 -14 4 -443 -259 19 -289 -476 -44 84 -272 -173 -396 -88 -93 -368
2183 -368 77 24 -251 -326 -228 20 -307 -306 326 -242 -306 12 -87 -240 -251 -27 191 -265 -99 483 165 -121 256
2206 256 111 137 218 386 180 -2 91 197 266 -21 123 245 63 95 194 186 299 236 199 105 318 229 391 256
2230 256 197 190 5 280 -188 150 175 120 -248 -212 -9 -107 -153 15 -110 -321 -73 36 -99 -231 -2 -145 -479
2253 -479 -245 47 22 -459 -289 -151 -169 -282 -22 194 -655 -231 -119 -186 -348 -262 -9 -140 -25 -8 79 -164
2275 -164 -137 26 -178 -255 22 -154 14 74 40 10 -8 96 203 198 -20 302 -55 283 165 179 85 163 410 178
2299 178 97 426 -88 17 520 51 -110 394 306 260 103 301 316 -220 88 466 40 118 -81 304 85 -59
2321 -59 345 -103 73 84 169 -107 -40 23 33 -277 65 165 34 -79 84 -41 -242 -371 325 -71 -348 -16
2343 -16 122 -344 -194 -161 -182 -132 166 71 -579 -131 -70 -147 -340 -189 -194 -305 -109 155 -115 -123 -93 3 -545 -219
2367 -219 298 -301 -221 557 55 -45 133 112 70 -320 111 171 -84 48 414 271 -70 269 442 -43 -296
2388 -296 282 431 138 -24 336 249 79 31 392 -297 10 538 151 -21 8 501 -128 172 278 180 -8
2409 -8 71 21 -64 -60 202 -128 -269 17 3 -165 53 58 -198 -135 88 -168 -448 -28 278 -223 -407 -13 41 -768
2433 -768 -373 -235 14 -393 33 -137 -160 -201 196 -146 -505 -166 19 -540 -211 -164 -161 -293 -69 182 -245 -527
2455 -527 -80 234 -115 -135 388 -260 -152 293 -100 -151 -91 -8 182 42 217 57 15 177 111 14 -1 264 290
2478 290 26 136 513 151 -133 320 252 -160 205 488 -68 -345 446 112 184 12 548 94 -70 220 341
2499 341 -301 -237 499 67 -126 155 306 -254 146 55 174 -510 18 405 -151 -414 223 230 -135 74 -99
2520 -99 -19 -294 -30 -4 -447 -120 111 224 -163 167 -87 -154 13 66 -361 -305 177 -167 -194 -250 310 -235 -505
2543 -505 12 227 -121 138 322 -349 125 -40 -9 1 101 443 -144 -212 -175 131 -135 74 668 -43 -39 326
2565 326 371 1 -21 651 247 -327 62 511 64 91 461 373 -122 104 238 -102 196 435 469 -4 84 286
2587 286 69 180 57 134 109 77 74 -80 -69 36 -224 -10 65 197 85 134 134 162 -369 -186 -58 -218 -209 73
2611 73 -278 -249 -5 27 71 -384 -176 133 -561 -345 35 -280 -363 51 310 -139 -229 73 -64 -68 -45 -106 -281
2634 -281 -97 45 141 -222 -153 32 -384 -377 219 -13 -182 -19 60 23 -65 117 107 -1 -32 261 -40 199 98
2657 98 368 120 111 332 97 -87 204 198 55 220 10 91 124 -134 115 -13 215 24 -14 121 47 5 387
2680 387 -106 121 -150 42 21 36 -457 -101 277 66 -218 -22 237 -218 -204 64 -125 -279 -102 -253 -29
2701 -29 67 147 -48 -367 17 19 -247 36 -82 -207 -160 -151 -114 154 -5 -137 -112 -141 220 -30 -284 67 14 -36
2725 -36 48 -237 8 88 -57 -63 264 -19 -74 -101 43 -67 47 39 -73 240 300 91 38 -53 -129 52 215 455
2749 455 122 -99 473 50 -179 344 341 -73 27 413 39 189 16 212 318 194 257 245 -90 270 208 221
2771 221 115 -118 182 195 -64 216 260 -110 38 40 52 -98 18 -155 -129 46 -45 -274 -255 -26 -82 198 15
2794 15 127 -334 -70 -1 -84 -236 -290 -213 -151 -243 116 24 26 21 66 -100 17 55 20 200 -3 21 -139 156 207 -26
2820 -26 126 -115 157 -3 38 228 -66 80 127 372 18 62 -73 -51 30 -4 36 173 -4 155 75 220 247
2843 247 284 94 -75 282 -29 -61 -43 -3 132 -69 27 217 36 92 3 46 105 -118 -1 278 -158 64 -54
2866 -54 -88 -129 -98 -261 -3 14 -209 283 -162 -182 -49 -30 40 -277 -222 74 -60 32 -31 -42 -250 -121 -63 -231
2890 -231 213 114 91 -242 -413 -195 -159 -54 150 -306 -341 105 191 -164 -127 152 95 72 16 27 31 -420 215 -72
2914 -72 11 -118 34 -149 -35 26 3 270 188 23 25 -179 -77 303 96 -34 285 3 366 215 169 199 100
2937 100 68 -30 26 51 201 -116 376 260 198 128 26 -53 -69 315 -14 84 156 162 130 -122 -2 347 -120 -44 -158
2962 -158 79 -115 -149 191 -88 -34 -51 -70 0 -242 77 -145 -3 10 -29 -107 -170 -53 273 -116 -304 -17 164
2985 164 -109 -286 41 -218 64 254 -14 -308 2 -17 -142 -133 204 250 -168 -138 5 -115 55 -91 -178 -101
3007 -101 128 -93 100 72 41 157 -20 136 -106 64 113 323 -116 47 250 402 249 78 153 89 134 46
3029 46 422 -157 -71 -46 -29 138 -62 126 96 180 -86 282 267 65 110 -36 -248 -17 258 -11 390 63 130
3052 130 -119 -36 393 -185 -287 140 -110 -4 -147 -172 -198 -112 160 64 62 -240 -92 71 -153 -167 -49 111 -87
3075 -87 310 127 -259 -14 -215 104 -86 272 -79 18 -115 -133 -16 23 -78 -41 36 -72 -145 -15 -60 6 137
3098 137 -272 -4 135 139 84 -34 -182 131 145 32 -56 -244 166 210 158 105 99 -150 -181 192 -153 73 -92 49
3122 49 209 80 44 254 102 -47 208 22 84 91 94 95 -41 359 -11 139 123 120 360 -164 -264 75 30 -100
3146 -100 -200 156 -56 114 -282 -58 191 -29 -62 -211 34 -174 -300 -148 193 -135 -182 111 -281 -89 -28
3167 -28 -61 3 -195 -16 -85 -234 74 26 -22 -20 -16 298 -345 -6 -97 -144 -180 -89 220 -274 73 113 -21 -145 -220
3192 -220 83 -162 -230 93 -37 108 97 77 -101 -77 -34 -64 -163 131 274 -9 -17 -306 124 -59 -150 55 234
3215 234 451 -102 239 164 -58 -37 205 -106 165 16 -156 -15 181 104 -48 169 -60 -336 63 105 -69
3236 -69 -244 -115 136 167 42 158 -65 -20 -30 113 265 -101 -28 -232 -143 177 55 49 150 -2 -116 110 -104
3259 -104 -280 204 -196 4 59 -38 -22 3 -92 -81 -92 46 -58 -66 174 223 56 66 -16 37 -155 -32 36 10 -27
3284 -27 50 102 -127 -59 -130 -37 20 94 63 162 -117 -108 14 -41 13 181 178 91 -225 -66 173 -98 158 -154 71 16
3310 16 168 -73 71 -29 -15 58 191 -113 -286 135 -186 6 -58 -180 -180 -223 -149 -66 199 -166 -47 186 201
3333 201 -23 279 -224 -111 -84 -372 -124 74 -69 -316 100 -6 -57 -22 87 322 64 -175 -45 -244 -18
3354 -18 -90 124 -71 -28 -196 -19 168 -86 -33 -279 -189 -114 172 -46 14 280 240 -120 51 113 84 7 -89 180
3378 180 92 25 90 191 187 95 -34 61 170 9 255 60 34 -150 47 155 -25 86 65 73 66 62 -217 36 162
3403 162 77 -31 -11 -169 194 -187 -57 101 204 147 -12 165 15 -59 -47 150 -308 -26 -56 -83 -216 -16
3425 -16 -123 -289 250 2 -56 -188 59 22 -244 74 196 61 39 124 -283 -27 75 -42 -55 54 -22 -229
3447 -229 136 -79 -11 224 81 283 -73 145 83 -92 132 -169 262 343 47 -62 -31 116 -38 140 301
3468 301 -40 -133 -103 119 -50 -104 -61 146 89 53 -31 -33 249 57 -191 213 278 117 255 319 -221 138 76 -2
3492 -2 -33 60 94 -164 -9 125 -26 152 -167 100 111 -24 351 -76 -183 137 102 134 -160 -59 -108 -160 35
3515 35 59 -172 -293 -68 -21 -62 -132 -188 -264 -254 -57 89 -71 150 132 -317 169 -25 159 161 -151 35 -49 -355
3539 -355 88 178 -192 206 -202 -28 -208 -198 -113 141 -102 -236 1 -10 151 102 -269 78 16 108 -1 237
3561 237 330 176 70 -211 -84 48 -15 159 -70 138 492 58 -366 -5 48 23 -97 76 199 161 -189 -113
3583 -113 -197 212 219 -185 190 86 91 138 95 152 141 218 12 97 177 71 33 -151 -336 121 187 70 164 -22 -221
3608 -221 -235 15 91 12 102 -84 -22 -255 81 -129 -200 120 -133 -90 -212 8 163 -206 -145 -182 -231 -364 140
3631 140 20 -52 -59 23 -32 167 55 -121 90 20 -198 -195 150 -63 -47 47 -243 -176 48 62 140 66 97 -208 -52
3656 -52 110 -187 -227 -204 25 68 94 -42 104 -310 168 113 181 146 -278 213 26 163 127 127 112 216 156 -58
3680 -58 -209 45 -195 190 129 -503 142 -124 -271 -12 -8 -79 40 -9 61 118 -18 -209 92 -43 71 27 10
3703 10 158 -33 -72 258 -253 -168 -33 192 -68 46 -52 -253 -276 -58 121 -134 -31 59 -128 -79 10 71 32
3726 32 -106 4 -5 96 -40 -12 107 -176 99 -255 134 72 277 -251 -14 110 33 -63 28 182 -48 -159 188
3749 188 150 -100 -145 74 -89 -82 -101 -93 112 124 328 -9 -80 -243 32 327 72 -52 321 22 -92 -117 -349
3772 -349 34 -50 -60 -63 -76 -53 113 -75 81 -154 -73 -27 -88 -169 58 73 42 -222 -87 4 -41 21 124 131 -131 -32
3798 -32 123 -3 170 79 -81 -56 145 -215 -135 -216 128 -48 8 -80 23 79 154 24 -113 -1 -59 179 -101
3821 -101 -71 214 265 -194 -17 131 148 83 -67 -112 107 200 9 141 56 -133 341 176 38 -134 32 242
3843 242 70 210 -152 124 10 179 -72 0 211 -71 27 45 -224 83 39 149 303 73 -208 38 -161
3864 -161 -303 -155 -151 -232 167 142 -102 -181 227 -165 -2 175 -56 -88 -113 39 358 -89 -154 184 94 174 -32
3887 -32 89 -3 -230 -208 164 5 -151 22 -84 64 -8 141 -42 -35 -163 -15 -89 -104 -9 271 178 -212 254
3910 254 102 96 68 30 209 43 -2 186 22 -194 200 74 26 -28 123 -141 -149 120 214 14 78 -247 -82 -246
3934 -246 125 211 24 175 215 -96 -69 -47 30 170 46 149 192 282 100 9 143 124 56 106 -283 -78 -197 -13
3958 -13 95 -212 -102 -99 43 -79 -68 -113 -210 386 -39 -49 -1 25 94 -125 -116 158 256 -10 124 -18 -232 -59
3982 -59 92 61 225 -7 -44 -241 -230 -76 -63 -102 -204 -153 43 120 17 21 -109 -123 -206 189 67 -96 -215 -105
4006 -105 -41 -175 65 -48 63 -27 164 171 -102 -219 46 178 -90 208 -223 152 2 -13 309 94 3 -78
4028 -78 -210 161 135 77 151 -17 -107 -205 -17 -70 -208 -134 123 24 115 59 -13 -91 257 -101 -139 206 -19 -81 91
4053 91 -43 86 18 40 101 -166 119 147 72 -328 -125 140 -81 -82 65 -42 -74 -70 -260 -40 -171 -423 15 -147
4077 -147 -189 34 -3 62 -96 309 -27 -115 -169 -28 -45 -85 -42 31 -130 -394 109 173 124 -239 91 -351 52 -255
4101 -255 -65 60 -19 -15 316 -11 155 15 -82 82 53 -114 232 105 -127 238 240 134 -182 148 -69 306
4123 306 129 -44 -156 -142 33 -21 -89 187 -31 14 -293 89 156 -21 141 10 166 93 90 -142 2 168 134
4146 134 246 6 -31 48 44 -64 290 55 -97 106 81 -35 15 -115 102 142 -88 174 177 113 170 44 -36 -114
4170 -114 48 152 -232 -76 -26 -65 -28 -59 -41 -211 -107 -145 -29 30 -87 10 18 89 150 -35 -156 123 18 -68
4194 -68 176 48 69 5 -157 226 -109 17 9 -114 271 -85 44 250 201 270 104 115 185 -2 176 70 71 158
4218 158 -158 8 126 -389 36 179 209 -20 45 -49 -227 278 -14 22 -66 183 86 -3 86 234 -370 79 -3
4241 -3 -114 -14 -165 5 -66 161 -19 -113 -151 -184 -211 -213 276 -53 -21 -49 105 461 25 173 190 119 5 -66 43
4266 43 226 -310 -245 179 -278 -31 157 -96 -147 -152 376 -101 -40 113 5 14 18 -154 127 41 165 202 276 231 269
4291 269 102 112 -2 52 -43 76 -15 160 115 243 54 133 -173 -139 48 42 304 217 -69 -56 -65 -67 112 113 -16 -67
4317 -67 -3 133 -107 -92 97 117 -63 -61 -74 23 198 263 -95 -4 98 -123 -233 37 -19 203 111 -199 -7 -162
4341 -162 -170 -72 -118 -236 -98 101 125 -185 -394 -58 -47 -8 -27 124 -185 -20 -50 76 -296 -287 -138 -21 194 -217
4365 -217 -2 32 -106 17 -129 71 -102 23 29 137 176 -138 182 78 98 164 44 -82 -100 181 -224 -141 78
4388 78 -3 36 -49 391 227 -46 92 -9 350 -172 -124 263 147 344 -50 -4 -143 84 59 8 -172 -92 52
4411 52 118 -237 -79 288 76 -49 -260 64 -107 -197 -169 96 -241 58 -259 106 -244 -15 -55 -95 -13 30 68
4434 68 73 -44 22 68 48 -168 110 -338 -58 -67 -297 -113 167 17 51 -92 -34 321 -149 -97 47 -219 -58 -201
4458 -201 -69 -291 168 -53 128 213 -101 25 -94 62 78 54 112 -4 39 106 85 14 92 66 54 -134 65 152
4482 152 -216 10 -241 -30 65 268 -100 -98 -169 154 -33 97 -49 -269 -51 -6 -155 194 167 68 98 -14 -41
4505 -41 122 330 154 -235 186 -49 70 176 -134 -40 -170 -27 101 118 -109 -7 200 197 -244 -118 179 -56
4527 -56 -298 136 45 -498 -135 -95 -26 -91 -166 -3 -35 26 188 -79 135 65 177 140 -172 -156 144 137 -62 -71 99
4552 99 -143 -58 -87 -78 -127 -249 34 102 193 99 -131 -79 102 93 -146 184 62 -21 40 -201 89 281 284 18 119
4577 119 -151 233 222 -43 -49 -17 66 -128 -42 -347 -108 -54 -78 77 45 21 89 -115 -26 -318 -119 99 187 9
4601 9 -77 -56 24 -243 59 -175 88 126 142 -150 67 -60 58 -83 -325 186 -171 59 -61 -44 -124 68 7
4624 7 -279 -15 -108 51 -61 -61 -116 297 221 103 -195 46 171 -160 287 -1 135 7 -131 155 186 152 -133
4647 -133 202 145 -192 57 89 -91 370 334 -91 -5 -28 0 -132 52 201 53 83 -44 62 49 -1 123 103
4670 103 142 -250 -110 56 33 -7 75 284 21 82 31 227 -96 -104 143 -170 -150 -41 158 135 25 37 72 -80
4694 -80 -80 80 9 -132 51 39 241 -62 245 -70 -165 79 -152 173 -118 326 -59 87 284 -424 -56 -207
4716 -207 -138 -122 41 193 -57 71 -28 5 159 65 -316 -75 95 72 -111 47 4 -217 -41 -254 77 -274
4738 -274 19 133 67 45 -20 155 41 -42 73 259 161 -13 -132 -279 7 -111 -51 -16 47 -169 -56 70 -106
4761 -106 -30 -163 -78 85 98 23 182 -153 242 -84 -147 -107 -61 -106 -86 -56 95 -168 -16 -287 -7 -18 45 -9
4785 -9 -6 -30 -74 42 75 -282 -39 -130 232 -190 -29 -67 -59 -125 126 -104 15 42 -174 -7 84 -108 48 28 -60
4810 -60 -155 -156 -211 -84 -45 21 -134 43 -83 0 176 -84 -49 -35 125 94 -48 -40 139 41 -210 -54 -13 164 68
4835 68 -123 -60 -169 -51 -107 -206 38 149 -81 124 -49 -23 -209 -142 -83 -73 81 71 -109 100 188 73 139 8
4859 8 -95 23 -21 72 36 91 -2 -162 -4 -142 -3 -101 212 32 45 133 -4 -264 -17 146 -261 107 -175
4882 -175 -87 151 286 -72 76 -131 30 -92 -6 -215 -11 -8 -102 1 -137 118 109 -176 -65 -69 -275 393 10
4905 10 -230 -81 118 72 -51 -49 -31 -155 89 -12 144 -93 -266 -38 -61 -19 -172 -90 141 99 -21 -25 -345 127
4929 127 -148 131 238 211 80 -119 213 69 196 -105 57 199 -1 -143 20 14 -57 20 6 1 168 -156 84
4952 84 -50 -34 -86 -25 126 -85 101 -58 54 -72 -184 -9 -20 181 18 -249 -24 -172 162 -88 52 -119
4974 -119 44 -98 -118 58 -26 -106 94 -164 -89 -29 135 -180 -87 62 55 201 41 149 11 93 -21 -188 -171
4997 -171 182 -5 -210 50 176 -61 181 -117 252 51 -106 161 -45 120 40 -171 -103 -29 173 -147 -26
5018 -26 26 3 -49 -46 -67 75 96 163 158 -128 255 111 47 -3 -45 213 112 -95 -50 18 149 -3 -45 -56 -40 40 -73
5045 -73 19 364 30 -29 -403 -169 17 8 58 -233 -26 -63 33 -50 225 -74 82 -33 -9 29 20 108 -139 -29 -6
5070 -6 -206 9 213 -69 26 146 139 -123 -33 -209 -70 -56 -57 -26 37 -8 -171 -218 -233 -76 37 -2 -39 7 165 -42
5096 -42 221 -140 63 -150 -39 25 35 43 48 184 73 234 104 6 41 -110 -223 279 202 280 34 -84 200 183
5120 183 -129 -68 18 60 21 -135 -39 -3 -155 -33 96 -6 -129 54 -32 -126 11 -414 8 -64 -125 -45 -147 -189
5144 -189 -70 117 286 73 -98 -3 160 -191 -354 336 380 -34 130 46 13 -84 -232 -38 183 -23 -98 -39
5166 -39 -375 -126 -91 153 99 93 -52 168 -216 -86 116 90 -32 50 60 11 142 92 32 32 -74 96 -153 76
5190 76 15 -34 78 0 172 -165 128 -27 232 22 -74 105 21 161 344 116 -47 -4 121 202 152 137 210 -95
5214 -95 198 -121 254 -32 242 114 97 14 338 32 -84 43 2 -65 -126 177 -153 66 -195 -120 56 98 -116
5237 -116 25 307 185 -40 21 -323 0 -2 -77 102 -162 26 -130 -167 217 -102 -68 -130 193 29 -91 55
5259 55 -62 104 -100 -19 -17 151 121 57 28 -344 -46 -46 -98 -132 -39 -51 -105 -56 -99 20 -114 -50 131 200 152 60 -116
5286 -116 -189 75 347 -31 16 121 -69 103 17 -52 26 139 -60 -120 -85 -6 114 112 -126 25 -246 -185 172 -27
5310 -27 313 63 -31 -16 2 120 210 -169 -41 2 -88 -63 -166 28 55 5 250 86 -168 49 -287 52 -115
5333 -115 -162 -225 -104 140 71 -63 -8 -44 -156 -24 -138 146 82 -189 1 -56 -19 123 -185 -120 -5 331 -373
5356 -373 -315 -119 51 94 -214 -61 223 7 -38 -79 100 66 102 72 151 144 -193 55 -78 97 139 102 -56 212
5380 212 -3 77 304 21 -88 147 12 -132 -465 92 -197 65 21 51 -28 -157 196 -349 -171 112 241
5401 241 150 261 -122 -214 -10 -69 42 216 25 -238 39 59 64 90 -68 -40 19 19 40 -140 234 -16 -19 -238 -102
5426 -102 110 -192 -28 -273 87 -25 -195 46 -80 -38 17 191 68 283 -147 121 -58 -173 24 140 56
5447 56 -319 66 22 250 102 148 -111 79 -69 -179 -79 -114 73 -54 -45 -32 101 194 -132 168 74 -225 -1
5470 -1 117 59 -4 -109 -46 103 114 69 56 162 214 157 78 62 -114 -2 -27 -195 61 193 83 -86 -50 242 -142
5495 -142 -56 -56 52 99 -178 80 -124 -190 58 -175 -62 -164 -30 60 73 -45 109 -67 -133 -231 -266 -147 87
5518 87 23 39 -185 138 -196 -157 89 146 -98 80 160 291 -22 -156 18 31 -361 -198 -45 174 3 -5 5
5541 5 -80 65 -133 150 -186 71 19 84 -26 -85 130 -35 142 104 -71 81 -110 -128 -47 68 91 -104 -64 -262
5565 -262 43 -9 256 420 -26 158 138 -128 46 121 -415 -43 158 135 25 159 22 41 53 54 120 -35 13
5588 13 -126 -65 -75 -136 -60 196 -112 -114 -67 28 -47 -165 -125 -349 -12 -197 -88 -9 -48 72 -74 -126 -4 138 -44
5613 -44 -225 237 -7 33 28 -26 -275 103 147 335 333 -57 -23 -34 18 247 -42 359 -146 -1 61 108 92 -36 36
5638 36 -269 -150 123 -226 150 244 -261 -356 256 -83 -271 238 132 70 -42 30 56 56 70 267 218 225 227 113 98
5663 98 123 36 58 -106 -75 177 260 55 -19 -69 -13 118 45 -74 -125 -333 -13 240 58 -60 -420 -84 179 51
5687 51 56 96 -161 172 -34 292 -2 -111 -97 -130 -82 -61 -95 -91 -77 39 68 -96 87 -66 74 -57 -109 30 89
5712 89 -96 -157 36 -204 -1 75 168 26 -48 282 65 -235 215 -373 78 134 129 -44 156 -281 -234 -294 178
5735 178 -38 83 -13 16 282 32 -172 -74 -24 -32 143 -148 7 -210 106 -301 398 -80 73 -212 52 38
5757 38 35 -19 64 27 -39 95 25 52 -213 99 -118 161 95 -139 -393 81 22 -36 -18 225 280 127 47 -27 -138
5782 -138 97 33 -59 -86 -131 -209 -46 -207 -9 -10 -181 -19 83 26 -153 341 -192 213 217 -227 30 -35 -89 -371
5806 -371 -79 -90 -74 64 208 21 -123 99 -182 -141 -315 120 93 -180 -32 89 124 -53 186 -174 188 99
5828 99 86 -107 -95 6 82 112 -7 123 148 116 114 -3 114 -22 -25 16 -148 -175 68 -17 28 -81 -274 -127 18
5853 18 44 -150 -112 48 -57 -205 142 -21 178 211 148 -164 -130 -327 108 145 -213 155 -58 -106 54 -13 -19 15
5877 15 -25 -143 104 14 52 126 -84 70 -263 30 -168 -105 145 -1 169 -155 7 -44 32 17 -43 -139 -221 258
5901 258 -52 182 -62 4 -256 171 -18 -145 -78 49 -51 51 43 -188 -176 240 90 73 69 5 48 13 -41 303
5925 303 -127 120 124 -41 -62 156 39 -234 -3 135 24 -254 -80 -189 158 -186 337 -62 -58 174 47 167
5947 167 92 -341 226 -295 258 100 -13 55 83 111 -233 -123 -244 -39 -140 131 182 79 5 -26 -12 96 97
5970 97 -144 -4 162 60 158 -295 -319 222 0 -69 -66 49 -185 -30 -66 -95 -171 -162 245 -33 145 119 -17 -36
5994 -36 326 18 -260 213 -94 64 197 -168 139 154 -13 15 73 14 -68 211 270 304 114 59 9 104 221 56
6018 56 131 34 -123 -91 -69 139 420 7 142 -141 -294 -158 -15 1 130 13 -69 36 61 -168 13 -222 -190
6041 -190 -207 33 220 -133 -210 -88 93 -108 245 -112 -305 -46 -19 -31 61 43 456 381 -191 -107 1 94 7
6064 7 -172 195 88 136 112 -100 -169 42 11 -44 -133 44 -51 -158 -144 2 160 -147 57 122 23 -147 -154 -25 -150
6089 -150 -168 -69 -184 -115 -127 86 -221 211 287 -33 -94 351 352 20 377 72 -19 2 -285 278 -115 -27 -42 3
6113 3 -145 -61 156 -44 -177 59 -16 294 5 -90 -8 -177 -52 24 202 -116 40 29 -193 146 -40 135 -215
6136 -215 100 -63 11 148 -27 91 -344 -78 14 261 110 -50 -206 -56 41 30 80 -165 71 -84 -160 -23
6158 -23 -55 -63 212 -169 -177 -30 -206 -59 -116 36 293 -106 14 196 279 169 134 -173 -5 -53 92 -18 -45 -1
6182 -1 -4 94 -186 -102 -42 89 232 184 -175 174 33 307 256 237 183 -202 209 41 30 73 104 35 -107 262 -167
6207 -167 -13 -139 -71 17 -245 189 92 -132 -101 -189 -16 27 284 -11 70 19 175 68 -200 -106 -113 -80 -161 -111 246
6232 246 -158 152 -182 48 210 -232 -49 -33 -131 -32 -118 -63 147 159 -309 28 -35 95 -115 84 95 -205 59
6255 59 74 2 -121 -385 104 4 100 109 6 82 67 -31 139 -79 -104 -52 219 252 -385 197 102 -76 -166 138 237
6280 237 -87 119 79 22 152 5 140 211 -81 48 241 -118 -97 172 124 135 -148 -50 -105 -338 -44 13 -240
6303 -240 -94 -139 -125 -56 -234 -129 12 -188 -330 -108 61 -118 96 230 -94 -182 286 143 -63 174 -97
6324 -97 -225 20 27 96 19 -300 112 -252 7 -78 7 -55 -200 -16 -67 14 -247 -138 292 -159 -65 -55 -457 -49
6348 -49 -188 -3 -24 81 98 47 100 66 -104 91 124 36 7 226 -110 52 309 -118 116 103 295 -98 10
6371 10 361 192 -259 78 73 -340 296 170 -121 -225 -39 -68 216 62 -249 168 -183 -167 16 74 47 -5 -176
6394 -176 -302 82 -27 -124 92 270 280 -19 -98 101 -87 51 -268 -225 -139 222 -156 222 281 -24 313 -10
6416 -10 -243 287 -58 -58 30 26 -322 27 187 -10 164 -47 -34 -17 -85 147 -84 -163 -57 167 -141 25 -167
6439 -167 -103 95 18 160 67 130 -92 49 -15 -104 195 212 -58 -235 7 -183 59 189 -94 -62 -62 53 63 123
6463 123 234 234 102 64 -140 -15 75 -34 -52 418 111 -134 21 71 57 44 16 206 -301 -87 18 -17 111
6486 111 23 20 -175 286 97 55 52 -258 -34 163 111 59 -132 180 259 -198 282 -161 124 -70 -279 -310 191
6509 191 14 109 -40 -186 131 -140 -282 -67 -126 207 -101 -77 -86 26 75 -71 79 -112 278 -118 164 -214
6531 -214 132 -300 176 159 17 -117 -196 -156 23 52 -115 107 -3 -112 131 0 33 320 222 292 -234 108
6553 108 27 95 -16 135 -48 113 -86 9 -13 16 100 111 99 -177 -115 82 214 -52 -40 158 -162 -96 43 87
6577 87 -316 22 53 214 113 82 93 37 -197 -8 -181 -88 -184 -90 -96 -198 -150 -158 -236 -185 15 -95 179 168 104 -278
6603 -278 80 -40 -26 200 -45 -35 70 81 8 -162 43 -125 24 -112 -84 151 21 27 69 160 29 -59 91
6626 91 -26 -275 137 146 59 -106 30 -130 -37 -164 -135 -233 144 -28 -61 228 -96 26 224 -65 -127 19 -178
6649 -178 -47 -18 90 45 261 -292 -36 23 -4 -123 -161 111 12 -236 90 82 9 -61 248 -75 -171 -52 -137 162
6673 162 -44 -88 -87 -68 -78 -266 126 -115 -126 3 22 -84 -150 -132 -11 -44 -110 83 -2 168 167 79 -20 -253 -159 228
6699 228 110 180 -3 -174 -6 115 -20 -80 48 106 33 -44 -15 -94 44 417 41 -2 -146 -188 174 278 104
6722 104 64 -98 110 190 -68 198 -171 36 192 -86 -34 118 57 72 -18 -223 -52 -7 -211 36 293 -65
6744 -65 18 -151 61 213 -130 103 -217 38 -134 22 203 72 105 -115 112 -200 -123 280 -76 -33 -67 -64 -142
6767 -142 -315 -49 -209 -34 -82 33 -46 -191 -128 -134 -170 -181 141 395 19 -357 -96 -17 -27 -110 65 -273 -123
6790 -123 47 -235 122 99 133 -99 134 -26 -110 -122 264 -54 -63 133 -28 134 -125 17 17 -7 81 20 32 158
6814 158 -118 -171 3 -19 154 19 174 -6 256 97 215 8 -41 -55 47 223 -173 170 13 62 11 113
6836 113 95 108 42 13 -109 124 -141 203 -38 -46 -89 -112 170 50 146 -83 -112 -58 94 3 117 -180 -181 -459 14
6861 14 161 -38 -148 -98 -256 -58 45 -267 -144 -126 -25 218 197 178 40 23 -149 -24 -178 -151 -126 52 -163
6884 -163 2 82 -13 -210 -229 129 148 47 5 -86 91 204 44 45 -70 -2 -29 -88 224 218 -165 22 220 225 210
6909 210 76 79 25 46 145 -132 17 -88 48 281 -61 185 -105 -127 214 72 2 -202 300 120 -216 -99
6931 -99 275 -23 -132 278 11 118 -105 -136 40 -59 174 -6 13 48 -52 59 -138 21 -24 -79 -45 -15 -218
6954 -218 114 -142 45 162 -266 83 145 135 -337 -137 231 -200 -48 -107 -70 -46 -64 -53 -64 58 -79 -64 -269
6977 -269 -140 -232 -8 158 -58 -229 -147 21 20 -59 -32 249 -12 192 -286 -135 298 195 136 -52 134 151 369
7000 369 -121 -52 -17 162 0 -6 -186 228 -152 39 -161 115 -43 -134 97 49 38 -92 35 63 38 139 -244
7023 -244 187 160 -392 180 33 -115 80 -28 107 12 87 175 203 -7 -333 -34 -90 220 -351 16 317 2
7045 2 124 -111 -185 239 -333 87 43 -213 1 79 -190 -37 170 44 -136 -39 -196 -183 -22 -450 164 -121
7067 -121 -115 -26 210 -19 14 -163 138 -85 -258 15 -120 24 303 60 -255 -44 -91 174 146 89 -25 -50 -165
7090 -165 -67 -187 354 116 -28 141 240 -34 -267 31 23 187 173 -181 -34 -128 -168 -185 -70 29 -27 271 -32
7113 -32 311 -146 159 -41 -59 77 93 90 -99 -159 -49 44 158 -88 0 -20 -37 216 219 -3 -157 86 183 11
7137 11 -154 109 -57 111 75 103 -271 -79 114 79 -40 -107 107 -88 -103 -24 -127 -98 134 40 180 55 198
7160 198 86 227 -152 35 -41 -40 -25 100 66 -28 -42 32 -142 65 87 -112 377 62 -25 -68 339 149 97 311
7184 311 -99 -3 -15 -72 17 18 -62 -9 -57 213 356 -137 3 8 110 8 318 156 15 47 -169 -180 46 -165
7208 -165 123 -27 -166 203 -140 -185 -186 -101 228 -38 21 148 38 -70 249 -235 -265 144 -10 -113 -120 -71 -218
7231 -218 33 165 36 84 -47 -118 -50 -271 -140 270 -29 134 -17 59 -47 -82 69 148 -162 67 56 -234
7253 -234 6 -140 -72 206 -53 247 -263 54 140 45 92 48 -211 335 -27 168 -152 152 -5 49 210 -79
7275 -79 -51 -45 -78 170 -59 -41 -28 1 -34 27 -231 24 -18 78 80 8 -14 276 -179 -109 89 -142 40 -148 6 186
7301 186 -155 100 -233 107 8 -127 -24 -34 -146 -199 104 -70 79 42 -17 2 -142 101 4 44 -39 -205 -118
7324 -118 -32 15 59 -50 -165 35 -159 -301 -33 177 -62 -79 -280 6 -239 22 60 86 -145 190 30 93
7346 93 165 2 122 135 -238 183 -245 24 241 255 -143 -1 -212 137 -93 34 -26 31 -173 -395 67 145
7368 145 -2 -13 23 61 132 -249 303 -2 97 -200 -90 69 179 113 -63 -126 -82 239 31 1 158 54 -15
7391 -15 112 52 55 26 51 -43 93 -43 128 -8 -353 -40 -169 173 -372 172 -21 -169 39 -135 -86 -61 152
7414 152 143 113 83 -155 -72 -102 28 250 -86 135 65 101 60 311 200 -24 155 -354 19 -27 -156 241 -27
7437 -27 174 2 171 -50 74 -43 86 41 246 -98 -174 421 244 16 -259 34 91 137 -2 -55 158 79
7459 79 -49 170 149 108 58 -182 122 36 -63 274 -360 170 102 -79 -113 339 -87 -326 -127 -127 25 -21 -87 -5
7483 -5 241 307 -118 112 -33 106 179 93 -99 183 -102 -94 -89 -138 -64 -138 -139 -80 5 -217 -66 -110 -32 12 8 -192 199
7510 199 -30 12 34 -159 78 -203 -48 -91 104 234 -176 137 -9 0 -147 188 57 -148 -66 -230 -72 27
7532 27 23 5 -31 -119 -282 -308 -48 191 121 -17 146 154 43 133 118 140 -296 95 28 -2 -69 -72 219 33 -155 24
7558 24 97 299 205 -159 -37 7 -134 52 -157 34 30 -87 -45 -72 11 35 192 -5 -106 91 118 -83 -140 60
7582 60 -143 171 -83 -18 -87 -84 133 -166 -263 -16 -56 257 36 -161 183 42 222 216 -180 -5 -36 -386 66
7605 66 97 -4 -137 115 140 -8 24 144 56 26 268 70 -111 147 -206 11 170 -8 -91 186 -144 -130 239
7628 239 -51 1 115 -20 131 30 195 258 -216 192 109 65 163 11 188 -118 -25 -146 -145 43 -201 176 93
7651 93 -43 139 218 63 -39 175 173 -53 7 30 65 -195 254 35 -209 -55 128 -316 -90 -102 -22 52 61 385
7675 385 -29 230 14 -226 -310 -220 -200 -214 157 52 -60 -246 1 110 -120 -62 -185 112 349 47 43 195
7697 195 135 122 -152 -17 -76 128 -107 -8 253 119 28 -221 30 -180 3 -284 88 -242 120 -185 -244 -68
7719 -68 -123 -1 13 -209 -28 -186 -80 142 146 102 38 205 79 98 -108 -41 136 -129 -50 105 -145 -114 -206 -9
7743 -9 149 -57 -66 354 -104 -88 128 161 -126 -159 319 114 133 1 -113 -90 44 -254 -103 27 -259 -287 19
7766 19 -15 168 52 220 13 -101 235 45 24 238 22 -47 -176 -251 -111 58 -55 -36 -20 -97 -75 -54 273
7789 273 233 -5 32 65 162 339 106 -185 -20 -104 -52 -127 36 90 32 -75 -172 109 83 22 173 301 125 206
7813 206 -12 -176 -72 68 -276 -2 -51 -58 -79 39 255 6 84 -20 136 77 80 11 -125 108 210 213 9 -8
7837 -8 108 -127 -342 235 -147 -59 -236 -16 -334 15 95 -14 -146 37 -190 -2 -82 35 152 -147 85 50
7859 50 161 86 158 -187 134 -53 -246 153 205 -68 -129 -188 -12 -246 -84 146 -41 -98 33 -151 -118 107 245
7882 245 -82 -164 -69 -5 93 69 57 91 69 -56 137 52 -21 -170 403 79 -116 377 158 32 107 103 -49 -77 -64
7907 -64 -133 39 123 -101 88 130 -12 39 -70 63 118 331 246 54 333 -7 -186 32 -43 -33 207 -57 161
7930 161 -175 -268 -30 68 21 -55 -378 392 71 -234 -114 13 -356 -113 86 97 -48 79 -101 -18 45 201
7952 201 -170 -60 -56 3 82 -117 335 10 -65 -15 121 37 20 296 109 160 76 -83 -277 72 155 121 50 -28 -319
7977 -319 -136 49 75 103 -68 38 121 -43 -77 311 -16 -74 90 -64 -17 190 -91 72 38 16 -6 -182 64
8000 64 205 -223 26 208 -209 247 -84 -92 -40 -140 -40 136 162 -111 -58 123 114 26 -175 -67 -245 -24 -64
8023 -64 -163 248 78 203 216 -71 -249 7 -246 -1 305 106 53 26 -309 62 143 -62 -52 -170 102 111 -4
8046 -4 -215 261 -30 103 -32 38 -89 163 -181 -108 2 -72 174 -69 -151 90 -23 124 -335 -195 -60 258
8068 258 225 -39 61 164 -62 -169 106 294 53 142 136 -90 6 156 -149 191 -4 102 58 -138 -34 -161
8090 -161 -90 159 97 -126 -28 102 213 204 -87 -198 86 -38 -59 4 31 -135 21 -143 335 153 22 -101 63
8113 63 -21 -240 86 -30 -163 117 -130 -97 67 -202 119 154 -189 35 -75 29 -66 -142 -158 92 -61 135
8135 135 -2 13 -49 -46 -118 16 1 -193 -90 151 45 143 124 234 257 201 92 -85 333 -211 -59 -110 8 -206
8159 -206 -83 57 206 49 10 75 35 65 216 147 28 -24 106 191 -33 -102 39 79 -267 2 6 -77 41 6
8183 6 211 -156 -90 196 -91 -158 195 -61
8191f1
$$ Imaginary data points
##PAGE= N=2
##DATA TABLE= (X++(I..I)), XYDATA
0 0 0 0 0 0 0 0 0 0 0 0 0 0 0 -8 8 -8 8 -8 16 -16 21 -24 29 -32 40 -46 52 -59 69 -79 89 -102 116 -131 146
35 146 -165 184 -207 229 -257 284 -316 349 -387 428 -470 519 -572 631 -696 766 -843 931 -1027
54 -1027 1136 -1261 1404 -1569 1764 -1995 2278 -2630 3083 -3691 4547 -5849 8039 -12395 24271
69 24271 -120681 -332002 122414 252285 -103242 -181560 96005 94135 -93990 -68860 60263
80 60263 45122 -7344 -48459 -72153 12108 119468 13119 -143261 -46394 120555 31283
91 31283 -99531 -9758 77022 -24196 -75837 21515 60881 -4893 -32412 -28046 -22006 42611
103 42611 69749 -44047 -93633 35899 83529 -38638 -54844 55721 32289 -69412 -21828
114 -21828 66896 27832 -31963 -23750 -8763 15766 49768 6707 -59469 -6935 60431 -4633
126 -4633 -45161 43969 47445 -69046 -42225 88278 40466 -76196 -7059 67376 -29026 -51052
138 -51052 73851 52581 -88844 -44085 90152 32647 -70378 -1756 57680 -23633 -47370
149 -47370 37593 42535 -28966 -29398 9370 5092 8274 20576 -18703 -37912 17876 31884 -23882
162 -23882 -18541 31312 -3191 -50660 8538 53962 -14743 -48520 9993 20092 -20268 -300
174 -300 24636 -19509 -34226 16638 21425 -16294 -6631 8498 -17824 -14591 24112 13122 -24951
187 -24951 -11800 11976 -5226 -6067 19310 1202 -28961 -3559 23152 -1185 -10250 12660 -4398
200 -4398 -28004 14827 38696 -19045 -35007 26959 25343 -35171 -8674 51954 3158 -56690
212 -56690 2233 56801 2662 -37766 2433 24723 -2157 -7530 9183 7319 1041 -2136 -10229
225 -10229 4423 30229 5727 -35832 -8939 40296 13423 -31605 -3339 28373 -5616 -22578
237 -22578 15457 22479 -13798 -16046 8321 4755 -308 10336 -3637 -23032 2581 24702 -2833
250 -2833 -21853 4169 12421 -12486 -10078 14267 6429 -14868 -10511 2065 4690 5385 -2645 -17639
264 -17639 -8138 17074 5761 -20799 -4468 16816 -7762 -23153 10104 22796 -15224 -25302
276 -25302 9108 14280 -8827 -5773 5361 -5847 -7923 7826 6260 -7045 -2362 3506 -5755
289 -5755 -2081 12081 3610 -11754 -3832 8872 3437 -817 4027 -1301 -7151 5591 11593 -2754
303 -2754 -4815 8074 2658 -9192 5101 18618 -2712 -16611 6190 17252 -2153 -6977 7262
316 7262 4975 -6266 637 10084 3097 -3078 -1043 -681 3246 8941 989 -8734 -1344 8871 1125
331 1125 -5922 3985 4761 -8301 -5502 9106 5406 -8012 -5335 3116 -1130 -2420 4014 -1133 -9369
346 -9369 -2072 5476 -1615 -5013 808 -890 -7831 -2068 5891 -797 -7766 -3693 154 -997 -120
361 -120 150 -4398 -5070 804 1251 -2538 -323 951 -5294 -4550 4958 5082 -5371 -5789 3652 1722 -2923
378 -2923 1744 3323 -3047 -3789 3475 4354 -327 -150 679 -1240 2207 4982 894 -1911 1036 2667
394 2667 621 1742 4538 1340 -2578 653 5052 3247 558 -167 685 1082 3697 3428 -965 -901 3253
411 3253 1752 -1531 1632 5064 -449 -5595 820 6837 1372 -4397 -2403 2384 2755 -1070 -2716
426 -2716 493 2465 -1815 -5082 867 5889 -1449 -9363 -2318 6260 1873 -6970 -4831 3130 1319
441 1319 -4795 -3079 1808 265 -4548 -4397 481 2018 -537 -4607 -4653 937 3342 -1666 -5248 -1649
457 -1649 2140 -110 -3630 -593 2218 -616 -4050 -1565 2928 1973 -1979 -2591 -404 1900 2218 362
473 362 -2075 -1001 2558 3201 -1256 -2332 3533 4207 -2420 -2934 4638 6884 -1768 -5627 2976 8103
489 8103 2162 -4086 -988 4900 4948 -282 -3017 1458 6897 2364 -6143 -1527 9945 6329 -8664
504 -8664 -7565 10785 11436 -8498 -11382 8485 11740 -6835 -10913 6267 10787 -4965 -10591 2179
518 2179 8614 246 -7980 -4450 4106 4685 -2939 -7903 -1609 6460 1020 -9892 -4819 8388 3466
533 3466 -11289 -7556 8810 6143 -10231 -8811 5812 5636 -7110 -6593 3916 2604 -5662 -2982
547 -2982 2734 149 -3302 -575 637 -2783 -524 4602 -1069 -6060 745 6324 -497 -5523 1438
562 1438 4467 -1327 -1891 3114 1184 -1943 2635 3645 -3851 -1097 9337 3188 -10670 -826 15253
577 15253 3307 -13882 -788 16842 2676 -13652 436 14990 2432 -11111 -772 10717
589 10717 3851 -5703 -2736 3101 4607 2376 -3332 -3864 4397 7266 -3639 -8813 4298 10840 -4506
604 -4506 -12584 3769 12985 -2682 -13815 -412 11664 531 -11591 -2815 8297 1738 -8771
617 -8771 -3930 5560 1268 -5717 -3762 795 1293 -235 -3222 -4268 186 4284 -1645 -7476 -209
632 -209 6092 -2538 -8160 1048 6427 -3541 -7477 3110 4960 -5185 -3850 5786 303 -7412 2163
647 2163 8410 -3824 -8768 5747 8642 -5996 -7082 7197 7267 -6306 -4950 6747 5855 -3659
661 -3659 -3469 3216 4315 1233 -1137 -1462 1947 5571 1166 -5348 407 8422 2237 -6859 -1243 8917
677 8917 4140 -6934 -2975 7562 6051 -4679 -5433 4471 7430 -2568 -6596 2145 7250 -24 -6497
692 -6497 -1234 5652 2242 -4512 -4187 2216 4532 -1705 -6375 -660 5696 297 -7821 -2560 6753
707 6753 1621 -8352 -3996 6109 1776 -7487 -3537 4755 277 -5698 -1678 2381 -1203 -3020 -395
722 -395 112 -1805 -123 343 -2293 -1535 1195 259 -2606 -1313 1107 328 -1655 -446 689 -23 -538
739 -538 -152 10 582 925 -231 -712 799 1830 5 -454 1022 1383 146 615 1146 1099 182 1176 951
758 951 617 1181 1548 420 504 1794 1807 30 59 830 1414 669 593 90 942 1396 147 -561 897 1548
778 1548 -453 -1124 1354 1872 -1418 -1457 1552 963 -1728 -1152 1487 300 -2434 -833 1278 -441 -2032
795 -2032 -1114 444 -419 -1567 -1405 -548 -392 -1333 -1705 -440 281 -1472 -1937 -404 366 -822 -1806 -546
813 -546 261 -1111 -1364 -81 44 -1175 -946 -392 -335 -554 -100 67 -775 -330 469 119 -555 63 872 621
833 621 -13 342 1001 1099 282 -113 981 2041 692 -423 1121 1966 933 -291 1185 1952 660 249
851 249 1004 1637 745 330 915 1207 590 932 608 156 876 1217 556 -366 385 1076 180 -450 401 821
871 821 11 -684 -58 292 224 -632 -623 -178 374 -1223 -1377 150 307 -1185 -1434 -243 504 -973 -2006
890 -2006 -183 336 -1173 -1635 -412 315 -971 -1561 -547 -48 -625 -1343 -1044 -227 174 -1161 -1319 106
908 106 175 -709 -1176 91 663 -660 -958 392 499 -128 -348 65 264 46 387 -129 75 801 591 221
928 221 391 1016 1037 -10 316 1307 778 252 387 750 652 594 587 468 579 1369 896 -44 739 1314 427 5
950 5 919 990 202 354 631 -90 321 994 344 -886 220 1082 164 -1618 289 1524 -714 -1371 398
969 398 655 -896 -1007 -583 -199 -432 -726 -934 -1196 160 -306 -2222 -1370 592 -349 -2043 -1146 667
987 667 -313 -1802 -748 64 -558 -726 -821 -767 -77 415 -435 -1506 243 861 -897 -1453 610 718 -804
1006 -804 -550 488 -263 -273 1046 300 -1319 949 2320 -780 -1619 1951 2606 -936 -1228 1894 2435
1023 2435 -732 -628 1525 1551 314 231 527 828 1080 1042 -831 49 2791 1447 -1679 -528 3017 1607
1041 1607 -2125 -378 2394 1505 -1079 -1315 1075 1658 -22 -1957 -448 2123 654 -2652 -770 2035
1057 2035 541 -2200 -1100 853 198 -1228 -1113 -612 -448 584 -748 -2655 -200 1969 -1058 -3530
1073 -3530 281 2738 -2350 -3793 1319 2044 -3134 -2202 1959 46 -3122 355 1680 -1968 -2006 2263
1089 2263 386 -3280 -251 2956 -680 -3123 912 2782 -1361 -1772 1488 1333 -1312 -152 1444
1104 1444 -231 -262 1804 432 -1509 909 2669 -310 -1958 1376 2869 2 -1332 928 2103
1119 2103 952 -1316 -352 2658 1967 -1347 -1190 2672 2280 -1688 -1254 2450 1475 -1178 -206 1103 291
1136 291 171 436 -177 -846 1514 1572 -2416 -1833 3483 977 -4517 -857 4219 -353 -4970 630 3552
1153 3552 -2353 -3364 1756 1207 -3043 -1051 1691 -1294 -2715 1129 1211 -2912 -1024 2402 -786 -3288
1169 -3288 327 1991 -1858 -2302 1593 785 -2296 -628 1427 -804 -1458 756 1056 -1693 -531 1569
1185 1569 -76 -1204 279 1156 -154 -107 144 -62 1127 1125 -383 -102 2165 907 -1218 481 2339
1202 2339 386 -1169 947 1774 149 -111 1202 28 -157 1644 683 -1418 194 3202 -404 -2457
1218 -2457 1937 3282 -1972 -1845 3315 1969 -2864 -773 2967 40 -2376 916 1275 -1461 -532 1462
1234 1462 -511 -1581 1157 1018 -2172 -1031 1550 -467 -2701 231 1625 -1667 -1989 869 314 -2327
1250 -2327 -713 945 -1191 -1590 836 -92 -2066 -67 921 -1383 -1016 755 -236 -1759 227 779
1266 779 -1316 -1075 1092 378 -1556 -455 1248 -513 -1130 981 546 -1053 24 1576 -112 -827
1282 -827 1539 944 -922 898 1731 -598 -777 1978 1248 -1407 349 2375 -29 -1007 1618 1588 -1058
1299 -1058 177 1914 423 -788 1281 1414 -814 125 2111 80 -1008 670 1512 -1097 -666 1850
1315 1850 230 -1684 635 1313 -1224 -1031 1639 259 -1693 86 1305 -1079 -1499 1068 43 -1515
1331 -1515 -109 1011 -983 -1357 813 187 -1670 -609 814 -649 -1629 239 325 -1331 -992 363
1347 363 -615 -1515 325 179 -1401 -287 1114 -715 -1256 578 603 -1610 -235 1548 -457 -1344 513
1364 513 842 -574 -464 1246 -139 -1068 899 1005 -487 -286 1519 524 -792 865 1449 -230 -296
1381 -296 1278 731 -278 1007 1397 -293 -89 1599 804 -810 472 1825 -264 -419 1497 908 -955
1398 -955 149 1522 150 -644 965 978 -490 -245 912 -51 -544 558 525 -1151 -446 1034 -545
1415 -545 -1406 629 425 -1281 -744 799 -222 -1459 45 348 -1236 -991 539 -623 -1011 42 540
1432 540 -1040 -779 577 -85 -1473 -415 417 -712 -888 207 -160 -1312 -331 487 -738 -490 391
1449 391 143 -872 -124 723 -585 -666 726 237 -396 72 835 -294 -112 818 454 -590 476 1192
1467 1192 232 -366 1001 879 -483 40 1108 423 -234 737 877 -237 -101 725 642 -139 566 964 -196
1486 -196 30 849 226 -487 483 769 -420 -410 391 375 -435 -97 447 -212 -202 74 229 -662 -10 -118 -566
1507 -566 -84 -152 -264 -653 -350 116 -635 -1046 -286 -190 -641 -702 -221 -313 -365 -80 -61 -649 -24 -116 -718 -607
1529 -607 135 12 -886 -387 181 -242 -728 -229 241 -413 -274 288 122 -320 -30 271 -327 -77 278 268
1549 268 -184 -185 411 229 -282 328 713 103 296 514 567 213 71 299 447 577 464 594 303 231 408
1570 408 318 275 321 570 633 -209 190 267 358 -96 -36 248 651 -188 -308 555 385 1 -113 89 60 -228 -160
1593 -160 92 -210 -286 -60 -16 -517 -330 70 -455 -398 -267 234 -399 -766 -382 127 -724 -928 35 -47 -824
1614 -824 -437 77 -259 -817 -355 129 -714 -464 150 303 -348 -480 346 -47 -872 -57 592 -258 -524 328
1634 328 526 -135 -321 721 450 -325 235 819 78 -185 590 418 -357 85 863 512 49 492 1050 449
1654 449 -381 440 716 317 -334 361 974 101 -5 431 526 -46 358 492 291 200 437 379 199 -121 124
1675 124 443 -214 -112 158 349 -820 -334 222 4 -1023 -80 554 -237 -689 97 293 -588 -731 97
1694 97 -340 -801 -319 328 -414 -933 32 222 -517 -820 530 62 -1056 -84 301 -374 -756 -123 176 -802
1714 -802 -446 539 107 -575 139 659 -132 -499 144 141 -485 -188 305 333 -4 84 640 374 -212 417 561
1735 561 350 158 100 357 325 245 293 327 265 99 342 322 -151 121 476 308 -234 305 838 105 -82 724
1757 724 376 -210 -54 410 65 -465 303 674 -78 -361 103 364 -495 -306 440 78 -725 -303 435 -586
1777 -586 -629 203 -21 -801 -182 211 -466 -470 -6 -190 -523 -292 239 -46 -393 -421 -194 94 -526 -263 -102
1798 -102 -439 -513 19 1 -175 -255 85 -393 -192 364 -67 -356 15 42 -68 251 59 -256 75 271 -184
1819 -184 -45 248 221 -48 197 410 -147 24 516 353 -12 139 742 139 325 438 616 204 -120 864
1839 864 570 -29 383 484 167 -166 415 265 175 150 616 343 -203 9 377 -248 81 576 126 -248 -52
1860 -52 279 -221 -248 -66 21 -563 -338 -110 -157 -500 18 -117 -388 -250 -151 -363 -307 64 -306 -455 -93 -163
1882 -163 -405 -410 -183 -158 -473 -265 -69 -218 -410 272 -301 -355 -61 -7 -417 -334 66 124 -339 -270 202 -299 -212
1905 -212 138 646 60 -218 608 341 -232 418 646 238 112 456 355 -136 245 630 62 41 294 341 184
1926 184 340 414 238 147 398 245 120 544 566 258 39 195 130 135 8 34 140 144 238 26 -167 -68 -220 -179
1950 -179 -260 217 -388 -188 -149 -189 -114 -435 -134 11 -120 -61 -83 -354 -809 -72 -213 -629 -459 189 -99 -698
1972 -698 -326 149 -167 -496 -26 -205 -614 -351 240 -326 -230 -370 112 -186 -68 16 68 -98 -170 46 101 112
1994 112 203 -82 17 -139 -86 401 -110 311 199 118 334 319 176 462 489 308 -66 428 288 -86 390 548
2016 548 235 -46 487 278 0 51 374 26 -232 222 330 -15 -173 303 347 -290 298 211 -29 -162 128
2037 128 35 -198 -126 193 29 -105 -342 372 5 -363 -303 -177 -158 -467 -245 -1 -348 -341 -108 -209 -119 5
2059 5 -278 -140 -190 -464 144 -342 -371 -97 -112 -491 -350 -40 87 -61 -239 -25 -39 -221 -16 -33 19 -98 -161
2082 -161 209 233 -71 137 177 111 -45 120 228 -133 172 526 136 -84 596 253 81 232 419 360 145
2103 145 359 424 301 -119 567 319 -63 295 207 154 78 129 475 381 -171 282 252 43 215 33 366 -84
2125 -84 15 14 28 -236 -76 -100 7 -22 -427 53 -126 -308 -33 -144 136 -255 -501 63 -135 -115 88 -309 -187
2148 -187 -149 -32 -421 -300 -71 -160 -403 -499 119 -21 -276 -214 -1 237 -275 -162 35 -184 -79 -163 51 -83
2170 -83 112 285 90 -36 -413 39 16 14 65 392 -139 -51 181 84 86 255 308 389 -30 144 434 161 -27 270
2194 270 433 338 -321 404 481 117 36 15 175 -204 169 237 5 -94 -44 241 82 -4 22 67 52 -191 -33 -175
2218 -175 -235 262 47 -3 -127 6 73 -356 -360 -120 -19 -78 71 -338 4 -116 -342 97 -160 -382 -193 100
2240 100 -354 -321 207 79 -161 -272 2 -35 -174 -64 -19 -516 -344 195 9 -355 189 -14 -19 -37 162 272
2262 272 -224 250 122 258 -189 12 406 -206 -12 -7 377 129 202 586 150 -5 92 77 193 88 236 261
2284 261 27 127 188 192 66 179 88 -24 451 243 115 127 127 11 43 135 -273 -431 64 20 192 -288 278
2307 278 123 -295 279 172 -151 -534 94 -291 -421 -367 413 -99 -664 -176 -54 -377 -333 30 -325 -186 11
2328 11 -26 -437 -205 32 95 -434 -123 -6 -176 -359 91 -45 -317 -93 -66 -18 -249 51 -142 -407 111 188
2350 188 206 -100 -16 1 -256 275 118 74 -28 351 283 -51 357 460 162 256 380 294 -49 334 399 22 -18
2373 -18 374 100 -200 78 212 340 -189 272 -75 113 52 193 44 -130 331 515 -66 -114 337 241 -190
2394 -190 56 153 -219 -248 290 -199 -147 -102 127 -129 -223 -213 184 -217 -111 294 -391 -160 -7 -131 -362 -132
2416 -132 198 -356 -198 -43 -50 -316 -62 186 -264 -70 124 -210 -344 -351 31 -211 -437 165 269 -337 95
2437 95 499 -319 -367 394 109 -478 328 368 -12 -171 328 214 -117 199 199 -53 -176 234 143 44 37 413 461
2460 461 -119 122 517 -173 88 370 108 -27 258 221 -219 208 274 -67 25 19 375 -97 -96 2 283 -267 389
2483 389 202 -102 119 363 178 -295 349 120 -130 -252 38 -23 -338 -216 342 -287 -240 172 35 -380 -62
2504 -62 86 -263 -310 213 111 -512 -152 -78 -193 -232 44 3 -399 -155 113 -224 -511 -281 -2 -88 -204 -80
2526 -80 -47 -163 -109 369 -117 -56 26 192 -109 178 54 296 181 123 -65 139 -72 130 -42 282 318 333 -167
2549 -167 307 242 -62 215 283 415 224 407 179 48 247 125 6 14 72 210 66 -282 184 96 -238 -25
2571 -25 58 -59 -173 129 -67 -310 -111 41 33 -390 16 61 -100 -60 89 -233 -203 -149 -108 -154 -431 -14 -52 -264
2595 -264 -186 61 -499 -189 -60 -94 -241 83 28 -344 -285 -65 -145 -233 -12 -70 -473 113 -25 -191 -470 315
2617 315 228 -254 35 113 1 -214 221 331 -151 -307 144 317 -215 -86 178 -196 62 9 215 -109 22
2638 22 448 242 -291 367 455 -180 132 212 219 235 459 115 201 159 275 212 -293 226 -88 -25 -66 99 251 -132
2662 -132 35 -171 -484 85 -47 33 30 297 -115 -46 73 -32 89 -152 -123 -125 9 -133 9 -14 -162 -88 237
2685 237 -265 -176 -21 63 -424 -120 89 -141 -30 -350 -261 -235 -299 70 -137 28 -245 -124 265 -293 195 -214
2707 -214 -218 -22 -169 -101 174 24 294 -77 -78 -55 -138 46 49 25 -103 54 249 126 17 119 84 250 -233 134
2731 134 293 142 -23 303 127 205 -60 -45 29 191 -44 230 207 119 5 318 7 20 -2 -74 79 75 -137
2754 -137 -60 158 39 -140 -69 -68 -181 -239 -17 2 212 139 -219 1 148 151 61 -172 -294 -177 -198 -60 27 -16
2778 -16 -155 -207 -115 -178 -20 -342 -136 -28 247 -303 -57 -169 -149 170 180 160 -139 335 -167 -89 28 191 -236
2801 -236 2 -84 50 107 482 193 -14 -186 173 -224 -69 209 185 325 71 142 180 206 1 415 528 79
2823 79 184 233 55 96 273 41 214 54 90 139 360 138 81 27 22 -189 -117 -36 79 80 347 20 -419 54
2847 54 83 132 201 -279 -68 61 75 47 -221 -321 -115 -152 -173 0 83 276 63 -60 -152 93 -244 -360 -36
2870 -36 -76 -383 -43 -149 166 100 131 -266 -138 -86 122 -56 -62 66 -57 137 101 24 -261 -82 89 73 -189
2893 -189 20 -27 -142 58 98 39 -38 376 380 279 134 199 208 53 97 160 101 79 -47 52 422 14 55 364 -120
2918 -120 79 355 -109 -79 298 337 60 93 -39 47 65 181 61 226 19 128 -257 -63 115 -10 -38 -32 163
2941 163 15 -202 150 -80 -193 187 -96 -4 -43 -1 -184 -229 -74 76 -413 -95 -80 65 7 -9 133 -90
2963 -90 -17 -167 -93 -277 -38 -4 -407 -246 39 131 19 -59 -43 197 164 36 252 87 67 165 167 126 218 322 -189
2988 -189 247 34 235 142 115 64 64 113 -205 235 -155 197 63 -120 48 192 185 -70 182 59 251 545 51
3011 51 -24 89 91 261 139 67 -98 -139 -137 -17 61 157 39 -153 178 4 -285 137 -154 114 -38 -78 -117 -180
3035 -180 206 168 -131 -152 184 -23 129 -8 -16 -209 -49 -84 85 -237 -82 -132 -94 -237 22 -155 -275 316
3057 316 142 -10 -62 124 -222 -45 55 -107 -326 -51 -213 74 -54 -111 192 93 94 247 18 -9 156 -169
3079 -169 72 -26 126 36 65 -124 34 5 159 77 232 18 138 266 34 -196 85 115 29 58 97 64 -8 191
3103 191 -165 -147 -73 280 14 -142 45 -15 -181 -48 155 128 -240 -28 -87 -130 22 95 5 15 11 55 160 -315
3127 -315 127 134 -178 -162 -38 -339 -179 -17 -127 79 -80 3 9 68 -104 148 185 19 -214 -51 -284 -27 -41
3150 -41 183 -188 -59 47 -87 250 -19 -351 80 -127 -287 28 81 -146 248 222 -276 226 6 69 -44
3171 -44 -204 90 375 -27 62 165 -159 172 -3 -59 332 184 124 191 -106 234 260 8 -118 -239 222 59
3193 59 160 215 -96 -134 -38 269 58 -61 77 75 -34 33 -137 -216 -211 178 -185 -75 -72 151 41 -103 -110 -170 45
3218 45 -138 -159 147 -231 9 -77 -99 -1 147 235 -87 -176 197 -27 -83 -268 -124 -43 162 241 -223 -255 -323 -374
3242 -374 -277 211 -169 -281 -211 164 162 -90 -155 149 -296 51 139 -4 119 62 -45 84 198 53 246 -171
3264 -171 26 381 96 -83 34 177 236 -26 194 127 -165 157 288 155 20 66 316 -89 -39 -17 211 5
3286 5 -49 -12 210 120 -303 41 16 -21 4 -52 -114 -45 123 -61 -103 44 148 -247 39 21 -4 166 -231 -96 -11
3311 -11 56 -142 124 329 137 -200 -178 61 12 3 -58 -9 -35 214 -125 -249 -35 -107 218 -161 -42 -9 -68 8
3335 8 -188 -52 -83 -31 -81 50 -210 -216 226 65 -52 125 204 174 -28 -108 196 -256 -6 175 129 35 174 178 336
3360 336 -184 99 -52 7 -67 -27 164 66 332 200 164 35 -87 59 -203 -29 244 215 -93 -46 130 -73
3382 -73 46 24 244 -207 -59 24 -260 -323 191 67 -101 -3 55 -150 -51 -65 6 112 -272 -71 60 125 124 -236
3406 -236 -10 -291 -173 -337 -356 -31 14 -68 40 51 128 97 -32 -248 -145 -124 -142 -28 -53 374 234 -155 102
3429 102 -131 174 207 -2 77 -192 -28 114 -95 125 -67 -126 161 153 307 -227 169 -143 81 81 -27 131
3451 131 105 647 -38 194 171 -148 104 27 -70 189 -248 68 186 -194 16 112 125 -161 313 174 -102 144
3473 144 -165 -25 89 131 128 -79 135 8 -264 34 72 -197 274 -126 87 -55 72 -423 11 122 37 247
3495 247 -23 -51 -238 29 9 -55 -345 198 -186 54 -138 -135 62 -121 154 85 -36 -22 359 116 48 289 -26
3518 -26 -206 0 69 181 -90 -143 206 -12 -224 -16 -271 144 291 153 -115 138 -40 -63 137 -113 114
3539 114 28 212 -1 -201 89 49 158 48 -14 -74 143 -49 -250 359 -5 135 -54 -1 -182 198 119 21
3561 21 -38 -232 -238 -42 65 -106 150 -94 3 92 122 155 -6 -214 -282 -78 -83 -90 -38 -15 -33 112 -66 -147 -169 -13
3587 -13 -125 -150 -68 143 55 207 -160 52 48 -37 2 -139 0 -62 80 125 -380 -26 -25 -101 29 188 -44 -33 -248
3612 -248 60 -38 -68 -62 127 -5 -128 -40 -20 -12 -109 1 -50 194 -125 156 -129 -118 122 5 181 -61 -2 125
3636 125 205 60 181 75 63 63 -74 310 0 147 -96 49 -34 6 43 452 395 0 162 164 174 -151 -193 12
3660 12 83 62 102 -207 73 190 20 -341 -131 128 197 -66 448 -141 -25 43 -95 -174 -244 -43 133 -139 -52
3683 -52 -400 13 157 -51 44 -201 -187 384 -257 -170 -19 -475 -98 -330 -193 -29 40 202 60 -234 53 144
3705 144 244 134 -21 26 58 -68 -122 -118 275 -33 -107 174 -129 -122 48 -113 80 276 351 -155 251 -142 62
3728 62 1 -8 238 -65 -159 31 36 169 69 -197 13 9 5 -253 33 66 183 0 -18 43 -53 -84 105 -375 -33
3753 -33 11 64 59 -39 -148 -182 -89 75 -493 79 -45 -50 -46 -26 -168 32 -22 -99 -14 9 25 67 -40 -85 -85 157 -237
3780 -237 -70 15 59 238 106 -98 5 -409 -1 69 105 46 -187 -70 -32 239 13 -58 -105 332 131 170 24
3803 24 -238 -250 -48 -1 68 -207 154 -57 248 -149 -15 159 153 -180 268 274 54 76 249 -198 114 -23 56
3826 56 289 -178 51 91 -90 161 114 -69 290 48 -4 -295 180 -35 -123 -50 -31 -51 10 204 -227 -241 -217 -90
3850 -90 -233 15 -48 102 -156 -36 13 38 -370 -432 99 30 109 49 15 -47 36 377 -11 -19 -210 -86 -16 -59 42
3875 42 7 33 -290 13 -74 -15 140 -190 22 -196 64 -150 151 193 -111 -214 167 162 -149 29 -109 81 -131
3898 -131 -174 -29 -177 121 95 -55 -46 -84 -99 -37 154 61 -18 -39 -120 106 -80 102 -104 -33 151 353 127 -112
3922 -112 74 118 57 -90 96 -151 153 -119 104 122 74 -63 -69 -132 -92 87 -148 63 -140 241 -20 103 -303
3945 -303 39 120 0 -178 -18 -197 38 122 -92 -2 -214 195 124 -214 260 -73 -9 -96 -13 -54 48 117 37
3968 37 104 -113 -204 -18 181 175 225 251 16 149 43 -97 -205 50 -16 -63 24 -29 -83 -7 -25 241 179 -5 -40
3993 -40 88 -214 70 -80 78 -165 94 160 169 -47 84 -20 202 -35 -244 22 84 -85 51 27 -171 -259
4015 -259 -38 -5 180 149 76 -5 136 270 3 -191 -103 -81 98 180 -44 -79 -207 -62 -38 -217 52 -399 36
4038 36 -56 -36 167 6 -156 -189 99 -123 8 -57 62 -131 -1 21 -177 208 -167 -86 -162 -284 77 -41 81
4061 81 -158 209 -265 25 178 165 -98 111 -60 14 -88 420 80 -25 -51 94 -153 -58 43 107 -138 -193
4083 -193 75 -286 -152 223 332 -177 108 -87 270 36 56 17 129 250 -28 -102 -144 37 -68 -101 -9 136
4105 136 -165 56 197 -183 294 -115 -214 159 -217 -236 -206 265 -16 -47 116 240 70 92 -120 7 -33 71
4127 71 -273 157 31 48 19 -31 100 237 -20 -301 -127 -123 239 71 -199 164 -43 -159 85 27 51 -25 100
4150 100 167 -107 -172 43 -45 30 -70 -37 -273 141 254 -109 179 76 58 -10 55 264 21 -149 142 334 -109
4173 -109 204 151 130 275 -266 -110 162 -159 -36 -151 97 -211 30 210 -154 370 -45 -101 14 48 -196
4194 -196 41 -222 164 -148 -96 -183 -34 320 137 -8 -7 -128 36 22 55 -63 -169 29 98 -24 75 -56 318
4217 318 -60 -1 -119 194 9 79 92 -71 226 179 49 -147 176 -210 -363 -54 -26 -17 48 -117 -217 -131 -46
4240 -46 48 -30 69 455 194 26 308 111 -388 -226 134 173 25 -280 23 -37 1 49 65 250 38 -46 -220
4263 -220 116 241 10 -41 -28 248 82 96 -72 -60 -35 254 245 25 46 40 -26 4 124 32 3 -125 123 80 127
4288 127 -70 -36 310 11 -157 32 3 187 -237 23 -138 -11 195 0 85 121 -75 144 -78 226 -83
4309 -83 -50 142 -333 20 30 41 -145 -86 50 -99 -135 -10 -24 2 -335 133 74 -311 53 179 -152 -283 -129
4332 -129 -145 -1 120 -94 206 121 -60 -206 202 69 -106 178 -41 -161 12 6 5 -51 -277 -193 -15 35 -17
4355 -17 -59 -124 103 13 36 96 81 229 -110 98 -67 -46 189 85 199 69 273 226 127 176 101 -60 262 187
4379 187 18 -51 -107 -68 -50 -51 212 191 -62 75 326 144 -69 8 -11 -37 329 -24 -175 23 -2 -2 -39 275 53
4404 53 -139 -90 24 -56 7 -262 73 26 68 -52 -439 31 -164 84 -109 -92 -91 13 -120 -26 111 -237 -76
4427 -76 83 157 130 169 -143 -115 -28 -113 100 284 141 -131 -253 -49 6 -104 -26 55 -34 142 24 103 27 -108
4451 -108 9 139 129 116 -75 202 -61 -4 336 72 -279 165 -45 -99 7 51 64 -212 -90 215 14 163
4473 163 -34 -82 202 -171 77 -234 -198 247 91 -73 -75 -56 129 247 316 -188 153 -185 -302 -138 -108 316
4495 316 -70 -126 -182 -26 -249 -183 -56 106 -44 18 -249 115 -42 -49 -250 -217 -138 -125 198 117 39 221 -291 -24
4519 -24 -25 -83 130 -133 -60 -17 144 85 78 -63 -37 -212 -70 -112 -37 133 -27 53 -36 -57 53 -27 200 -143 -53 -136
4545 -136 -129 -55 150 -58 -63 192 -40 52 -23 170 -9 -15 -164 134 -109 150 1 -19 -157 -169 -172 -324 -24 190
4569 190 75 -44 -100 114 126 137 -275 -302 -5 158 203 -55 -206 -6 139 191 -169 351 -140 -186 38 -135
4591 -135 -2 83 -63 -167 40 -38 53 -181 -160 -54 -142 -151 172 214 -128 -254 37 58 127 133 -151 25 71 87 38
4616 38 64 130 165 -14 220 32 -176 128 75 53 -69 -91 309 -50 129 -18 110 122 110 6 -40 -52 47 -26
4640 -26 29 -136 -105 11 139 89 -218 29 -47 253 -154 -19 148 76 -39 57 -193 17 42 -137 -198 -43 179
4663 179 111 -91 -65 152 131 -24 -168 -112 -67 102 48 -104 84 9 -147 -171 134 164 -151 93 -180 -100 83
4686 83 -96 -111 51 13 11 -208 -242 -162 -21 -49 -205 -122 -117 -114 8 -158 -154 -161 -118 27 -211 24 -82 -74 89 18 53
4713 53 79 -243 -203 113 60 94 -292 217 106 383 -88 150 -3 106 186 -34 46 75 122 286 -182 26 -101
4736 -101 -24 106 90 248 -43 23 -190 11 39 -2 -290 160 -41 -109 23 -108 128 125 89 -255 65 81 -203
4759 -203 -237 167 -202 -236 -114 -84 62 -66 17 -122 -185 8 4 -78 -214 -232 -65 -9 -51 12 39 -164 -251 231 -141
4784 -141 86 129 38 18 133 80 -2 229 68 -103 -179 -220 -207 101 18 -77 -145 155 72 101 -131 129 93 502 102
4809 102 -111 -8 152 114 -137 -162 -122 217 39 146 -44 182 -38 -180 -38 89 18 -86 -163 42 112 114 -270
4832 -270 168 -209 42 -248 -179 -84 -117 -40 19 36 117 -60 155 160 -113 137 -234 -69 1 -135 -109 -210 -136 -12
4856 -12 -254 -134 -55 -93 -63 271 -2 7 -56 24 -113 -184 -69 -273 -3 -101 -265 -240 134 -72 -14 311 29 53
4880 53 5 125 -92 -237 -138 -106 179 -142 81 183 130 24 171 86 -198 -48 -126 92 6 82 -107 -79 -66 95
4904 95 22 200 211 -206 69 -21 -28 138 -14 -12 -31 74 284 123 -40 -44 70 -2 90 231 1 33 -70 43 -16
4929 -16 -107 59 -57 74 -126 104 124 -166 -83 166 -106 -208 8 162 17 -219 -144 -288 -112 -2 248 -100
4951 -100 -122 89 -175 -42 197 -45 -50 -315 -189 -167 -21 135 83 347 -147 -90 -26 104 -301 -18 48 -5 -43
4974 -43 98 -192 -153 -85 -146 23 17 -31 -62 -62 170 42 141 156 44 -236 -10 128 129 72 37 -160 -39 -174 5
4999 5 104 90 -148 -264 96 -66 49 42 -84 -9 112 156 -34 21 54 -79 31 177 -162 1 192 -90 14
5022 14 255 -53 26 167 58 -31 386 68 222 150 -75 150 161 -52 43 24 118 7 -366 -98 13 -171 -53
5045 -53 181 -137 111 -13 19 89 -44 -146 12 31 -105 -138 94 -121 -46 190 -78 49 -75 -180 279 207
5067 207 57 207 -165 -131 191 124 -203 -209 94 131 129 204 -25 125 -101 128 -148 -221 -111 9 -71 -9 29 55
5091 55 -35 142 147 -81 -75 121 -22 -24 -135 69 8 -126 209 -74 -17 38 -38 56 216 118 173 -290 92 -25 -175
5116 -175 161 30 14 -49 262 -26 -378 -37 16 -45 -10 -39 68 -11 128 -30 -164 37 39 99 -88 361 -51
5139 -51 -212 -362 -17 267 -29 10 -22 -69 -16 32 6 -341 30 23 4 -79 34 144 -47 -296 9 -74 -40 -73 -16
5164 -16 31 -70 283 35 -168 -72 370 14 44 61 157 -37 36 30 17 -24 68 28 -417 22 159 211 315 -198 165
5189 165 447 -24 -1 259 303 219 104 242 32 63 -50 -35 105 -167 4 163 -7 26 28 -13 -9 38 162 200
5213 200 66 -10 -325 -22 -167 161 -136 -77 -47 342 -35 295 170 -20 7 -182 -118 -249 87 77 -24 -257
5235 -257 42 102 143 67 -108 -81 -162 -38 -82 165 13 119 -152 212 81 374 32 241 152 -18 -266 -9
5257 -9 164 183 -163 14 -155 18 294 -340 -49 -70 189 361 137 86 76 -5 -79 143 170 5 178 -296 -118
5280 -118 -22 71 69 89 134 -36 -81 -21 149 196 -27 172 157 -94 74 147 -90 40 281 194 -220 -191 -211 -22 -7
5305 -7 -66 125 91 -10 -127 -102 -160 48 46 -54 51 -280 135 -65 -197 -101 -69 28 40 252 -158 124 -17 -103
5329 -103 -76 73 25 386 -50 213 4 40 -120 -67 -30 -74 97 142 129 -78 239 -67 182 -29 -378 46 -8
5352 -8 -67 262 323 -71 -97 184 40 -142 92 -251 -49 16 -262 -2 154 178 80 -1 24 69 -20 -128 -11 -19 96
5377 96 1 126 -62 -90 -112 -21 -112 90 296 90 -421 -181 2 108 -51 14 -124 -38 -74 208 223 33 -136
5400 -136 56 -242 -155 115 196 -78 -143 99 -355 -159 79 42 -21 -328 -225 -169 -43 -140 114 -102 -70 -142 -154
5423 -154 112 -7 -56 -59 31 -130 -158 61 179 122 49 -74 158 -1 147 263 73 -19 202 206 -30 77 65 73
5447 73 109 111 -78 -188 38 135 67 73 -9 -58 40 -55 91 8 -8 12 91 155 -270 41 -201 58 -188 -144 -33 284
5473 284 77 -71 0 -131 102 229 -40 -7 -369 137 218 -105 -23 77 -74 -263 61 -72 -93 166 -56 -165
5495 -165 -21 77 -91 -52 -152 305 39 -201 -17 -33 -74 65 4 -286 22 -200 -3 -161 142 18 78 -17
5517 -17 -207 105 67 141 -32 -270 75 77 165 51 -62 268 -194 275 8 -52 371 127 240 -12 -167 -99 197
5540 197 80 -121 186 429 106 153 -10 -231 24 148 77 116 152 8 157 129 -202 161 -14 98 176 177 -75
5563 -75 -76 -19 31 -31 17 204 -93 -85 -147 53 71 -9 -121 6 -273 -71 -65 164 -22 49 -21 191 243 108 -98 -315
5589 -315 -160 -96 -108 -226 -99 -82 -211 148 348 -127 121 53 -15 104 103 -166 -200 23 -97 -35 128 140 55 80
5613 80 -257 58 -31 68 -92 -59 138 -38 149 -40 53 139 31 114 30 30 163 262 74 173 27 102 -51 -3 -74
5638 -74 62 225 106 27 -283 -9 23 104 245 37 28 -147 -43 114 -81 286 -99 -82 158 145 194 273 -3
5661 -3 -59 -92 -173 -176 -207 -97 136 -356 95 7 -103 -94 -204 90 111 -184 -92 35 14 -326 -112 -182 -165 -214 11 -139
5687 -139 -120 -167 -52 124 -62 -55 -58 87 247 138 167 33 -28 -352 -108 179 -19 -101 -253 93 -41 -268 -156
5710 -156 186 -90 201 128 86 -12 -80 153 65 105 -214 225 -110 68 360 -58 214 -196 307 70 106 -148
5732 -148 -216 -90 -127 91 -55 211 111 -16 -1 11 53 51 -389 -87 181 -210 -198 51 -207 82 172 -77 40
5755 40 -30 -279 98 -159 -254 -25 105 452 -67 -169 -104 -95 -72 194 74 -31 -267 -65 -47 68 167 26 101
5778 101 -98 -233 -96 -452 -129 92 -79 -51 -144 134 -127 112 -13 8 111 -177 96 -1 210 -130 -23
5799 -23 4 -198 43 116 -35 204 189 164 209 155 -20 100 77 291 125 238 -6 -91 180 71 -90 -53 -25 134
5823 134 61 133 -171 -157 116 -263 -81 230 30 70 70 -100 -209 -40 233 173 55 21 20 87 88 -38 154 215 -7
5848 -7 -285 262 29 32 -25 -38 181 11 131 -181 71 -49 106 152 -3 119 -97 6 -199 28 95 33 -144
5871 -144 -213 68 -7 -161 83 -259 -349 -47 -223 60 32 36 98 -37 82 234 206 -78 -2 113 -58 80 -31
5894 -31 77 -255 149 -61 75 15 239 -103 -66 -52 -230 -156 -82 111 12 23 -422 164 18 32 290 132 -253
5917 -253 223 76 8 44 -10 -193 66 113 103 107 -352 153 -151 -15 -39 -94 118 -198 -134 -66 -142 -256 160 36
5941 36 -103 -150 214 -241 -48 29 -167 -25 -357 -151 3 -67 -184 171 -274 218 -23 116 -202 -88 -44 -15
5963 -15 -54 94 6 -43 -206 52 -196 -83 25 -41 48 -312 -243 -45 62 -232 64 -10 -126 -72 32 -109 -31
5986 -31 312 64 -231 -26 -222 95 357 -52 28 174 -56 104 87 88 -145 118 124 27 -173 -21 -73 126 -173
6009 -173 41 173 -14 -75 -85 -194 -26 -161 -185 107 -142 208 -127 158 -153 118 4 -9 -92 -34 44 116 48
6032 48 -38 -182 -237 220 113 -15 -220 -103 -57 -386 -151 264 203 111 16 -72 -137 -217 153 -139 18 80 -76 179
6056 179 25 -58 -114 -43 200 -45 102 2 70 37 168 254 -37 -81 -153 143 97 257 -40 159 -143 142 -14
6079 -14 58 -3 141 -139 1 290 -49 216 -18 -14 -109 -69 24 175 -92 314 -5 -73 -101 6 -92 315 -187 117
6103 117 139 -145 17 144 -43 -215 -19 268 20 85 77 -236 193 -38 390 153 -136 -47 -178 -138 37 244
6125 244 270 -54 -164 -156 143 -108 -77 -125 172 -60 -75 104 26 215 53 -158 -212 -141 8 -97 -56 77 -15 159
6149 159 83 -25 -270 1 -14 173 56 -308 40 -10 -469 -189 70 30 -165 147 245 4 102 -137 -16 -77
6171 -77 -67 31 223 121 73 132 -141 156 -59 -124 87 -119 -71 -130 18 162 9 122 13 -36 142 50 -243
6194 -243 -94 -4 21 52 -126 -111 66 94 127 17 -264 21 -199 134 107 66 54 20 -60 158 -81 2 -40 -76 -128
6219 -128 62 56 -297 -2 32 -129 -174 195 55 89 -97 -160 -59 -133 75 23 81 321 194 -15 -6 233 36 -164
6243 -164 -89 82 46 -153 -33 131 271 107 178 9 -182 -14 341 -333 187 -193 118 40 243 205 -2 185
6265 185 9 -9 90 177 147 68 47 -67 -65 -2 -14 51 -226 -101 -43 -221 206 11 -143 -44 -88 -101 -211 71 67 -138
6291 -138 -9 -102 235 52 170 -115 -124 -80 -56 50 -75 -51 -124 148 94 -49 47 -235 186 -92 -274 124 -14
6314 -14 132 181 75 -38 -142 -175 90 172 79 -306 -92 -93 -350 -144 61 19 -225 80 30 10 78 40 200 176
6338 176 109 114 -307 -26 -49 -17 56 -281 -54 -24 -132 202 -14 195 73 -114 -198 19 94 -108 55 141 -170
6361 -170 10 208 19 -74 119 76 282 -69 45 82 -122 -63 205 178 -185 -56 36 33 6 -161 115 -199 -38
6384 -38 37 -218 -31 -239 -23 187 177 175 144 -286 -179 -87 342 24 -136 -128 106 248 -74 -246 42 232 -70
6407 -70 -43 -4 -24 149 -95 170 -65 -21 -240 91 61 -29 -168 -19 -1 -116 -83 -94 -17 314 103 -70 322 12
6431 12 -97 149 66 -107 110 -69 70 -108 -169 -99 -106 13 -97 -35 238 -105 -16 19 -236 116 -140 -16 -38
6454 -38 235 -9 62 -183 110 55 -63 188 71 -75 -143 -73 2 26 -26 -53 -171 32 -134 71 -144 -96 -200
6477 -200 318 -279 1 -65 59 6 0 -77 -52 264 -172 -269 -127 53 -306 -260 -96 92 -79 -142 -279 -85 241
6500 241 111 -136 -34 122 -14 88 -70 246 31 68 -181 170 32 -23 270 7 -212 102 -25 171 -52
6521 -52 -12 295 218 198 -48 -309 -372 227 356 -89 -149 99 12 71 48 106 39 16 44 -252 -204 67 68 -90 155
6546 155 -29 6 262 220 -241 112 50 -137 14 -5 -22 142 199 55 11 285 122 267 -62 139 -197 30
6568 30 74 -25 172 -31 -179 -39 110 10 -6 168 -233 -120 -238 -273 22 -84 282 -333 -81 -63 55 -201
6590 -201 53 -116 -21 194 238 74 53 -120 -223 -21 -64 232 45 209 144 -36 119 197 -46 -47 202 260 57
6613 57 101 -92 154 -166 -34 -141 -122 168 -43 -132 134 81 227 -64 179 479 30 7 14 -91 185 106 30
6636 30 30 -129 -72 4 -84 -89 40 265 115 15 -12 -256 51 110 46 166 20 -35 274 -81 -199 -40 -17 88
6660 88 -143 -120 -48 -186 -131 43 117 -109 -292 -101 56 11 103 234 -78 197 113 -9 97 60 -68 -30 75
6683 75 -106 -233 110 58 -200 -137 173 -22 -32 171 214 143 -79 214 -172 -121 87 95 7 -47 4 -62 -239 -21
6707 -21 305 -239 -51 176 -57 374 -57 -7 69 430 -291 -25 12 83 -53 103 -172 -152 -198 -137 -86 188 -136
6730 -136 -99 112 189 -67 165 -17 -8 27 85 -70 50 90 -124 -151 -286 224 -35 15 24 55 -21 -197 56 60 -369
6755 -369 36 2 -137 175 -142 -148 -225 67 -91 131 -257 -96 -58 263 27 42 -125 -347 -45 128 29 88 -120
6778 -120 114 16 17 -115 35 33 -125 361 -197 88 31 -129 25 -231 -51 -137 127 181 85 -73 75 222 307
6801 307 53 59 -305 186 184 116 -23 201 -25 -101 -26 -73 -316 75 -75 152 -23 68 335 -135 -209 123 5
6824 5 135 49 -167 142 4 -110 65 251 -116 -151 40 341 53 256 -110 -3 -187 25 -143 -163 -187 56
6846 56 -231 -204 83 -64 -18 55 -50 28 122 76 30 -23 99 -169 2 -92 -248 -37 275 -31 9 -133 1 -60
6870 -60 -375 -2 352 -198 57 -323 -150 -66 29 127 82 -48 297 162 143 58 5 240 51 52 10 -192 -62 160
6894 160 -75 115 34 -63 -138 155 83 109 151 -46 43 40 -65 -58 -12 112 238 104 101 -90 120 -221 -60 -3 180
6919 180 -15 101 -160 96 58 -311 -170 -119 28 -96 -227 -302 -30 -188 -128 4 -70 -331 -123 -105 53 159
6941 159 -145 -216 -317 -12 81 266 -147 239 -181 101 -168 -90 154 29 193 322 -283 -26 64 204 -134
6962 -134 5 -106 182 125 123 52 -12 219 171 101 -74 103 201 87 7 107 125 -21 -217 199 1 132 -54
6985 -54 -30 69 320 -76 -70 -142 -143 81 83 -121 -19 132 -94 136 16 -228 111 -162 -105 -266 269 13 -1 -151
7009 -151 -36 196 93 -76 9 -131 -57 -33 -82 -126 179 32 87 -97 -75 4 -70 200 -272 -317 -129 70 -77
7032 -77 248 -61 140 90 -259 -224 -62 224 18 -49 66 -131 -218 111 -152 -228 82 -1 253 73 -145 -54 -91
7055 -91 28 44 -141 -53 100 -68 35 77 -92 -214 246 5 -101 103 -110 83 297 -103 -52 155 -155 -139
7077 -139 -193 114 -140 8 43 -17 220 114 322 129 -323 -114 -12 368 53 23 173 -127 74 303 -15
7098 -15 31 -124 -23 49 209 144 -245 124 -33 -12 -143 16 -128 -68 -73 267 267 157 -250 -41 -265 -53 -87 20
7122 20 -104 -260 -244 -191 168 72 48 -121 -242 -190 -61 -6 -101 347 -42 94 17 -8 -32 3 138 7 -190 78
7146 78 206 113 275 208 133 51 -35 -109 181 -105 128 15 -49 -47 -34 -277 -81 233 -105 113 44 -385 -117 -80
7170 -80 -301 218 276 69 50 19 -240 64 80 151 191 4 -5 6 -263 -55 -242 422 -56 42 -14 -152 247 -19
7194 -19 -205 -24 221 -96 -82 -226 171 -27 103 -236 -130 -10 190 -139 346 30 175 -4 -59 -246 -39
7215 -39 -227 46 155 -190 198 41 220 -22 -272 -66 -155 -109 127 84 -4 1 -125 -79 51 -101 188 -170 -171
7238 -171 69 62 -30 -143 78 -83 -44 -263 102 86 185 -83 -103 70 124 -68 -261 13 258 26 -47 221 -60
7261 -60 90 167 -133 -23 106 -71 35 127 -156 25 39 -225 -427 -251 -59 54 2 -71 -153 -226 -41 -125 -432
7284 -432 2 74 31 121 200 -77 71 -177 -148 -165 31 196 -166 70 24 -309 70 -85 -154 -35 162 -163 185
7307 185 -154 -302 60 -21 111 -111 -129 45 149 -96 -337 -123 129 -59 376 123 -184 -15 142 -110 0
7328 0 38 -11 -19 91 145 378 -203 47 -123 91 34 4 -15 -55 164 160 -139 -203 19 -35 -190 -30 148 -37 -153
7353 -153 -122 -178 -83 -100 133 25 -141 -22 19 76 -218 -154 2 16 16 81 159 42 -99 131 113 -67 -22 -168 35
7378 35 -31 136 -173 173 -66 -32 -218 -126 -135 28 -33 9 -64 -52 -107 91 -215 177 112 64 201 -243 -58 12 35
7403 35 95 -231 0 3 53 10 -128 74 -187 68 203 -10 -258 314 -145 -13 200 162 31 -198 70 -130
7425 -130 73 167 -185 102 -45 -61 80 -159 29 42 -13 -65 228 -143 220 -154 -64 -266 198 -82 -58 -249
7447 -249 -330 -40 10 108 78 41 31 -261 -176 -68 -52 37 17 -100 283 -81 -320 -264 112 191 143 -94 74 -101
7471 -101 -106 -2 -172 19 -101 127 49 199 191 -32 -135 153 182 -173 -20 79 -73 -64 -2 -180 246 -125 -20
7494 -20 129 -116 -163 256 14 161 -91 34 168 -26 -38 183 -99 -105 18 192 145 -70 130 42 256 -30
7516 -30 58 40 -50 288 -92 -323 -31 71 14 166 374 162 -88 -179 178 64 54 45 -224 -184 56 58 5 11 -113
7541 -113 -86 -75 -100 -174 -17 -124 -94 -87 6 -114 45 -214 11 -64 -47 -154 169 -179 52 21 37 -12 102 -128
7565 -128 -47 -25 -106 -116 116 -73 -39 -2 -16 -130 -108 167 -87 -94 -15 194 60 122 9 -256 -104 -135 170 -114
7589 -114 9 -68 -301 -103 18 -205 -8 -137 209 173 -169 147 -62 -200 -82 146 127 14 -145 93 16
7610 16 108 -16 -11 -184 240 109 -23 -67 -2 105 -60 101 -103 40 84 -137 -132 -207 -74 -16 113 -10 21 -120
7634 -120 68 -20 105 68 -115 167 55 -70 59 -96 -35 40 230 -136 -288 218 120 -248 -26 69 273 126
7656 126 -31 184 63 58 93 -34 -33 -16 -167 48 82 -3 28 32 216 -62 49 -185 -46 -101 31 270 -195 -97
7680 -97 -137 159 -336 135 71 91 -148 -99 149 -138 119 265 -95 191 -21 136 -158 -77 120 -211 -24 40
7702 40 77 185 52 131 85 174 17 113 361 -21 63 109 192 280 -49 138 48 35 7 -88 -157 -11 201 -7 -206
7727 -206 -20 -126 -136 -134 40 115 -181 140 186 -12 122 -14 93 -96 -227 -233 -130 -39 -68 -97 -88 101 388 104
7751 104 310 -311 -313 -165 -116 21 268 -136 -113 237 -20 88 -44 222 -158 -139 -61 -119 266 198 -186 16 83
7774 83 264 11 -196 295 -41 -54 74 -128 320 -228 247 158 -363 212 -27 -77 120 -132 -30 133 42 93
7796 93 53 -182 -19 -108 -206 29 60 -291 -34 -16 -137 -156 -202 -56 -100 96 144 15 -157 -72 -243 83 -107 15
7820 15 -19 -291 -69 -72 43 -140 -61 -149 20 43 99 183 90 24 -99 226 7 -178 -17 54 -10 241 -233 -306 198
7845 198 -99 -209 90 46 -90 -183 -208 -210 -90 -86 -116 449 -67 -73 -111 33 -155 -202 6 358 170 51 253 8
7869 8 -109 -32 83 107 -63 -17 41 119 50 -144 36 -238 79 172 91 177 101 1 -90 124 -191 -148 382 -40 -334
7894 -334 -89 -143 238 -349 230 -5 76 139 30 61 1 -79 22 -162 -191 -83 -63 -191 -149 131 -63 -19 -59 297
7918 297 -41 -60 33 -263 7 -222 18 -164 -122 235 -46 33 -179 -68 -142 5 37 -35 -122 135 12 -18 342
7941 342 -154 -23 80 -14 153 -87 191 -13 -77 146 -39 -178 150 33 -142 152 -24 21 -35 230 -88
7962 -88 150 -2 240 -113 100 13 -283 114 -115 22 34 -168 66 129 30 30 -216 84 278 124 20 -89
7984 -89 151 -82 -57 91 20 305 143 -118 172 -13 -239 89 -172 155 -190 146 100 -33 -1 158 0 -71
8006 -71 19 -26 -167 -193 75 -28 122 153 -288 134 283 168 -38 -176 206 -252 -164 76 216 54 -18 -180
8028 -180 138 -105 -203 191 135 -71 -11 182 115 94 37 116 221 -53 -30 -21 -7 110 -46 -100 -152 31 -49 29 -154
8053 -154 30 12 275 -92 -55 -219 -19 -182 138 202 -6 -45 156 -132 -44 -280 -116 58 -39 -104 53 73 53
8076 53 -218 -92 -237 -4 -36 185 222 35 -289 -146 -59 70 -7 -24 -184 -84 28 -91 -64 274 152 -79
8098 -79 135 -9 -76 -56 -142 -48 -122 284 118 -282 100 -24 35 -48 -25 -160 -23 47 233 -62 -247 200 -243
8121 -243 294 -135 182 232 -289 250 -41 -122 -31 48 29 -96 236 67 97 -138 49 229 -23 168 -131 -166
8143 -166 -154 -4 78 -206 -143 98 298 19 -70 -231 7 -185 -4 185 -200 279 -10 287 31 198 129 54
8165 54 -105 -196 -89 -53 -76 -109 -85 90 -205 -120 -367 301 213 221 90 -84 3 -31 261 219 146 -21 -129 102 215
8190 215 263
8191B63
##END NTUPLES=NMR FID
##END=
