##TITLE=1H_Pr Am-Pr3
 CDCl3, 8 sc, 
 4.9.2020
##JCAMPDX= 6.0         $$ Bruker NMR JCAMP-DX V2.0
##DATA TYPE= NMR FID
##DATA CLASS= NTUPLES
##ORIGIN= UXNMR, Bruker Analytische Messtechnik GmbH
##OWNER= root
$$ XWIN-NMR		Version 3.5
$$ Fri Sep  4 10:52:45 2020 Russian Standard Time (UT+4h)  she@DPX200
##.OBSERVE FREQUENCY= 200.1315066352
##.OBSERVE NUCLEUS= ^1H
##.DELAY= (6, 6)
##.ACQUISITION MODE= SIMULTANEOUS
##.ACQUISITION SCHEME= undefined
##.AVERAGES= 8
##.DIGITISER RES= 18
##SPECTROMETER/DATA SYSTEM= spect
##.PULSE SEQUENCE= zg30
##.SOLVENT NAME= CDCl3
##.SHIFT REFERENCE= (INTERNAL, CDCl3, 0, 15.7039)
##AUDIT TRAIL= $$ (NUMBER, WHEN, WHO, WHERE, WHAT)
$$ ##TITLE= Audit trail, XWIN-NMR		Version 3.5
$$ ##JCAMPDX= 5.01
$$ ##ORIGIN= Bruker BioSpin GmbH
$$ ##OWNER= she
$$ F:/spectra/data/she/nmr/H-F/1/audita.txt
$$ ##AUDIT TRAIL=  $$ (NUMBER, WHEN, WHO, WHERE, WHAT)
(   1,<2020-09-04 10:51:23.50 +0400>,<she>,<DPX200>,
      <created by zg, POWCHK disabled, PULCHK disabled
       configuration hash MD5:
       00 E9 B6 7A A2 85 ED C7 34 08 36 98 17 FE 4E 26
       data hash MD5: 16K
       42 D6 71 19 EF 6F 42 9C 20 35 29 A9 62 02 7A EF>)
$$ ##END=
$$ 
$$ hash MD5
$$ 76 5C F7 AB 5A 53 26 50 5B 2C 8F 30 58 74 CA 43
##$RELAX= 
##$RELAX= 
##$RELAX= 
##$RELAX= 
##$RELAX= 
##$RELAX= 
$$ Bruker specific parameters
$$ --------------------------
##$DU= <F:/spectra>
##$EXPNO= 1
##$NAME= <H-F>
##$PROCNO= 1
##$TYPE= <nmr>
##$USER= <she>
##$AMP= (0..31)
100 100 100 100 100 100 100 100 100 100 100 100 100 100 100 100 100 100 
100 100 100 100 100 100 100 100 100 100 100 100 100 100 
##$AQSEQ= 0
##$AQ_mod= 1
##$AUNM= <au_zg>
##$AUTOPOS= <>
##$BF1= 200.13
##$BF2= 200.13
##$BF3= 200.13
##$BF4= 200.13
##$BF5= 200.13
##$BF6= 200.13
##$BF7= 200.13
##$BF8= 200.13
##$BYTORDA= 1
##$CFDGTYP= 0
##$CFRGTYP= 5
##$CHEMSTR= <none>
##$CNST= (0..31)
1 1 145 1 1 1 1 1 1 1 1 1 1 1 1 1 1 1 1 1 1 1 1 1 1 1 1 1 1 1 1 1 
##$CPDPRG= <>
##$CPDPRG1= <>
##$CPDPRG2= <>
##$CPDPRG3= <>
##$CPDPRG4= <mlev>
##$CPDPRG5= <mlev>
##$CPDPRG6= <mlev>
##$CPDPRG7= <mlev>
##$CPDPRG8= <mlev>
##$CPDPRGB= <>
##$CPDPRGT= <>
##$D= (0..31)
0 1.2 0 0 0 0 0 0 0 0.06 0 0.03 0 0 0 0 0.0002 0 0 0 0 0 0 0 0 0 0 0 0 
0 0 0 
##$DATE= 1599202282
##$DBL= (0..7)
120 120 120 120 120 120 120 120 
##$DBP= (0..7)
150 150 150 150 150 150 150 150 
##$DBP07= 0
##$DBPNAM0= <>
##$DBPNAM1= <>
##$DBPNAM2= <>
##$DBPNAM3= <>
##$DBPNAM4= <>
##$DBPNAM5= <>
##$DBPNAM6= <>
##$DBPNAM7= <>
##$DBPOAL= (0..7)
0.5 0.5 0.5 0.5 0.5 0.5 0.5 0.5 
##$DBPOFFS= (0..7)
0 0 0 0 0 0 0 0 
##$DE= 6
##$DECBNUC= <off>
##$DECIM= 32
##$DECNUC= <off>
##$DECSTAT= 4
##$DIGMOD= 1
##$DIGTYP= 9
##$DL= (0..7)
0 120 120 120 120 120 120 120 
##$DP= (0..7)
150 150 150 150 150 150 150 150 
##$DP07= 0
##$DPNAME0= <>
##$DPNAME1= <>
##$DPNAME2= <>
##$DPNAME3= <>
##$DPNAME4= <>
##$DPNAME5= <>
##$DPNAME6= <>
##$DPNAME7= <>
##$DPOAL= (0..7)
0.5 0.5 0.5 0.5 0.5 0.5 0.5 0.5 
##$DPOFFS= (0..7)
0 0 0 0 0 0 0 0 
##$DQDMODE= 0
##$DR= 18
##$DS= 0
##$DSLIST= <SSSSSSSSSSSSSSS>
$$ [...]
##$SUBNAM2= <"">
##$SUBNAM3= <"">
##$SUBNAM4= <"">
##$SUBNAM5= <"">
##$SUBNAM6= <"">
##$SUBNAM7= <"">
##$SUBNAM8= <"">
##$SUBNAM9= <"">
##$SW= 16.880792210976
##$SWIBOX= (0..15)
0 0 2 0 0 0 0 0 0 0 0 0 0 0 0 0 
##$SW_h= 3378.37837837838
##$TD= 16384
##$TD0= 1
##$TE= 0
##$TE2= 300
##$TE3= 300
##$TEG= 300
##$TL= (0..7)
0 120 120 120 120 120 120 120 
##$TP= (0..7)
150 150 150 150 150 150 150 150 
##$TP07= 0
##$TPNAME0= <>
##$TPNAME1= <>
##$TPNAME2= <>
##$TPNAME3= <>
##$TPNAME4= <>
##$TPNAME5= <>
##$TPNAME6= <>
##$TPNAME7= <>
##$TPOAL= (0..7)
0.5 0.5 0.5 0.5 0.5 0.5 0.5 0.5 
##$TPOFFS= (0..7)
0 0 0 0 0 0 0 0 
##$TUNHIN= 0
##$TUNHOUT= 0
##$TUNXOUT= 0
##$USERA1= <user>
##$USERA2= <user>
##$USERA3= <user>
##$USERA4= <user>
##$USERA5= <user>
##$V9= 5
##$VALIST= <valist>
##$VCLIST= <CCCCCCCCCCCCCCC>
##$VD= 0
##$VDLIST= <DDDDDDDDDDDDDDD>
##$VPLIST= <PPPPPPPPPPPPPPP>
##$VTLIST= <TTTTTTTTTTTTTTT>
##$WBST= 1024
##$WBSW= 4
##$XGAIN= (0..3)
0 0 0 0 
##$XL= 0
##$YL= 0
##$YMAX_a= 191053
##$YMIN_a= -259957
##$ZGOPTNS= <>
##$ZL1= 120
##$ZL2= 120
##$ZL3= 120
##$ZL4= 120
##$ABSF1= 10
##$ABSF2= 0
##$ABSG= 5
##$ABSL= 3
##$ALPHA= 0
##$AQORDER= 0
##$ASSFAC= 0
##$ASSFACI= 0
##$ASSFACX= 0
##$ASSWID= 0
##$AUNMP= <proc_1d>
##$AZFE= 0.1
##$AZFW= 0.1
##$BCFW= 1
##$BC_mod= 2
##$BYTORDP= 1
##$COROFFS= 0
##$CY= 11.3945322036743
##$DATMOD= 1
##$DC= 2
##$DFILT= <>
##$DTYPP= 0
##$F1P= 16.9975609425685
##$F2P= -3.02152046262296
##$FCOR= 0.5
##$FTSIZE= 0
##$FT_mod= 4
##$GAMMA= 1
##$GB= 0.15
##$INTBC= 1
##$INTSCL= 1
##$ISEN= 128
##$LB= 0.24
##$LEV0= 0
##$LPBIN= 0
##$MAXI= 10000
##$MC2= 0
##$MEAN= 0
##$ME_mod= 0
##$MI= 1.114404
##$NCOEF= 0
##$NC_proc= 0
##$NLEV= 6
##$NOISF1= 3.799351
##$NOISF2= 2.8
##$NSP= 1
##$NTH_PI= 0
##$NZP= 0
##$OFFSET= 15.70392
##$PC= 1
##$PHC0= -9971.568
##$PHC1= 10.0009
##$PH_mod= 1
##$PKNL= yes
##$PPARMOD= 0
##$PSCAL= 0
##$PSIGN= 0
##$REVERSE= no
##$SF= 200.130013532006
##$SI= 16384
##$SIGF1= 3
##$SIGF2= 2
##$SINO= 400
##$SIOLD= 16384
##$SREGLST= <1H.CDCl3>
##$SSB= 0
##$STSI= 0
##$STSR= 0
##$SW_p= 3612.71676300578
##$SYMM= 0
##$S_DEV= 0
##$TDeff= 0
##$TDoff= 0
##$TI= <>
##$TILT= no
##$TM1= 0
##$TM2= 0
##$TOPLEV= 0
##$USERP1= <user>
##$USERP2= <user>
##$USERP3= <user>
##$USERP4= <user>
##$USERP5= <user>
##$WDW= 1
##$XDIM= 8192
##$YMAX_p= 0
##$YMIN_p= 0
$$ End of Bruker specific parameters
$$ ---------------------------------
##NTUPLES= NMR FID
##VAR_NAME=  TIME,          FID/REAL,        FID/IMAG
##SYMBOL=    X,             R,               I
##VAR_TYPE=  INDEPENDENT,   DEPENDENT,       DEPENDENT
##VAR_FORM=  AFFN,          ASDF,            ASDF
##VAR_DIM=   8192,          8192,            8192
##UNITS=     SECONDS,       ARBITRARY UNITS, ARBITRARY UNITS
##FACTOR=    0.000296,      1,               1
##FIRST=     0,             0,               0
##LAST=      2.424536,      0,               0
##MIN=       0,             -259957,         0
##MAX=       2.424536,      191053,          0
$$ Real data points
##PAGE= N=1
##DATA TABLE= (X++(R..R)), XYDATA
$$ [...]
2141C248r301K096Q913k019p627J825N693q17m696J266K152q28n6j57p50o10L740
2158B072o47m407J14O368k35p612J097P283o1q412J049P723p09p426M44P650j334
2175B957n562J94M992m35l169N03J006M64o26P73j706q2K408K48l502n57M813
2192B719l9m842r09O394n3n840n21N728Q25n783l20M486O03m112n18L368k3j762
2210e99o77J611m53K20K8j135o2J535R43l121n2K606J032l663r36M269L32l634
2228a756j189M359N62l649r91L453J161k976n03J621J161j714k54O47M13R7k62
2245A80l87n42J736n2j342o48J831R71k378m51J731J490k618j037K200J247j955
2262b4j318K078M57p30j539J244J001r79m65j05J362q18q9o02O64M08l48n35n70
$$ y = [3248, -6053, -3957, 4956, 2937, -4690, -2865, 2828, 2011, -2685, -1419, 733, -95, -151, -308, -1058, -1668, 2072, 1425, -2982, -2868, 3500, 3265, -4347, -3250, 4033, 3972, -4440, -3391, 4332, 3623, -3803, -3359, 4291, 2957, -2605, -2411, 2581, 2146, -1023, -520, 486, 950, 324, 1097, -609, -691, 1717, 1965, -1537, -2094, 2719, 2680, -2162, -3071, 3323, 3270, -2570, -3091, 2637, 3462, -2321, -2641, 1845, 2448, -1664, -2182, 1186, 1163, -599, -1276, 335, -118, 102, 130, -1005, -1067, 468, 1411, -1710, -1762, 844, 1876, -1787, -2723, 1546, 1878, -1756, -2945, 1414, 1976, -1673, -2664, 789, 1950, -1026, -1529, 92, 1253, -461, -715, -68, 345, 442, 180, -207, -749, 987, 935, -407, -1055, 776, 1747, -631, -1082, 649, 2139, -479, -1516, 684, 1931, -24, -1342, 736, 1193, 463, -1076, 168, 1169, 190, -275, -380, 982, 164, 75, -527, 137, 545, 197, -338, -908]
2281i08J444J93j193r52J655P84j782n96J008J649j776j063J299J269j491j240
2297a700J509P87j34k048R74R59K52j420j22J102m7k99q75R84K88J38q71j3J358
2316H22l14p08r07J491P84j091j227J453J273j321r83N31J784r64j469Q67J069
2333A090q1j649M36Q23N20j138m19N48P06R7j563J59J009M96j474k96J121N74
2351I59q73j514J838N59r63j236P28J317q67l23k97J007m50k57j08L28K69n30
2369d13j04l54J298k15q17m25Q76Q95j532j62Q03R81j328l06Q80L99o34m27R28
2388C43m43N79p08L66n29N05L52n03n63M68J419r88q60J67J327m77j350J006Q78
2407I89o05j106R18P77q91k25L94N27r84P71l78l56M9Q44J16j813M62J640j1k857
$$ y = [-908, 536, 729, -464, -1416, 239, 1023, -759, -1355, -347, 1302, -474, -1537, -238, 1031, -460, -1700, -191, 596, 462, -1586, -612, 347, 599, -821, -943, 159, 112, -187, -1062, -78, 210, 348, -523, -536, 822, 508, -200, -1107, 384, 1168, 77, -1150, 303, 1576, 255, -728, -197, 1587, 623, -846, 21, 1090, 1009, -640, -204, 619, 1139, 1, -418, 130, 836, 933, -630, -471, 538, 1034, -440, -736, 385, 959, 86, -1428, 410, 969, 6, -1230, -502, 815, -52, -375, -672, 335, -115, -372, -480, -152, 117, -413, -517, -871, 427, 212, -605, -1030, -154, 741, -791, -953, -150, 831, -497, -803, 77, 476, -158, -585, 343, -100, 479, -229, 137, -392, 113, 465, -38, -601, -133, 1286, 298, -562, -395, 932, 455, -895, 111, 989, 384, -722, 196, 973, 82, -143, 251, 778, -206, 565, 187, -169, -120, 724, 840, -973, -511, 1129, 1118, -1739]
2427a739J152K091r05k567J091K689j320k118N12K473r36j764N23J233k20r88
2443g93N50k7M3M89q6j543K48K836j219k570L04L829p77m009R94L790l14m518
2461b773J099L652n26l385N23L108q37j742o9J946l21n60j52m17J34J376O1k509
2479a392M95L012J66m625M77M900p83m580j1N669n47n152J09M811K16m956L74
2496a817L377L74l068L30J261P8l29j25n68o54K428K0l018o44M479M03n287l94
2514c154N385R88o165n07N916Q20n962q27N740K74m593n32M094%k929K63J179
2531a0K38k96P04j532p65K557J203l648j668N372Q86m961j675O076J554o357j442
2548c764O281J521o278r32N117J226m241j115L797k86j727k09J328p75L74J042
$$ y = [-1739, -587, 1504, 599, -1968, -877, 1812, 492, -1626, -1114, 1359, 423, -1341, -818, 415, 195, -793, -243, -270, -227, 262, 176, -1367, -1119, 1717, 498, -2072, -1768, 2061, 1284, -2725, -1731, 2059, 1745, -2773, -1674, 1978, 1452, -1933, -1410, 1698, 861, -881, -950, 996, 675, 115, -37, -454, -320, 1056, 1117, -1392, -897, 2115, 2281, -2344, -1867, 3033, 2250, -2330, -2341, 3328, 2781, -2371, -2262, 2549, 2765, -2191, -1817, 1560, 1934, -1134, -804, 457, 535, 206, 81, -487, -1141, 1287, 1307, -1711, -2355, 2124, 2527, -2760, -3154, 2231, 3219, -2946, -3453, 2463, 3283, -2679, -3506, 2234, 2508, -2085, -2617, 1477, 1477, -1452, -1189, -10, 228, -68, 636, -896, -1661, 896, 2099, -1549, -3217, 2155, 3041, -1920, -3595, 2481, 4035, -2322, -3764, 2517, 4038, -2240, -3172, 1945, 3171, -1070, -2185, 1612, 1326, -401, -610, 718, -57, 317, 1359]
2564A359j632j400K477K221m035k033M271K839n309k874N521K616n023l414O059
2579A643J957n049j877M471J754m132m23K196O01k117M57Q30j231O67J347q48
2595B46k694K430K598l152l220L795L603m612k889M212L670m732l328M379K855
2610C161l507k711L893J313k492j224K252m2j261R52j82q56J78K582j644k662
2626b250K073L348k218m307L367L664k806m665L774L692l375l308K735L559l159
2641A24k172K035K013j775j340J299k8J00J13r1j519Q59K155j319k832J666L569
2658B857k495l487K135M030k313m315K724L385j567m157K394L123j809k473Q53
2673a115K588j353j140O36N14k51N47n13j159J014J242l97k718J468K709j213
$$ y = [1359, -273, -1673, 804, 3025, -1010, -3043, 1228, 4067, -1242, -4116, 1405, 4021, -1002, -4416, 1643, 3600, -1449, -3326, 1145, 2899, -1233, -1656, 540, 1141, -976, -519, 311, -920, -253, 1094, 246, -2448, -18, 2580, -572, -3792, 3, 3606, -1006, -3895, 317, 3987, -745, -4073, 306, 3161, -346, -3057, 836, 2149, -343, -1567, 685, 643, -618, 334, 152, -704, -526, 2056, 412, -2250, -177, 3171, 953, -3354, 13, 3677, 871, -3794, -20, 3672, 297, -3011, -276, 3283, 124, -2048, -13, 2000, 225, -1115, 184, 156, 256, 369, 278, -1241, -382, 1773, 454, -2378, -712, 2857, 362, -3125, -990, 3040, 727, -3588, -864, 2521, 954, -3203, -809, 2314, 505, -1968, -1115, 1473, 120, -1020, -384, 130, -121, 426, -87, -1246, -232, 1010, 613, -2105, -637, 2072, 859]
2689H59l174J272L573j828k869J363L528j993k913J791K476j225k345J184J323
2704A022J9j528M31M71k79K24l97j48k01J621q18j323L79K124n69k657J099K072
2722A542m15k701P51K381r72j819L41K212r24j353J74J598m88j096N89K53K61
2739C34n75K33j71l6K60k84k27l34J250n21q20R8J285qj735M80J249K81j848N73
2759e16J194j51j248j2J414n80k53l40Q40M7o32L09K45r8j75M93q02N38K62j61
2779C74m09k25J004m04m95k91J299j91r33K51O47J70j321K15O54L80q61m02Q81
2798C43J44k51p05O55r0N5k64q3J76n7L80q40K73L51K15n97j83P23p0n80p46J703
2820E52Q5j101m10J008M56j367Q1N72O17j035n5O72K53l18m94L90N5M14o95k9
$$ y = [859, -2315, -1043, 2530, 702, -2167, -804, 2724, 731, -2182, -391, 2085, 860, -1485, -301, 1022, 1041, -487, -56, 415, 136, 360, -37, -185, -386, 1235, 417, -906, -527, 1597, 1028, -1629, -530, 1542, 1127, -1574, -823, 1558, 586, -1233, -892, 1320, 396, -957, -783, 815, 327, -769, -180, 73, 334, -241, -8, -179, -215, 45, -239, -466, -800, 450, -71, -891, -793, 492, 484, -1251, -771, 478, 759, -1089, -516, 678, 527, -721, -733, 681, 101, -152, -492, 348, 395, -237, 72, 317, 219, 44, 537, -265, 273, 535, 374, -35, -260, 744, 340, -155, -446, 853, 662, -271, -20, 627, 797, -524, -309, 345, 725, -136, -538, 343, 487, 236, -469, 186, 96, 151, -113, -196, -20, -77, 303, -537, -264, 87, 302, -295, -478, 245, 175, -405, -1151, 552, 637, -464, -874, 134, 590, -777, -696, -124, 493, -542, -597, 75, 328, 10, -484, -94, -39, 375, -320, -349]
2840c49M16K12p4p31N18M41K09j044J95P51J06p26o86J634l08m67n98J007K55
2859G61n96k12rP05l73l97p6O32p8l72p6RP52n27l34k47Q19r2r78L01M95K0p08
2882e81M47M52r2p10K80L70n55K02j59L86m50K45K46n46o1N13K85q67K94M02L74
2903D75r56j88O68J77n29k51P00N6m59K60J24p7r4P52p30j44J49J048p02q45R91
2924D25L7k93j087J487K51n89p88P39O72n94l51J73M69n81K76j55k19K50M41k35
2944C28r80Q62P71r31j066R67J224r99j418R94J532j272j322J173J136q76j526
2961a403J199R56q79r78Q81L80m02J68k98O1Q4P01l45j189Q34J336r46j911J461
2980b90J861j245k119J332K073j450j733R45K494j598j636R20J540q26j299J143
$$ y = [-349, 67, 279, 205, -526, -8, 433, 642, -402, -207, 544, 650, -76, -762, 872, 564, 97, -501, 506, 761, 165, -47, -56, 649, 276, -121, -197, 435, 357, -15, -91, -82, 670, 143, -191, -438, 381, 289, -689, -388, 107, 127, -581, -134, 318, 226, -484, -204, 166, -389, -187, -346, 40, -410, -165, 81, -465, -526, -13, 272, -595, -301, 101, 475, -481, -669, -1, 176, -353, -604, 96, 152, -307, -47, 77, 0, -94, 658, -72, -216, -67, 981, 279, -566, 425, 462, 169, -918, 569, 820, 231, -557, 182, 854, 260, -91, 82, 551, -30, 246, 91, -128, 122, 563, 328, -652, 210, 981, 50, -1016, -49, 1175, 176, -1242, -248, 1284, 12, -1310, -137, 999, 123, -1403, -204, 752, -127, -1105, -224, 156, -246, -78, -376, -315, -231, 470, 125, -1064, -230, 1106, 160, -1751, -290, 1571, 326, -1793, -461, 1612, 162, -1571, -626, 1868, 270, -1366, -446, 1094, 268, -1031, 112]
2996A12K85l89J47R0n43L07R53n71j150M10K103j076k203J075K418j137k600J089
3014f80K397j008k537J584J867j242j717R66J634r87j006L34Q23q00M67K21j027
3031g11J44J270k3k154P98J854j56k522L46K698p17k519K85K856m30k793P33K452
3049A411o04k275J163J097o27r15R38j77m31N99J54j012k74K022J07k315j14K638
3067A385L3k934L28K763j65k876K96K827n62k213K34K076l32j584L39J193m68
3084C40n70P90m43m36M86R31j733l57J906J12j774p30K735M18k943n38K695R53
3102A842l065l95K583L90k304o7J508J67j279M7N98m22L40J12m25m63J078P35
3120I80j733q23J774J233k365q34K311J152k329j389K760O71k073q68K089P05
$$ y = [112, 397, 8, 155, 245, -298, 9, 962, 391, -759, -349, 1754, 678, -1525, -450, 1968, 831, -1769, -680, 1717, 709, -1828, -244, 1623, 381, -1336, -370, 1264, 277, -729, -395, 428, -372, 95, 316, -711, -567, 703, 680, -1474, -676, 1178, 1022, -1500, -1154, 1544, 827, -1692, -1407, 1449, 1019, -1774, -1041, 1411, 807, -1468, -305, 792, 165, -750, 188, 11, -420, 179, 333, -679, -953, 1069, 1176, -1139, -1253, 1385, 1418, -1516, -1188, 1575, 1410, -1466, -1170, 1657, 1095, -1118, -884, 1192, 860, -724, -385, 808, 340, -230, 560, 117, -319, 167, 1098, -635, -992, 914, 1026, -748, -1478, 1257, 1675, -1268, -1806, 889, 1842, -1223, -1618, 965, 1355, -949, -1016, 492, 659, -620, -573, 25, -397, -57, 55, -370, -833, 245, 980, -753, -1576, 198, 1431, -934, -1768, 543, 1695, -634, -2023, 737, 1408, -665, -1533, 556, 1261]
3136A261j630m63Q90R32j250m36Q17J57k17L18l33o52J255M09j032j370J776J210
3154A642j964j180K186J228k430j053K166J028j969r04J552J097j326j248J439
3169B64N31n82m32L9L58K66P9r82n1P68N45j259q29J471J176j643j457J965R21
3188A148j437j265J466J635j862j238J154J595j343q44N09R89j77r93N46J61J96
3205B40m29j54p3M18Q56j164k55O93Q73j398n66J351N36r44j140J523Q09r96j428
3224a248J444P37o87q96O82R47p47m47O3O18j02k79k08K46L67m27j90n9M39M07
3244F60q62l67M13Q68q08p85Q41Q47q49q84Q84O48n43j015R49N50n92q78Q45M29
3264C51l89L3k07M12m62L63k98j40J81K09k11k88O83J53n42m25N63M68n61k72
$$ y = [1261, -369, -832, 58, 990, -260, -696, 121, 278, 61, 379, 46, -606, 649, 1058, 26, -1344, 432, 1642, -322, -1502, 684, 1912, -518, -1571, 595, 1623, -346, -1250, 302, 1399, 73, -1175, 264, 795, 213, -219, -180, 178, 444, 523, -459, -510, 258, 803, -456, -1285, 186, 1362, -281, -1738, 227, 1148, -289, -1554, -88, 1547, -315, -1553, -399, 1196, -147, -991, -482, 507, 330, -663, -117, 44, 240, -189, -343, -416, 2, 858, -306, -561, 132, 1005, -393, -959, 392, 928, -16, -1156, 367, 1176, 180, -1248, 196, 933, 246, -650, 32, 979, 232, -215, -152, 466, 364, 85, -123, 123, 490, 63, -127, -186, 253, 660, -202, -569, -156, 712, -96, -881, -40, 807, -42, -926, -42, 606, 63, -952, -3, 547, -45, -923, -78, 351, -38, -5, -212, 200, -262, 101, -197, -337, -156, 53, -158, -446, 237, 390, -152, -577, -14, 454, -107, -379]
3284c79J69O49j88n66J60N27k03o33N47M12p9o15M26Q7j65J08k16P9j23K70j45
3305A22j98K00K90k36l71J79L59j16m95K90M08k24l91N5L45j35o3r1K73k62l69
3326d30N34j83L8j69L37m20J43O7R3j11l84O06k73J42l34L21J21n09k2K79L55
3347B01n31k5L73K71m44q8K56p2k9P5l3r2J77R9l33J36K41K84o03k7K54K52n55
3370b13k85Q35L7m93k32O29r7r7k57M09K42k14l44J76J10j99j90R2L8Q19q15l2
3392h1j26P33l25p88L60N32N8r63L51L36L28n94m02Q93k2j79n98M45p0K56l31
3413a87j83P9L41n9o82L30L92M83j178K51O41J7o85p9Q39l9m06l75N02K13l54
3434a39j75K74K48k66K33k52PL40j54l4j49M29k14m40N3Q16L07j112Q7L19O09
$$ y = [-379, -210, 439, 251, -315, -155, 372, 169, -464, 83, 495, 416, -199, 227, 314, 149, 257, 41, 120, -3, 267, 122, -76, 124, 414, 178, -193, -14, 345, 229, -266, 24, 432, 208, -183, -128, 217, 82, 19, -72, 201, -61, -430, 104, -79, -41, -210, 127, -293, -150, -83, 10, -101, -485, 121, -152, -10, -344, -23, 98, -411, -433, -154, 201, -330, -355, 18, 289, -155, -243, 13, -59, -88, -13, -46, -138, 39, 138, -195, -59, 182, 466, -137, -164, 90, 342, -213, -498, 337, 374, -119, -351, 278, 181, 84, -173, 236, 478, 264, -80, 96, 206, 7, -183, -91, -53, 766, -49, -81, -207, 526, 201, -587, -227, 305, 363, -600, -249, 87, 415, -179, -581, 312, 290, 111, -487, -42, -112, 144, -187, -370, -291, 50, -9, -691, -361, 31, 514, -664, -413, 228, 245, -440, -519, 320, 281, -125, -500, 2, 215, -139, -314, -40, 208, -58, 175, -77, -70, 270, 116, 82, -67, 362, 148, -292, -239, 577, 884, -228, -141, 178, 787]
3455G87j026M8Q48r0o54j29O45l63K53k96rp9J02J53m59n6M83M50r72j70R21j26
3477B61n07n16J026J03o11m18Q12L52p66k21N19M40n39k66R9L61k63r6L01n02
3497d31M13N9j15l84O82M26o78q11R21N76r39n66R36P78r84o35R39N03q29m19
3517e58P31K95m39k56L98J21k15o2j24q6M33Q75j150o90Q74N23n33j207J376Q30
3537A136j007j037R83Q38j118n94P58R35r08q70R71L59l87n21N91k07k60K48J77
3556H7q14O12O66m60p43K18J337r45p84L34J343q11j079R74P42m37j006O37Q42
3575G13q16n09K40O69l09l08N04j35J98n6k34l21L46N15O2j372L17J132k00j114
3595f78L25J396p56j087Q01R63n53r93P21M54l08p15L16M5K30j50N0K9l39N53
$$ y = [787, -239, -191, 657, 567, -87, -216, 429, 66, 319, 23, 14, -65, 37, 190, -269, -325, 158, 608, -364, -534, 387, 261, -246, -762, 264, 367, -244, -662, 150, 502, -264, -485, 34, 474, -65, -331, -232, 129, -134, -230, 71, -431, -18, 41, -74, -458, 224, 650, -28, -839, 82, 658, -281, -847, 89, 867, -117, -752, 187, 690, -139, -558, 173, 468, 29, -227, 171, 292, 77, 15, -109, -195, 238, 1113, -37, -727, 147, 670, 137, -1070, 306, 1136, 129, -908, 75, 913, -205, -799, -41, 894, -14, -884, 87, 446, 59, -462, 129, -78, -338, -90, 87, -727, -115, 551, 91, -652, -434, 903, -42, -826, -492, 851, 40, -1039, -65, 677, 240, -766, -129, 713, -103, -612, -372, 297, -12, -320, 184, 49, 247, 191, -43, -364, -18, 497, 559, -813, -496, 636, 436, -678, -353, 1043, 287, -800, 1, 964, 411, -582, 139, 593, 285, -430, -114, -69, 161, 11, 61, 90, -249, 304]
3615C04J17p60J43Q52m27r22M97O68r4j521O70J132l02j211K05J059k39n93K4
3634c98R98l58o42R7L94j16Kp9k78L32J93J89q89JJ021o5j010J18J058r5j123
3655f50J55J034L31j295k31R85M03r76k57J030j1p98m3N88j74K8n3j21P2J75Q1
3676B73m78J87O19j68j101L70Q53O4r60l87J660l95p12m10J088L8p01k91O68N08
3696G25j075j16L76L71n06j3J74OM25l46k45LN93l05m51O7N70L45j033j68R75
3717C72K00q60p10J513J00j177k8R03R3n95l72M50O93q29J21p1N14p5l26k35N20
3738B01p3J29j39l96N20L23q41j46N53M53q21l57J064O7p48k62Q39J97m28n46
3758d11O90K51n93k20K93L48l25J6k50O42l86k07j41kN44J2n80l4N04j23m12j07
$$ y = [304, 421, -339, -196, 656, 229, -693, -196, 472, 378, -1143, -473, 659, 357, -854, -649, 410, 171, -422, -398, 600, 242, -400, -303, 91, -25, -23, -102, -380, -48, 145, 334, -555, -554, 467, 402, -608, -490, 568, 473, -650, -495, 539, 870, -425, -656, 329, 732, -244, -501, 529, 518, -280, -323, 265, 91, 119, 66, -55, 17, 192, 273, -205, -18, 601, 433, -668, -298, 555, 619, -341, -728, 932, 537, -175, -585, 503, 541, -160, -451, 217, 725, -350, -466, -90, 281, -225, -238, -64, -58, 367, 21, -224, -221, 372, 67, -384, -317, 253, 598, -435, -603, 372, 572, -288, -998, 515, 615, -562, -590, 313, 406, -189, -561, -111, 582, -247, -126, -197, 317, 242, -84, -319, 201, 128, 257, 118, -278, 242, 565, -276, -422, 131, 584, -237, -594, 470, 537, -211, -473, 366, 563, 135, -411, 279, 530, -63, -283, 10, 358, 33, 49, -201, 441, 55, -152, -293, -295, 249, 261, -319, -353, 151, 28, -384, -491]
3780d91P13M41r71k9M42K89o61r1K94L42l31m90P04o6k40J09j7M0mQ1q0k03M40
3803B21J83n95J21N2K01j00k53K68L18m33l28L25L09k92j39O8L18j65l08L01K10
3824B82j58K01l04J8L74l42J20l48L13k9L5j41J80K29k84n21J66O17l75k17Q6
3845i8K52o9l15J60p6K88k53j88L28K29j57l01J83K14J73m35n05L14M54L2m34
3866b04Q0L67l8o66J58P30j51m13k23L93L65n20o9j59O09j88k81q5L30K4l91L48
3888A6L3K99o92k36M80L40Q2n16o6P19k20n79n4O89J26l36m53M78K18m22%K87
3910A93jM0j09k28K21n8R0m42M72K24l40n18O55N7k18n82M02N83n24m43K31L19
3932B4K5n40K81J59k24J5J60J3K1j30L0j43K82K54m01l66N02M56n68k78M09L71
$$ y = [-491, 222, 663, -308, -337, 105, 394, -267, -358, -64, 278, -53, -543, 161, 95, -145, -36, -53, -13, -17, 64, -16, -219, 221, 404, -191, -70, -18, 183, 83, -170, 98, 416, -17, -345, -20, 289, -3, -142, -74, 244, 79, -229, 72, 282, 124, 325, 21, 39, 413, 71, 191, -157, 156, 127, 162, 21, 201, 430, 146, -375, -209, 408, 33, -184, -98, 154, 85, -230, -70, -146, 142, -111, -299, 29, 258, 101, -200, -17, 197, 370, -65, -570, -256, 198, 230, -204, -124, 243, 205, -461, -303, 427, 276, -137, -360, 33, 398, -122, -191, -350, 259, 71, -210, -295, 35, 59, -332, 16, 49, 348, -344, -580, -100, 240, 322, -194, -260, 459, 239, -340, -394, 295, 421, 85, -368, 110, 328, -94, -94, 193, 192, 232, 123, -105, 116, 58, 148, -294, 178, 402, 62, -456, 199, 256, 38, -544, -142, 441, -83, -526, -295, 24, 49, -491, -210, -51, -275, -260, -100, -87, -66, -196, -166, -309, -27, 227, -174, -540, -38, 418, -150, -428, -19, 352]
3954C52m36m40J92L77M2l69J44L96j24l5qJ2J52j34j71j31M07j56K66m64L74Q4
3976C30M6n44o9P14n46J42j84L05N9k03k48L44J38l85mJ45k30j48J44J03l28O08
3998A89j15m35R7L42j71l02K79K42J98o67ML70K29o72J26L51k8j42k11L56j79
4019a39R5k27L69j77K00m4l02O4L45K06m66j24K45K27l71j00O27j29l72p8K88
4040A37j4k00p4K45L62m27l4J33J08k41n5j5o7K84k34J15k24M55k2m98K33J33
4062A00J23m63J62J88L93p03k18O97l32r0j99N51L9m11j89L05K24j87p7k4n0K44
4084H3K7o2l47L92q6l7l25K83M00p62o5K75M58n32m8J93N56m29m04N60j3j12p3
4107f8J99k30J87l52J20m9J50K66m04K11O1L87l29m54M56J67k49l20N99k12k74
$$ y = [352, -84, -524, -332, 45, 87, -282, -138, 258, 134, 99, 91, 103, 255, 121, -50, -181, 226, 70, 336, -128, 246, 330, 376, -168, -237, 477, -69, 73, -111, 194, 253, 50, -198, 146, 284, -101, -105, 40, -190, -338, -194, -91, -419, 189, 74, -361, -264, 78, -93, -395, -116, 126, 324, -343, -339, 31, 260, -412, -286, 65, 37, -105, -316, 40, -139, -44, -271, 98, -79, 121, 77, -225, -161, 184, 390, -76, -200, 45, 272, -99, -199, 428, 299, -73, -151, 137, 123, -77, -151, 94, 456, 29, -5, 128, 236, -5, -60, -75, -142, 142, -92, 23, -201, 254, 232, -266, -33, 100, 223, -240, -78, 110, 503, -200, -418, 279, -53, -143, -342, 209, 248, -163, -352, -47, 177, -10, -87, -111, -161, 83, 110, 48, -299, 93, 7, -30, -355, -72, 328, -434, -499, -224, 234, -298, -346, -153, 403, -26, -430, 130, 117, 5, -68, 131, -99, 88, -264, -144, -193, -43, 223, -181, 30, 91, 478, 149, -305, 151, 318, 69, -251, 348, 136, -138]
4128a38r1L83L33n24m2K47K72k31k37p8K78k11o8K62j04J02p8k06j44L8O74q37
4150d00j43M90N09n41m08M90L59m79k84M21K39k75l76L81L2J2k71k5K69N3j76
4171a23N0K3j0rk7lj18K80k3j62L2N84l22l51J73K71j34k3j7K32k61l67L22K53
4195B70m4j49k2l4K82n34J82J34K66j70L2l37J27M73m78M9K62N4j74n62L66K38
4217B31j37l36kM87l76k03K23M51l01j01J13p3J67k24J07m10O05j04r5j9o5J82
4239A20k52k0L7J82%j15J31J98l45k30J77L12K50r14L02M90l80j82j20M93J58
4260B92k13j54O5R6R9k71l56N55j46R0j36M9N08j95m63r1O71k25k15K44M7k3m25
4283a97j22Q33k03m99n9L13J46p0l72K84j9K8n24K92K49J63j47m11M7L50J6k13
$$ y = [-138, -229, 154, 487, -37, -79, 168, 440, 209, -28, -106, 172, -39, -107, 155, 51, 153, 75, -131, -275, -237, 437, -400, -543, -53, 456, -85, -493, -3, 356, -123, -407, 14, 253, -22, -398, -17, 15, 27, -244, -269, 0, 53, -123, -73, -50, -60, -69, -96, -99, -217, 63, 40, -122, -90, 494, 172, -179, -6, 265, 131, 108, 91, 323, 62, -305, 17, 270, 226, 77, 55, 21, 303, -231, -49, 85, 351, 181, 213, -124, 3, 476, -2, 47, 309, 363, 189, -373, -7, 231, 94, -242, -244, 243, -133, -336, -113, 338, 37, -64, 49, -24, 143, -81, 26, -384, 221, 117, 22, 3, -62, 120, -132, -152, -115, 67, 67, -48, 83, 281, -64, -294, -117, 195, 445, -469, -167, 323, -57, -239, -359, 134, 292, 79, -75, -10, 86, 185, -86, -442, 113, -33, 57, -79, -30, 478, 283, -180, -271, 400, 175, -40, 204, 251, 228, -197, -319, 514, 311, -188, -247, 66, 212, 142, -230, 54, 35, 63, -461, -169, 80, 243, 96, -315, -268, 82, 98, -115]
4305a15J14J92O0m92P3K87j72j49l23P54j44n23K47M21j69k19N6q9K50o1j55J86
4327B9p1K12r3j44M2j42K43Kl92N71o7l48Q5J70L46o12J5M74k1r9l9J90m59j5
4351a23QJ4K44j79J46j89K7L39l42K12l09K96j1K4l72M04Nq7k09l8M03n00k3M59
4375A99o9k45p0P1J08p4L9lr8J56J0j77j12M00k43m5rL51k96L4k25M48j83M9m31
4400d15N25o0o5k28K62J51Mj61oM9k3O1j51p1J47L00k89j26N21l17P2l51J44M17
4424C90n04j3L55l1k87j30n0N10j08m94K94J29j47n2J13j03K64n1k13J79L54m95
4446i0m05M58j68K54l8j20L40k4k01l44O62k99j58j19K21K04j40l06K06L53l07
4467b1n5J20q3pk55K39JoR9Mj61J12N4k8K9P1J19m20J69J71j44J33l92M94j45
$$ y = [-115, -1, 191, 251, -241, -168, 119, -53, -202, -525, 229, 85, -438, -191, 230, 61, -158, -102, -191, 59, -2, -157, 29, -42, 170, 77, -67, -25, -167, 76, 78, -314, 257, 190, -158, -73, 97, 443, -169, -154, 320, 299, 200, 161, 351, -108, -123, -115, -101, 143, -36, 110, -79, -52, 287, -55, 157, -152, 144, 133, 157, -215, 189, 194, 107, -102, -140, 263, -237, -260, 199, 130, -115, -185, -114, -6, -80, -41, -44, -142, 14, 24, -153, -265, 135, -108, -153, -162, 189, -107, -73, -298, 150, -33, 16, -415, 110, 50, -15, -243, 19, 170, 174, 13, 7, 56, 33, 94, -57, -128, 19, 319, 30, -96, 425, 108, 180, -171, -27, 390, -114, -127, 228, 197, -90, -220, -270, 240, 132, -362, -68, 61, -86, -138, -25, -128, 136, 85, -128, 51, 405, -90, -495, -37, -205, 49, 11, -109, 231, 207, 6, -338, 324, 25, -133, -252, -31, 173, 33, -273, -67, 286, -21, -76, 44, -39, -46, -301, -62, -61, -67, 32, 36, -125, -13, 41, 13, 42, 113, 232, -188, -19, 152, 8, 141, -251, 243, 98]
4492I8P3j66K11L7j65j23k37M09kP6m24K41L7k65J18q1K32LN7j64K65k23k7P7
4516E7j17K73m49K06o2L29k69k36K46O4k71J95M00n55O8R4L09n01K8K38q7O2M5
4539F7n8J36k80L7K0Nj31J71K21j71O1j24P4Mj61P0R7J18L1L8j52mK6J07k78j4
4565i0M38k5o04j06N27j2m5l09N64j41j74j8R2o8j43K07J3k79J4R6J47k43P2R7
4589A0O3j23J15m2k0Pj45J01k55J01K62p4l52K15K57k64k91K59L16j20j92l9L87
4612A76q4k82L2J05nJ48k22J1j19Q7j3L77l20K83k14j00J71L03j16m76K52K55
4634B49j19l27K4J22L50l46J48R7k11j23J52PK21k82j27K22l9j45K85J6k96L16
4656A94l58J7N3L27r0j03n1L04r2l62J54J9J50l35L24j0j07J18r8mj50K20k07
$$ y = [98, 171, 5, 216, 253, 88, -35, -272, 137, 135, 211, -213, 28, 65, -200, -82, -163, 69, 72, 129, -35, 230, 7, -20, 57, -60, 213, -236, -30, -92, 237, -32, -268, -22, 42, -229, -34, 366, -189, -121, -27, 282, -219, -191, 47, -40, 22, 67, 9, 145, -135, -98, -78, -73, -204, -33, 188, 17, 78, -46, 28, 32, -129, -59, 38, 156, 187, 225, 73, 69, 95, 202, -76, -90, 348, 323, -281, -387, 140, 128, 83, -226, 338, 197, 23, 5, 97, 29, -114, 93, 106, -173, -159, -63, 84, -159, -87, 10, 73, -50, 65, 23, 3, 10, -135, -34, -289, -188, 74, 0, -352, -137, 120, -144, -435, -176, 140, 20, -172, -211, 176, 92, -190, -158, -53, -58, 90, -132, -121, -240, -153, -166, 211, -109, 174, -40, -140, 31, 334, 218, -258, -6, 249, 130, -197, -173, -51, 299, -47, 101, 198, -13, -136, 16, 23, 244, -38, -165, 57, 18, -127, 158, 174, -122, 194, -164, -147, -94, 233, 143, 40, -11, 293, 201, -161, -7, 12, 162, -173, 151, 141, 34, 152, 54, 50, -100, 120, -87]
4679h7L8j21K58k67O3K3K02r9j29j99J03L35j81q3K82j81K4j94L31k8l40K86k0
4702A6M4k69J49Q7j93o7J30JJ99O8K9j07J9p8j18J86j86J68m1k5Op0K35k8k25
4727g0J35K06l97r7J95J96q3J19o0k5o8K08k44l49L92J45k43k93J55K42l6j87
4749a59K61J59K5p16M09L5K4j9K0j52K26j50O5k2J11j86%p5J81K68m92o6J78J78
4773A03j93j74J85K28J23k74j65K91j54p9J22J58j88L1p0P6J47r5RM9k80L07P
4796A64q0j91K26R3l33J34K4P5l18L45K3J4k94J41J70j65k52K40K07k44Q5j55
4818i1L92k79mP9j46j58J54K6J41p0O4j90J95l92N79j33j59J54j03J31m97L71
4840F4m4m3nj91M69l61l31L62J32l1J04j34N7m1Nj13M01q9l97J29J40m0o2n6J
$$ y = [-87, -49, -170, 88, -179, -116, -93, 109, 10, -119, -318, -215, 120, -61, -144, 138, -43, -19, -213, 118, 90, -250, 36, 16, 60, -209, -60, 27, -166, -233, -103, -102, 97, 165, 194, 87, 106, 28, -90, 96, -90, 78, 37, 12, 18, -52, 183, 155, -70, 65, 271, -126, -223, -28, 168, 85, 204, 144, 119, 51, 259, 15, -334, 58, 203, -40, -333, -178, 64, 28, -159, 102, 261, 286, -430, -21, 14, 38, 19, 39, -113, 113, -37, 28, 6, 117, -69, -69, -144, 37, 305, -187, -253, -75, 103, -90, -264, -79, 149, 272, -2, -167, 124, -30, -109, 13, 171, -17, 14, -56, 20, 167, 72, 81, 130, -150, 157, 164, 84, -107, 119, 212, -121, 13, 37, 112, -206, 139, 162, 176, -118, 23, 193, 28, -224, 16, 223, -21, 64, -91, 301, 22, 18, 97, -49, -207, -53, -27, 114, 44, 108, -82, 113, -279, 300, 167, 8, 162, 59, 190, -307, 64, 20, -23, -28, -219, 250, -111, -442, -80, 52, 21, 125, -9, 48, 7, 12, -101, 300, 211, -186, -57, 83, 43, -19, -75, -74]
4865g4N6J27P6l10K92n0k11Q7L30m33Q0l1P1n9o8R1K44q2l28M47k38k08J64J84
4889A57k7m43J65K13M0j78J80J83m30J94j65K02k96L45j91j7oN5j56m3J10j53
4911b61L25j73L2J31Oj89J26R6n3l58K01K69J15l54j66K00K23o8k45J28o1K6Q1
4934C1J42j48P9j56J49q6J36p6k18L05n8pp7L9k6K64l23l2L29m9k51M0J04j25
4958a4O1l4Op5P0qoK21m22J49J97j90r8p9J08j56L61M6q0m06M58j03N1l19K05
4983e7L52k49k7K17j67j43k0K30o1j34q3M21l59L04l56l6L24j38L00m08K67j26
5005E1L4m4oo7R6j47L0J19j15M9j57J44K74k61r4J85j68j04K60K28k05N1k97N2
5029i2L94k83m6K92k17J75l91L21k91J00J56R5k37J77o0Qk78K38k1k15J92q4J28
$$ y = [-74, -18, 109, 185, -125, 167, 117, -94, -7, 323, -110, -30, -61, 10, -49, -117, -26, 218, 136, -192, 255, 17, -191, -27, 157, 130, -313, -148, 65, 105, -73, 107, 290, -140, 54, -111, 91, -205, 140, -51, -68, -74, -19, -175, -218, -108, -261, 64, -109, -77, 54, 60, -129, -3, 93, 40, -318, -117, 152, 267, -87, -253, -53, 170, 102, -143, -15, -76, -50, 31, 173, 25, 104, -52, 97, 11, 147, 71, -147, 158, 100, 93, 16, 55, 29, 293, -30, -62, 267, 218, -33, 7, 111, -14, 47, 13, 19, -56, 14, 6, 0, 221, -201, -52, 145, -45, -143, -222, -114, -270, 91, 137, 57, -349, 109, 6, 57, -262, -57, 295, 46, 19, 236, 69, -74, -94, 136, 75, -59, -142, 279, -80, 224, -132, -168, 156, 18, 318, -90, 177, 51, 85, 41, 35, -32, 64, -83, -53, 66, -49, 0, -157, -13, 261, 0, -94, 91, -77, -181, 79, 307, 102, 153, -144, -92, 302, 19, -27, 265, 48, 223, -168, 153, -138, -38, 118, 213, -24, 153, 93, 101, -177, 61, 40, -175, 17, -67, 61]
5052F1K6j89J93j57j6J96k44L67l68J94j23k48P0J70p7qJ23J00j8l05J94N1J13
5075A05l02K47p7K3K06l9j41k27J12J48j02K94k70k77J74J36j07P8J04l1l5o3
5097d4j02K42m0J46n17K73L21k63q6J03M8j44J66k5M5k58O4j74K98j45J51M5m59
5120c55N23j31L38m10J2J67m91J09J58K36k39j00K74N2Pk67n7M26l2l45L28j58
5142D5j5Q9j58J7k47N10j24q0K25j66k98J71O6K67l52j81J45Q4n0N2k35N04m4
5165B25k71J57m2j04j30nK65k94K77R0qj09J43J07j92k34J80O7l22N1J25j19J57
5188A4k24M02q3l51J92J9j8J98l59J12k43K15J4J66o7pJ4O7k67J99K36m09K23
5211D3j59O7j01rL99p2l20K69J4k29K54l02K10R6l19K34o7Rj06J0M4l35J86J92
$$ y = [61, 87, -102, 91, -66, -82, 114, -130, 237, -131, 63, -60, -308, -238, -68, -145, -153, -30, 70, 52, -253, -59, -8, 105, -197, 50, -27, -4, 202, 163, 22, -205, -93, 55, -47, 247, -23, -300, -126, 10, -97, -19, 85, 54, 19, -44, -146, 96, 56, 202, -315, -42, 279, 16, -70, 33, 81, -63, 103, 78, 123, -135, -71, -245, 53, -92, 59, 104, -355, 168, 37, 375, -35, -23, 144, -347, -238, -80, 156, -83, -183, 91, 143, 150, -117, -174, 252, 220, -125, 203, 45, 30, 119, -39, -22, -269, 241, 117, 37, 262, 96, -202, -31, 35, 302, -50, -231, -86, -2, -52, 0, -235, 269, 225, -46, 111, 69, -35, -165, -170, 95, -199, 78, 168, 160, 51, 194, 301, 109, -125, 55, 122, -200, -149, -24, -143, 14, -210, 192, 109, -242, -50, -31, -49, 149, -210, -98, -341, -126, -112, 54, -13, -20, -6, 61, -206, -7, 229, -180, 43, -116, -49, -150, -159, 240, 168, -152, 117, 131, -98, 156, -146, 64, 160, -159, 75, 8, 17, -89, -79, -35, -370, -184, 8]
5235Hr3N7J33J28l95NK75m4j91K69m9j86k1k24L54j59J36J16k02K41Q5k08L1j64
5259i8J26M0k26L14j46K57j51J26k06R7j61k5J39J8o9j32P5n4J25j31q9J97j16
5282i0L8p8K17J5n03M76k47L54k90J1j31K28M9k71K47J60j63j30PK23l37K37j98
5305a76J48J62k51pR9J6O5k22K07R9j08J65k69J24q4K43J01m49J31L76m58qK12
5328A16r6j13K77l76L97r8nJ17k37Q4j05J80j11j07n6K26j06N1M2j11O1J92k49
5351b7k2m8P3j5j01M1l9P1R2j22j23J05L58j56o9r9J92k37lL3Q1p7J63P8j42o5
5377e8R6k6J40J4k07Q7J40p2J26k74K5Q5r4O8k53L59j94N8q8n2K91j50p1r0K28
5402H8L32n81K15o8J01j37j25J15K21j13j12J0L07k45p2j64qL37k58J57j87L34
$$ y = [8, -85, -28, 105, 233, -162, -157, 118, 74, -117, 152, 103, -83, -104, -328, 26, -133, 3, 119, -83, 158, 243, 35, 66, -98, 28, 68, -158, 156, 10, 267, 116, 242, 36, 133, -28, -53, 86, 104, 35, -97, -22, -76, 49, -82, -171, 26, -90, -52, -130, 87, 102, -401, 75, -172, 182, -108, -97, -228, 0, 49, -222, 25, 185, 22, -108, -101, 122, -215, 22, -176, -28, 134, -117, -124, -25, -9, 56, -166, 41, 140, 32, 197, -72, 52, -32, 211, 312, -137, -6, 370, -88, -96, 116, 20, -93, 184, -192, 205, 107, 102, 219, -18, 66, -39, 141, 30, -77, -133, 93, -13, 38, 80, -31, 30, 222, -27, -49, -97, -24, -39, -140, -99, -138, -67, 25, -97, -220, -115, 243, 87, 18, -81, 111, -126, -129, -96, -15, -92, 71, 149, 7, -58, 38, 12, 152, 166, -41, 46, 186, 114, 240, -34, -9, 76, -18, 50, -203, 156, -38, 20, -68, -120, 171, 21, -50, -140, 88, 420, -161, 54, -14, 87, -50, -175, -60, 161, 48, -64, -54, 253, 8, -64, -228, -236, 101, -157, 0, -187, 147]
5424A47j25j03j2J50k9k97J92L4j5j2J36r8J7L2M8j46Q5K05k81j5J26r5K4J52
5448A20k6k42L01j60K6Np8j2J55J7k40J10j10J76NK2j21k20N58k83J90j84J82
5471A91M2l32K25Q5j95j72OK42o3j62Q2M32j36m43l3P7J23N3m2j56J62R2j49J34
5495F3M4j7J00k42kK25m26K59q5m9K00ln2Q2o2m25K60K06J41k99k30M4J95N9n0
5520f4J5J54j53OO0o8j98L46j38l0J4J2K04k26j0M17p7j52k9jLm23J99K39k30
5545a30J01oL18k27K1K30j82j74n9K68m09K01J47j22j73J28J54j16M2J13j58Q6
5567E3k9nQk6J49k57%j9J44j63K26k09j2p5K75R1ml25J97P2q4N4k7n7o2J9O5j61
5595a62M85m15j10L31l2K2k09j18K27k32J50J02J10k24J31Lk20R3K50n4l14J96
$$ y = [147, 22, -81, -93, 57, 28, -269, -77, -43, -58, -70, 66, -32, -15, 17, 65, -81, 4, 209, -72, -87, 39, -56, -32, 120, 94, -148, 153, -7, 19, 24, -54, -66, 89, 106, -134, -24, -134, 42, 47, 69, -52, -272, 286, 3, 193, 9, 191, 233, -99, 126, 211, 16, -156, -150, 92, 29, -133, -51, 381, 245, -198, -231, -154, -31, 22, -20, -176, -14, 78, -71, 63, 107, 90, 190, -52, -54, 171, -255, 4, -81, -130, 70, 67, 15, 97, 35, -390, -130, 76, 217, -82, -312, -268, -73, -14, -64, -49, 105, -48, -42, 18, -50, -248, 98, -40, -70, -56, -44, 160, -66, -76, 341, 264, 112, 83, 82, 85, -338, -139, 100, -130, -29, -35, 283, 56, 77, 307, 125, -49, -108, 160, -249, -48, 99, -23, -196, -68, 86, -30, 12, 125, -33, 53, 24, 19, 27, 1, 150, -107, -107, -126, 18, -145, 81, -128, -140, -215, 60, 151, 147, -178, 19, 91, 7, 61, 34, -23, -85, -66, -1, -162, 323, -92, -202, 129, 97, 119, -90, -208, 19, -213, -63, 39, 149, -75, 56, 59, -161, -68, 182, 128, -186, 10]
5617A0P7k7k69L74Q9j32k28K44M7l83o2K36K91l50j72K17L23l03J12j47J04j97
5639a46K48O4j29n9O6J16k27R4Q1j75K4J40j19k7R1k56J97k7M1J88n0k30k3O5
5663e3J81j01j76J3J37k17J62J30k76J95K09l47J45%P4k17l3J78j26R3p4J44j0
5686C1N4k79L43J4K7j21l7P5k44j1J59P1J6M7j08j99L1L20k91Q8K04m15L40j65
5710e0k52L90j57n2J62O2j88J57k00L58k60R5m0J53j36k04K40p6j12J87k77k9
5732b29P7Q9j45n6M66Q3l91p8K11n8L6j55N0K82j78l11M39J01j40j53J88Q3o6
5755A45l31K39j41J94o6P3j78J54j23K49k69PJ50p3n2j37K91j35R8j70J71Q4j70
5778A0J08j5k97K01L7K1j20J94j71q1J08Q8Q7j14l05K51J82j63J53j22P3j11K7
$$ y = [10, 87, 60, -209, 165, 254, 122, -106, 138, 185, -198, -260, -24, 267, -83, -255, -38, 285, -18, 94, -53, 51, -146, 102, 166, 37, -22, 44, 160, -67, 27, 108, -67, -43, 97, -22, -49, 42, -214, -17, -44, -3, 185, 135, -95, -118, -53, 128, 27, -149, -136, 1, -216, -54, 76, -200, -5, 204, -143, 2, 2, 76, -141, -174, 4, -122, -29, -103, 41, 31, 85, -194, 149, 163, 190, 69, 32, 107, -137, -148, 11, 82, 98, 145, 37, -162, -131, 189, -102, -14, 190, -225, 115, -50, -302, 88, -69, -121, 41, 103, -85, 72, -128, 230, -30, 65, 25, 178, 42, -162, 78, 2, -110, 77, -200, -229, -152, -63, -208, -264, 202, 285, -106, -184, 27, -31, 5, -150, -100, 182, 4, -307, 132, 233, 93, -60, 128, 211, 145, -186, 53, -88, 106, 40, 113, -65, 89, -34, 215, -54, -47, 103, 30, -22, -159, 132, -3, 95, -75, 96, 180, 10, 118, 103, -194, 7, 44, 65, -55, 139, -32, -113, -5, 83, 170, 56, -249, 2, 184, 21, 174, 52, 125, 14, 41]
5801D1j37R3j4J82q6j11l6k88L53L08l31L1O2K0j05M3l9P2m7k09K23l2K32j71
5825E4q0J2q2N7M6P0J84r2k06K9m5J35k79K23J58l07J01p1K7K27P6k51m2O5O8
5850G7Q3l26J48j64J67k6r3J8K94K0l25N8K68k02p1lop8J41J08l12M21k27L4q9
5875h5J30r6L7J81j29j90J58K53n31K49j29L7J76j44N5P1k70J0K93p3r0J77J50
5898B40n2p1k08J87o7J76j86j52L83l41M1J20O0j43j45J78L1K20m49O3K67k77
5920a25M5J47p7j56Q3j55L71j83NL7R3Rm6l26M41j10J0n3m4J06j09j32j52M64
5944A43r4o7k42M29j83J11p9n5P0P4k94K70O0l02J99k82L22J54m2l91J56J4K27
5967A98K7j67J35J14k04k68L94k95J68k15L84J63n78J74p8J24n2p2J94j76j19
$$ y = [41, -96, -3, -17, 165, 79, -32, -68, -356, -3, 305, -26, 5, 67, 87, -18, 25, -14, 58, 11, -198, 25, -7, 225, 54, -26, -14, -96, -39, 7, 77, 261, 169, -37, -8, -53, 82, -197, 26, 184, -123, -22, -93, -66, 161, 237, -14, -56, 9, 77, 160, -166, -18, -182, -15, -41, -134, -116, 178, 198, -127, -69, 199, -3, -74, -77, -83, -161, -20, 88, -224, 197, -30, 4, -85, 45, -51, -14, 167, 38, -152, 6, 259, -272, -23, -152, -115, 61, -83, -28, 43, -227, -217, 76, 3, -87, 90, 240, 188, 117, -91, 96, 29, 205, 19, -133, 250, -91, -50, 70, 130, -13, -158, 20, 51, 271, -178, -115, 152, -125, -80, 67, -10, -166, -83, -238, 133, -50, -45, -8, 85, 94, 48, -278, 163, 53, 63, 10, -34, 72, -37, -169, -321, 143, 49, -18, -260, 169, -14, 97, 18, -37, 33, 107, -187, 83, 143, -159, 40, -242, 80, 234, 192, -199, -43, -29, 198, 225, 58, 193, 307, 103, -165, 229, -66, 102, -113, 271, 434, -144, 30, -48, 76, 24, -48, 146, -30, -149]
5988a49N1q6K53q9p3J54k8j45J91K7J00m2j87n5l3Q2J78j26k22K80q0o7LR0N6
6013H3j27j51J17J46p4j84J55M4j88J9NJ3J10J28j97L1J07qR9n32L54M67m10k13
6037b06K06J24j11M9k04L36k01j11o4L79j97j88J74L97k02j40j55l8J88J07o3
6058H0k16Q8o9J16J53l75L54k02k1J53J40r1l20L06J43k07r0o3P6m6K69l10K02
6081G0j9l9k47M8K06p2j87J98J02m5l6k12K47J37M2m05K93o5k9j22j14L60j80
6104f9R2k33J02J98Nj5k76K32O4k88K76m2o2q0J60m52M97J81p6J3j8k91j1O5J26
6129I8k86M4n7K98j34j54QL54J3j02j15j00j99M47k63M04j73J73l25j9J66n5J38
6152A61m24K06j5j18N5K83k24K29j29o7K13J5j51j14J14NJ07j51O8NN3j32j94
$$ y = [-149, -98, -184, 69, -20, -93, 61, 33, -112, 79, 106, 206, 164, -23, -78, -111, -29, 149, 23, -199, 81, 1, -66, -63, 27, 83, -44, -195, -78, 68, -6, -190, -35, 9, -179, -160, -155, -142, -32, 96, -101, -70, 37, 29, 128, -404, -50, 417, 7, -206, 0, 124, 13, 62, -142, 194, -7, -118, -182, 197, 0, -188, -14, 383, 181, 41, -114, -152, 36, 143, 80, -136, -48, -117, -1, 152, -223, 131, -71, -92, 61, 201, 110, -210, 96, 239, 32, -58, -121, -45, -91, 178, -132, 70, 51, 12, -235, -187, 19, -53, -240, -42, 60, 15, -21, -233, 14, 151, 193, -212, 81, 16, -13, -135, -249, 111, -69, 23, -210, -108, 90, 95, 80, -196, 36, 100, -188, 88, 46, -16, -96, 64, -388, 109, 290, 214, 227, 209, -82, -93, -28, 98, -188, -144, -201, 97, -37, -191, -183, 171, 184, 82, -33, -133, -332, 115, -148, 256, 83, 256, -69, -88, 78, 23, 161, -263, -57, -72, -190, -135, 148, -76, 153, 24, -43, 170, 185, 34, -80, 34, 39, 146, -5, 63, 68, 121, -11, -205]
6175b05K2J96j63K55k18J24O8m38K41L32p1j35LL22j50j16KK02j18L8j58n2L3
6198A4J86j07m54L99L44l28j50l18M99Oj99J40RM5j89J5M01j53q4k19J44Oj0O2
6222E9o1l4Q0J18k52P9J57l27J75k10M77l57J39j04J47k06j27O2L84j34j94PK25
6245A03r8j03M8J16n3m7q3J50N5k66J82J80qo4J72j71j42J46L6l3k98L26n2k65
6269a69K49J66k73j29J03K95k09j13R0p7O4p6RK46k23q8Q9n1J0J99l0R5k26J11
6293F2J41k50J9M8oj75K04P2k6J35l67p4L00L0k06lL67k24k54K89k32L58j4k58
6317f4Q3j21j22j8K93o9R6N8RR6l2j12j64J01j3%k55K65Oj61J20M5J2J38j68k30
6343b07J67J52r2j50J75J23j43J43k54rJ14j26K82j56O6P0k04O4J65j77P6j65
$$ y = [-205, -183, 13, -150, 105, -113, 11, 79, -359, -118, 214, 143, 8, 11, 333, 183, 67, 69, 271, 153, 191, 33, -19, 14, 200, 93, -361, 38, 382, 54, -96, -414, 85, 91, -108, 32, 41, 86, -103, -88, 313, 160, 76, -143, 1, 7, -3, 59, -2, -36, 44, 162, -90, -11, 146, -181, -6, -216, 261, -96, 43, -61, 86, -120, -247, -185, 199, 65, -129, -122, 103, 5, -98, -50, 66, 13, -34, -117, 33, 88, -178, 4, 184, 176, 112, 284, 113, -29, 117, 153, 120, -178, 148, 96, -169, 80, 246, -27, -156, -53, 242, 33, -80, 10, -67, -3, -79, -70, 176, -47, -135, -46, -97, -87, 112, 82, 177, -49, 62, 203, -47, -28, 20, 14, -161, 43, 115, 89, 224, -143, -217, 83, 113, -93, -96, 271, 47, -207, 82, -150, 208, 194, -64, 19, -102, -224, -242, 51, -18, 78, 136, 145, 241, 209, 97, -67, 34, 21, 21, -234, 31, 37, -124, -4, 41, 53, 191, 23, -207, -40, 112, 20, -130, 45, 168, 25, 168, -86, -95, 19, -107, 175, 19, 85, 155, -49, 15, 180, 3, 79, -86]
6365h6K09j64j34L00J76j55j14L9j03J21P0k84L5LJ43j90o8L16k7k34J4K43j61
6388e1Q1p3p9n0K77j37j63R3L61k1k87j4P9R0k91J01J73k28J55J75r4q6J02j11
6412Bq6J95k56J74QK47m39J93J28j78L1k17N2J42J42l42L58J31l51L13k12j64
6434a29j6o0M42l90J19L59k21j13Q5m6p3l13O06l57j43L48Q3p0k12J61o3L6j02
6457f9J00k43K33L1j66K63l32L21j21L7k26J28J86j34J00m9J6J39m01j3K60j97
6479a37NQ5J51K63l13M7l3Jj37jP5P7m1J32j51j31L55k63j16J70j45j4J91j58
6503h8J24o7K29j16J10m1k62R3K11R3l79J86M3m3m66K97P5J0kj36O6J92k70j07
6527b48J83j55K85l01J04K52j4l8j87L07P9k01k33J47j3j32J11NK01p1m8j8n3
$$ y = [-86, 123, -41, -175, 125, 301, 146, 32, 71, -32, 89, 159, -125, -90, -87, 56, -134, -202, 114, 87, -147, -133, 110, -51, 30, -43, -122, -172, 105, -32, -195, -102, 259, 238, -49, -63, 16, 106, -185, -84, 89, -139, 16, 191, 97, 11, 113, 2, -84, 111, -145, 29, 37, 284, -155, 38, 166, -12, 19, -198, -146, -4, 138, -204, 154, 285, -66, 247, 35, -129, -145, -205, 237, -153, -34, 325, 104, -9, 76, 30, -43, -356, 250, -107, -250, 98, 181, 111, -101, 60, -3, 33, -69, 31, -212, 21, 52, -114, 149, -183, 138, 17, 54, -172, -44, 142, 8, 108, 59, 75, 214, -187, -200, 60, -137, -132, -47, 104, 367, 54, 101, 68, 69, -68, -69, 6, 83, 42, 174, 23, -108, 247, -16, -132, 38, -107, -121, 70, -88, 36, -31, 198, 82, 192, 151, -111, -18, 193, 286, -93, 93, 136, 93, -373, -76, -1, 9, 7, -129, -63, 129, -141, -248, -65, -220, 65, -236, -132, 120, 106, 68, -119, 188, 267, 66, -167, -20, -33, -165, -54, -49, 152, 81, 33, 15, -38]
6550c8J84m2j01r5n0J62q8k80L50j08m5l0K96n4M1j68K8P1l5j13Q2J17N1k77J75
6575C3M6R0k91M54m53Q1P0P6Nk74L40j13O7j32J94j01ok87K30K44j29k28K63j06
6599G3n5k32K33K43k31j6k48L83j97L58l79k31J90J14o5K08K2%k15l8j44L43k27
6622a11j13L96j25n7j52RJ53q7J72j55k03R6M8j48L38J71j11j90q6K20j31n9J25
6645@Q4k91J80o0J2J32J7l16K87J74l29o2J38J42k02K91j31j93L08k24K04l18
6667a57QP1J67J80j15k91K44m0jK62o11K8K84N7l52J79l9j0M6j69K93P8k09k48
6691c45L72J68j32j56p9qP9J53k11J45M6J08j31J04J03j42k57K47kk35J91k1M
6714AM8P8k44J31k1j23K97p0j2n7r2K01l21L01Rj72j3K14r5l6k26pK89j82m0J15
$$ y = [-38, 146, 104, 3, -92, -142, 20, -68, -348, 2, -106, -151, -181, 115, 61, 102, -66, -38, 33, -2, -115, -33, 84, 135, -142, 33, 79, 169, -122, 332, -121, -40, 30, 106, 111, -163, 177, 64, 131, -1, 193, 92, 86, -201, 29, 273, 144, -84, 179, 73, 18, -214, 19, 262, 31, 15, -233, 150, -47, 311, -68, -299, -109, 5, -60, 148, 170, 170, -45, -83, -227, 116, -111, -224, 172, 47, -10, -162, -153, 0, -87, 85, -70, -273, -177, -129, -277, 61, 232, 121, -69, -155, 65, -66, -125, 0, 84, -207, -27, -87, -75, 57, 74, -242, 45, 219, -110, -172, -34, 108, -94, 197, 66, -127, 181, -43, 161, -157, -149, -78, 89, 269, 154, -137, 107, 67, 66, 328, -283, -255, 29, 86, -266, -87, -126, -136, -90, -259, 34, 112, -97, -345, 27, 195, 63, -93, -172, -180, -101, 52, -159, -14, 32, 140, 9, 113, 216, 74, -183, 64, 62, -173, 18, -3, 1, 49, 127, -117, 14, -7, -130, 167, 97, 85, 28, -64, 137, -184, 117, 126, -46, -59, 155, 60, 24, -202, -209, 80, -102, -142, -27]
6740b7M9r7J91n5n4n1K12l48M74m14J05J22k16j39J25K45l2L4j51j35N2J85j87
6763a12K03k40M3K1k6N0Q2q9J86J60l60K55j57n2j77K08MJ76k6j03J3M3M7o2q3
6788Dj9l7K49o5Ro1k55K43K1L6l34L59k57J84no6j4N3j61J26q4P2O0k55m3J92
6814d8R8Q7k54O0j9R5k87K14qP5j96J17m0K26k22o2J32J38j36J64k5p0j39jN1
6839e0R5r1k2J47j12R5p2J1l03K89Q3k40J64N9k67J32o9J17J47m2k88J87P4j15
6863g1J13Q2n7J29J35k10J03j38q5j79J72M1M2L5l34J28j19m7K43j9Q2n9n9J05
6887C3o1K0J0J23k7j32J34j76Q0P5j8k34K34J30j4k11q2J69k16M05r3j53O3j22
6911f3m7n0K54j38j89m9L90k45Mo5J91j19M3j1J63J53r9k06K16N4j67J06r5J40
$$ y = [-27, 22, -75, 116, 61, 7, -44, 168, -180, 294, -120, -15, 107, -109, -248, -123, 122, 90, 124, -27, -162, -110, 75, -112, 91, -149, -106, -85, -111, -61, 21, -68, 118, 278, -82, 173, 16, -36, -213, -5, -1, 175, 149, 46, 59, 102, 149, 87, 4, -15, -52, 197, 132, 141, 80, -175, 68, 89, 125, -209, 150, -107, 77, 72, 6, -8, 45, -116, 10, -74, -2, 58, -197, -240, -48, 50, 137, -117, -57, -76, 19, -268, -54, -62, 13, -183, -66, -106, 120, -102, -164, -32, 106, -30, 134, 109, 39, -100, -101, -50, 45, -46, -68, 79, -33, 62, -10, 1, -302, -13, 70, -170, -6, 53, -214, -82, -151, -34, 113, 71, -217, -30, 44, -71, 42, 124, 67, 196, 331, 121, 224, 86, 1, -178, -6, 35, 77, 112, -222, -94, -213, -260, -17, -36, 46, -13, -72, 33, -28, -8, 2, 125, 98, -34, 100, -76, 4, 79, 61, -173, 61, 191, 177, -34, -116, 53, -163, 242, 149, -4, 59, -63, -110, -160, 94, -44, -233, -282, 108, -137, -133, -198, -7, -126, -83, -94, 69, 222, 123, -83, 133, 187, 20, 126, 31, 171]
6935A71l65N7K50O7k88L9J10L00k49j6j09J58j07Rj59P6o4j56K00Q5P5j42M7O8
6959E7q7k2J99o7j90J40L0r1q9L37l42N6O3o3J08K4P5p1q9J58K0r3n0l1j29j2
6985a59J92J4p3k4m3K10r2O7k2M8j87lr1K50n6R0m8J96j55k24L15l25J95k95R3
7010a27R8P1k18J67j36J03j1j2N9J76n6j11ok53L46j17J60j41o1K79j68j33m2
7033a33K00j27mnJ49lj51J76r4j22K03k45m0J54J08j06j28M34k78J14j56r9K77
7056A24l44O7J95j32Q2j05L01k70N4m0L20k83m5K83k61P6j65J37n4L83k98R3l21
7079b03J22K32j93j06M7L9j8L64o16M19o4K1j70l4K44j89J11o4J65l20L16J46
7101B49j66Rj33J5L18l16J38k78J34J6J32k5j20N2L1N0j72j8J74J0M0j5k53R6
$$ y = [171, -194, -137, 113, 180, -108, -69, 41, 341, 92, 76, -33, 125, 18, 27, -132, -56, -120, -276, -76, 9, 84, -58, -11, 57, -30, -52, 147, 80, -110, 30, 60, -31, -120, 217, -125, -69, -6, -69, 39, 63, 138, 67, -22, 136, 156, 63, 13, -18, -147, -159, 33, 47, -26, -50, -93, 117, 25, 92, 70, 118, -69, -72, -163, 87, 31, 121, 73, 269, 114, -110, 205, -120, 75, -220, -127, -29, 42, -176, -9, -145, -42, -53, -65, -6, 170, 114, 3, -3, -256, 90, -27, 133, -8, -69, 210, 42, -91, -133, 67, -60, -64, -69, 80, 77, -74, 102, 8, -114, 89, -156, -196, -42, 66, -40, -168, 266, -12, 102, -54, -153, 124, -220, -153, 42, -90, -8, -113, 188, -82, -28, -68, 252, -31, -76, 207, -54, 22, -143, -6, -60, 323, 25, 118, -203, -81, 151, -42, -148, -101, -62, -80, 284, -332, 87, 23, 44, -126, -160, 84, -105, 6, -58, 107, -213, 103, 249, 83, 92, -41, -26, 292, -24, 114, -164, -30, -14, 118, 93, -27, 25, 56, 106, -66, -84, 90, 100, 140, 125, -128, -32]
7125c2K9j31J66J5l3Lj6r5L88k52j70Q5K57j88L8P3k30k0n2L82k52K88k71M5N8
7150H5l3j86Q9K31k45J28K1j80Q8J76k10K5j06o2M24l32m6L03k88N5O7J15l1l00
7174b12J17L22J20m09J97j74j66K26J74j21j35M7J71k08K36k01o5M5o3m8Qm5L85
7197B01l01J04k6K40k5M5l06r2M64l45k83L47M7j74K87k17P3q4K26l31J48J45
7219A43j59N1j42J72Q5l95J89k01M62j14j21Q5j98R5QJ11l45K46k55M40K5k46
7241f4L24l13j9l6J03J29j88J33K1J86m42L28j64M8K10m22J00R6j53nL44k34J05
7264H7j63R1j19R6o4j24k3K04j7J23m7k3k35K37pM6M3l30K81j0J35j04K8q5R8
7289A18mj03j04J1N3j20K50l01J98J39m0L8l9m43M24J6k00J97l26M27j11k01j4
$$ y = [-32, -3, -134, 32, 47, 14, 17, 1, -94, 294, 42, -128, -43, 214, 26, 64, 137, -93, -113, -165, 217, -35, 253, -18, 27, 85, 52, -134, -45, 186, -59, 69, 90, -90, -2, 174, -36, -11, -117, -179, 245, -87, -133, 170, -118, -63, 4, 119, 88, -212, -95, 227, 347, -62, 135, -39, -205, 21, 195, 74, -61, -14, 157, -51, 185, -16, -81, -36, -99, -147, -139, -184, 201, -100, 4, -22, 218, 193, 238, -68, -160, 304, -41, -324, 23, 70, -104, 183, -34, 39, -45, 181, -150, -2, 143, -16, 35, -107, 65, 150, -245, -56, -257, 205, 91, -30, 55, -143, -48, -40, 71, -274, -28, -283, 157, 182, -64, 260, -53, -72, -108, -5, 124, -64, 69, 90, 276, -166, 162, -2, 46, 256, -166, -66, 30, -123, -128, 216, -18, 87, -76, 15, -104, -8, -72, -196, -219, -15, -32, 91, 44, 21, -214, 23, 16, 62, 105, -225, 56, 46, 181, 77, 105, 20, 118, 114, 11, -93, -82, -29, -149, 101, -200, -2, 137, 97, 135, 96, -347, 77, 93, -107, 90, -236, 191, 80, -121, -135]
7312a35or2J47K57k33K26k16j10O7q5J07L4O9j9q0J95j12J42P2k06M2n0J34l14
7336a66L6J23j15J69J29K4m46J0J08M3L0k2L44l88j16m6M16j72j73r7K68qj41
7359a90L13q2p4J17k39L7K15j40r2L6J1O9J38j41Mo9K42n0M2o0j13j64J42K09
7383A61q4l6lj3q4M0JJ52j7m1M8j70j42K47j46J16J59k23j69J51p5k4L62m04L24
7408A30j33j87N2J38L4j80k10M24j26k12R3J71N5l89K41JL70l89K47J65j80J01
7430B16l24J29jm9J52r8q1J08p1l0j56K89p5j89K36J67k01j08K7n0J85n4J80l75
7454a73j6K30k92L29l64K27K0J42j46L5r1j16J03L94qj72n76O36j36P8j75k2L51
7477B58l31J85l36L03j00J57j83J56k41L04j50n7N6M09m02n2J64l24K06k76L87
$$ y = [-135, -141, -233, -86, 171, -62, 164, -52, -162, -95, -180, -73, -39, 30, 11, -69, 126, 14, 156, 228, 22, 64, 14, 148, -166, -130, -7, -122, 47, 176, 200, -246, -236, -128, -85, -55, -77, 267, -121, -237, -283, 133, -39, -212, -309, -41, -49, -190, 123, 41, -33, 84, -155, -118, 97, -43, -135, -99, -88, -19, 119, -22, -18, -87, 155, 105, 147, 87, -26, -190, -48, 161, 77, 41, 38, 25, -59, -19, -18, 134, 117, 76, 124, -46, -188, 59, -87, 29, 188, -35, -204, -53, -128, -152, 210, -194, 130, -3, -190, -138, 0, 34, -146, -356, 68, -58, -270, -177, -6, 49, -340, -99, -98, 272, -117, 130, 295, 115, 216, -108, 21, 20, -29, 123, 25, -56, 52, -19, -49, -205, 84, 9, -180, 56, 223, 22, -86, -59, -109, 76, 22, 202, -173, -189, 41, -251, 78, -286, -59, -39, 103, -43, -8, -99, -215, -112, 282, 274, 102, -474, 162, 26, 104, -71, -93, 258, -73, 112, -224, 79, -21, 136, -47, 109, -132, 172, 22, -35, 21, 430, 28, -24, 140, -184, 22, -254, 133]
7498A33k00K96k80L9q5J10J6j8n9P9K60k37j12M3J71r9n5j30J42k7Q7j37J70K03
7522C10l73L3J96n5Q9m8j49Ml33M48O5j63LPP5o2j75J70j04m6K48q5j09J70Nj22
7548am6R4l1N2q8K0K14l45J20J57j13l0j18n6J19K36m84L47K36l27N1J12o2Kl4
7573B5L7l08K40J16l10R8J53k7j35J11n2L13l25m4j14L19j05L9J25J4j53m9j61
7596a93K99m15L07J94k25K67j21n3j90L5K38%l58K2L11N0j57r8rK30k09J10n6
7619b1j48R2J23k34L92j74k07K30K40j79k01j47J68L9J39l31J97K15j29r8J30
7640I6o5j66L8K04J09n0l87K78J87j64k11K86k38J76k16J50%k1M2j58l2J27M4
7663B9j17Q7j5J28o4j7j17K77Kr8l35R4J5J65R9j4l3J1l3J87k96J97O2j61k34
$$ y = [133, -67, 229, -51, -12, -97, 13, 29, 11, -48, 31, 291, 54, -58, -15, 156, 57, 2, -128, 14, -13, 74, -63, 107, 310, -63, -30, 166, 111, 200, 152, 3, 7, -326, 122, 187, 24, 27, 34, 109, 47, -128, 42, -62, -108, 140, 55, -54, 116, 121, -1, -47, 47, 16, 68, -20, 0, 214, -131, -11, 146, 33, 3, -115, -171, -52, 184, -300, 47, 283, -44, 7, 119, 57, 59, 25, 62, -246, -6, 110, -200, -102, 51, 24, -111, 0, -52, 261, -64, -108, -222, 97, -8, 31, 156, 170, 17, -32, -193, 106, -309, -2, 192, -33, 234, 113, 60, -130, -95, 143, 143, -215, -193, 118, 168, 11, -87, -96, 134, -75, 35, -21, -169, -77, 46, -188, 204, 30, -177, 53, 293, 114, -87, -234, -66, -27, 112, -219, -22, 193, 64, -34, 96, 31, -135, -97, 107, 216, 166, -221, 57, 244, 80, -131, 155, -83, 93, -123, 27, 27, 6, 48, -110, -142, -15, 29, -88, -1, -16, 112, 48, 31, -86, 191, 193, 95, -240, -146, -131, 34, 133, 119, 86, 97, 64, 251, -45, 152, 214, 53, -181]
7688a81J02J82j55J05l5N3j15R3m0j52L56j45jk46P4O5o1J08j32L56J2k55j89
7711b01P2L42k03M7K73l29j89K72j79O1j31K28k3K27l86O5J74j21J20j69k9M3
7733c6k66L10L45k75J05j95l9Q4k2RN8j81J84q5J61l45J42k5o7J70O1p1m8N8q
7758B4P1K4o0j83j25M00j28O7J41l08o5j29M87k75K05k91J9L01j40J82l48J67
7780C6O9j88k9K52J5Ok15P7K17j49j2on3k58K92J18k02L47n17k1K51p0J03m5R
7805B7q0M5k36M93k49J4m8J43J58k39l6k05J46Ko6l8M7K55j56j8L7K68j78m1m8
7830co2K83l68K16l3n6j6j5K5r5J84m6o0J97k34R9j3J03k01KL1q2K64r3n7K7j8
7857b1o9J27j67K10N7k59K95k10J27j5J86n51L21r2K01Qn6J47k66RR6R3j82k00
$$ y = [-181, -79, 103, -52, 53, 18, 71, -44, 49, 9, -143, 213, 68, 67, -179, -105, -40, -101, 7, -125, 231, 243, -12, -201, -129, 213, 10, 57, 330, 1, -188, 84, -95, -34, -165, 63, 40, 267, -119, -54, 120, -1, 119, -50, -79, -36, -302, 8, 353, 78, 183, -12, -51, 33, 11, 20, 78, -103, 81, -4, 157, -188, -46, -71, -138, 32, 93, 22, -26, 32, 24, 95, 119, 59, -124, -249, 151, 23, 90, 231, -77, -142, -271, 216, -59, 146, -145, -126, 175, 35, 217, -131, 36, 105, -83, -112, 140, 155, 161, -54, 23, 240, 91, 79, 73, 20, -238, 54, 172, -30, 317, -200, -221, 30, -40, 63, 18, 27, -53, -8, -244, 249, 0, 14, -34, 109, 267, 28, -8, -213, -67, -65, -131, -169, -122, 133, -23, -41, -4, 264, 86, 45, -3, -65, 218, -150, 66, 33, -23, -39, -54, -29, -124, 60, 14, -46, 151, -83, 16, 3, 106, -95, -93, -62, -144, 120, 27, -30, -3, -21, -90, 37, -130, 80, 137, -122, 173, -37, 90, 75, 261, -290, 31, -61, 140, 148, 92, 239, -27, -18, 78, 171, -11, -211]
7881b11K44R1k72K16j95K39k43K38o3j48L7J32o9j29J85k71J95j60K47J68l26
7902i5j2L59O5j20k84J96k67J57J53k14J84j97j2J05Q4k55J62j18M6J68J8q0j24
7925h1p7K68kL0lk65L36l56K33j81J7JR2J37q7k35J94J58j07j39J58j37P3l4m2
7950d9O1k7P2k39J02K18j4k62J56k7n2Pj58K12J96k62r5J22j75N9J95N2m8k42
7974a98K94p5M7l8J06r7J89l02Q6n1J6K5j23p9J52K50l75K1J50jj4j59J86N1o4
7999cj04J50N1l5j0J39l07J62J64j85J17j4l8K22l93J54j84L1J72j87P4J96j77
8022ej05K31k27K63k52l25M25M6r6J06j9N1j1l26j5K71j42J09n3J2O2q6K5L10
8046B49j90q2K40j80m4R7R8j70Q5j29K02j20m4o1nK12j80j12q5J20N6J76J31l15
$$ y = [-211, 33, 124, -148, 68, -127, 112, -131, 107, 44, -104, -67, 65, -4, -133, 52, -219, -24, -184, 63, 231, -95, -107, 252, 317, 197, -87, 109, -158, -1, 152, -62, 122, -75, -87, 18, 102, -153, 9, -109, -63, 105, 123, 43, -81, -158, 110, 108, 138, 135, -130, 206, -150, 83, -98, -81, -80, 12, 149, 62, -173, 21, 179, 72, -67, 91, -46, 27, -7, -49, 12, -15, 57, -182, -80, 138, 124, -138, 18, -9, -61, -54, -212, 0, 196, -66, -161, -39, -214, -155, 40, 92, 44, -198, 96, 21, 68, 30, 136, 39, 228, -74, 12, -39, -23, 2, -121, -200, -48, 202, -173, -152, -2, -3, -17, -176, 10, 61, -3, -107, 43, 94, 59, 49, 188, -119, 43, 207, 22, 139, 125, 87, 309, -84, 70, -114, -83, 89, -98, -24, 172, -5, -110, 121, -106, 157, -95, -420, 5, 51, -45, 61, 42, 93, 82, -244, -259, 12, -130, -21, -74, -62, 0, -86, -61, 249, 59, -23, 217, 37, -7, 90, 188, 18, 103, -26, 176, 56, 12, -49, -54, 158, -22, -134, -219, -99, -43, 133, 264, -51]
8070e1l5r4J41j5q2K43r5O1o0j47L10J7j36p9K2n3m1J78j00K18j36j01K3l4K10
8095A64J28k96j50K74m7j22J39j20j15M4j40M50l14K60m3j15J97k83LM1j61o8
8117b74K13P5j37Q3J1o8K17l63J17J33j05L26k46J82o8O2j8k69K40J37j17l27
8139a96O4q6J62j17K28L3j73n5J62p2L1J47j68l8j2K67j57m5JN1J3o0o8J32L5
8164G9R1j18n7q8K57k37J03j34m8K18J49j14j81K13k06L3K72j91K7r0P9L0j35
8187d8n3J77j14j95
$$ y = [-51, -86, -180, -39, -54, -136, 107, 12, 73, 13, -134, 176, 193, 57, -22, 0, -53, -94, 84, -16, 202, 66, -35, -12, -46, 164, 292, -4, -154, 120, 73, -49, 90, -30, -145, -101, -241, 209, -105, 155, 112, -3, 194, -89, -86, -45, -206, -274, -61, 14, -123, -40, -29, -97, 120, -243, -126, 7, -98, 228, -18, 164, 96, 158, 140, -129, 111, 248, 131, -196, -132, -218, -56, -173, 55, 88, -85, -140, 22, -50, -19, 128, -40, -78, -90, 177, 20, -25, -24, 27, 40, -20, -88, 44, 79, 170, 52, -5, -93, 164, -73, 30, -104, -152, 66, 215, 101, -80, 133, -73, -40, 232, 41, 68, -22, 57, 87, -48, -101, 76, -38, -233]
8191b33
$$ Imaginary data points
##PAGE= N=2
##DATA TABLE= (X++(I..I)), XYDATA
0@%%%%%%%%%%qJ6j6J6j6K4l2L2m0N6o4P2q8J04j21J45j69J93k24K57k97L39l85
33b06M38m94N57o25P00p84Q74r73J083j202J331j472J628j798J982k185K406k648
51a388K918l217L548l918M336m808N349n977O713p594Q666j0004J1732j4058J7376
66I674k2529L1675n2668J86910J9222m32241J02918L36959J1133k93139J123J61407
78F0444L855j20470N6837P3813n0914p1294J5381L6422L9760M4275q7561j40853
90a40305Q7005K16064m4357k60920J7147K37802N152k29922L0110K14951o3630
101F9097k27312P0321K51151n5593k37101L099K00115K5215j27903k5005M7110
112f806J3164o991K2272l0452k0438M9171K04p9472K3489J36681m6831j77833
$$ y = [0, 0, 0, 0, 0, 0, 0, 0, 0, 0, 0, -8, 8, -8, 8, -8, 16, -16, 16, -24, 32, -32, 40, -48, 56, -65, 80, -89, 104, -120, 137, -160, 179, -206, 232, -262, 295, -330, 370, -414, 460, -513, 570, -632, 699, -773, 855, -943, 1039, -1146, 1260, -1388, 1530, -1687, 1861, -2057, 2279, -2529, 2820, -3157, 3556, -4038, 4628, -5376, 6356, -7702, 9674, -12855, 18820, -33848, 153062, 172284, -259957, -157039, 179920, 191053, -102086, -100963, 60444, 64299, -56171, 666, 74479, 23565, -47729, -32348, 4074, 43834, 88109, 548, -140305, -53300, 162764, 118407, -142513, -125366, 112436, 117588, -112334, -82224, 132727, 69097, -158215, -87894, 163257, 107664, -129437, -126338, 73777, 98992, -28911, -53916, -6806, 6358, -633, 21639, -8813, -29251, 19920, 20124, -59348, -35859, 100822, 53991, -123842]
124a23842K6005K20384k979k26119j1920K00019J9938j80044P341J50807j8239
135F1351j42882K2458J34163j6111r7381j0955O1223J2226j915p214m4611o803
147c6451O9662K7109r4577j7529R7263J4035j15731p160J41000J485j50746k0143
159i1783J60937K3735j39218l1098J11324K6888r0411n358N9126J974m9317N523
171a7678K8042l919M33l548k5195j1513O4464J6200q0739l1484Q7128M3475r3538
184b7872l5549Q4230L7553r3485k7164R3997K5978q7459l5072Q3370K7923n4266
196g816k8543L4835J5997j6565J479r58m616K350J7860j9541j4495L3860J4867
209B8714m4857k6502O4335K8123o0780m1176O1651M1503n5629l2496M3467L2890
$$ y = [-123842, -97837, 122547, 119568, -106551, -118471, 81548, 101486, -78558, -71217, 79590, 61351, -81531, -59073, 75090, 58979, -38402, -49357, 11866, 24092, 22177, 14963, -29648, -36451, 33211, 60320, -34257, -51786, 45477, 59512, -56219, -63379, 77621, 79106, -71640, -91783, 69154, 92889, -46329, -77427, 33897, 60785, -29626, -34984, 24142, 26116, -23201, -17678, 10364, 6445, 6878, 3330, -21865, -33378, 31086, 47286, -33453, -64937, 22191, 65666, -27872, -63421, 20809, 58362, -35123, -62287, 31710, 57688, -29771, -64843, 18527, 46450, -7816, -36359, -1524, 14473, -2092, -613, -1571, -6187, -3837, 14023, -5518, -20013, 13847, 28714, -16143, -42645, 21690, 49813, -10967, -52143, 9508, 51011, -4618, -37114, 6353, 39243]
221C9243m8079j9617M0118K0101l4672k0552K6943J2971o141j4663j54m15J1540
234F623R716j8560j1720J4666J9479k4588j2923K3772J6243k9918k1581L6281
246G490J9118k7441k9467K7918K3331j9664j9185J3301J6580j6455n938P365J0886
259G839r674p377L841L608O699n538m896o433J3301O166j0090q570P983J2215
273I074j3356l845Q135R587j2802q644J3296Q317p170j3823J1054N884j426p596
287c315K339O252m944o2p71O947m793j530j375M660L016n469k86k078P201k984
303B808j546j162K585Q46m975L317J33L634q222P2M370K591k330o661M244R55
319F59K543o157J951J102m84j216k151N665l017k28m111M357J545k297p30j598
$$ y = [39243, -8836, -28453, 11665, 31766, -2906, -23458, 3485, 16456, 10315, -4348, -4502, -4917, 6623, 16339, -2221, -13941, 725, 20204, -4384, -17307, 6465, 22708, -7210, -28791, 7490, 26608, -833, -30300, -2382, 20949, 1285, -17900, -4599, 11981, -4474, -10412, -3047, 7839, -1835, -9212, -5371, -1763, 4936, -602, -5498, -11931, 1370, 7536, -2554, -11124, -3141, 9074, -4282, -8127, 8, 9595, -3207, -11851, 1445, 9762, 2592, -11231, -177, 5707, 4281, -3315, -976, 5276, 332, 270, -501, 6446, 1653, 123, -1252, 3408, 6424, 955, 669, -1409, 5792, 2808, 1262, 100, 2685, 3531, -1444, 1873, 2006, 5640, -2582, -2510, 1860, 4451, 2121, -4540, -296, 659, 3202, -2955, -1004, 98, -386, -1602, -3753, 1912, -1105, -1333, -5444, -1087, 458, -1839, -2569, -4167]
335d167M629m119K232j270K963k593k618M336L35N69o116M786Q71N07l116J343
351a428L119m317K601n30L148n213K377L201k199k119J062O522o867p09K209N619
367F476m962m391N832O0k48k977M861n104L40M906M44o872l802J4615k768j1410
383e000j985J7524q12j8853J751J6814K064k2314L140J5623Jj5866Q70J4301n428
398A830o891Q44P755o020O85L137n294j878P651O377j9565m42J9947M062k7228
413a5030l312L2935K53l2378m588L9476P7l6355j349L4755L747l4190Q45K3897
427H783L627k0287O87J0283j279Q86o4o194o746K1675M420k7468p875L6154J1651
442B8253m5982q889M6544J4840n3750j2232N3069J1567m9374j4222M9875Q166
$$ y = [-4167, 462, -3657, -1425, -2695, 268, -2325, -4943, -607, -272, 297, -5819, -1033, -162, 345, -2771, -1428, 1691, -2626, -25, -555, 2593, -2620, -243, 2958, 759, -1360, -298, 6224, -643, -1352, 857, 6476, 1514, -2877, 2955, 3015, 2767, -210, 4651, -453, -113, 4793, 5237, -1635, -5437, 9178, 6410, -5000, -6985, 10539, 9727, -9126, -7375, 9439, 11503, -10811, -7671, 7952, 7953, -7913, -7043, 7258, 1830, -5061, -4217, 3538, -2482, -1797, 1340, -3954, -5832, 1819, 8196, -11369, -11811, 8136, 12198, -15030, -18342, 14593, 14846, -17532, -22120, 17356, 17433, -18922, -20271, 14484, 18231, -15959, -15114, 8783, 12410, -7877, -7190, 3093, 1814, 2700, 2636, -3558, -10304, 11371, 15791, -11677, -19552, 16602, 28253, -17729, -26618, 19926, 34766, -18984, -31216, 21853, 33420, -15954, -30176, 19699, 27865]
454B7865l9508j0185L4023N964k4194j059Q851J885j824P042j5757r100K7153
467A1156J2821l7984j9399N1999J8166n5904k5732O4579K6379o8545k4881O4372
479A7027K8662o5564k2861N5609K1750m8197j7209L8640Q339k0406p251J0915
491e46l571O312J0465k2267j5212L3227K6912n0686k8332N7519L6521o5847m1065
504e6570P3255M0567p0660m5533P3077M1850o5676l9615N7359L6428m9307k5226
516c0051L2113K0596k0435q449M902l554J2594J1762k3698k7263M1612L4334n1344
529f881m4471N9944N4290p0379n5881O9637O2415p3146o0745O9485N6652o1107
541a87n5284N6518M2775m1950l5759K9940K3774j6757q613j623j735J2092J9396
$$ y = [27865, -11643, -21828, 12195, 18159, -6035, -7094, 1757, 3642, 1818, 8860, -6897, -15997, 11156, 23977, -14007, -33406, 18593, 36759, -19145, -44877, 19702, 46081, -22464, -47345, 17027, 45689, -19875, -42736, 12873, 34623, -13574, -30783, 7857, 16196, -4210, -11461, -546, -4117, 2195, 12660, -9607, -24819, 8408, 35320, -15366, -43698, 13821, 50342, -15505, -56570, 16685, 57252, -13408, -58941, 14136, 55986, -9690, -49305, 8054, 44482, -4825, -30051, 2062, 22658, 2223, -6226, -1324, -4878, 7716, 19478, -4220, -31483, 10129, 44463, -6881, -51352, 8592, 62882, -7497, -63378, 6259, 68674, -4472, -65217, 4268, 60920, -187, -55471, 1047, 43822, 1872, -33887, -3947, 19827, 3070, -5543, -7166, -8901, 3191, 22587]
554B2587k8764l1001M0196M1647m7500n5244N8703N9198o0367o6909O4040O9064
566F5650o4295o5433N6340O6681n4608n5324M3261M6954l2664l6421K4490J9809
578A4440q839r228R45q105J3100K2692k5603l3668L2074N0318m3896n6693M6670
591e793O6047n0157p1234N3989O8250m8538o9871M8913O2201m2570n4251L4513
603h501M5644k9047k9503J6010J8135q914k204m48j3838J1274K3601j5121l9586
616c2498K4563M7688k9592n5774L1739O4055l7696o3072L4151O5565l5055o1341
628d7267L2548N3169k6142m7977K5424L3451j7019k3595J2285J1560q728M783
640B492p68j3634K644K8308q759l7525J2576M3933j2126n2485J7769N1848j6334
$$ y = [22587, -6177, -37178, 3018, 44665, -2835, -58079, 624, 59822, -545, -67454, -3414, 65650, 1355, -64078, -7738, 58943, 4335, -50989, -7728, 39226, 6562, -29859, -5369, 14440, 5601, -3627, -2682, -10787, 2313, 25005, -598, -34266, -2192, 48126, 4230, -52463, -5793, 60254, 10097, -61137, -7148, 61102, 12564, -57307, -8394, 53807, 11237, -43014, -8501, 37143, 8096, -21407, -5397, 12738, 3824, 1620, 1172, -12666, -1392, 22209, 7088, -32498, -7935, 39753, 10161, -45613, -13874, 50181, 12485, -50587, -16436, 49129, 14074, -47267, -14719, 38450, 12308, -35669, -10245, 23206, 6187, -17408, -5123, 6437, -2291, 2492, 1724, -11910, -9266, 19042, 10283, -27242, -14666, 29267, 17141, -35344, -17575, 34273, 17939]
653A7939n3394J7773N2439j9332m5775J5977M3024j7534l2124J4005K3608j0881
665E725j5748J1780K553n748L852O133j4926k787K4095j706k8521N97L7816o010
679A7105l9096N471M1186n400m2900Q216L7355n306l6384P468K9201p353k1809
692a2246N022J6983q054o342M161R06m679O486M288j4536j911J6792N145k4254
706a2239k250K5201J813k5760k879K8641q72k4815j996K6083M03k2847N28J7215
720F226K142j5439J539Q107L61m748N40R35k574O912K2p515l348J3411K824j6336
736f941j745J5985N231k0089k097J7167M624j7294m256J7057J379j1769l845J2162
750E569L65p416j211N034K075m579R71j664J835Q68O01m200r18O756j597m715
$$ y = [17939, -35455, -17682, 34757, 15425, -30350, -14373, 28651, 11117, -21007, -7002, 16606, 5725, -10023, 1757, 4310, -1438, 2414, 8547, -6379, -9166, 14929, 13223, -15298, -14701, 23115, 17105, -21991, -16520, 24666, 19266, -23634, -15418, 21937, 16631, -19753, -12285, 16916, 9563, -12246, -7224, 9759, 1705, -4637, -476, 430, -4249, 2237, 6525, -8011, -9922, 6870, 12015, -12239, -14489, 10712, 12525, -13235, -16114, 12527, 11655, -13160, -15156, 10927, 11330, -11517, -10989, 6226, 8368, -7071, -5532, 2575, 2936, -1812, -1272, -337, -2911, 4001, 4023, -3492, -6840, 6571, 9395, -6941, -8686, 7299, 12530, -7559, -9656, 7511, 12135, -5159, -9415, 7642, 9021, -2748, -6593, 5569, 5934, -1482, -2693, 2341, 4416, -163, 808, -856, 979, 1847, 2448, -1752, -2670, 4086, 2489, -2226]
766b226k086Q694j014p539k78P687J374r772P73O044K896q624j155O882J060n320
782b604k921O690M64k859l211L649K511k929j282j42M110j842j363j461L669J754
798B233l898j068J569N184m517k401J747M968k311n122K955L748P62p394J988
813a557M506J095m802k213O036P08k835l956M886K334k799l407J259N624k782
828B097l432n05N437k72m401q97L382K999n453j263J964M422l847l445K617K860
844B263o07n433K542K160N66m207M29L312p98o17k658K520J95N01k473K00K342
861B37k46j166k458M754m36k265j814L875K003n173q1L186K891o200J62M889M50
878B608n360m04P605k260m699j38P352k108n394K207L794q82n014M057R81p40
$$ y = [-2226, -4312, 4382, 3368, -4171, -4449, 3238, 4612, -5160, -4387, 1657, 4553, -4071, -5226, 1656, 2716, -2604, -5525, 1165, 1629, -1230, -4441, -792, 1719, -1210, -2492, -2634, 1476, -366, -1729, -3190, 479, 2233, -1665, -2733, -1164, 4020, -497, -2898, -1151, 3817, 1506, -3616, -661, 3087, 3849, -3545, -1557, 2949, 4044, -758, -2971, 3065, 3773, 938, -3018, 1868, 4202, 1403, -2004, -745, 4879, 2097, -1335, -1840, 3597, 3325, -1076, -1973, 1409, 4408, -1045, -2308, -344, 4078, 231, -3214, -597, 2263, 1656, -3777, -1235, 925, 1491, -2716, -2287, 1025, 227, -390, -3048, -528, -333, 168, -2305, -2105, 237, -9, -1175, -3633, 1121, 685, -1580, -3394, 481, 2484, -2689, -2770, 416, 3307, -2893, -2731, 2158, 2608, -2752, -3156, 4449, 2189, -2510, -2648, 4704, 2596, -2798, -591, 3203, 2321, -2693, 1364, 2345, 1605]
894A605j575J252k25j866M256j353l480q54Q443j969r593K787R658j433j4229
909h576N140J2557l638j4975M736J4830n974j2546L267J3894n671r847L119P982
923D298k515n724L332o14M84J119J240p053J376J0696l591j2895K575J8845o207
938E366j9235M772K2568n336k4297P273K2351m799k3760P060K0470o058j6604
951a0229M067J4416n325o789J692L692k117L482J145r947J611J3211K04k0640
965a1527K875K3852l127k7101K413L1874n825l0066L676L1875n113k9646M733
978a1107K5662k703k3666M955J5323k371j0583K590L626l524N903J12j0739k306
992h828K0031O86k6685m72L0809K324l6856m73L7161J448l8312j011L7478q37
$$ y = [1605, 30, 1282, 1057, -809, 3447, 2094, -1386, -2240, 6203, 4234, -5359, -2572, 7086, 5653, -8576, -3436, 9121, 5483, -9492, -4756, 10074, 4100, -8446, -5179, 8715, 3044, -6803, -3684, 4298, 1783, -3941, -609, -1223, -739, 380, 1620, -5433, -4057, 6639, 3048, -9847, -7272, 11573, 5366, -13869, -9097, 13471, 8135, -16162, -8889, 13462, 8663, -15097, -8037, 12433, 6375, -10229, -6162, 8254, 2929, -3860, -2168, 1524, -593, 2889, 4034, -5913, -4302, 8909, 9113, -11527, -8652, 15200, 12073, -15028, -12615, 19259, 13434, -16632, -12956, 18919, 13806, -15840, -11107, 14555, 11852, -11814, -6859, 8464, 6093, -4490, -1900, 1726, -1798, 4105, 4217, -6522, -8828, 11203, 11889, -14796, -15268, 15541, 17865, -18991, -19464, 17697, 19145, -19167, -20178, 17300, 16463]
1006A6463l2748j035L0613j431k2873R59J5928j012r254L974j362k745P759N322
1020H558j6585n693K4532N100k8577p998L6520O106l8412o962M0448P429m1591
1033a7125n007L7330O940l5448m191K9206K811k1632k365J6127k220n042K165
1046A549k210n019J1011P643k0476p810K5339J2300l3556j2429L6952J3155l8532
1059a2083j5249M1338J2450l8343j3582L7171J0935l2812q110K5511P456k1386
1071f704k392J1605P24m348K853l265q223J3223R221j8373j4469K6423J6181l1736
1085i280j6967L3767K0124l8329j7978L6934J8909l6129j7756L4221J3545k6966
1097e905j2895K3852P347j5608m234Q895O25l104N829n942p424J0829J2412j7067
$$ y = [16463, -16285, -17320, 13293, 11862, -11011, -10052, 5876, 4864, -4390, -416, -1778, -4523, 3236, 8558, -8027, -13720, 10812, 15912, -12665, -20663, 15857, 21963, -16449, -23411, 17037, 24466, -17125, -22132, 15198, 22138, -13310, -17501, 11705, 14516, -7116, -9481, 6646, 4426, -616, 1549, -661, -5680, 5331, 12974, -7502, -15312, 10027, 22327, -11229, -23658, 13294, 26449, -12083, -27332, 14006, 26456, -11887, -25469, 11702, 22637, -10175, -18285, 7226, 14682, -6704, -9096, 2509, 3233, -1115, 1738, -1527, -9750, 3473, 12694, -5679, -20148, 6275, 22456, -9280, -26247, 7520, 27644, -10685, -28663, 8271, 27180, -8949, -26705, 7516, 21061, -5905, -18800, 5052, 12399, -3209, -7443, 1452, 2077, -1027, 4802, -1140, -8564, 2265, 14677, -2390]
1111b390j5996K3359J6940k5070k1043K9614K0633k9574k1004K8735K1538k9338
1123c596j7335K4418J6762k3005j1901J7782Q158j2123n383Q549j570p28M289
1136D317l465r376P656J4639j4039j5467J4864K0006j9555k0384K0999J9754k0532
1149e83k1252K2693J7402j9174j7398J8613J3622j6084q851J0800O939r539n83
1162c395M412k482j040N776q29j1266O726J1580o878j5734J0223J7335j2436j6569
1176a4577J1154J9131j3628j5532J1168J4968j0638j2740J0770Q373p502p052
1188f105P513K434m154N93J791k942j285P493j901q779K319J1572l293j3924N172
1203c496J2856m037j5022O393J3347n887j2525M974J2218o417q710L547Q183m247
$$ y = [-2390, -18386, 4973, 21913, -3157, -24200, 5414, 26047, -3527, -24531, 4204, 25742, -3596, -20931, 3487, 20249, -2756, -14657, 3125, 11283, -840, -6223, 2326, 756, 28, 4317, 852, -8524, -868, 13771, -268, -15735, -871, 19135, -420, -20804, 195, 19949, -583, -21835, 858, 18260, -914, -18312, 301, 13923, -2161, -11012, -212, 6727, -2812, -3395, 1017, -1465, -2505, 3271, 2442, -8824, -2098, 9482, 2604, -13130, -2907, 14428, 1992, -14577, -3423, 15708, 2080, -13452, -2284, 12684, 2046, -10694, 76, 8449, 947, -6105, 1408, 3842, -312, 281, 2072, -870, -2155, 5338, 3437, -5342, -3023, 8549, 5256, -8668, -3496, 9360, 5323, -9699, -3306, 10041, 4154, -8371, -3397, 8821, 2404, -6306, -2759, 5424, 1177]
1217A177m902L557J155j603n17L194m527j99M751K36o574p9R020k376p818P65
1233d740J0023k097r714K300Q599q27r662K890O402q96o494K077M849k280k053
1248a623r2L156j510l9L03o70N00J347M65m152J301L232K32m499O44M687j017
1265B265l995J31N578k166m063J239M332q43m779J957K492M1l741J521J740j141
1281E68j165K31K047j675N3o92R50L26p36p5r59J548l81j19j507J444P09j354
1299g87m33J02K126k094l03N49J905j732j690J829Q25k6k891K071J127l72k139
1316a933O87K328j188o12r47K753n27j173p15J261J875k059m71j29K773j245j282
1333f04p5J684Q34k878R22J020J286k484m37J500J071q60j964K317o1o17j394
$$ y = [1177, -3725, -168, 987, -616, -1133, 2061, -2466, -2665, 2086, 2322, -4252, -4331, 4689, 2313, -5505, -4740, 5283, 3186, -6528, -4228, 4371, 3544, -6118, -3228, 3174, 2278, -4216, -2139, 2710, 430, -1623, -1715, 1441, -69, -108, 195, -475, 25, 1372, 1837, -2315, -1014, 2218, 2450, -2049, -1405, 3282, 2265, -1730, -1599, 3979, 1813, -2250, -1011, 3321, 2478, -2301, -344, 2148, 2189, -1552, -31, 1709, 568, -597, -366, 1681, 6, 59, -633, 317, 643, -93, -168, -1127, 421, 40, -79, -1586, -142, 567, -787, -1220, -1118, 1008, -1086, -1389, -840, 1065, -667, -2357, -528, 297, 271, -2620, -549, 578, 206, -1933, -1246, 1082, -106, -718, -1665, 1088, 561, -612, -1327, -66, 1809, -250, -721, -850, 1923, 678, -604, -679, 1005, 1839, -1039, -117, 903, 2189, -295, -732, 768, 1839, 979, -985, 1332, 1271, 654, -740]
1350g40J279Q46j152J02n39J572r05o9p74R55N42j336m22N6K100j744j083N74
1368g38K145j274k183J779J469p70l627K879J679j490k607J744L042l017j210
1383b179J067K579k448j019J474M57j24j253J451j240J552M08j017j833J944K912
1399B731l579k110K668M743n003m097N269M556m839n710O463M201m820n334N668
1414H07M093m783k811K527L785l306o59M42N82N76M43j318l157L778L337l874
1430D62o062O482O485p622p201P219R149r303q121P993R033p960q907P713O822
1445F182n441p081N347M138k870k581P50J174j04K890l334m080M242O803n859
1460A76r631Q658R940q158j2736J0040J2692r606j3454R778J3654r717j1521P367
$$ y = [-740, 539, 1385, 233, 335, -204, 1368, 463, 394, -380, 575, 1117, -219, -641, -585, 1515, -229, -1312, -738, 1407, 133, -2050, -271, 1198, 428, -3199, -320, 1359, -131, -2738, -994, 2048, -969, -2179, -1112, 1467, -981, -2000, -526, -69, -193, -1446, 5, -1235, 317, 725, -292, -2125, -181, 2731, -848, -2958, -290, 4453, -550, -4647, 622, 5178, 339, -5371, 1092, 5293, 473, -4861, 807, 4900, 117, -2694, -167, 3618, 312, -347, 95, 677, 1253, 1696, 378, -2779, 999, 4336, 462, -5600, 882, 7367, -255, -7456, -237, 8912, -391, -8512, -519, 8514, 554, -8353, -640, 6182, 741, -6340, -993, 3145, 275, -2306, -1556, -382, -486, 2404, -930, -5010, -768, 6035, 176, -9455, -797, 9143, 985, -11751, -1711, 10981, 1375, -12079, -2301, 11353, 1636, -9885, -2518]
1474b518J1518p241q430N152N719k647l152J305j044J982L393k849p047M453J1041
1489I635p536j1760P089J5757r246j6774R724J6934q635j8476R853J5912p953
1502D524j5266Q068J2697p260r129M283O952m214j455P90k229J090N897k135j0870
1517h257M902J2899m822j7315O694J9183p732k0069P016K1908q602k0060P017
1530g238J9450o538j7128O090J3092l883j0246L574N242k231l44L89l040p50R237
1545E676j916j1882K029J6545l127j9609M333K0881l179k3508M387K2902l967
1558I565k1570L126K0805m077j6602K618J3759k520r116K228L417k90K71J391
1572C005o989O28J0063K96j4862L0J8558j260j9833k94K2659m95k2998K48K1937
$$ y = [-2518, 9000, 1759, -6671, -1519, 4200, 1553, -1599, -294, -1338, 644, 4037, 1188, -5859, -1406, 9635, 2099, -9661, -2572, 13185, 3939, -12835, -3111, 13823, 5188, -13288, -3435, 12477, 4524, -10742, -2674, 10023, 2763, -6366, -2083, 4869, 655, -800, -10, -2239, -1149, 4748, 2613, -8257, -3355, 9544, 4722, -12593, -5899, 13284, 5552, -14517, -7501, 14407, 5805, -14255, -7238, 12212, 5674, -11454, -5364, 7728, 3845, -6401, -2827, 2415, 184, -160, 229, -2811, -3561, 5676, 3760, -8122, -6093, 10452, 7325, -12284, -7951, 12930, 9751, -13757, -9370, 13532, 9565, -12005, -8879, 11926, 7849, -8753, -6135, 7624, 5104, -4012, -1784, 1633, 1343, 1614, 3005, -3984, -3356, 6707, 7003, -7859, -7829, 10729, 9469, -10364, -10658, 12001, 11506, -11492, -11244, 10693]
1587A0693N52k1264J7J7862Q99j5562n92J2062m36o275r30K984r36K799J14o834
1603d847n78J0642K016j5456j358J7159L125k0392k719K1421K499k0357m297K1543
1617H401K680j8510l222J6343K847j3424j301Q164K668n935k8P65n26L660Q43
1632C425o076l079J0851K580j2806l558J5177M594j7437l913J7015N252j7870
1645e845m545J6305M649j4805m750J3743K711r762l091P432J557l923l17l7j29
1660h07K244K355o316k882Q388L809r820n687J2363M958j2301o444J3529N544
1674H933j3030n260J1713N794j1417l793Q283L764o662k625M880O30j558k51L71
1689b28j958K346K575m054l166M946N433p583m865P287O556q191o212Q176N687
$$ y = [10693, 11245, -10019, -10002, 7860, 8759, -6803, -7395, 4667, 4231, -2044, -2974, 10, -926, 1873, 1987, -4847, -5425, 5217, 7233, -8223, -9581, 7578, 10703, -9689, -12408, 9013, 11512, -8845, -13142, 8401, 11081, -7429, -10651, 5692, 8539, -4885, -6186, 1978, 4646, -1289, -1317, -552, -1078, 2582, 3425, -2651, -5730, 5121, 7701, -5105, -8663, 6514, 11108, -6329, -10242, 6773, 12025, -5845, -10390, 5915, 10564, -4241, -8991, 4752, 7463, -2299, -5390, 2042, 3599, -324, -641, -678, -807, 1437, 3792, -2524, -5406, 2982, 6791, -3029, -8716, 3647, 8605, -3696, -10140, 3389, 8933, -4097, -9357, 2356, 8150, -3267, -7060, 1223, 4987, -1675, -4300, 580, 1210, -348, -599, -228, -2186, 160, 2735, -1319, -4485, 461, 5894, -1689, -6554, 733, 7289, -902, -7114, 1062, 6749]
1704F749o772o268P567L914n105m102M389L368l449j474J205J369j148R92n53
1719F82k544K501K402k057m443L962L695l461m660L560N505m736m410L014N587
1734D597l676m678K782L865j789l891K182J829n01k077Q36N06n45Q84q94o86K42
1751a014K527j565k477J536L146j303m473K452L218j282l981K070L646k310k633
1766b443Q87L710j967j722L76J996r3j776N24M68Q89p89j84l52J048P91j657k78
1784e72O91K131k070j067O55K109n57k589J275J327L77k810P10J950k94j606m19
1801g59K019p8r38r62J274Q9l94o11J89R53q01qp92J113L75r52p27L20J662j254
1821b82r96K03J841n83j539O70Q90M53j857O32K20J374j892k13J030O2j37j227
$$ y = [6749, -23, -6291, 1276, 5190, 85, -4017, 372, 3740, 291, -1183, 22, 1391, 243, 1235, 682, -1862, 639, 3041, 984, -3459, 503, 4198, 737, -3923, -363, 5142, 406, -4004, -990, 4597, 921, -3757, -975, 2890, 1101, -2790, -608, 1221, 720, -1357, -521, -15, -560, 324, -570, -1256, -1014, 1513, -52, -2529, -993, 2153, 850, -3623, -1171, 2047, 765, -3216, -1146, 2500, 190, -2443, -1556, 2154, 187, -1535, -1159, 837, 744, -1032, -508, -40, 849, 60, -124, -476, 572, 1363, -294, -572, 119, 2250, 180, -887, -232, 1877, 1320, -1269, 6, 1333, 1710, -1100, -390, 1560, 1266, -340, -759, 1260, 1182, 244, -718, 556, 645, 251, -360, -171, 782, -19, -27, -819, 294, 669, -283, -1010, -690, 972, -282, -1278, -1075, 766, 183, -1356, -686, 204, 657, -1200, -568, -348, 1026, -866, -1079, -49, 13, -124, -1351]
1839a351R62L96K37p51k61O55K50K7j177R29L62J34p91K59Q47l86k92m14J633
1858A268r39l55k3L12K87m37L89o31N86L14K25j133m5J397o56q53j09K006o11
1877I92j350k72J784j6k081M89J094L52j581J25N57n4K73l79k13o90J945r02r53
1896h80o74K400L31l057K21K151J588m230j99L173R12l452p66L721K47k571j015
1913b100K450N35j338k04J84O86J46L73j909k22K850L26l338j187N316L16m763
1930a879j777O338J293o006j614N763K301o065j492M732K157m702j061L511K93
1945A792j557j047J093n6R56K47k809n75L524K125n903j541O110K653p579k751
1961e318Q011K819p499m177Q618K792p408l113O429K988n889j374L285K258l112
$$ y = [-1351, -389, 7, 244, -507, -768, -113, 137, 164, -1013, -84, 278, 412, -379, -120, 727, 341, 49, -365, 1268, 329, -26, -49, 263, 550, 113, 502, -129, 457, 771, 996, -137, -182, 1215, 559, -294, -403, 1603, 992, -358, -630, 1154, 1138, -943, -454, 640, 992, -589, -464, 93, 39, 312, -67, -280, -970, 975, 73, -880, -1554, 846, 1177, -1880, -1659, 492, 2080, -2150, -2349, 824, 1736, -1716, -2482, 1239, 1486, -1085, -2100, 350, 885, -453, -657, -473, 213, 359, 732, -1177, -1399, 1451, 1777, -1561, -2748, 2568, 2884, -1879, -3656, 2682, 3975, -2031, -3645, 2118, 4419, -1646, -3138, 1594, 3751, -951, -2012, 1499, 1792, 235, -812, 281, 225, 1181, 1428, -1381, -1956, 1568, 3693, -2210, -3751, 2359, 5012, -2567, -5318, 2693, 5512, -1987, -6164, 2454, 5246, -2162, -5275, 1154, 4142, -1747, -3121, 164, 2422, -690]
1976f90o15O51n51J782J005k775k914N731K698o522l717P575M547q898m299Q620
1992A628N964r874m906Q819M749p555n117P697L242n065l257M286J519k122p5
2007f7J31r21J334L201m247l801N423N214o564o721Q768O396q257q039R335P615
2023H800r364p034P918P711q717m981O137M647n241l110L705O74j021R4K93l361
2039b850K832M006m217n855N267P960p390p939P007R508p792r953Q611Q808p374
2054F29r468Q061P310o097o356M889N313m686k156J649J360r53J766o37m075K713
2070g38N278l431p679N560Q217n377j0043O546J0889p461j0101O333J0866o878
2084A981r414O139P857m803o899M638M228k528k798J422N84n73K505j502m039
$$ y = [-690, -1305, -654, -1205, 577, 1582, -1193, -4107, 1624, 4322, -2200, -5917, 1658, 6205, -2693, -6992, 1628, 7592, -2282, -7188, 1631, 6380, -1175, -6292, 1405, 4647, -418, -3675, 611, 2130, 8, -67, 64, -857, 477, 3678, -569, -4370, 1053, 6267, -297, -7018, 1750, 8146, -111, -8150, 1185, 8800, -564, -7598, 320, 8031, -686, -5667, 470, 5117, -124, -3234, 471, 1145, 124, 218, 511, -2850, -18, 3988, -229, -6084, -817, 7143, -247, -8186, -1179, 8329, 537, -9416, -805, 8003, 629, -8839, -778, 6532, 435, -5921, -1032, 4281, -405, -2561, -912, 448, -505, 1261, 624, -3451, -738, 4540, 1109, -6570, -1010, 7207, 1830, -8213, -1667, 9222, 1761, -8340, -2007, 8859, 1981, -7433, -1294, 6563, 1760, -5139, -501, 3727, 1199, -1599, -177, 407, -166, 2339, 837, -3202]
2099c202J920O887l465q182L793R353l879j0805M844J0480m409j1182M764J0142
2113G059m682q759L502Q478l998n774K336M244j556k650J476o03K54J839l8m748
2129c620J455O219k119p249J585R645l236r107K556J0136k842r893K913Q364j158
2144C649q671K033O525j100m951Q39L683j445q47N9k1j82K264o7m270P20N081
2161C299L3p123Q56P348p65p396N7Q451j116p449N30P574j247o312J041M648L4
2178B463m469J161J717K1j054M93o95o98K478j4l138p80M780j06n013O0N418L46
2196B970o407K21N294J057o029n85N466P0l804r00L792jk413k62J981j95n01K89
2214D3r24P8J295N83k547k38L052Q31l337j301M209L99l298j268L993J230m278
$$ y = [-3202, -1282, 5605, 2140, -6042, -2249, 7104, 3225, -7580, -2736, 7744, 3335, -7847, -3083, 7059, 2377, -6382, -2880, 5598, 1600, -4174, -1838, 2406, 850, -1800, -324, -927, -673, 1166, 1128, -3620, -2165, 4054, 1935, -5314, -3729, 5916, 2680, -6427, -3871, 6265, 3423, -6470, -3557, 4807, 3649, -5022, -2989, 3536, 2436, -2515, -1676, 2007, 562, -285, -226, -247, -429, 1835, 1768, -2502, -1782, 3299, 3332, -3791, -2935, 4413, 3648, -3748, -3691, 4760, 3644, -3805, -3275, 4299, 3052, -3260, -2219, 2429, 2463, -2006, -845, 872, 893, -161, 332, -363, -1061, 1417, 1403, -1735, -2515, 2265, 2159, -2854, -2794, 2624, 2970, -3437, -3216, 2078, 3135, -2894, -3479, 1987, 2057, -1747, -2647, 1145, 1144, -1269, -1531, 450, 255, -246, 43, -881, -803, 492, 1075, -1472, -1710, 1342, 2173, -1164, -2465, 1744, 2143, -1155, -2423, 1570, 2800, -1478]
2231a478m82L179J502l608m75K392O65j648q12J134K95J04m74o61k3J421N23k046
2249d92QJ264Q98k395n28K158R92k428j668K941R83j805j880K415J053j591j269
2266a344R46J527j622o95O85J014l92p50M22k82Q94p22l07m20J365o6j122m45
2284a314J406R90k220l27J240J542j513j388J790P62q51j680J509J107o11j479
2300a037N92J482o44o86m69J594k64p95k26N08J112p13m57k97J506j70j181k91
2318d36Q96J012j532p02Q39J403j213j232R47J414p24j743J097Q30l7j654K00
2335f35J041O5n96q15J025K10l4j300O45R34l83n40r30J592Mq12j028J413J287
2354A143j424r14N80J317j073l47J33J022l44m30Q3pN69q31K44l14J005o0q31
$$ y = [-1478, -1960, 1219, 2721, -887, -1362, 1030, 1695, 47, -765, 369, 664, 768, 294, -367, -390, 1031, 1554, -492, -484, 780, 1678, -717, -1245, 913, 1905, -523, -2191, 750, 1733, -72, -1952, 463, 1516, -75, -1344, -398, 1129, -493, -1188, -503, 511, 119, -631, -209, -491, 403, -319, -626, -1046, 319, 253, -869, -1314, 92, 1082, -1138, -1465, -225, 1317, -196, -1584, 206, 968, 117, -1563, -54, 1053, 442, -1037, -445, 1037, 393, -293, -762, 832, 568, -227, -453, 55, 1167, 454, -3, -300, 1206, 1036, -145, -436, 460, 1472, -60, -762, 77, 1480, 267, -965, -18, 1396, 672, -1071, 26, 856, 819, -835, -635, 406, 471, -125, -940, 85, 295, 261, -1039, -394, 540, 157, -383, -1313, 279, 283, -529, -1557, -144, 1143, -281, -1195, -615, 702, -371, -718, -585, 437, 93, -337, -254, -261, 308, -523, -279, -593, 412, 352, -479]
2373d79J58M28J062j433k96Q84P41j074o26Q44K80k89p42J131j15k62k9j6L16
2392D83l87N99q84j99L16J050o97j151J108P52n86j514J223J089r26j198O78J237
2410I93j223q5lO74o49J26L58r58L57O00K79j713M52J821n25k167M34L034j401
2429D04k183P38K757j480k210R10K453n31k561J127J148n4j284L84J97k01Q39
2446D53m54n96l51K481n47k683N43L143k63m191J386L451j28m453O46M124n91
2463A970l779L42L749q23k416p6K238k24j435P22o2k9N59L54k467K09L243r40
2481A135l001q8M524p62m434j8N696o78n554O70M631L93n058L85L683J87l361
2498a650j44K684n97m80m1k45m76J983P2l115m1L565Q87m984l36N444O72o004
$$ y = [-479, -321, 107, 1169, -264, -560, 324, 1065, -9, -635, 209, 489, 200, -542, 589, 474, 212, 183, 167, 483, 96, 695, -189, -388, -72, 978, 281, -870, 238, 990, 404, -1110, 113, 1202, 276, -922, -244, 993, -230, -315, -318, 356, -293, -167, 191, -767, -410, 190, 469, -1244, -792, 1029, 504, -1663, -1229, 1805, 404, -1779, -1041, 1716, 236, -1974, -1064, 1389, 858, -1703, -576, 572, 518, -766, -382, -185, -386, 453, -1, -597, -948, 1533, 986, -1697, -1154, 1989, 1726, -2465, -1079, 2372, 2244, -2209, -1563, 2561, 1970, -1809, -1467, 2282, 1459, -957, -1033, 1205, 981, -454, 268, 206, 177, 736, 1090, -1377, -1168, 2075, 1135, -1866, -1954, 2570, 1808, -2626, -2644, 3052, 2374, -3180, -2510, 2121, 2514, -2544, -2159, 1524, 1711, -1650, -1794, 890, 293, -187, -228, -473, -949, 1034, 1106, -2009, -2050, 1515, 2402, -2582, -2918, 2526, 3198, -2806]
2516b806p53O306L86n561j119O071N17n168m74M279O61l715M33J509K15q40M86
2533D27o18q08K363N79k904j489M403J401n168j379N584K046o670j155N787J756
2549D155o172j427N407J180m297j495M004M09k535m26J828m24n54J046j252j127
2565a680J855K205l074k743M225K544m581l180N438K893n357k954N631K548n268
2580a498k158M459K165m339r37L073M28j996l32J829j406N32R35m51k097J620
2596a73L008l216k648L208L659m306l286M354L730m797l551M926K737m017k688
2611c060L933J883l071j175K059Q76j921N91K55m74l7J603q57k589J864K837j827
2628H90m184L039L956l249m196L353M128l282l946K948L356k571k921K665J845
$$ y = [-2806, -3559, 2747, 3133, -2428, -3547, 2524, 3041, -2127, -2601, 1678, 2339, -1376, -943, 566, 781, -59, 427, -191, -999, 1364, 1943, -961, -2450, 1953, 3354, -1814, -3193, 2391, 4437, -2233, -3388, 2399, 4155, -2017, -3444, 1963, 3143, -1154, -2649, 1355, 1764, -771, -1197, 631, 207, -347, 699, -553, -1680, 175, 2380, -694, -3437, 788, 3332, -1249, -4429, 1009, 3902, -1455, -4409, 1222, 3770, -1498, -3656, 803, 2968, -1371, -2308, 765, 1193, -803, -1135, 694, -712, -180, 755, 304, -1793, -173, 2835, -381, -3029, 179, 3838, -468, -3754, 600, 4330, -467, -4018, 908, 3645, -372, -3060, 873, 2756, -315, -1490, 569, 1445, -476, 115, 370, -104, -141, 1462, 605, -1984, -120, 2717, 890, -3294, -255, 3701, 452, -3744, -391, 3737, 455, -3491, -543, 2813, 242, -2679, -14, 1831]
2643A831j725j740J492O12o21J27K3j312M95K298j462k401J525L359k292l657
2659c448K821L421j956m374K503M181k281l808K049L543j858k801J152K477j066
2674E55j627Q08R72q2o80L90q90O12J122l81k000R21K840j707k854J370L264j851
2692G82k877J109L389j257l459J762K514r35k558R17K087r56j105K02J203q51
2708c3n2j46j05P7N82J52j539M00J501k69k201O86K377r00k000O25K215j108j971
2727a709P67K076p83j956R85J358j23j658N07P11O0n70j8M83k98N04k84l55J07
2746a96P94l8j373O38P85O4j616P09J284l56j246K4J510m05j136P7J619o01q70
2765c33K57O37k60p23O60K30j05m36K02j65J5P30m99k73k83P90m17n80K77N69
$$ y = [1831, 106, -1634, -142, 470, -151, -24, -1, -1313, -818, 1480, 18, -2383, -858, 2501, 209, -3448, -627, 2794, 838, -3536, -1033, 3148, 867, -2941, -892, 2651, 793, -2008, -856, 1621, 555, -1072, -264, 708, 626, -54, 336, -554, 58, 1180, 799, -1201, -280, 2560, 853, -2001, -631, 2633, 782, -2095, -986, 2403, 1146, -2313, -551, 1963, 1028, -1530, -613, 1474, 518, -587, -385, 818, -33, -85, -231, -336, -259, 323, 475, -1064, -664, 837, 568, -1633, -947, 1430, 530, -1470, -845, 1370, 262, -1709, -942, 1134, 351, -1605, -620, 738, 615, -1043, -536, 175, 235, -335, -353, 130, -168, 336, 52, -303, -196, 598, 560, -813, -175, 610, 674, -942, -233, 1051, 695, -551, -527, 983, 578, -558, -481, 1138, 537, -333, -76, 561, 301, -422, 238, 468, 363, -73, 129, -36, -21, 709, 210, -63, -346, 444, 27, -553, -276, 293]
2785B93K36j245L38O69J0r04K2Q31J55r71j59O38J08k54l16O12pl66K52n77P81
2806A46l67J88k75J21L77k88n1j55O65j36m98m02J114J43j002o9O24P79j287J4
2826c59O80L27q34l80R08J82k80o83Q04j24N5q3l03N18j32O9n65L70J64J88q87
2847c65j26J257l36p17l87R73L21r72r8N79N67j130K96j68O21l79l40P2Q6K75
2867B9l43R9j08P42n42n69L73N51O7j164K67R01j90n76jQ69l80l65j98J072p60
2888b26R2L2j04j9jL20k59J64JM82m90k70P17j8n32j84R21k57m15j56N18K0n84
2911b48N37j48j87o3P18m15n21L06P12l74j008J091M79o55j012J079O16j064m91
2930f48M89R18j030j32L76K75k49n40O91l66K64j32K54p05L32Q13r23m55N67J396
$$ y = [293, 529, -716, -378, 291, 301, -603, -581, 250, 405, -566, -725, -87, 21, -233, -549, 63, 56, -310, -58, -635, 146, -221, -33, -308, -187, 190, -98, -149, -304, 361, 225, -273, -675, 439, 582, -420, -489, 135, 914, -373, -359, 321, 648, -186, -566, 342, 524, 244, -439, 365, 241, 296, 213, -90, 428, 296, 365, -200, 170, 334, 522, -365, -491, 766, 430, -287, -674, 299, 620, -352, -450, 129, 696, -434, -138, -306, 315, -64, -404, -332, -246, 29, -314, -215, -323, 419, -123, -692, -319, 232, 299, -865, -598, 303, 113, -463, -464, 405, 25, -340, -538, 534, -226, -134, -102, -206, -225, -226, 94, -165, -1, 0, 482, -8, -278, 439, 421, -111, -295, 626, 369, -46, -202, 316, 336, -248, 289, 141, -46, -109, 609, 194, -327, -21, 691, 317, -691, 400, 879, 224, -788, 291, 907, -157, -648, -159, 759, -271, -403, -27, 248, -1, -541, 150, -216, 48, -84, 170, -535, -203, 610, -313, -768, -201, 1195]
2950A195j277j370J221J443j224j552J462J214j044j631J312J186r86p51N47P65
2966E10n54k17K69J61j40L45l59q02R61P68m16j640J081J699j418j748J342K228
2984B070j908j742J233J980q52k186J299J751r72j523Q53O90k63m38L03k02n7
3001C6O88m87j080N23J553q31j945J191K097j155k837J551K343j162k353R88K720
3018A840j452k057R33K170j282j109N44P39l48k29M73q52K06P56J6j547P0K350
3036A221l90k105J46L302j432k768J177K550p59k595J042J823k91k070P41J630
3052A222p01q48K42O78q03L06L44n23m64J390K33k033J35J935N13l228L68K955
3070A721j50k712k30K925l30k457q4K606n54j592K60J283r0j431P75o2k66N43
$$ y = [1195, -82, -1452, -231, 1212, -12, -1564, -102, 1112, 68, -1563, -251, 935, -51, -802, -255, 510, -44, -261, 8, 169, 29, 374, 15, -787, 174, 942, 526, -1114, -33, 1666, 248, -1500, -158, 2070, 162, -1580, -347, 1633, 781, -1405, -106, 1645, 673, -850, 3, 693, 430, -8, 295, 93, 36, 724, 237, -843, -320, 1233, 402, -1543, -352, 1745, 590, -2247, -696, 1647, 485, -1868, -880, 1840, 388, -1669, -736, 1434, 152, -957, -413, 326, -22, -251, 222, -630, -424, 332, 348, -1199, -1129, 1221, 831, -1274, -1128, 2174, 742, -2026, -849, 1701, 942, -1653, -611, 1212, 921, -1149, -408, 1222, 521, -327, -85, 593, -210, 96, 440, -83, -547, 843, 1076, -957, -822, 1113, 1626, -1602, -1234, 1721, 1571, -1141, -1371, 1554, 1224, -1233, -1317, 1289, 735, -857, -597, 686, 596, -835, -60, -122, -388, 155]
3088A55N37r32r08J670L65j743n52K354P32k945n54K615P69k899r2K368M42k511
3106a129m04K176K05j420j82J164m46l60N98m77k04N78J123j825n78J579J059
3123A457j855j214K345Q97k015j574K784P07k030r11J923J123k171n19J454O90
3139A091r97o35P95o8J06k16J3o11J024M27r84j072J586J039k109p12J734J145
3157A556j983j345K139J138j949j165J597J298j519j211J375P85q75m99L56M34
3173A32m70K75n41K94P34j89p19q59J887L94j409r80J649J316k163r13J520J899
3191A857k131o47R44J307j338j041J036P38k18j226N33O33j34l11k48L74K6N45
3209F99r38k36R29M73r66p59J087P76q80j173J172Q27q92j191J141Q98q18r59
$$ y = [155, 692, -240, -1148, 522, 887, -856, -1408, 946, 1678, -1267, -1821, 794, 1563, -1336, -1428, 940, 1382, -1129, -1533, 643, 848, -572, -754, 410, -36, -396, 202, -275, -479, 99, 1222, -603, -1181, 398, 1457, -398, -1612, 733, 1630, -385, -1959, 825, 1532, -498, -1409, 514, 1637, -534, -1053, 401, 1091, 94, -541, 254, 186, 292, 76, 89, -522, 502, 929, -55, -1127, 459, 1498, -611, -1323, 411, 1556, -427, -1772, 367, 1505, -444, -1609, -12, 1286, -233, -1444, -69, 716, -159, -658, -302, 132, -338, -63, -604, -310, 424, 235, -484, -1343, 544, 938, -471, -1451, 198, 1514, -649, -1562, -42, 1857, -274, -921, 23, 1330, -8, -1049, -13, 725, 507, -719, -186, 447, 313, 2, -246, 128, 154, 699, -239, -475, 454, 927, -39, -798, 289, 1065, 185, -988, 184, 1011, 119, -1072, 69, 967, 149, -810]
3227h10O09R64p80o59P07J19J36n02j80M10R6k26J5k38J30Q48r64o07J026N56
3247F50p63q85R45O67m14j397J256K87m15p86Q11Q94p49l06j51J034p30k72j0
3266c34P88k44k17m8J82NK30k51l99M84K20m07r2N5O60m39o83N99O71m08r25Q69
3288C16L67k62p74J82P32l89l57N8P10l35r4k98L47m34K94K05o06K77L35j29m58
3309c13K67Q1L4l33j67P78k43k19m16O86j17l78R0J10J39m92M37lk18R2M22l57
3331a20p2K66J5k41P5M60k28k50j36L39K22n29K81n8M08m38k40L59J41l74j4N71
3353D37k25NJ20l64K98j46q5k91K40L63j50m32K30K81k08j92m24J102l85k06k95
3374c27N98L1n17o8M14L57n62j47J10q5L00j99J13k77K31J16l86Q8K03J89o89
$$ y = [-810, -201, 763, -17, -676, 31, 150, 286, -216, -396, 14, 110, -116, -101, -339, -209, 639, -325, -932, 94, 650, -113, -998, -53, 614, 200, -1197, 59, 346, -69, -855, -44, 850, 101, -205, -356, 678, -52, -324, -334, 454, 210, -7, -55, 127, 132, 362, 111, -288, 196, 416, 9, -83, -28, 632, 193, -490, 109, 780, 372, -553, 316, 683, 421, -353, -171, 561, 172, -185, -127, 583, 248, 154, -144, 203, -231, 63, 268, -338, -61, 274, 145, -313, -46, 35, 69, -264, -431, 347, 104, -115, -531, 155, 38, -340, -250, -140, -1, -493, -56, -59, -277, -185, 237, -120, -192, 74, 89, -152, -77, 383, 155, -95, -231, 108, 330, -199, 82, 24, 432, -6, -246, 113, 254, -120, -134, 437, 212, 217, 337, -27, 271, 125, 40, -251, -11, 352, 202, -230, 0, 281, 73, -119, -543, 559, 174, -32, -327, 271, 302, -215, -283, 131, 488, -74, -221, -111, -196, 104, -95, 18, -259, -28, 88, -298, -210, -7, 182, -507]
3395e07J56M28K05q99L06P41k0o78m45J136o8l29n00N18J40k08j60j83N99M7l44
3416f5l16L39N69l96l38p0P65k3p49j00J022k15q54J79O17R0o07J53M3O9l6l02
3438b25M91k52K41l14J35k50N73r0l36m3M77L58j116o7P84r8o26k06P89l4k67
3459g6m79Q81j82n2m44K54J63j28R4k04k26J22M55n33j49R34j76n98j93Q33J88
3480D84r99l62R01O39j047j93N96M50q65o8O81N3j62q6J01l68J81N78l98l56O0
3501a80Q21q00l28N61Q38q55q83J173M90p47q23J283J76n49p85P42N16p38l39
3520d27J79O02m89O3J50k36J91Q1Q3p83P46N14n80r46Q59Q12j001n83M06J334
3540I75j145j122Q67Q51m97q02O97O45o44l26O20n2p8M1k37j72J1J004p16o62
$$ y = [-507, -351, 77, 282, -617, -311, 430, 410, -268, -713, 423, 355, 26, -474, 44, 184, -24, -184, -367, 232, 279, -65, -381, -42, 527, 131, -207, -277, 488, 465, -284, -384, 638, 423, -431, -252, 365, 455, -152, 1, 44, 113, 77, -225, 266, 14, 255, -59, 76, -174, 399, 309, -27, -70, 407, 765, -351, -418, 366, 268, -358, -564, 225, 191, -76, -555, 326, 144, 92, -352, -98, 65, -63, 31, -173, -399, -277, 178, -355, -504, 430, 254, -344, -537, 296, 484, -515, -877, 24, 663, -384, -577, 19, 469, -396, -464, 217, 270, 108, 22, 123, -245, -64, 514, 116, -240, -180, 641, -159, -487, 74, 912, 57, -826, 347, 837, 90, -733, 550, 726, 177, -608, 134, 650, -88, -427, -248, 354, -135, -72, 78, -158, 33, 114, 197, -586, 160, 674, 94, -852, 7, 819, -182, -765, -359, 975, -170, -1292, -425, 426, -71, -873, -176, 469, -175, -501, 119, 67, -11, 30, -207, -379, -368, 636, -80, -742]
3560g42O02R71m05j334N99Q84k55j165P28J136q25j056P12J168p74n52J02P86
3578E80o06l2K22j86m0J82L97p82J57O41k89o63J43J224p12p94J68J244m16j173
3598g35L83J017k38j272N00Q86l34q26L29Q47q92lK83K9oJ74j37m98K86M70L3
3619B96j155L79J122j50j383N30J090j73j118o3J431m00r25r5J113L2r49J32J58
3638a28L18l05K0rK18l3J57k52l96J055m49o81R6Q39P4r55k04J200L81j612P4
3659e92J414O2j293q3J090j43m17l35P12J48p18O8J88P0j42J15m06J21M09q5m73
3680b90l06J369l78q06j92R93J80j153O9P10J80o45j36P28J27q51l24Q01K51j03
3700B24o45L71l4K21k48k10K72K67j08p21K17O70R9r01l2J066R7r99j89J008J32
$$ y = [-742, -140, 831, 426, -908, -309, 575, 320, -845, -117, 1019, 194, -862, -150, 1018, 244, -308, -206, 580, -26, -58, 164, -22, -62, 120, 517, -265, -108, 533, 244, -419, -276, 948, 236, -558, -390, 854, 438, -735, -352, 665, 427, -845, -345, 541, 207, -619, -290, 557, -335, -338, -55, -26, -32, 142, 5, -493, -207, 263, 296, -859, -480, 642, 492, -891, -361, 729, 556, -562, -625, 806, 406, -519, -614, 499, 531, -418, -286, -128, 190, -115, -95, -104, 114, 81, 238, -14, -410, 645, 196, -485, -389, 450, 524, -431, -635, 565, 946, -666, -592, 822, 884, -409, -492, 598, 455, 38, -297, 415, 563, -155, -87, 101, 171, 29, 144, -262, -141, 268, 183, -290, -596, 773, 395, -411, -603, 390, 570, -583, -514, 196, 376, -269, -405, 323, 450, -401, -725, 76, 327, 224, -421, -50, -84, 137, -111, -321, -49, 218, 110, -611, -394, 276, 375, -526, -558, 508, 605, -394, -583, 425, 557]
3721E57q66l35J060K10j003j80N89L95l66l63M58Q9K77n47l3L18l3j10q5K89j31
3742A90K75r92K45N67J23p58k38R52J87r46n42J167J58n18l97N97O17q75l76M85
3762g9M45n90Q4J19O1o2j61q4m9K31q3R5k27M13J48n49n5M16M60p45k39N39K37
3785C25k94o12P42J3j05k06L88J40j49k48j72K31K13j65r9o7J78K45m25kJ26J61
3807B18k91k18M59L27n52k23M08K55n81PJ45M06j39k41R9J02m8j80J38j98L74
3828B67l86J12l5O1M36p69j1L38J02m31k68L88N46k53n66K68M08l31j89J3K20
3849h0J93l48L1J96j8J91l82K3L02R0k36n06L17M14j01j30K2N09m07k99jO86l52
3872A14l90L53M2L27l27l07J57N31n58k52L34J81J52l95o7M81O9m76p4J35K86
$$ y = [557, -309, -644, 416, 626, -377, -557, 32, 427, 61, -302, 156, 245, 522, -25, -58, 260, 227, 117, 32, 321, 190, 465, -527, -282, 285, 408, -350, -588, 364, 551, -395, -937, 230, 388, -130, -527, 70, 687, -188, -564, -79, 366, -224, -140, -21, 40, -22, -183, -267, -316, -85, -168, -73, -300, 113, 261, -288, -343, 73, 533, -212, -451, 88, 325, 31, -581, 161, 174, 69, -137, 251, 391, 242, -6, -178, 53, 266, 101, 2, -65, 113, 358, -67, -69, 57, 218, -73, -291, 168, 495, -57, -280, 128, 383, -198, -191, -46, 360, 221, -20, 79, 181, 133, -47, 91, -107, 267, -119, -7, -42, 19, 455, -314, -325, 13, 115, -316, -584, -196, 350, 97, -469, -201, 207, -124, -313, -300, -80, 113, -235, -204, -8, -26, 165, -217, -194, 108, 198, -38, -544, -227, 187, 86, -44, -22, 487, 80, -219, -220, 466, 114, -276, 77, 119, 446, 119, -188, -31, 500, -58, -310, 24, 205, 357, -38, -105, 376, 445, -31, -105, 30, 316]
3893C16k68m18J76O79j99n96J06N68J5o28LN18k43j27k55N74M2m39k9J18K60j63
3915A0j54j48L84K07n10l03M41L98l36m21J14O24l38l56J79N42N4q24J73K67K2
3936B5j16o9K89j86J92l97J14J00Q7%k44K41J65l1l59R7K27n3j56j4O37m16j89
3959e6J0N56l79j06p4j6L31j37j9j45K38k14oo8Q5L0J19j25j63M33k65k97K00
3982f8J35K40p21N16P0r5k29J23J17k16J15j77j51K95K04nl25lK23K74o37L37
4004B2K58J45o70n4L76N0m76n6N77l19j39J13M06k86J74j40n7K13k20K14L2j94
4026c1M80k44j81q1L82O4m64k91P28J5n33r2N78K46r41N15K05j16j61k73L07j4
4048I8j35K72n7k52K14l5j76j74K96N08n56j90K97R9l17k41O47L2m51l14N93J77
$$ y = [316, 48, -370, -194, 485, 286, -310, -204, 364, 379, -249, -246, 272, 29, -98, -353, 221, 263, -176, -205, -87, 173, 10, -144, -292, 92, 299, -211, -514, -73, 325, -11, -432, -318, 306, -32, -388, -209, 333, 387, -437, -264, 3, 25, -91, -160, 129, -57, 135, -262, -148, -48, 39, 39, -205, 36, 201, 170, -189, -92, 135, 82, -74, -88, 549, 133, -56, -46, 510, 131, 25, -49, -65, 266, 129, 110, -35, 203, -11, -17, -85, 0, 30, 149, 24, -139, 294, 29, -268, -68, 67, 307, -414, 102, 172, 77, -152, -29, 88, -128, -13, -190, -341, -46, 158, 153, -172, -175, 48, 322, -315, 22, 280, 425, -245, -299, 77, 127, -349, -405, 172, -147, -286, -173, 233, -53, 121, -19, -76, 137, -83, 131, 163, -31, 449, 205, 24, -57, 325, 389, -75, -366, 362, 377, -156, -248, 330, 576, -365, 150, 355, 239, 78, -195, 112, 98, -37, 235, 178, -74, 140, 105, -71, -245, 51, 559, 3, -187, 110, 209, -108, -349, 298, 330, -121, -435, 158, 335]
4070C35o68L9K89J16k46k81K67M01k34r7k31J85J48j24J44l94N01P6k81m40N88
4091I3K24m41l19O08M73o98k24L87J88k96k23K16N87m02k93K58J81j54lj66K48
4112B44k81L46m19oR0Q6O8n93N47L39l34m22M02K73l64j48J30P01p18l14M10J06
4134A43j56l19M11pn0k68J77J30q3L9K51n15J23K99m46M6l3L67p8l44k5O50l83
4157g1l95M38J67j47n95M88N69n12q1K99K05k14k45j5M5K28k31L5p3K62n6m0j05
4180d4N1J77l02K09k04L12l3l87K84K79k01k93J35lJ1l15K01K90n5k31J4K39j71
4203c7J64k37L6J86j1j24p1p4L61k34j35j03N12M7o79J17N64k92l89J37K90J62
4225A90n73K98J81M1o05L05L73j26j1j89j17j51L91J6k79J33L57M3o82L45M25
$$ y = [335, -333, -294, -5, 111, -135, -416, -149, 252, 18, -79, -310, -125, 23, -101, 43, -351, 150, 226, -55, -495, 93, 317, -124, -443, 165, 638, -60, -284, 103, 291, -5, -228, -12, 575, 173, -120, 138, 319, 165, 162, -4, 244, -37, 309, -110, -116, -26, 60, 128, -465, 82, 421, 87, -335, 67, 340, -24, -172, -42, 659, -59, -373, 37, 143, -13, -332, 79, 72, 22, -246, -69, 61, -22, 17, 268, -247, -124, 175, -271, -225, -258, 109, 31, -313, -338, 312, -71, -466, -28, 139, -8, -603, -115, 454, -58, -139, 160, 365, 151, -94, -109, -64, 164, -67, -32, -105, 157, 101, 61, -44, 7, 184, -118, 91, -113, 199, 166, -221, 63, 342, 141, -152, -17, -20, -9, -324, -123, 167, 112, -119, -105, 134, -37, 127, -110, -74, 112, 101, -23, -94, -168, 193, -41, -176, -279, 233, 280, -399, -282, 282, -10, -399, -262, 28, 190, -383, -85, 96, 137, -468, -163, 210, 84, 73, -116, -233, -384, 7, 23, -256, -123, 234, 277, -405, -60, 365]
4246C65r9n01J74K85N3k60q5K17K0k15J61P7j79k05K1J87J22k54J6N5P3N0k55
4269a77K74k87M40k21j79j0K98j66l54J73M05Ko82J66N61lm69j26N49p9k29j95
4291c09N98l09m4Qk75M62j30j63O8j2J77j14l4J37j81L95n54n0P05j71m83L11
4313C2L8J37m11K1L51J02j04l28N27k64k7l98L6M75R4m25rK34L23m62j25J14L52
4336B83J0n40O3M64O7m73m4K40r9j11k3J99N2j35J05j77J29j43K10j04j03K17
4358H7L3j06k31J76Q6j14j72K34J95m28P0K62j3j72m5J58o2J10m82L70L04l79
4380a19m0r6L50j59N8p1J5P3M6%k05K90j66Q7l03M53k61K24k94K71m0j7j70r5
4404a69M27j24k44j90P29o8n28J05J69J16k09j92P7L99k07k30K84M5K04n66J24
$$ y = [365, 266, -235, -61, 224, 277, 17, -68, 149, 169, -46, 115, 192, 13, -192, -171, 16, 138, -116, -100, -45, 28, 78, -177, 97, -190, 250, 29, -150, -160, 138, -28, -382, -209, 196, 198, -484, -318, 243, 240, -229, -355, 194, 115, -114, -309, 289, -20, -64, -56, -331, 131, 1, -162, -94, -106, 71, -43, -77, 60, -121, 274, -280, -330, 375, 204, -279, 32, 70, 207, -204, -183, 168, 270, 166, -162, 365, 101, 74, -324, -288, 187, 281, -144, -153, 81, 404, -58, -183, -69, 283, 293, -247, -184, 280, 347, -126, -170, 70, -29, -140, -163, 36, 88, -47, 58, -119, 10, -133, 77, -27, -130, 87, 120, 14, -217, -41, 45, -69, -241, -7, 188, -240, -170, 92, 79, -93, -138, 20, -42, 68, -414, -44, 260, -119, -159, -255, 95, -64, -6, -77, -62, 11, 57, 57, -148, 142, -24, 63, -240, 213, -48, 176, -118, 153, 113, 96, -74, -169, 258, 134, -110, -300, 429, 361, -167, -62, 107, 223, 14, -178, -101, 298, 91, -139, 145, 190, 394, -172, -48]
4425d8O8K54j95m60L39Q7j77O3M7K02j41P8l27K47j11J03k12J44k3rj32j13L04
4448a2R1o5j50J89K53m36p8J02L36j52k99M23J64m47J18K70N4m46j9R4Q5J98l52
4471g9L55j85j41K7R8k02N80m13j22m8L80j13l88K44M00k84k14J87P3j18j08k
4493g3J32LJ59r6k18M10l21K5j58J20oj47J78q3J6K59j08k54J43R2k93J76j62
4516b06K57j13J38j84M3J20k75J01j3J81k33KJ44j08L49k61K55k45l8J15j08L54
4538B75r6p6j53L10o7j65o6q0N43m40pM7LM3j44J96r8Kk48L77k06J32J67k20j9
4563A0j46K06r9k27J96K02j64k55L73K16j02k45N3K11p8J4k12K95j19j29m0O8
4585B8k90M37k73O6j33K54pk56r3L59Q8m19j66O17k22j85O6L18j10j87j29K87
$$ y = [-48, 20, 274, 79, -381, -42, 45, -132, -69, -22, 180, 39, 117, -210, 37, -74, 29, -183, -39, -62, -71, -203, -316, -12, 79, 14, -136, 53, 306, -130, -208, -106, 230, 78, -221, 202, 366, -81, 37, 307, 361, -85, -104, -10, 75, 273, -79, 276, 91, -50, -23, 75, -127, 453, 40, -82, -130, 250, 137, -251, -7, 393, 109, -105, 82, 155, 37, -71, -73, 59, 62, 221, 125, -93, 317, -4, 21, -137, -17, -23, -170, 8, -75, -59, 200, 92, -162, -19, 73, -220, -44, -206, 51, -62, 76, -108, -65, 55, -220, -119, -132, 49, -184, -182, -38, -146, 203, -58, 197, -48, -86, 29, -79, 275, 179, 103, -50, 260, 193, 28, -38, -118, 425, -15, -22, 25, 28, 71, -73, 123, 25, 27, -221, 156, -50, 82, 249, 29, 10, -136, 70, -29, -256, -60, 142, -22, -277, 96, 312, 210, -35, 18, 229, 151, 165, -47, 248, 129, 0, -40, 28, -262, 175, -98, -32, -165, 89, 82, -174, -267, 92, 180, -239, -405, 212, -10, -195, -129, 189, 79, -108, -237, 50]
4607E0J39j71j77M23l45L2j36K18J36k06j6R1P2j46j7J93l49N06j02q9j85p2L36
4630A85l36K50J25j62k28J95J73n3m79L00K14p4k57K4J34J38o5oq5P7J78j93j30
4653g5Q8K3R4k49o2L51N4n05J72K20R3n34L79q3K45l99n6M02j27pj17N11m34r
4677b5o7L66j13j42OKj55J62K09l47J7J33j20k57J55L84k0k09L3Q0J81o20M54
4700A07MJ34l05n3k0q9K28K72k05j83M63j59L6o15M60J7q5j90m5N75o78K82K55
4723B06O3k00j69K01q4K8k42K91j6k2j24l5K63j23m3N7j91J60K45m20O5JK18j53
4747b4j21r8M67p4j58k22L54j99M6J09j09k36M35j57j4K24j81p2J18k31K75K7
4769A59j92J6J24j47P3J77j57j2k8J77M3j24j32J24%m8l67M00O9n1k46J33J24
$$ y = [50, 189, 18, -159, 264, -81, -49, -185, 33, 169, -37, -53, 38, 110, -36, -53, 140, -209, 297, 195, 106, -79, -151, 185, -151, 99, 224, 62, -166, 29, 202, 149, -330, -30, 184, 110, -147, -123, 11, 149, 84, 78, -7, 70, 248, 55, -75, 13, 36, 130, -119, -181, 170, 224, -281, -109, 111, 204, -330, 49, -34, 211, -188, -244, 158, 31, 24, -93, 418, -16, -25, -92, 274, 161, 19, 25, 27, -128, 34, 243, -104, -87, 46, -74, -331, -176, 208, 188, -21, 12, 92, 273, -347, 107, 111, 245, -60, -113, -133, -222, 6, 278, 73, -110, 353, 194, 230, -385, 75, 92, 7, -183, -228, 347, -331, -49, 206, 269, 69, -100, 101, 17, 45, -197, 94, 78, 56, -68, -103, 160, 37, -6, 51, -140, 20, 265, -155, -90, -89, 129, -24, -145, -243, 224, 150, -8, -230, 124, -75, -29, 80, -29, -265, 170, 13, -1, 223, 42, -30, 88, -143, 132, 159, -33, -17, 107, -40, 33, 210, 53, 41, 13, 190, 233, 109, -23, 101, 101, 53, -314, 86, 155, 104, -142, -9, 115]
4792A15r4j17q7L58l15J13J58k96J82K69n74J11L8K55k20m2J33M3k12j62K31K30
4814A17l1r8Q1K12l06k55L42l0K4k13k5J28J45j04k02L03j03o0M08m63qM78k75
4837F5N2k1K49k91q8k5O4q8J19P0p3l7o2J91j86L39j22J8l37R7P0K9j54J45L33
4862C57m81Q8J12O0K15m66J44J5oj93K25JQ5k61K6rL8J64j71J8rJ07o5O8k09L0
4888a17J5q8J72QJ82l47P3k7NN1j33M49k41j57K3K22p7J21j60pj6K0J50l6l34
4913b49J50J45o4j12K91k10j43L2K79J09k98L3J10l7R1j08j47K67L0k53K96r2
4935A20P6n11M92k90K79r8j43J22j78nJ45K7k29K22n5m3J09J30k82K1J28O8k14
4958a09M9P3j7j75j35K65j66J63P3J83l02q4k4o8K62oK8pq7J26k2Q9j77O7J83
$$ y = [115, 21, -96, -183, 175, -140, -27, 131, -165, 17, 286, -288, -177, -139, 116, -104, -146, -13, 30, -182, -344, -113, 117, 86, -12, 69, 281, -25, -280, 62, 32, 56, -157, -182, -54, 91, -13, -215, 88, -15, -75, 333, -130, -138, 340, 65, 117, 96, 345, 54, -34, -59, 5, -83, 36, 106, 33, -4, -66, 125, -61, 278, 156, 174, -163, -66, 4, 33, -121, 24, 357, -124, -36, 76, 136, 351, -115, 29, 44, 38, -155, 70, 71, 156, -105, -79, -88, -50, 114, -57, -39, -48, 59, -6, 62, -147, -117, -102, -190, -18, -10, 172, -175, -102, -129, -124, -73, -206, 243, 2, -155, -132, 90, 13, 134, -26, -33, -49, -29, 121, 85, -249, -99, 46, -18, -130, 161, -49, -192, -160, 119, 228, -70, -37, 73, 36, 127, 19, -128, 139, 169, -84, 212, 120, 196, -315, 177, -113, 166, 68, -75, 47, -131, -136, 9, 36, -193, 29, -26, -69, 40, 170, -112, -91, 37, 105, -109, -60, 13, -4, -179, -314, -49, -215, -52, 21, 204, -98, -182, -206, -274, -12, -18, 10, 3, -84, 42, 20, 109, -68, -1, 182]
4983A82l99K61L9q7l3j53K73j01j50J78j00L11l52L67j72J74k07J0m2p8J63j5
5005F9j34J66l1lk07K03n2Mj21J85j87J54k01k4L86j94l3n4k30L41M3j93K16l10
5029b07R6J14r7Q8q8J54L0j32j15K39J6m51K02lJ57j52J89K9j88J35l0J2j32J34
5053@j7QQ2J02j69p7R5k1J74j90NJ44l56K33k1K74l43l7O2K28j77k22L42j58J98
5078A59k54K27O0L1j14k19J3O3M7R2l0M2q7K19m26J60L07k11k41OL97O1k83j77
5102a58M24n40K01K40k10J12k74K66k48K19j14J67j5r7j5K28k71P5L45l80j46
$$ y = [182, -217, 44, 83, -4, -37, -190, 83, -18, -168, 10, -90, 221, -131, 236, 64, 238, 31, 41, -1, -79, 84, 69, -65, 101, 70, 67, -140, 63, 11, 15, -106, 79, -108, 46, -155, -179, 207, 13, -20, -74, -304, 37, 80, -113, 103, -207, -111, 3, -94, -6, -94, 60, 90, -42, -157, 82, 98, -353, -151, -154, 3, -149, 40, 69, -119, 16, -14, -2, -134, 0, -17, -9, 73, 175, 6, -71, 24, 3, 177, -13, -8, 136, -220, 13, -8, 266, -77, -114, -52, 176, -1, -223, 119, -39, 159, -95, 132, 192, 223, 109, -110, -97, -34, 13, 105, 75, 117, 30, 249, -177, -17, 290, 79, -162, -156, 241, 302, 19, -158, 266, -274, -73, 167, -43, 69, -205, 61, -187, 32, -82, 85, 70, -27, -42, 186, -85, -10, 335, -45, -191]
$$ [...]
8191A47
##END NTUPLES=NMR FID
##END=
