##TITLE=1H_Pr Am-Pr2
 CDCl3, 8 sc, 
 4.9.2020
##JCAMPDX= 6.0         $$ Bruker NMR JCAMP-DX V2.0
##DATA TYPE= NMR FID
##DATA CLASS= NTUPLES
##ORIGIN= UXNMR, Bruker Analytische Messtechnik GmbH
##OWNER= root
$$ XWIN-NMR		Version 3.5
$$ Fri Sep  4 09:32:00 2020 Russian Standard Time (UT+4h)  she@DPX200
##.OBSERVE FREQUENCY= 200.1315066352
##.OBSERVE NUCLEUS= ^1H
##.DELAY= (6, 6)
##.ACQUISITION MODE= SIMULTANEOUS
##.ACQUISITION SCHEME= undefined
##.AVERAGES= 8
##.DIGITISER RES= 18
##SPECTROMETER/DATA SYSTEM= spect
##.PULSE SEQUENCE= zg30
##.SOLVENT NAME= CDCl3
##.SHIFT REFERENCE= (INTERNAL, CDCl3, 0, 15.7039)
##AUDIT TRAIL= $$ (NUMBER, WHEN, WHO, WHERE, WHAT)
$$ ##TITLE= Audit trail, XWIN-NMR		Version 3.5
$$ ##JCAMPDX= 5.01
$$ ##ORIGIN= Bruker BioSpin GmbH
$$ ##OWNER= she
$$ F:/spectra/data/she/nmr/H-F/1/audita.txt
$$ ##AUDIT TRAIL=  $$ (NUMBER, WHEN, WHO, WHERE, WHAT)
(   1,<2020-09-04 09:30:48.68 +0400>,<she>,<DPX200>,
      <created by zg, POWCHK disabled, PULCHK disabled
       configuration hash MD5:
       00 E9 B6 7A A2 85 ED C7 34 08 36 98 17 FE 4E 26
       data hash MD5: 16K
       D1 2A 0F 07 D3 DF 7D BE FF 7B 89 B9 4E 92 C2 CA>)
$$ ##END=
$$ 
$$ hash MD5
$$ 69 49 27 73 E6 7C 2D ED 9B 93 D6 9B B0 D7 B4 BB
##$RELAX= 
##$RELAX= 
##$RELAX= 
##$RELAX= 
##$RELAX= 
##$RELAX= 
$$ Bruker specific parameters
$$ --------------------------
##$DU= <F:/spectra>
##$EXPNO= 1
##$NAME= <H-F>
##$PROCNO= 1
##$TYPE= <nmr>
##$USER= <she>
##$AMP= (0..31)
100 100 100 100 100 100 100 100 100 100 100 100 100 100 100 100 100 100 
100 100 100 100 100 100 100 100 100 100 100 100 100 100 
##$AQSEQ= 0
##$AQ_mod= 1
##$AUNM= <au_zg>
##$AUTOPOS= <>
##$BF1= 200.13
##$BF2= 200.13
##$BF3= 200.13
##$BF4= 200.13
##$BF5= 200.13
##$BF6= 200.13
##$BF7= 200.13
##$BF8= 200.13
##$BYTORDA= 1
##$CFDGTYP= 0
##$CFRGTYP= 5
##$CHEMSTR= <none>
##$CNST= (0..31)
1 1 145 1 1 1 1 1 1 1 1 1 1 1 1 1 1 1 1 1 1 1 1 1 1 1 1 1 1 1 1 1 
##$CPDPRG= <>
##$CPDPRG1= <>
##$CPDPRG2= <>
##$CPDPRG3= <>
##$CPDPRG4= <mlev>
##$CPDPRG5= <mlev>
##$CPDPRG6= <mlev>
##$CPDPRG7= <mlev>
##$CPDPRG8= <mlev>
##$CPDPRGB= <>
##$CPDPRGT= <>
##$D= (0..31)
0 1.2 0 0 0 0 0 0 0 0.06 0 0.03 0 0 0 0 0.0002 0 0 0 0 0 0 0 0 0 0 0 0 
0 0 0 
##$DATE= 1599197448
##$DBL= (0..7)
120 120 120 120 120 120 120 120 
##$DBP= (0..7)
150 150 150 150 150 150 150 150 
##$DBP07= 0
##$DBPNAM0= <>
##$DBPNAM1= <>
##$DBPNAM2= <>
##$DBPNAM3= <>
##$DBPNAM4= <>
##$DBPNAM5= <>
##$DBPNAM6= <>
##$DBPNAM7= <>
##$DBPOAL= (0..7)
0.5 0.5 0.5 0.5 0.5 0.5 0.5 0.5 
##$DBPOFFS= (0..7)
0 0 0 0 0 0 0 0 
##$DE= 6
##$DECBNUC= <off>
##$DECIM= 32
##$DECNUC= <off>
##$DECSTAT= 4
##$DIGMOD= 1
##$DIGTYP= 9
##$DL= (0..7)
0 120 120 120 120 120 120 120 
##$DP= (0..7)
150 150 150 150 150 150 150 150 
##$DP07= 0
##$DPNAME0= <>
##$DPNAME1= <>
##$DPNAME2= <>
##$DPNAME3= <>
##$DPNAME4= <>
##$DPNAME5= <>
##$DPNAME6= <>
##$DPNAME7= <>
##$DPOAL= (0..7)
0.5 0.5 0.5 0.5 0.5 0.5 0.5 0.5 
##$DPOFFS= (0..7)
0 0 0 0 0 0 0 0 
##$DQDMODE= 0
##$DR= 18
##$DS= 0
##$DSLIST= <SSSSSSSSSSSSSSS>
$$ [...]
##$SUBNAM2= <"">
##$SUBNAM3= <"">
##$SUBNAM4= <"">
##$SUBNAM5= <"">
##$SUBNAM6= <"">
##$SUBNAM7= <"">
##$SUBNAM8= <"">
##$SUBNAM9= <"">
##$SW= 16.880792210976
##$SWIBOX= (0..15)
0 0 2 0 0 0 0 0 0 0 0 0 0 0 0 0 
##$SW_h= 3378.37837837838
##$TD= 16384
##$TD0= 1
##$TE= 0
##$TE2= 300
##$TE3= 300
##$TEG= 300
##$TL= (0..7)
0 120 120 120 120 120 120 120 
##$TP= (0..7)
150 150 150 150 150 150 150 150 
##$TP07= 0
##$TPNAME0= <>
##$TPNAME1= <>
##$TPNAME2= <>
##$TPNAME3= <>
##$TPNAME4= <>
##$TPNAME5= <>
##$TPNAME6= <>
##$TPNAME7= <>
##$TPOAL= (0..7)
0.5 0.5 0.5 0.5 0.5 0.5 0.5 0.5 
##$TPOFFS= (0..7)
0 0 0 0 0 0 0 0 
##$TUNHIN= 0
##$TUNHOUT= 0
##$TUNXOUT= 0
##$USERA1= <user>
##$USERA2= <user>
##$USERA3= <user>
##$USERA4= <user>
##$USERA5= <user>
##$V9= 5
##$VALIST= <valist>
##$VCLIST= <CCCCCCCCCCCCCCC>
##$VD= 0
##$VDLIST= <DDDDDDDDDDDDDDD>
##$VPLIST= <PPPPPPPPPPPPPPP>
##$VTLIST= <TTTTTTTTTTTTTTT>
##$WBST= 1024
##$WBSW= 4
##$XGAIN= (0..3)
0 0 0 0 
##$XL= 0
##$YL= 0
##$YMAX_a= 305808
##$YMIN_a= -266351
##$ZGOPTNS= <>
##$ZL1= 120
##$ZL2= 120
##$ZL3= 120
##$ZL4= 120
##$ABSF1= 10
##$ABSF2= 0
##$ABSG= 5
##$ABSL= 3
##$ALPHA= 0
##$AQORDER= 0
##$ASSFAC= 0
##$ASSFACI= 0
##$ASSFACX= 0
##$ASSWID= 0
##$AUNMP= <proc_1d>
##$AZFE= 0.1
##$AZFW= 0.1
##$BCFW= 1
##$BC_mod= 2
##$BYTORDP= 1
##$COROFFS= 0
##$CY= 11.3945322036743
##$DATMOD= 1
##$DC= 2
##$DFILT= <>
##$DTYPP= 0
##$F1P= 16.9975609425685
##$F2P= -3.02152046262296
##$FCOR= 0.5
##$FTSIZE= 0
##$FT_mod= 4
##$GAMMA= 1
##$GB= 0.15
##$INTBC= 1
##$INTSCL= 1
##$ISEN= 128
##$LB= 0.24
##$LEV0= 0
##$LPBIN= 0
##$MAXI= 10000
##$MC2= 0
##$MEAN= 0
##$ME_mod= 0
##$MI= 1.114404
##$NCOEF= 0
##$NC_proc= 0
##$NLEV= 6
##$NOISF1= 3.799351
##$NOISF2= 2.8
##$NSP= 1
##$NTH_PI= 0
##$NZP= 0
##$OFFSET= 15.70392
##$PC= 1
##$PHC0= -9977.667
##$PHC1= 18.00089
##$PH_mod= 1
##$PKNL= yes
##$PPARMOD= 0
##$PSCAL= 0
##$PSIGN= 0
##$REVERSE= no
##$SF= 200.130013532006
##$SI= 16384
##$SIGF1= 3
##$SIGF2= 2
##$SINO= 400
##$SIOLD= 16384
##$SREGLST= <1H.CDCl3>
##$SSB= 0
##$STSI= 0
##$STSR= 0
##$SW_p= 3612.71676300578
##$SYMM= 0
##$S_DEV= 0
##$TDeff= 0
##$TDoff= 0
##$TI= <>
##$TILT= no
##$TM1= 0
##$TM2= 0
##$TOPLEV= 0
##$USERP1= <user>
##$USERP2= <user>
##$USERP3= <user>
##$USERP4= <user>
##$USERP5= <user>
##$WDW= 1
##$XDIM= 8192
##$YMAX_p= 0
##$YMIN_p= 0
$$ End of Bruker specific parameters
$$ ---------------------------------
##NTUPLES= NMR FID
##VAR_NAME=  TIME,          FID/REAL,        FID/IMAG
##SYMBOL=    X,             R,               I
##VAR_TYPE=  INDEPENDENT,   DEPENDENT,       DEPENDENT
##VAR_FORM=  AFFN,          ASDF,            ASDF
##VAR_DIM=   8192,          8192,            8192
##UNITS=     SECONDS,       ARBITRARY UNITS, ARBITRARY UNITS
##FACTOR=    0.000296,      1,               1
##FIRST=     0,             0,               0
##LAST=      2.424536,      0,               0
##MIN=       0,             -266351,         0
##MAX=       2.424536,      305808,          0
$$ Real data points
##PAGE= N=1
##DATA TABLE= (X++(R..R)), XYDATA
0 0 0 0 0 0 0 0 0 0 0 0 0 0 8 -8 8 -8 9 -16 16 -22 24 -32 36 -40 49 -57 68 -79 92 -105 120 -138 158 -180
34 -180 204 -228 259 -289 324 -363 403 -451 502 -555 614 -679 750 -828 914 -1006 1110 -1220
52 -1220 1345 -1482 1636 -1808 2000 -2220 2472 -2766 3111 -3526 4032 -4667 5494 -6614 8226
67 8226 -10740 15264 -43764 305808 175343 -171522 18934 -15967 -161289 -26284 146948
78 146948 113806 -58568 -194421 -8918 61380 -43212 99064 162263 -174788 -186905 133605
89 133605 126746 -4355 14259 3852 -45371 -48548 23697 140477 69222 -106592 -48646 16283
101 16283 3344 65062 69473 -38524 -79584 -56279 33096 95691 -25830 -37191 33596 -77960
113 -77960 -80131 108641 75703 -68587 -43546 -34505 -7123 48734 19962 12151 5727 -81143
125 -81143 -27473 90959 2653 -6957 43718 -70988 -64997 83094 41744 -21716 16380 -48879
137 -48879 -38277 44902 9085 -6931 25911 -31419 -57818 3892 23045 40254 -1292 -63549
149 -63549 -15929 24565 -8024 18609 36620 -46347 -32556 27406 5086 153 34749 12897
161 12897 -38771 -29263 29151 64254 -7130 -33701 18597 -1268 -15602 35886 24449 -22209
173 -22209 4765 -9055 -20757 23088 24855 -393 -14302 -26555 -6407 37243 6266 -14338
185 -14338 -595 -16274 -8085 11555 458 5735 19137 -34463 -27228 34842 15757 -9871 4304
198 4304 -8094 -22160 12135 14787 4265 -3668 -14307 -1836 -5058 -6021 19128 15545 -34710
211 -34710 -19534 16236 1811 -1065 2278 -6642 -14150 -4439 -2220 12602 6382 -14962 -7609 -5869
225 -5869 -1168 12342 12054 -10088 -5208 124 3034 15894 358 -987 6450 -8057 -14090 21403
239 21403 19121 -10787 -4311 1107 3121 5865 10995 4102 -2082 -9096 1574 11599 -4864 4899
253 4899 8716 -13061 -14527 16404 11278 -6155 617 -5218 -3901 1166 5915 3403 -25 -7790
267 -7790 -2106 3475 -3013 10436 3567 -12371 -7650 5487 -247 434 3233 -10899 -5260 -1555
281 -1555 -313 1265 2488 -5932 -6186 -2458 -3754 6776 -427 -6205 -3842 -2508 -2773 4578 2211
296 2211 -7495 701 -4442 -3100 5254 5854 -1969 -1194 1372 -1322 6474 2433 2707 -783 -3417 426
312 426 5526 2728 -464 5427 -3947 -944 6342 4960 912 1527 392 -2416 4602 912 3562 136
328 136 -3166 -51 3010 2368 832 3607 -4049 422 436 821 2927 678 -2170 -2180 2749 -2546 1459
345 1459 -395 -3332 -3551 -1697 923 -1392 -84 -3369 483 -3905 -2963 1452 -1655 -3668 -2954 874
361 874 -4276 -696 -1060 -364 -1954 -4207 253 264 -835 -3232 3390 -1620 -2783 1687 1689 -115 -1754
378 -1754 2684 301 406 -1572 3910 2849 -4671 1329 5763 1989 -3912 6746 4119 -2897 -41
393 -41 4906 2415 -3640 2738 2579 1174 -1402 6051 4667 -3576 -382 5416 2299 -7351 2466 5643
409 5643 -2655 -4832 5120 5348 -6554 985 3986 -1117 -4556 2376 402 -4141 -1301 -578 903
424 903 -5451 -1738 2732 261 -7446 -762 6061 -5924 -5412 809 17 -5235 536 -1882 -3050 3413
440 3413 -2599 -1769 1534 469 -4128 2150 -1036 -4897 3915 2041 -4019 -3698 5884 1306 -1237 -1772
456 -1772 765 7323 -241 -5815 4225 10992 -6541 -3206 8177 -891 -2482 6435 2518 -8006
470 -8006 4663 7584 -847 -4449 2111 8308 1155 -6535 -578 15409 -2052 -13259 6752 9790
484 9790 -8825 -3521 10229 -4780 -5428 5770 3963 -6802 -2682 6707 -461 -8184 -4508 11498
498 11498 1700 -16496 -3702 16187 -3496 -18022 9205 7159 -12702 -4371 9901 -4514 -8111
511 -8111 4772 -181 -6919 -3318 6612 1060 -7667 -4813 9733 3944 -16406 1811 15341 -7524
525 -7524 -13744 10838 5610 -6531 2499 121 -1064 3642 3271 -3154 1169 911 1723 4571 -4544
540 -4544 -2148 9515 5264 -11485 1017 11701 1325 -3624 -2023 4313 5446 209 -6166 4176
554 4176 6027 -2506 -2280 1264 2332 -173 3706 -3470 -6045 5474 7598 -6776 -7674 6635 3317
569 3317 -2000 -6266 -1749 5982 1034 -9643 -3662 7501 -2903 -4114 139 -2154 -2605 4172 -1663
584 -1663 -7727 2832 1135 -1495 -3674 -3609 3575 4968 -9601 -6582 11811 82 -8354 521 5197
599 5197 -1796 -1880 908 -370 1774 68 1469 -1748 -91 4492 3502 -4118 -2433 8780 1912 -4303
615 -4303 -178 6075 1907 -2582 -389 4168 4421 -2825 -48 283 3962 3472 -3290 -1777 4747 3398
631 3398 -3070 599 -491 2460 3005 -4096 -4330 3608 5264 -4394 -4653 -896 6152 1117 -7755 -1822
647 -1822 5882 710 -7538 -160 -41 31 513 -4351 -3867 2685 2846 -4498 -3652 -2109 4415 417 -7908
664 -7908 -1646 5019 977 -6149 -1523 1738 4276 -1796 -5100 1567 3741 508 -2328 336 -1359
679 -1359 2893 1716 -2884 -32 3462 3084 -2375 -566 2740 6044 -1420 -3679 4411 3348 -428
694 -428 -693 2539 134 2511 434 -275 2412 1595 1015 -1622 505 1315 2583 -1963 -1610 2931 433
711 433 -511 -1507 716 290 1112 -2956 -1786 3171 -816 -2625 -2241 1428 -42 -946 -2886 -365 1229
728 1229 -2560 -1286 -2319 -451 -71 -551 -4312 -1318 3127 -793 -2296 -2459 1458 391 -891 -3060
744 -3060 142 2085 -1946 -885 -858 1623 763 -283 -2161 952 2541 -317 240 -1163 1769 1711 795
761 795 -1266 1522 3529 208 -78 -184 3597 1187 -133 -241 1941 1814 -194 1510 17 1552
777 1552 1122 719 -756 782 2049 -434 144 -961 2057 50 -704 -669 349 404 -1465 141 -1323
794 -1323 354 -1152 -1083 -720 117 -558 -2019 -25 -1351 -82 -1578 -739 -1188 -1123 -579 -1403 -176 -1722
812 -1722 619 -1248 -1341 -576 242 -324 -1862 214 -366 454 -1463 385 526 -444 -369 -109 1499 -688
830 -688 1162 141 752 390 820 1310 -330 607 410 2195 -546 624 1894 1131 187 502 3085 -435
848 -435 887 719 1154 -156 694 1211 33 1030 -498 1498 -172 73 354 1257 -624 -1397 1570 -928
866 -928 -792 -451 408 -1565 -658 164 -1006 332 -1897 -692 -949 -716 -2030 -254 -78 -2565 -168
883 -168 -736 -545 -1726 95 -899 -1319 -533 -1107 485 -738 -581 -1155 1000 -1007 -903 1480 -598 -1002
901 -1002 62 2241 -1421 297 1116 307 269 540 1128 365 1827 -1121 1782 1555 -979 1106 2712
918 2712 -189 -897 3968 94 -218 1875 1328 -693 -35 1802 -76 1037 -1307 885 2234 -806
934 -806 -1523 1738 1160 -3528 1551 656 -1723 -367 1348 -1139 -2003 895 -431 -378 -2129 -83 -164
951 -164 -1131 -1819 -373 1748 -2880 -2153 1033 354 -2869 -143 118 -2310 502 -207 -1191 -2035 1314
968 1314 -542 -854 -196 -952 1750 329 -1354 -598 3136 -1479 -1414 2532 -612 -146 1237 727 -403
985 -403 2478 -457 -323 2083 362 706 780 782 -561 2910 491 -1376 1436 2137 348 -83 1645 -277
1003 -277 1663 79 -1371 1304 455 -305 -675 1280 -771 503 156 -536 -472 -90 651 -2524 168
1020 168 333 -314 -1499 -733 39 680 -744 -3565 791 74 -1382 -2382 -358 -209 -649 482 -2085
1037 -2085 -411 520 699 -2252 -883 -104 324 620 -3112 -10 2001 57 -2048 1091 1454 84
1053 84 250 -1681 1191 1361 612 -1202 355 1909 1291 702 -1276 1429 2292 1119 -1953 256 2722
1070 2722 1249 -269 -1859 1988 1873 494 -1015 1072 1957 424 -175 -1026 1898 201 11 -1127
1086 -1127 -447 1186 501 -1406 -1544 1793 -176 -1110 -1970 385 973 -1497 -1850 -1063 1754 -1280 -2076
1103 -2076 -1203 245 25 -1345 -1613 -1266 1474 -1252 -1536 -937 509 339 -1468 -1515 20 2349 -1374
1120 -1374 -1698 -86 1235 582 -1881 -823 1096 2302 -1501 -699 705 2030 891 -832 -133 948
1136 948 3020 -663 -1008 668 2184 1581 -1090 -516 2202 2820 -1514 -662 948 1894 935 -1510 260
1153 260 1555 1810 -1101 109 112 1498 738 -1742 -733 694 1588 -2029 -1321 -237 1612 37 -2721
1170 -2721 -516 1142 325 -2221 -520 -412 -166 -406 -2006 -678 110 73 -1739 -724 -907 805 -304
1187 -304 -2703 -326 488 -222 -1828 297 272 386 -818 -1495 1003 249 -457 -1073 753 453 769 -272
1205 -272 -597 1221 683 105 -1094 1043 909 933 -403 -461 2387 1004 127 -510 1934 1014 705 -461
1223 -461 -136 2050 249 -128 -685 1126 971 671 -1023 -293 2310 232 -552 -1379 801 713 -313 -1329
1241 -1329 -447 1233 -855 -692 -1363 668 434 -463 -1844 -541 882 -1122 -928 -1393 14 15 -778 -1668
1259 -1668 -786 941 -794 -919 -1250 382 36 -399 -1367 126 1145 -1073 -338 -487 828 8 -322
1276 -322 -534 488 1084 -438 548 -202 873 244 278 0 739 1507 -143 710 542 1618 198 -12
1294 -12 280 848 611 -288 1007 -183 907 284 477 424 363 696 -811 512 -119 778 -155 -557 -47
1313 -47 110 -48 -834 202 -181 166 -745 -732 -232 -338 -237 -708 58 -395 199 -1156 -484 -854 -1012 -438
1333 -438 -1497 -327 -426 335 -1155 -376 54 -221 85 -915 151 -746 244 -956 269 344 -321 41
1351 41 -149 536 -180 995 -434 114 555 504 639 109 985 412 965 396 768 812 323 173 70 973
1371 973 -393 684 603 317 491 617 564 72 905 -55 194 -433 -98 -152 -28 -103 -671 960 -663 -296
1391 -296 -10 -51 -899 -298 -130 -1297 309 -476 -445 -586 -219 -504 -765 -257 -797 -160 -959 -419 -842 154
1411 154 -684 -687 378 -432 -52 -349 -41 -576 348 -521 -261 209 -75 850 -193 477 -67 624 291 133
1431 133 494 601 427 -133 1189 -224 352 724 158 864 670 496 161 1311 259 541 326 227 535
1450 535 111 680 -841 854 290 -19 230 94 156 46 932 -608 546 -362 -69 -139 -359 -369 -635 -5
1470 -5 -575 -272 -739 -244 -541 -314 -259 -1356 41 -883 -453 -462 -231 -490 -282 -131 -854 -114 -909 -165 -634
1491 -634 63 -571 -473 177 0 390 -86 -77 -251 945 -29 -522 427 111 768 -136 374 600 907 335 173
1512 173 805 398 809 -69 837 221 1009 415 12 1122 679 310 -659 619 245 764 -433 -330 914
1531 914 389 379 -443 587 56 344 -417 -388 -63 -339 -80 -1485 209 -254 -142 -504 -488 26 -231 -411
1551 -411 -1194 162 -577 -421 -756 -168 455 -315 -411 -798 153 -489 -409 -812 -341 284 -276 260 -899 718
1571 718 511 -280 -170 54 482 -204 74 -396 859 -156 423 45 377 1064 -59 628 425 772 413
1590 413 375 43 792 930 -194 476 241 1248 384 -227 267 573 617 -437 252 -150 795 -268 161
1609 161 -241 234 394 -816 -519 -400 657 -419 -528 -485 172 328 -1076 -343 -402 380 -879 -985 -500
1628 -500 62 9 -917 -602 -699 600 -583 -855 -575 -109 346 -1248 -639 28 1029 -673 -458 -197 801
1647 801 445 -885 -215 93 1027 -316 -75 469 857 669 -475 148 437 1134 -438 -216 458 969 582
1666 582 -348 448 747 1055 -246 181 775 663 204 -587 405 497 695 -468 -6 172 163 -49 -626 367
1686 367 30 328 -1016 -190 333 109 -367 -893 256 -283 -750 -1389 -316 -308 -661 -431 -906 491 -168
1705 -168 -177 -1136 -77 -177 -433 -871 -1147 420 -297 -360 -972 616 121 -139 -509 -461 935 -13 -63 -569
1725 -569 717 264 67 -297 -168 1251 475 184 -549 757 385 -4 -89 -57 1367 427 131 -301 1191
1744 1191 766 176 -105 -203 1023 -139 320 -403 547 650 62 -496 17 755 -265 70 -294 336 132
1763 132 -100 -535 -403 542 -540 -493 -410 -9 -232 -349 -802 -388 346 -1034 -319 -673 -249 -407 -431 -520 -416
1784 -416 186 -717 -430 -628 308 -567 -570 15 -55 527 -553 -51 36 411 -123 -197 395 229 370 -342 266
1805 266 -92 676 176 -161 495 608 700 13 628 304 736 122 136 494 475 543 -199 454 243 353 111
1826 111 249 180 498 457 -661 470 21 589 -247 -506 204 -22 -17 -764 -31 -145 -71 -736 -300 -144 -617
1847 -617 253 -604 -40 -167 -47 -746 -294 -229 -423 151 -772 110 -464 117 -402 -129 148 -558 -330 -521
1867 -521 139 -458 227 -347 55 375 -202 411 136 333 -159 464 -104 150 387 -40 667 -53 546 -37
1887 -37 879 320 486 445 217 336 97 399 -134 845 81 415 637 71 432 -164 313 -287 324 -239 62
1908 62 -116 -57 344 -439 342 -258 -153 -8 -91 -265 -448 -285 -640 124 -744 -21 -508 -458 -130 -583 -187
1929 -187 -640 139 -327 -231 -506 -256 -380 -277 -50 -837 64 -236 -180 -199 -168 -340 283 260 -201 434 -156 357
1951 357 73 270 248 -86 420 300 356 -177 399 1 514 504 -44 589 -120 487 -32 425 18 136 386
1972 386 430 328 -80 428 -300 221 -64 0 -22 81 361 74 250 -560 394 -205 -324 -333 -377 288 -468 163
1994 163 -780 -290 -400 -238 -583 -199 9 -650 194 -500 243 -425 -168 -348 -121 -13 -485 -124 -411 29
2014 29 -583 -44 -133 -117 248 -289 257 -214 295 117 194 -194 240 427 -83 562 145 526 8 375 417 -30
2036 -30 416 91 733 64 914 333 584 377 -154 441 -152 528 -85 105 -249 28 -4 -317 328 116 413
2057 413 -314 185 63 -2 -276 -263 11 -389 -247 -702 197 -243 -412 -129 -134 28 -674 -111 -683 18 -203
2078 -203 -172 -372 -450 98 -615 -138 -808 137 -173 -296 -171 149 -7 -572 5 -367 440 -201 -18 -51 56
2099 56 422 -59 -21 97 726 240 136 329 508 589 -196 122 128 646 20 131 164 554 501 -91 459 24
2121 24 739 56 -20 179 54 573 -285 270 249 504 -276 -275 103 64 267 -573 105 -95 196 -399 -215 -574
2143 -574 -208 -224 -660 -336 -503 309 -688 -397 -287 -222 -109 -555 -117 -570 -42 -331 84 13 -67 58 -339
2164 -339 224 -296 523 -345 -254 52 24 41 -451 292 -63 701 -231 330 709 343 79 -196 545 80 380
2185 380 146 302 413 303 363 22 782 137 223 -211 411 588 46 110 -2 651 -75 48 -257 151 15
2206 15 327 -279 -388 449 -244 135 -854 6 20 -187 -273 -457 157 -286 -257 -556 115 4 -205 -320 -418 127
2228 127 -94 -269 -726 -23 -116 -237 -355 -508 163 -92 -180 -403 154 158 -224 -78 -340 668 -46 204 -269
2249 -269 336 162 -29 158 -5 624 -130 294 159 255 138 138 305 82 686 88 335 -14 473 387 94
2270 94 306 114 519 -221 128 103 396 158 -108 -38 -169 169 -326 -18 41 135 -63 -424 -225 -464 192 -663
2292 -663 -80 -488 -201 -309 -395 82 -423 32 -648 -157 -326 24 -474 -264 -27 -502 -94 -606 87 -365
2312 -365 52 -248 -255 121 -54 301 -523 137 -23 179 -64 -28 152 73 466 -51 659 96 500 197 113 379
2334 379 372 376 48 476 33 549 120 419 481 69 534 -204 320 93 -20 76 -254 124 66 365 -211 298
2356 298 25 132 -129 -263 -171 -139 -64 -369 -122 -332 104 -433 -155 -191 -435 170 -372 0 -469 -258 -252 -91
2378 -91 -332 -622 135 -437 48 -201 -126 -219 -241 -71 -225 -273 -431 97 -212 315 -224 115 211 -13 441 -247
2400 -247 394 -126 259 80 120 274 342 232 -46 508 -129 -92 325 350 462 -13 270 13 505 34 274
2421 274 267 303 504 -94 346 -130 338 -326 377 -116 -116 -88 -12 42 -491 -64 -325 -164 81 -159 -75 -232 312
2444 312 -533 -22 -655 -144 -325 -114 -341 -652 -65 -454 -199 -446 -32 -156 -120 -196 -233 -3 -521 77 16
2465 16 -35 -132 -39 80 20 82 -81 348 115 202 -285 242 235 -46 320 -128 35 202 480 218 182 323 83
2488 83 659 267 379 -124 351 156 -5 392 37 273 -96 579 108 381 -282 -190 241 99 223 -324 266
2509 266 -410 155 -133 -450 40 -200 117 -352 -22 -444 -160 -180 -113 -396 -284 -95 -396 89 -419 40 -505
2530 -505 -64 -125 -226 -192 -282 54 -229 -80 -412 -133 110 -252 46 -131 404 10 78 80 211 114 54 251 39
2553 39 271 -197 146 178 144 379 -113 647 80 263 -111 274 120 198 334 -175 367 -97 647 -73 490
2574 490 167 481 222 -46 87 19 57 -286 219 -208 7 -6 -189 269 -230 -10 -280 -172 -366 -525 -316
2595 -316 -370 -87 -333 32 -316 -147 -273 -243 -124 -206 37 -537 112 -376 150 -74 -36 -39 -131 98 -372 27
2617 27 -575 142 -106 -97 -166 -67 243 41 409 99 320 103 28 10 55 580 179 332 19 293 163 165 397
2640 397 12 434 237 253 269 445 -198 160 79 14 430 -280 117 58 54 -124 -90 -52 70 262 -403 147 -317
2663 -317 76 -227 -551 -169 -257 14 -531 -57 -394 -258 -335 -451 -312 -266 -147 -337 14 -347 108 -303 -161
2684 -161 -102 -70 -121 -409 256 -131 17 -254 -51 239 150 182 67 472 -123 410 -177 251 355 194 200 139 431
2707 431 -21 382 23 166 243 -24 -24 12 590 135 247 180 146 588 105 57 -211 500 20 -54 127 119 273
2730 273 -52 -132 -161 255 -332 -30 -225 9 -201 -176 -15 -231 59 -376 -47 -460 75 -5 -262 -305 -217 29
2752 29 -507 -92 -400 -264 -123 -117 254 -261 78 -235 -65 -160 236 12 31 -127 -407 25 -81 133 -207 358
2774 358 185 -41 96 107 432 -38 556 270 262 261 179 203 -146 550 223 403 290 258 165 103 131 147 403 -47
2798 -47 152 25 303 85 95 102 -337 76 -126 112 -66 -39 -95 -125 -55 -73 69 -328 142 -458 -118 -378 -526
2821 -526 -166 -486 -241 -150 10 -326 -75 -464 -212 120 -357 -88 -353 40 -118 -49 229 -318 -68 13 44
2842 44 -28 448 -180 218 236 -121 259 -171 278 -142 474 18 127 233 205 220 96 343 127 373 30 325
2864 325 191 162 279 121 324 -108 361 86 236 192 -101 282 -232 88 -198 352 -281 -106 -50 -219 240
2885 240 -311 7 -391 -186 -81 -41 -410 -357 -77 -554 -203 -452 52 -352 -281 -269 -265 338 -292 276 -472 -23
2907 -23 -224 -101 19 -149 6 -189 -7 -210 46 -27 13 -152 26 29 -175 211 118 360 -58 369 115 58
2929 58 334 225 381 -93 556 36 352 205 166 403 142 241 -66 289 202 94 -137 6 230 -96 264
2950 264 -63 379 93 -4 169 75 -67 15 -56 -41 221 -422 -48 62 -113 -61 -220 79 -203 187 -43 -160
2972 -160 -41 -384 -156 -359 97 -338 211 -236 -159 -40 -182 15 -139 -86 -112 84 -276 264 -70 -255 -7
2993 -7 44 214 -57 371 -235 171 25 -68 207 124 435 -56 214 380 352 131 24 421 40 65 -225 228
3015 228 8 277 213 188 224 171 226 -68 383 -115 291 -66 -200 177 -119 45 -366 104 -368 -54 -81 -311
3037 -311 103 -262 119 -363 -38 -149 -301 -230 -128 124 -445 69 -505 -111 -390 -81 -242 -269 -204 -388 50
3058 50 -167 155 -190 -175 -197 -188 -24 -48 253 -404 -26 73 56 -220 98 233 -133 369 342 548 -17 245 12
3081 12 14 -1 -150 392 57 343 58 130 119 270 14 65 158 127 226 150 285 192 2 -104 -91 115 -95 31
3105 31 -9 -135 -34 -214 51 -380 -22 -422 9 -333 -101 -301 -227 -54 -460 -155 -432 -44 -404 -142 -170
3126 -170 -396 -109 -304 18 -158 45 -417 -137 -292 -9 -176 -233 286 -323 31 150 196 167 -86 208 264
3147 264 46 -110 160 -138 236 -115 36 297 79 503 -69 79 376 266 167 244 271 49 338 -126 140
3168 140 54 102 -29 150 294 -99 378 -115 145 -296 233 -147 -109 25 -74 213 -405 95 -332 43 103 -269
3190 -269 -142 -229 21 -204 -181 -176 61 -446 -128 -101 -231 56 -114 8 -243 -233 -486 -93 -161 -277 272 7
3212 7 162 -138 102 53 148 319 -213 25 -140 167 79 217 183 105 89 76 363 -88 617 -79 119 113 -23 341
3236 341 226 176 -37 422 135 -29 65 -148 55 -62 76 18 278 -188 20 152 29 272 26 -53 -331
3257 -331 -43 -263 67 -297 -110 54 -173 -322 -228 -72 -291 -316 -161 -266 -53 -365 -48 -176 -7 -217 -280
3278 -280 -385 -316 -313 -142 151 -238 82 -300 38 -27 266 84 -286 73 -118 384 -187 18 234 204 178 79
3300 79 286 -164 257 -34 276 179 285 275 92 355 100 204 -113 214 -160 121 351 5 241 -21 117
3321 117 -267 164 -27 -38 154 -113 -163 -308 103 -263 155 -180 -4 -8 61 -182 -106 -178 -272 104 -459 -92 -318
3344 -318 -173 201 -259 -178 -528 -181 -195 -122 -360 -309 -167 -190 175 -375 173 -73 -19 132 -132 142 0 105
3366 105 -295 94 183 88 270 90 327 264 190 -68 97 -61 122 228 272 145 167 391 -124 301 442 30
3388 30 378 52 274 52 525 -21 327 78 372 134 31 185 -188 298 59 132 -154 125 -36 -172 37
3409 37 -236 -129 -452 -176 -156 -232 -15 -198 -335 -211 218 -115 68 -400 -293 -191 -402 19 -45 -253 -327 44
3431 44 -359 126 -150 -21 280 -121 18 -160 -32 106 282 -83 -177 105 14 98 73 202 81 101 247 198
3453 198 264 -204 307 292 107 384 201 307 108 327 -95 362 -81 318 70 180 -70 -148 327 24 67
3474 67 -148 45 -136 319 163 9 -79 -77 25 -299 227 -462 -188 -95 -331 -104 -148 166 -431 -76 -183 -139
3496 -139 -80 -161 -125 -209 -325 -203 -61 -218 -13 -189 -168 51 -321 104 -256 112 -146 -8 -100 -144 226 -76
3518 -76 -31 -25 309 -50 312 230 154 131 0 324 -96 191 70 82 257 -31 278 -140 416 -3 58 -83 109
3541 109 20 215 173 97 90 -236 188 107 -55 -43 83 166 -46 -23 -92 84 -119 -34 112 -64 -91 -156 21 -246
3565 -246 123 -222 53 -69 -268 34 -175 99 -195 -323 -56 -283 -284 40 -6 -173 147 -328 111 -267 159
3586 159 3 19 31 -287 110 -10 20 -48 -57 -207 41 17 -22 196 -17 78 10 227 169 83 133 125 -24 22 50 -36
3612 -36 319 159 86 163 293 242 -62 323 99 185 200 128 -57 -40 -11 -291 183 -99 -89 -20 53 0 -140 130
3636 130 -334 -112 -57 90 -128 -404 -132 -331 4 -397 5 -342 -154 -252 -120 127 -381 70 -121 -96 -175
3657 -175 181 -168 -33 62 22 22 -12 31 -56 -39 -103 19 145 -122 395 -86 70 185 292 54 87 287 192 248
3681 248 6 275 318 145 170 116 105 3 332 53 397 60 90 119 154 52 259 45 -82 339 -36 143
3703 143 -101 69 -68 -132 -20 -116 -187 -88 165 13 -247 -280 -63 -139 -99 -126 -411 -12 -5 -115 -111 -33 62 -305 -109
3728 -109 -250 -43 -26 17 26 -92 98 -48 149 -289 50 -188 -103 -194 202 213 -131 128 117 77 -42 8 159
3751 159 132 35 219 311 207 305 133 62 97 263 210 108 212 83 -46 -144 265 299 -48 204 -92 138 153
3774 153 -75 207 71 124 -240 210 -27 4 94 -186 155 -17 -116 -78 124 -256 42 -225 -183 -72 -181 -136
3796 -136 -365 -165 -134 84 -345 -237 -91 -353 -41 -104 221 -46 -233 -2 45 -51 -72 224 -22 189 -186 103
3818 103 -278 -3 -39 -92 163 -48 223 -145 148 -47 88 30 -208 585 -92 250 -6 93 62 158 19 105
3840 105 261 85 294 -175 106 8 45 233 297 206 28 259 -17 52 37 93 53 -287 -120 -83 -83 -184 -62 -146
3864 -146 39 -27 -24 -123 -322 3 -331 140 -146 -250 -30 -314 -61 -38 264 -348 96 -151 -139 -137 -128 212 -250
3887 -250 -157 50 16 -132 110 -268 228 -84 52 159 -146 274 -100 146 -39 126 -3 -28 71 42 94 23
3909 23 111 -7 68 314 238 -36 -51 199 -59 218 77 199 113 -48 133 18 66 -139 -32 -194 95 -9
3931 -9 -42 194 -162 -146 -233 48 -142 -60 22 -53 -145 -266 46 -124 -277 -270 -82 -214 -237 12 -162 -49 -227 -295
3955 -295 95 -71 -99 -109 349 -78 207 -126 135 114 17 108 79 178 -42 294 -26 271 9 12 20 -115 -15 -35
3979 -35 35 155 143 53 24 -23 18 80 87 239 -16 -27 -20 34 -27 -39 67 -10 80 21 112 153 -2 80 132 121 -287 -2
4007 -2 -179 1 -314 -22 24 -164 -13 -289 -36 -197 -77 -79 -144 -44 -129 280 -124 -49 -135 -81 -208 -125 -168 -215
4031 -215 -76 -38 -15 -74 53 47 -78 2 -270 248 -65 138 24 105 114 255 208 57 91 -78 315 147 -11 225
4055 225 155 49 28 236 221 290 49 87 122 177 22 -34 143 -76 63 17 9 4 99 9 -143 313 16 4 -181
4080 -181 93 -452 -75 12 157 -55 -236 -48 -43 -11 27 -197 -10 -276 -228 -133 -248 -91 104 -171 -414 -330 -331
4103 -331 47 -366 -16 -162 -228 -178 -165 -76 212 180 6 -75 -30 -42 10 -44 12 -195 167 -222 327 15 123 -283
4127 -283 -6 133 -70 340 -37 197 36 231 210 75 296 108 36 -19 145 -105 283 222 -20 -105 -9 -36
4149 -36 -40 198 -253 12 -180 -62 95 -150 185 -237 -130 -129 -105 -146 -33 -102 -325 -6 -259 168 -340 -201 -365
4172 -365 -77 -70 -284 61 -333 72 -99 -46 -75 -69 -8 185 11 39 146 -123 -95 -219 15 239 83 -4 72 41
4196 41 2 -16 -26 207 111 -124 4 34 245 126 207 92 190 361 -93 164 202 48 56 88 38 72 164 -79 40
4221 40 79 4 -62 127 114 -14 9 -148 156 -45 -101 139 -95 -13 37 -172 -261 14 -289 -22 -196 -117 -131 -81
4245 -81 60 -21 -153 -309 107 -103 154 -10 -244 -57 -33 -5 -37 -136 -1 -35 -87 -64 89 15 108 -107 286 295
4269 295 238 -130 10 -51 108 188 -18 342 139 127 36 246 97 64 410 144 196 146 202 149 -33 45 -71 153
4293 153 -61 93 -56 169 -100 173 238 -51 -7 -125 180 -242 305 -163 -139 -110 -396 -90 -143 -210 -242 -66
4315 -66 -211 -220 -54 -62 -238 -82 114 -137 110 -92 -130 -115 -139 82 -30 -220 -19 -37 -70 217 -129 -27 280
4338 280 -141 48 -137 31 -146 263 279 49 132 -286 30 29 103 172 175 -17 341 162 48 249 -62 3 94
4361 94 -73 75 199 122 65 15 -155 164 221 -87 41 3 143 -41 373 11 -72 23 -105 -147 -1 -123 -333
4384 -333 -89 -252 134 -239 -53 11 -108 183 -141 -212 -318 103 -145 -194 -223 -380 -20 7 44 -27 -51 -122 -98
4407 -98 79 197 -57 -94 132 -87 -250 -33 -302 -201 299 7 14 65 -35 330 -198 23 260 127 98 235
4429 235 305 95 202 87 29 185 -124 153 -68 57 -309 112 197 328 153 -40 33 -140 150 -272 114
4450 114 -274 60 -130 86 208 -161 198 104 51 -162 72 -163 -56 -113 -246 219 -134 68 -165 136 -23
4471 -23 -56 -137 -297 -20 29 64 -69 -193 229 156 -331 -127 -229 -134 31 -90 -69 -36 -129 206 -136 238 -253
4494 -253 -23 169 4 175 12 184 29 -22 167 2 -31 98 96 202 180 34 408 97 116 -40 33 79 -48
4517 -48 142 19 194 223 -143 -19 63 -66 -16 -24 -109 113 -106 58 -40 -133 -88 20 -63 -126 -48 -193 165 -223
4541 -223 -25 -17 -115 227 -73 -66 -339 -81 -281 101 48 -143 -203 153 -41 -59 40 -153 78 -207 134 -100 69
4564 69 191 -162 118 215 264 146 -45 219 -15 -31 21 142 275 54 -255 84 182 -13 13 -80 289 -79 93
4587 93 -145 -4 105 -242 322 108 71 -123 11 -13 31 -14 -129 5 21 57 -420 -193 -160 -154 -34 -101 -169 -459
4611 -459 43 -203 80 -351 -117 33 78 -128 -223 71 -307 -33 142 253 56 -93 56 -130 -152 -159 -59 -54
4633 -54 -149 -1 14 115 67 7 -121 0 -67 151 71 65 304 89 78 22 73 -9 -49 -62 95 34 -89 301 28
4658 28 156 213 188 31 -45 136 26 16 -107 -33 46 -9 227 79 114 -6 270 14 131 -44 -408 -86 49
4681 49 -75 -115 -75 -221 53 -16 109 10 -241 -84 -264 -187 -284 10 -81 18 -2 -70 -1 -216 63 -92 189 -291
4705 -291 53 179 -141 87 -76 276 -145 -50 -325 -136 -28 -95 170 91 -23 -2 183 120 -70 46 -130 -80
4727 -80 242 17 138 9 -69 -110 128 115 447 12 2 -55 84 125 50 238 -89 49 -245 4 -50 89 56
4750 56 161 62 5 -103 -26 25 -89 -102 -46 -201 -241 -83 30 151 49 -241 -132 -87 169 -57 5 53 -337 -7
4774 -7 -15 -123 -284 -11 -66 60 136 6 -52 -64 20 -161 211 -86 -204 368 249 40 12 14 70 143 -42 246 249
4799 249 129 0 -76 297 144 -176 120 -166 231 57 146 -20 -67 -6 73 -127 -114 121 -108 93 150 221 113
4822 113 151 147 -128 12 -106 -213 -126 122 -111 -161 -140 -166 -62 -311 -121 -168 -116 -108 -1 -23 -12 155 -484 -29
4846 -29 -68 -147 11 -12 -117 -59 33 -181 115 159 141 -126 -138 -42 58 14 -106 -159 -30 359 296 94 286 147
4870 147 13 -91 -124 194 116 -23 -64 107 1 218 91 167 144 172 53 188 66 -204 -30 -162 -7 225
4892 225 -48 -71 93 -15 -76 -86 97 62 44 346 -122 59 39 -217 62 -281 55 -441 -160 28 -65 99
4914 99 9 -14 -68 32 -51 -248 -160 -101 97 -61 40 -117 -96 -1 -57 -212 -99 -58 -198 -130 49 52 119 198 -30
4939 -30 148 254 138 218 -224 64 175 131 171 210 -8 198 126 288 303 45 127 -96 267 63 92 174 -108
4962 -108 -144 128 -120 -103 68 -82 -6 14 -73 169 131 -116 -280 -95 243 -213 159 -210 -75 -35 -124 -140 -173
4985 -173 -129 17 -88 16 208 -191 -264 -49 -58 -29 -159 -95 -41 36 -134 -63 -111 -23 36 -39 -135 -290 119 3 148
5010 148 -175 7 -135 189 392 -8 246 -61 128 6 -50 52 33 199 -43 113 -131 118 -87 -63 -65 9
5032 9 -31 320 79 -165 273 151 28 -22 -220 191 70 -91 29 -17 199 85 -153 16 -7 -101 26 -68 168
5055 168 21 37 -28 -186 103 31 169 -334 57 -136 -12 98 -347 -233 35 52 206 0 -72 11 -130 -128 236
5078 236 -356 -257 188 282 66 143 134 -24 91 -85 22 -158 121 9 193 150 87 160 138 81 -85 285 -31
5101 -31 157 -16 175 80 121 132 -38 207 -118 -45 12 -51 99 -134 171 198 127 80 -64 83 -181 39 -36 78
5125 78 -230 28 -135 134 1 88 10 -72 77 -96 30 169 22 47 134 197 -76 176 -57 -151 4 3 -151
5148 -151 -247 -263 -55 -122 40 41 121 -283 75 69 -42 -223 -10 -42 56 13 -277 190 -7 68 38 346 -39 238
5172 238 -178 -96 36 -125 138 -115 339 150 153 21 72 -86 44 36 183 18 -136 100 153 -24 141 -211
5194 -211 33 -229 -128 -24 -71 27 15 -229 -280 24 162 24 93 -96 -360 -39 142 -166 -31 -130 -85 -220
5216 -220 -157 -294 227 -235 -103 20 -211 -27 -176 -80 -29 184 -14 10 -48 23 19 -74 221 -29 143 24 -56
5239 -56 100 -183 -54 -5 137 48 116 2 43 -132 -75 120 -36 198 -75 -178 46 -54 353 103 128 21
5261 21 198 95 -10 223 -72 310 -35 132 -180 17 -245 -9 -143 -10 -50 -344 34 -50 54 -22 2 -257
5283 -257 -93 -83 -223 55 -70 31 -326 -231 28 -3 -181 -134 47 42 84 -18 18 -229 34 -68 -61 79 -53
5306 -53 59 -269 145 50 -18 289 40 33 -89 169 37 181 -48 -24 38 -313 314 113 101 137 205 30 134
5329 134 230 -206 154 4 380 156 102 216 -135 224 220 272 -240 63 -257 -89 -105 -126 134 -152 -124 23 279
5352 279 -169 113 -87 16 -65 43 -68 -168 -195 -209 127 69 -36 -83 50 -82 -200 13 -120 79 -155 84
5374 84 103 -33 56 -186 -148 -8 -65 34 207 -13 104 -168 -2 263 -37 -7 51 -200 64 39 186 -46 52
5397 52 -17 157 -160 -51 154 127 141 -167 16 -171 190 21 32 -169 144 114 -47 105 4 121 -40 45
5419 45 -153 -135 30 -194 130 54 -152 78 -178 62 -127 -55 32 21 -86 -185 -26 -59 -87 -176 -154 -99 87 -64
5443 -64 -36 -243 18 -27 -13 86 -134 -8 257 -8 98 48 7 -9 -23 -47 -11 -137 95 -34 -276 147 -43 253
5467 253 156 111 -45 10 -98 -121 -88 257 -113 116 95 -160 -89 -17 -102 155 133 176 65 265 8 66 -162 253
5491 253 85 -84 202 -105 108 -246 -46 27 128 100 -146 -18 35 150 -330 -135 -13 -74 158 -102 183
5512 183 -310 -137 -166 48 -14 -30 -101 -91 -173 -170 10 -363 -118 -35 -90 -175 -100 -76 -295 2 69 80 156 141 -93 32
5538 32 84 135 126 117 -34 120 -175 81 7 244 -73 -140 -117 195 -241 -67 67 115 61 -14 128 -125 86 -39
5562 -39 -34 189 -40 -29 -83 -81 28 11 -181 39 13 -282 98 48 75 -245 103 -27 -79 -30 -178 -25 -271 29
5586 29 198 -130 -126 -147 -78 14 38 63 -97 -65 60 -186 -169 -4 -36 -102 110 0 -32 87 -210 -68 -90 -86 94
5611 94 20 13 -124 3 230 -142 147 17 22 194 134 -187 -79 -105 211 -160 232 60 49 35 61 188 208 75
5635 75 -100 -183 40 214 65 -339 73 -64 94 124 249 142 -136 -71 71 -79 -273 69 -186 61 -276
5656 -276 -4 -89 74 170 -5 -89 -10 -37 180 -42 -123 69 57 -234 44 -126 -193 -18 -86 383 -116 -210 -244 157
5680 157 62 66 80 -106 -93 58 100 46 -103 -179 192 147 -82 75 -225 151 87 125 -19 202 81 -145 295 -61
5704 -61 95 130 190 54 -9 162 120 -108 146 -282 -265 -30 89 -44 121 -59 110 -75 100 -280 -147 88
5726 88 -105 -34 -23 -134 -282 165 -100 -39 -34 -67 -131 -210 -16 -161 -75 -180 201 60 14 143 -202 35 48 -82
5750 -82 42 -63 4 -97 196 -43 -260 -177 19 93 -85 65 18 -161 121 102 -53 151 -72 13 78 -128 -39
5773 -39 -18 254 108 -169 -78 -31 199 26 -244 169 17 62 -96 -9 -27 69 303 -99 -108 -33 -58 -70 39 -192
5797 -192 -38 -81 72 1 11 -41 -71 -180 193 118 129 78 -95 -59 -177 -88 160 -24 -31 -68 44 -287 -132 -75 63
5822 63 176 144 -151 -19 111 -95 31 -11 247 54 125 -54 48 44 -32 123 20 173 -221 -68 -26 150 152
5845 152 -47 -30 -108 -152 176 116 -89 -27 -11 2 -20 127 -15 -179 -176 112 93 93 -204 64 -54 -53 -142 16 118
5870 118 109 -63 119 19 213 56 -178 43 -127 -41 112 57 -265 -90 -71 -39 -55 -165 -127 18 -155 -127 -46
5893 -46 -16 117 116 101 -171 57 -5 14 8 254 10 -122 26 11 156 -167 -64 -74 221 -13 -124 92 -32 8
5917 8 4 -115 231 265 129 61 120 21 -28 228 -100 -149 167 -180 191 41 66 -34 -32 -250 -66 110 44 -92 -120
5942 -120 -45 -131 -99 -203 98 -100 33 54 62 -228 8 98 -119 -17 30 -102 53 16 -2 -141 56 -36 213 -36
5966 -36 -220 -161 171 -29 55 -105 -142 8 -35 -12 17 -45 -29 -151 -43 32 192 122 22 126 -87 15 139 111
5990 111 150 149 -3 69 57 -9 63 55 176 -12 -36 84 -183 255 17 78 7 -79 -19 7 15 215 125 60 204 6
6016 6 -68 90 138 9 -135 110 -132 65 163 201 0 -4 -217 -46 126 -121 -187 -7 129 70 -4 -104 -75 -152
6040 -152 149 132 -151 79 -88 -215 202 8 -183 -134 -176 -143 94 -165 -140 162 299 175 43 265 -221 -26
6062 -26 -48 142 236 54 71 30 355 119 38 177 -40 85 -1 165 -141 57 79 -111 88 -157 107 -42 -117
6085 -117 80 10 109 -12 61 -112 -144 208 123 -25 -116 -117 -20 -176 -145 48 -142 148 22 52 55 -49 43 -15 19
6110 19 -70 257 -216 80 -251 -31 6 207 -146 99 213 -29 112 37 132 -34 -71 41 -7 55 -204 7 47
6133 47 21 32 -84 168 49 -11 95 89 -20 194 349 45 175 -80 30 204 143 104 212 -16 120 -3 -52
6156 -52 28 27 270 -81 -90 82 107 -7 106 217 -106 75 37 -219 232 291 52 -66 -246 -98 -50 52 63 49
6180 49 -9 152 -238 -161 -73 0 -279 -188 17 -143 26 -103 -82 39 -7 48 -16 -21 -36 41 -93 327 -187 51 -52
6205 -52 -210 111 -117 193 -157 -25 -182 57 143 125 196 8 243 -24 102 -29 56 -67 -201 -26 48 119
6227 119 -193 172 -249 -48 -40 -77 203 60 -4 -107 -93 -46 -76 62 137 -33 13 222 -307 5 -67 -44 -58 -216
6251 -216 -60 -294 68 -211 3 -86 -45 -40 212 -3 -177 114 28 -240 -56 -116 -62 -14 41 -159 -147 -109 26 -14
6275 -14 66 -52 -24 133 -181 154 26 8 -84 47 -24 52 -95 117 -135 159 133 79 -23 287 171 -151 19
6298 19 172 129 317 -150 184 -50 -110 47 132 36 -281 -113 149 -130 97 -68 172 -198 74 -415 -41 103
6320 103 -96 -49 101 52 -144 -130 -232 66 93 24 39 -212 39 -103 -126 6 -78 8 199 -92 29 -26 -221
6343 -221 46 -56 6 48 147 -16 81 -62 193 -285 45 -29 -268 131 138 -194 52 102 194 62 -61 -161 -101
6366 -101 -100 131 407 -18 264 -128 -103 -2 -53 54 -172 71 -62 196 -40 54 111 6 72 10 -31 -9 71 -85
6390 -85 12 -107 -66 127 121 79 -2 -85 -7 73 -160 103 -218 -55 87 -86 210 -167 -184 -356 -22 -119 249 60
6414 60 -326 66 -55 -40 -366 -10 -69 68 86 -90 70 -102 273 5 62 -37 75 161 -72 91 -25 217
6436 217 -101 133 -180 -50 -104 12 30 214 83 -53 -19 -221 -87 223 -166 52 42 -27 62 -122 -113 66 -193
6459 -193 108 97 -111 111 -286 91 -95 26 -123 -189 -78 0 -11 -117 239 156 -112 74 -74 25 -185 -70
6481 -70 97 266 99 26 217 -68 -59 -112 -141 -288 87 37 0 206 23 138 47 146 -248 -49 32 -160 28 149
6505 149 -83 26 5 55 134 13 211 62 -188 363 38 15 -87 50 90 -190 131 320 -221 -11 211 -72
6527 -72 101 -70 202 226 -136 27 12 -115 33 56 59 -30 98 82 51 337 83 -114 15 -147 -72 8 -3 213
6551 213 9 153 -73 -186 29 102 -102 1 -14 -294 102 -45 -258 -74 -45 -20 -45 177 -132 -9 -1 -21 -110
6574 -110 -21 59 54 -161 11 -3 23 -41 19 171 -351 -147 -35 48 268 221 -32 124 110 -26 30 251 21 -212
6598 -212 162 155 6 -120 129 186 -11 -8 -12 -102 20 -79 65 166 -126 -74 36 36 44 161 -77 75 -185 -86 -219
6623 -219 -39 66 63 3 -163 149 -160 -178 -243 -62 -15 101 -12 -102 -132 160 -105 -125 86 -135 -165 122 -41
6646 -41 86 -82 98 -34 -87 13 42 -88 -73 -215 76 88 -8 64 138 60 -6 -121 155 -61 -122 67 -152 304
6670 304 1 60 202 39 -48 282 88 -158 82 -41 3 -97 -123 -15 5 -167 59 -104 -213 88 -173 111
6692 111 -24 36 101 -152 161 -227 184 -171 -62 45 -77 -89 -86 -240 -301 87 -171 -196 93 178 26 -16 140
6715 140 -48 -12 60 54 -98 -93 223 69 -137 -44 -56 -260 329 -136 3 43 -71 123 -185 153 -114 139 -25
6738 -25 -229 28 -207 142 -92 228 -34 68 -110 9 -68 432 81 -34 74 58 288 -143 -24 -21 -11 -198
6760 -198 -255 49 -149 -227 114 51 -45 -63 91 -3 -85 -127 71 -55 -8 -61 11 -101 -21 168 -30 -21 28 43 131 6
6786 6 -6 -197 -122 41 141 -27 -126 48 -17 -78 170 114 -18 120 105 21 80 35 73 28 198 68 -146 -125 -124 31
6812 31 173 -5 -79 80 -274 256 -106 58 -22 -142 138 18 -168 -159 -17 -103 139 136 -290 27 2 101 7 -159
6836 -159 -184 199 99 121 287 96 -103 -180 95 -55 25 119 -251 169 136 28 116 82 -20 -94 15 29 -188
6859 -188 -44 -11 -101 -87 -172 -168 122 43 34 1 -166 -90 317 -104 -120 145 169 13 86 53 -217 134 270 150 -16
6884 -16 101 -34 -170 -56 20 155 58 129 147 80 -48 115 -29 -72 -80 108 -135 27 207 132 254 -79 54
6907 54 -134 -109 -47 -101 96 -43 107 -78 -41 22 -224 17 -2 16 139 174 -123 -269 -235 -241 17 155 -342 124
6931 124 -170 50 -95 -125 3 -7 20 87 -78 -249 -151 -58 16 -101 79 -86 58 255 10 91 -42 249 -95
6954 -95 89 107 -153 -9 -161 228 20 -201 -13 -53 -124 -91 154 141 71 119 -117 -79 -192 78 -81 -70 -5 -49
6978 -49 -262 -172 -87 -55 47 -28 -11 6 108 -37 -81 -4 4 185 163 -23 251 112 -65 15 -63 -67 82 -107 30
7003 30 -136 -105 84 93 -37 -117 127 42 37 -275 59 67 -39 -61 -169 -125 190 19 139 -119 -107 47 -24 50 62
7028 62 91 279 93 -44 184 -24 -81 -81 -113 -108 -30 -154 104 144 88 -23 28 126 35 81 -27 -213 -419 -211 -48
7053 -48 -66 196 87 120 52 -86 -19 -131 -144 78 184 1 29 -49 180 24 179 103 -174 -110 -265 14 29 -152
7077 -152 227 -176 -408 -219 140 73 81 -107 -45 10 2 -24 -240 140 149 90 -189 105 -360 -96 -54 -196 -282 -11
7101 -11 -96 -175 201 47 -208 193 77 0 174 94 279 -99 -108 109 -143 135 -40 66 -121 -2 -143 -156 135
7124 135 123 -70 -101 226 41 200 12 70 -51 -73 124 -145 -131 -45 24 77 -207 239 181 29 -4 -10 64 -50
7148 -50 -2 113 -15 -11 105 127 30 118 119 65 -164 -226 8 256 143 -161 150 -225 19 171 117 -170 143 49
7172 49 -300 -127 169 100 -71 -27 37 146 -60 -119 65 174 -50 291 96 -138 68 -68 -75 -53 -294 -21 -20
7195 -20 -119 45 290 139 144 -147 -27 -64 93 189 54 140 -43 -19 -41 -98 -132 -19 -148 68 255 -135 -56 21
7219 21 -75 112 14 -180 -109 -224 148 -73 89 30 64 -149 -29 149 -40 -189 -265 114 -17 227 -191 -78
7241 -78 201 -173 -34 -116 -20 -175 -252 117 131 -110 202 30 29 -76 -22 184 169 6 226 -25 64 101 195 12
7265 12 -82 174 82 -36 78 49 123 240 -86 -66 130 -15 -263 -27 -33 66 -101 -161 -25 -17 -18 -261 61 197 -96
7290 -96 85 132 128 -49 -6 93 -62 -210 17 2 -162 327 87 46 -53 -14 183 26 -44 -14 232 -74 124 -90
7314 -90 -100 150 119 -164 48 10 59 87 -8 -14 66 -79 36 -186 75 160 -108 -67 -60 187 -53 89 165 -60 16
7339 16 -185 -59 232 101 -120 -25 -158 -93 -42 184 7 152 66 136 173 41 94 -202 70 -220 -208 -30 -331
7362 -331 120 94 -150 67 222 -112 16 18 -150 -79 -116 23 123 -15 -163 131 162 -75 178 -174 206 -236
7384 -236 18 -9 133 120 98 -128 -88 27 130 -17 -14 -114 116 138 -309 -130 -123 46 -78 -55 -47 -114 32 -273
7408 -273 251 47 5 121 -154 75 -163 111 49 -84 101 144 -63 85 69 116 97 34 228 103 -137 -158 -89
7431 -89 233 8 -57 -170 -116 -44 290 -26 -92 172 -66 53 361 -10 185 -71 -107 -33 -85 177 126 3 136
7454 136 -57 145 149 -255 -70 -95 -59 166 -122 -31 195 -149 -184 -141 -20 19 18 -16 124 -165 169 -10 -146 -47
7478 -47 -148 -74 260 103 285 -15 -81 32 -147 47 278 21 13 162 -127 -6 -103 -69 -205 -117 -19 223 48
7501 48 121 -146 -46 101 -156 -180 -137 102 48 -189 217 -123 53 201 101 -85 19 133 25 19 -243 99
7523 99 53 -46 -95 199 -142 93 13 -44 -144 -83 127 -147 4 -144 61 -46 28 207 284 -143 -70 -170 34
7546 34 -79 8 147 38 -141 -47 -61 141 96 312 -119 -126 40 134 102 158 -186 91 -65 63 10 -33 -11 92
7570 92 160 82 -19 -164 85 92 162 76 64 -76 33 79 -171 -145 -25 159 105 -288 15 -44 -85 -109 -125 -100 14
7595 14 -109 45 -25 -103 85 -91 -84 -28 -81 -134 -152 23 240 -46 -2 -109 -97 -169 174 7 -162 68 177 -82
7619 -82 -135 -35 -31 169 125 -77 -55 -14 15 66 -181 278 -35 152 144 -64 -1 19 -162 80 14 -33 21 -101 75
7644 75 -172 141 3 131 2 121 -159 5 155 115 -96 102 60 -234 3 15 100 31 -56 49 -21 30 2
7667 2 69 24 131 199 -251 20 -207 279 331 -90 -88 -24 21 -4 62 -177 -111 110 -231 -6 -109 -164 -179 -144 2
7692 2 27 -201 43 88 114 -42 252 -59 -39 -108 -74 35 -59 142 162 0 -34 58 78 295 0 -29 12 202 180
7717 180 241 113 -162 126 135 -70 -48 158 -185 141 74 -29 -66 103 3 94 -237 -493 -151 -59 -99 -113 -209 -166
7741 -166 -433 -2 79 47 -191 118 -3 -4 -65 -35 -175 73 111 -145 -55 -7 189 -106 65 81 101 -69 89 -254
7765 -254 -79 84 -9 92 202 87 311 40 53 71 -121 -53 -411 32 19 -17 -2 62 7 -175 -184 -109 141 -56
7789 -56 -174 -33 -37 4 272 117 -87 -174 -185 0 -288 164 -90 103 33 173 -53 -162 -211 -23 60 -72 -163
7812 -163 36 -207 61 -6 -88 -12 -63 177 1 143 -233 251 -34 -40 112 128 38 -121 -57 -103 -80 56 13 8 -98
7837 -98 -204 -181 199 -145 -77 -151 -37 -72 27 -40 -5 166 370 35 -253 173 -51 196 45 -108 23 -81 37
7860 37 -161 37 105 -126 29 226 -7 -97 3 105 139 -26 -83 -109 117 31 23 -18 -164 93 75 94 -100 -18
7884 -18 -183 266 128 1 261 -133 -112 115 -30 -153 -69 -63 116 -262 -111 -264 -199 149 22 107 107 -102 -3
7907 -3 -32 30 -108 42 -75 -143 117 -175 -35 -60 194 -53 128 -153 127 99 -21 118 -121 79 -135 17
7929 17 41 45 -174 23 83 48 22 -19 54 -23 200 -42 -17 -55 -186 52 -151 -174 -41 6 -110 -6 -29 -112 -160 -70
7955 -70 -153 148 -212 -16 76 -111 232 -224 -78 -181 -88 -81 151 187 80 -134 52 -89 -67 -201 64 19 -237
7978 -237 139 -130 55 -103 -46 -24 -39 92 -7 27 -66 -165 105 -286 -149 116 105 -81 181 25 333 242 -147
8001 -147 -64 14 -199 -10 -152 1 95 -80 352 -52 -36 -70 131 164 -4 -106 113 39 59 111 -89 -43 -27 -175
8025 -175 -92 -106 -54 -166 100 101 138 -91 29 -119 127 -102 -164 -70 -131 -37 -64 -23 56 -57 -2 -52 -157 -59 10 119
8051 119 -123 22 -81 40 -4 253 81 -188 -249 148 35 13 -173 52 156 -128 -32 71 126 79 142 179 -92
8074 -92 15 171 -41 141 11 35 152 32 80 -176 204 -114 -48 14 87 -109 -1 34 -46 5 119 22 282
8097 282 -184 -259 -210 17 -177 0 143 -71 -78 189 7 157 69 -36 -28 33 60 -24 102 61 98 -11 -353 54
8121 54 -151 117 148 -127 -99 25 -173 -188 -128 -202 118 168 -106 -59 -37 91 107 -243 -102 -102 -23 19 -79 -224 113
8146 113 37 3 98 67 115 159 93 138 101 206 -53 171 -168 232 83 -213 115 -10 -143 -202 -78 258 -8
8169 -8 -27 175 -27 73 7 303 -96 -45 -82 41 -172 -79 -317 -137 67 -76 -1 -99 98 92 10 -84
8191h4
$$ Imaginary data points
##PAGE= N=2
##DATA TABLE= (X++(I..I)), XYDATA
0 0 0 0 0 0 0 0 0 0 0 0 -8 8 -8 16 -16 24 -24 32 -40 43 -56 64 -72 88 -104 120 -138 160 -184 213 -243 275
32 275 -314 355 -401 451 -507 566 -634 706 -786 873 -968 1071 -1184 1308 -1443 1590 -1751
49 -1751 1930 -2125 2341 -2583 2850 -3148 3489 -3876 4320 -4837 5452 -6188 7096 -8247
63 -8247 9760 -11836 14883 -19793 28985 -52049 232758 282320 -266351 -47527 53401 -85223
75 -85223 7598 182025 55134 -104119 -186581 10067 132783 -8872 10508 95756 -165602
86 -165602 -197991 159271 162628 -73786 -57620 -16528 -42740 -21815 48444 101872 33669 -133483
98 -133483 -61880 72258 37885 42186 43506 -57741 -78103 -1122 61969 92194 -22031 -78654
110 -78654 25469 -26841 -61089 98441 78193 -108048 -71396 5654 6750 46089 9469 -32426
122 -32426 -19540 -57459 -28278 92723 16613 -58960 20344 -38547 -57455 89185 64418 -54684
134 -54684 -6530 -12865 -28261 62600 33837 -20410 13597 -10776 -42630 29388 48866 21293
146 21293 -7462 -58002 -9023 47960 7566 -3857 23021 -39374 -41464 39667 18427 -11690
158 -11690 13903 2445 -42182 -19363 35813 50655 -14486 -54099 13966 17767 -13992 24250
170 24250 25145 -31293 -9772 9688 -13309 23751 25610 -13103 -21403 -13883 2083 33920 6873
183 6873 -32872 -6540 -8026 -8189 12762 2632 -9106 4428 -25343 -30661 35793 18891 -26363
196 -26363 -9677 -3041 -17427 11258 20424 -6257 -8153 -12442 1493 7694 1613 14426 13246
209 13246 -26257 -18264 31008 12921 -4976 2138 -2609 -8374 3551 9014 9568 6937 -16397 -6516
223 -6516 5394 5056 11755 8718 -11392 -10300 7808 3743 11253 -636 -9479 2688 -3162 -9053
237 -9053 16897 21170 -16843 -9360 7026 5690 5441 5658 -266 -7938 -6094 16 12629 -3595
251 -3595 -4563 5334 -11500 -13231 13741 12925 -15516 -6893 -3868 -5159 2008 2962 -945 -6203 -7796
266 -7796 -4677 5652 -2566 2322 1355 -15136 -7113 7534 4325 -4135 2549 -7587 -4409 5794
280 5794 3106 3632 1922 -2465 -5327 3972 1807 6499 3048 -7061 -779 1956 2155 4136 4993 -7052
296 -7052 592 2824 -1044 7816 5767 -1439 -3094 4118 464 4854 3510 -1659 -258 -2921 2782
311 2782 5537 3718 -2643 3021 -963 -2717 7221 3059 -1714 -2966 121 -3770 2262 718 -2064
326 -2064 -770 -5864 -540 1214 658 -3245 -1003 -4757 -3720 1533 -2254 375 -2661 -3849 -4087 1439
342 1439 -1924 -2460 522 -4573 -2034 -750 2740 -899 -151 -1792 -602 -81 -2879 3751 -260 -1939
358 -1939 -1393 3474 -133 -117 2848 -200 1373 -2315 2855 2973 990 -763 3331 2289 -2553 4331
374 4331 2815 1085 -711 3198 1801 480 1168 2111 4571 -3661 1309 5895 2007 -4116 3226 5100
390 5100 -5558 -1080 3232 1927 -5100 821 3037 -1579 -1819 1507 3566 -6837 -3071 2629 -43
405 -43 -7786 -1596 5542 -4353 -5904 2129 4880 -7848 -3148 3915 -2844 -5699 -563 1597 -5267
420 -5267 -1102 -22 688 -2757 -2457 4216 -126 -4878 -2033 7248 -3833 -5995 3279 2981 -2481 362
436 362 3176 -2177 4701 684 -1671 2975 1649 -2048 1403 3470 -3658 4567 4201 -2248 -1691 6543
452 6543 4469 -2645 943 1497 6458 416 -5609 2999 9439 -4744 -7724 8591 907 -4268 3617
467 3617 2867 -7291 1369 8453 -3724 -5337 398 6279 -1519 -7235 -2379 9841 -1025 -16890
481 -16890 3747 10020 -8938 -8704 9267 -2247 -9116 5114 2925 -6825 -5205 6043 -784 -7921
495 -7921 -3071 8349 2632 -15506 -3188 15494 546 -18446 6756 12222 -11886 -5185 11286
508 11286 395 -9613 6429 3934 -5161 -584 7903 3385 -6529 -1486 8418 6560 -12770 -81
522 -81 17538 -3661 -13733 10839 11980 -8944 1028 3838 -746 3439 3481 -2892 -870 3335 -199
537 -199 3038 -3098 -2772 7342 4121 -10180 -2250 12675 -1232 -7351 -2631 3382 3415 -2262 -6647
552 -6647 512 6200 -5221 -4575 276 1594 -2238 -737 -2194 -6547 4126 5411 -6933 -9315 6385
567 6385 4122 -5357 -5057 -1672 5790 160 -8112 -3521 8969 -169 -6407 1802 543 -1024 2688
582 2688 1228 -6781 3201 4753 -2236 -1103 -525 4552 5027 -5215 -6098 12655 4153 -9770 1874
597 1874 7253 304 -2691 2911 1113 1996 1060 693 473 -154 4411 2071 -3189 -3113 7699 2659 -6434
614 -6434 -313 4826 1706 -4715 -511 3046 2921 -4188 -2689 1666 1060 1616 -4611 -3042 2790 2113
630 2113 -5609 -2192 539 -1015 1398 -5031 -4628 2366 4248 -5385 -5848 1161 3932 743 -8145 -1985
646 -1985 5494 1108 -7947 -547 3539 -1205 634 -3278 -2206 3259 4001 -3863 -2922 1452 3740 2194
662 2194 -6271 -19 6744 2428 -4946 -114 5271 3619 -7 -4647 3063 5052 929 -2314 580
677 580 1691 1790 3147 -2670 617 3786 2683 -2510 -670 3092 3380 -1176 -5524 3582 3306 -2291
693 -2291 -2279 1745 269 -435 584 -2573 1370 -108 -1080 -2393 -1180 629 219 -2246 -3854 2244
709 2244 -406 -2412 -2038 -74 -162 -1083 -2136 -3284 2673 -565 -3437 -1553 1350 397 -1940 -1556 -814
726 -814 2394 -2020 -1277 -55 164 1061 -79 -1194 -752 5004 85 -1785 -444 2653 2233 -907 -590
743 -590 887 3722 -691 -47 1334 2489 1746 -509 -83 1090 3837 -322 -158 33 1592 2018 -207
760 -207 -656 -40 3224 -898 -921 -72 2012 770 -2169 -359 1006 1566 -1850 -168 -662 -347 454 -1726
778 -1726 -1403 -1250 757 -1990 -1283 -1034 105 -142 -2552 -957 -921 13 -2047 -504 -1190 -461 -345 -1790
796 -1790 197 -507 87 -2116 27 -247 -46 -164 -1015 442 -742 1101 -88 1019 -33 792 993
813 993 -662 1277 848 1091 -1064 1400 1184 1145 476 264 2301 63 731 632 2017 -86 800 1399
831 1399 298 1200 393 1875 -591 634 582 869 -124 -777 1527 -33 -398 -676 1921 -974 -1306 89
849 89 -512 -557 -1321 480 -1377 -321 -1245 -214 -333 -1896 -70 -522 -872 -2560 333 -483 -2053 -466
867 -466 -143 -917 -1702 757 -1208 29 -957 -959 159 -435 -345 -320 1411 -1535 425 868 285 -415 476
886 476 1423 -993 1262 424 1331 740 428 582 1484 1239 -1118 2450 585 -208 784 2758 71 -333
904 -333 2528 213 408 381 1249 -81 601 -350 -33 2040 -1858 265 1793 -490 -2006 2170 371
921 371 -2703 1250 118 -1329 -1475 1293 -812 -573 -1139 -1090 1596 -1713 -2451 114 866 -4072 -540
938 -540 1457 -2666 -858 538 -985 -2453 747 -345 -1230 -1218 -320 999 -1340 -746 -323 2131 -1742
955 -1742 -1902 2180 1249 -1738 -619 2555 -1465 826 1439 -484 -384 1440 1751 -612 1314 317 1913
972 1913 995 -739 158 2949 752 -2350 3372 768 -791 1361 1128 -717 1295 1091 -1743 2114
988 2114 -30 -208 51 171 -631 1050 933 -2802 702 1195 -646 -2009 356 -495 -853 -174 -2750
1005 -2750 426 160 -850 -1295 375 -853 -1294 -132 -1683 -454 -1214 118 -2189 -583 965 -1015
1021 -1015 -1034 -644 715 -143 -83 -2260 475 1766 -1536 -990 140 1507 -470 973 -388 -142 1693
1038 1693 859 -1006 -625 1989 388 1269 -1073 748 3590 647 -1025 926 2774 -703 370 -578
1054 -578 1006 1896 213 -645 -153 2478 1038 212 -1587 814 1901 -230 -2086 -1126 2723 -102
1070 -102 -1215 -1823 1145 1456 -1289 -1479 -520 1193 -1448 -1303 -1775 593 216 -1968 -1076 -794 1018
1087 1018 -503 -1587 -2018 1356 163 -2075 -803 -117 1395 -1729 -1469 -488 1527 -450 -2135 343
1103 343 773 957 -1110 -392 -30 1954 302 -1475 874 877 1373 -603 -435 975 2687 -502 -1677
1120 -1677 1291 1620 1235 -1513 504 2093 2239 -722 -1228 1933 1702 946 -1702 123 914 2058 -423
1137 -423 -1822 1268 1390 1130 -1762 -685 1267 1594 -2021 -2036 1384 563 -218 -2403 -470 1051 515
1154 515 -1975 -1562 399 -216 -39 -2632 -1116 368 641 -1851 -1746 686 668 -17 -3195 -442 1050
1171 1050 12 -2139 -1174 1056 -233 168 -1370 43 769 653 -843 -618 650 808 1299 -1686 907
1188 907 1673 618 -756 564 1839 752 275 -733 1744 1280 309 -155 955 1518 274 750 -668
1205 -668 1327 983 -153 -834 677 1489 -44 -191 -988 1971 758 -1390 -681 697 674 -1029 -809
1222 -809 -1005 1238 -675 -1446 -973 369 763 -1208 -1215 -1227 1375 -610 -1953 -1342 -42 574 -1452 -1105
1240 -1105 -904 1641 -658 -1666 -734 239 362 -1239 -1085 -389 1332 -869 -875 -222 485 792 -459 -187
1258 -187 -40 1647 50 -163 43 1134 1378 -125 258 230 2119 -195 -104 986 839 1018 -51 522
1276 522 542 1419 -85 577 431 522 930 -150 502 331 1227 -622 261 165 177 92 -1051 282 -15 80
1296 80 -1054 107 55 -494 -10 -964 165 -682 184 -1155 -466 -249 -486 -420 -1593 -38 -739 -94 -1538
1315 -1538 -358 -56 -619 -664 -874 488 -480 -129 -645 97 184 -376 -368 -786 468 -655 369 -331 368
1334 368 631 696 363 -173 1286 -129 669 -106 587 172 363 366 48 1468 -24 762 396 653 475 661
1354 661 540 -9 1112 391 642 -335 714 329 43 318 -411 402 -339 -394 -452 515 -290 -250 528 -670
1374 -670 159 -415 10 -950 -382 -810 -1011 -606 -799 -58 -875 -144 -1047 -37 -360 -1030 60 -601 -668 -669
1394 -669 330 -1286 157 -4 -479 147 -357 174 -347 294 -458 207 150 -121 188 245 775 -310 1307
1413 1307 214 472 422 140 192 394 1033 -352 1154 370 810 441 554 780 70 871 -107 707 486
1432 486 420 24 791 157 -314 912 -530 301 163 34 -258 245 294 -750 47 -664 -54 -784 -109 -706
1452 -706 -283 337 -940 -128 -434 -334 -728 -162 -1157 -604 -394 -1088 -193 -754 -369 -734 -74 -376 -463 -57
1472 -57 -412 170 -414 521 -657 191 315 -552 262 -169 110 -221 579 -56 291 214 168 512 476 1005 -30
1493 -30 978 478 566 301 42 243 720 583 -656 941 271 734 427 49 761 429 370 -482 680 111
1513 111 318 -109 -23 253 -444 316 -888 247 -21 -310 -842 -313 -7 -329 -494 -1361 693 -135 -331
1532 -331 -866 -480 -142 -676 -851 -1116 -43 -583 -298 -983 -315 414 -437 -106 -851 181 -172 -144 -749 361
1552 361 179 -604 9 -99 889 -359 90 -138 177 648 -213 255 218 1345 97 638 -102 865 1192
1571 1192 -209 126 173 774 -189 185 185 851 591 160 859 390 929 -176 359 355 309 99 -371 -71 -145
1592 -145 682 -740 -253 -8 -66 -312 -910 -342 -144 142 -941 -488 -363 65 -409 -1006 -281 -552 357 -1191
1612 -1191 -446 -489 102 -432 -910 -163 -245 410 -1183 -291 -133 262 -286 -1076 178 309 604 -821 -20
1631 -20 253 822 -70 -803 439 387 1158 -646 102 889 1298 220 -572 721 758 838 -388 -6 837 1050
1651 1050 159 -312 861 668 572 -699 242 282 631 -276 -472 783 486 470 -710 173 393 344 -672
1670 -672 -798 781 37 -64 -1269 304 73 -254 -706 -920 111 -517 -196 -1051 -99 -220 -314 -605 -554
1689 -554 421 -670 -546 -1011 92 -269 -812 -820 -304 653 -297 11 -509 871 298 -489 -502 -38 608 -463
1709 -463 100 -415 799 587 5 31 708 1049 73 140 -7 1194 528 -210 245 813 983 -118 359 -52
1729 -52 1048 367 -275 -208 473 800 -375 41 -92 1142 247 -249 -171 -10 222 -529 -418 -614 639 -244
1749 -244 -491 -406 24 202 -798 -269 -724 510 -520 -795 -552 -319 289 -793 -458 -812 29 -817 -448
1768 -448 -43 -93 87 -765 -118 -78 476 -506 -53 88 -152 341 -381 375 -192 455 -120 112 320 216 454
1789 454 -189 709 163 625 3 354 578 419 591 106 790 424 486 -268 247 630 4 532 -353 492
1809 492 449 245 -376 344 399 -62 -111 -727 356 59 78 -725 41 23 -258 19 -726 210 -346 76 -1066
1830 -1066 -464 3 -584 -206 -768 -105 -470 -229 -835 -76 -119 -615 17 -526 174 -351 87 -418 -4 257
1850 257 -253 -156 -253 402 -114 429 -299 93 501 124 354 3 523 -188 369 11 516 479 528 360 280 879
1872 879 -126 716 260 440 215 318 115 138 751 -181 454 104 265 23 -137 266 -212 502 -26 -130
1892 -130 -164 18 -187 -349 322 -555 -125 -692 -237 -477 -502 -456 -349 -119 -782 -212 -755 179 -369 117 -71
1913 -71 -707 55 -553 -34 -300 -62 -278 -121 -127 -179 310 -354 339 -457 83 -234 170 225 1 235 2 578
1935 578 -227 433 -155 98 510 176 712 375 473 338 838 68 377 327 151 225 -2 716 -481 202 170
1956 170 76 128 300 82 56 423 -644 239 -25 -71 -93 -121 193 -235 89 -619 -269 -639 -359 -584 -560 -56
1978 -56 -633 -79 -690 115 -364 -299 -562 -127 218 -796 26 -669 -127 -280 21 -235 -407 213 -42 -204
1998 -204 -491 286 -230 396 15 -111 391 18 413 -65 236 -154 345 244 299 679 -183 704 167 819
2018 819 94 288 329 76 409 -25 386 32 777 31 275 498 30 461 -16 357 -197 219 -238 497
2038 497 60 -21 199 -249 146 -572 -125 -347 -199 32 -50 -307 -307 -91 -420 206 -289 -16 -445 -681 -277
2059 -277 -428 -450 -447 152 -343 -252 -663 102 148 -354 -103 -305 220 -449 -236 -332 11 225 66 320 -353 430
2081 430 -107 -2 277 243 559 -126 246 95 707 85 339 225 477 632 -193 454 60 785 205 244 268
2102 268 266 473 -200 159 6 697 -101 59 9 355 277 -277 305 75 181 -537 -81 -134 25 -237 -623 87
2124 87 -271 177 -783 -383 -386 -369 -555 -728 -141 -390 -80 -850 -199 -316 -31 -338 -650 112 -333 152 -494
2145 -494 -146 308 -105 -36 -276 224 19 182 -317 330 246 204 203 9 741 -78 494 -221 415 418 398 351 -60
2168 -60 477 219 371 -167 436 422 296 26 -24 616 61 387 -103 523 -101 -189 169 7 488 -245 214
2189 214 -291 -111 49 -347 -224 -185 97 -370 -65 -442 60 -236 -446 -150 -244 208 -518 -194 -477 56 -349
2210 -349 -483 -492 -214 286 -386 -320 -475 191 -168 -421 -387 -249 391 -378 -152 -524 231 -49 -247 -73 176
2231 176 357 0 260 13 529 272 -38 -23 361 661 -192 308 381 544 47 -9 436 302 626 -181 198
2252 198 -121 460 -11 68 46 -177 554 -246 -132 -96 357 -143 -186 75 88 142 -445 -111 -299 82 -249 -192
2274 -192 71 -336 -14 -738 -112 -334 -71 -428 -678 -116 -192 -113 -680 -124 -201 41 -137 -330 89 -135 256
2295 256 -433 142 -19 266 -148 -145 71 -15 131 -395 503 66 358 -164 187 589 176 362 -172 819 59
2316 59 516 -24 72 388 237 324 -216 470 93 375 -80 406 205 217 371 -184 518 170 262 -119 37 241
2338 241 19 101 -313 134 -208 25 -300 -224 -7 -624 78 -365 -88 -519 -325 -337 -180 -276 -416 -133 -725
2359 -725 -25 -241 -127 -310 -123 -496 -325 65 -331 67 -406 -91 -79 -224 79 -600 144 -167 224 28
2379 28 -10 111 293 74 -40 194 35 450 24 231 410 459 318 218 323 263 744 -233 432 -17 -59 462
2401 462 32 322 -11 219 179 430 -73 172 -89 -342 546 -113 289 -104 178 -127 -41 -4 -341 75 -456
2422 -456 218 -519 -124 -294 -301 -70 -552 -28 -303 -223 -389 47 -195 -122 -481 -377 -170 -140 43 -205 94 -128
2444 -128 -70 -208 -212 194 -280 179 -396 360 173 37 277 -18 187 230 414 0 377 -4 449 89 -85
2465 -85 551 58 481 23 299 15 302 399 2 344 -30 498 27 376 29 183 90 440 373 -399 465
2486 465 -211 158 -122 65 -206 -472 181 -440 2 -353 -295 -312 119 -10 -379 78 -437 208 -444 -75 -300
2507 -300 -185 -176 -259 -438 -359 36 -356 64 -301 -224 -146 -196 -15 -147 43 -470 114 -155 137 -7 43 406 -180
2530 -180 434 64 317 85 521 201 -18 254 -85 396 -122 446 97 285 244 196 221 243 502 -55 632
2551 632 -85 66 14 -53 476 -306 285 -136 168 -46 -70 -6 130 -28 -468 285 -356 86 -268 -309 -99 -376
2573 -376 -100 -491 -124 -509 -51 -291 -402 -281 -129 43 -300 -23 -397 -82 -272 -110 -144 -52 171 -308 88
2594 88 -459 -61 20 -124 -155 -210 14 -224 57 -171 237 48 238 279 86 363 -65 520 -358 276 323 445
2616 445 349 -7 530 -194 511 -89 271 0 225 334 173 290 20 97 -196 472 -329 74 -102 -134 -98
2637 -98 -320 -14 -216 61 -391 -121 -222 -281 -135 -509 -52 -295 108 -445 -210 -208 -449 -140 -628 -57 -300
2658 -300 -101 -431 -69 -99 -141 -41 -415 96 -186 116 -230 -2 -16 -185 -159 -184 3 -172 131 -60 174 204
2680 204 61 -79 145 219 33 255 -15 423 322 166 244 213 492 107 419 263 292 108 109 132 49 504 -119
2703 -119 308 109 263 26 115 50 -194 306 -51 27 23 59 157 -276 -57 -83 165 -306 -189 -330 -34 -315 -625
2726 -625 -192 -418 23 -387 -361 -286 43 -73 -427 -292 -233 138 -445 -3 -280 -71 -3 -400 56 -163 11
2747 11 -324 -25 -186 174 72 -220 85 -61 480 -51 87 128 356 243 168 435 -48 203 -206 166 65
2768 65 335 89 174 380 219 349 -130 149 60 72 68 171 75 -31 136 -98 260 -68 101 -95 -111 14 -138
2791 -138 233 -325 169 13 -21 -85 -56 74 -83 -279 -594 -135 -436 -11 -701 -172 249 -21 50 -492 56
2812 56 -379 139 -232 -409 171 -143 35 -584 102 -398 -5 148 -200 -58 232 314 -86 356 -120 276 -86
2833 -86 132 86 297 264 -99 295 166 186 222 122 593 68 452 159 350 66 146 23 84 180 50 295 -24
2856 -24 319 85 344 -285 -64 272 -231 -76 -164 25 -278 -294 -96 -61 -58 -358 -220 -300 -103 -283 -85 -187
2878 -187 -213 -217 -561 -97 -318 -37 -84 26 -96 -382 -247 -265 -136 -170 77 -399 34 -191 62 60 -135 111 -84
2901 -84 283 59 70 -88 95 236 -169 667 1 327 -53 392 369 89 274 93 379 66 505 -130 382
2922 382 194 355 261 -224 454 101 286 -23 403 -343 108 38 9 120 -325 123 107 327 -53 62 -296
2943 -296 -424 -21 -471 79 -323 -86 -152 -100 -51 -237 20 -293 -138 -219 3 -268 -272 -145 -255 392 -307 147
2965 147 128 -34 -118 -62 -46 -112 79 -160 223 -223 195 87 -43 155 88 -1 -7 414 -114 369 230 140 184 13
2989 13 283 194 294 -99 135 161 196 129 52 262 -159 267 101 289 120 145 362 -148 -90 -211 3 -115 -117
3012 -117 -36 10 -66 -87 -22 -416 69 -83 -20 -292 -249 -161 -265 -82 -294 253 -363 -200 -324 -141 -13 -247 -252
3035 -252 -227 14 -403 21 -135 -29 -95 -321 -89 -309 -5 -473 135 -122 204 -12 64 181 -146 332 29
3056 29 144 86 -123 184 99 389 157 131 -36 434 218 260 280 -21 362 51 361 91 319 -79 264 128
3078 128 -81 170 -143 174 31 150 -228 -15 -168 -237 57 -325 24 -62 203 -370 -179 -114 -282 9 -338
3099 -338 233 -392 169 -478 -124 -103 -150 134 -450 -316 -393 -65 -263 -173 68 -222 25 -212 78 -183 17
3120 17 -355 334 -95 -249 226 -111 187 192 227 37 -25 9 221 194 8 659 7 390 208 276 235 56 568
3143 568 -51 295 -204 293 91 465 302 143 476 -92 31 -116 -241 -38 85 171 -223 135 -227 237
3163 237 -88 79 -84 -196 -63 -203 184 -247 58 -93 -37 -50 -133 -268 -238 10 -360 -98 -432 47 -472
3184 -472 -234 -92 -296 -6 -332 193 -175 153 -40 -212 154 -105 -207 -209 337 -47 168 108 69 -43 -290
3205 -290 133 -5 216 86 285 332 380 208 183 320 -173 262 88 102 258 273 329 159 243 -90 339 68
3227 68 348 111 156 219 -102 205 -130 197 -297 -40 -316 134 -122 -381 -167 -153 87 -260 83 -430 218
3248 218 72 -139 -142 -266 153 -338 -102 -303 -86 -121 -197 -143 -375 -142 -470 -272 -316 -229 -3 -35 -108 -110 67 -206
3272 -206 32 79 85 -77 -92 157 67 219 254 144 133 188 278 164 85 74 258 -171 310 -4 286 201 -9 260
3296 260 200 379 -128 165 38 236 226 99 304 50 207 32 -115 -261 -129 160 -218 -205 -169 -133 -207 -9
3318 -9 -272 -103 40 -484 -130 -205 -251 -577 -211 -23 7 -191 -361 98 -383 319 -148 -38 -238 -172 -253 -242 179
3341 179 -149 55 -258 220 -122 -62 -59 -6 135 69 111 -4 392 62 311 67 -38 155 -269 339 -115 -174
3363 -174 94 165 199 265 208 146 232 7 215 -94 111 27 -147 138 74 206 -245 172 46 160 74 -48 58
3386 58 -168 -18 -242 207 -207 156 -104 6 -48 -234 -129 -252 -134 87 -54 -177 -227 -149 18 -172 -433
3407 -433 -219 -510 -178 -259 -79 -49 -274 210 26 -27 -249 -138 -38 80 143 -314 116 -204 26 -178 202
3428 202 55 40 229 -160 339 -235 196 212 461 -92 198 156 44 386 -93 138 0 236 137 75 192 73
3450 73 282 105 223 85 96 -129 130 16 -143 393 -103 81 -202 -116 37 -242 -26 -389 -11 -267 -14
3471 -14 -500 -40 -59 -281 33 -165 -70 -310 -29 -269 -153 -196 -154 -70 -511 -147 -278 -43 -143 -226 -206 -181 150
3494 150 -205 -57 -41 147 -47 10 -181 -140 191 -206 259 -275 251 -31 325 157 -6 92 -50 328 -173
3515 -173 358 -2 245 112 223 154 -114 389 -75 213 -81 62 -191 27 369 -140 252 -441 -44 -183
3535 -183 306 -19 23 -67 -22 -19 -163 328 -228 -24 12 -115 -107 -378 -124 -299 8 -63 -121 -293 -338 -139 -53 -230
3559 -230 -131 20 -149 176 -239 -283 -130 -218 -114 -250 -71 -145 226 183 235 15 116 500 -194 166 -34 200
3581 200 -39 216 225 -147 88 112 447 -96 254 -26 22 83 117 430 58 176 36 32 218 203 74 62 202
3604 202 -34 221 -261 168 -147 -202 -33 52 -53 -115 226 -460 -39 -33 -257 -200 -233 -126 -227 185 -363 126
3626 126 -227 -284 -118 -146 -130 -444 -39 -165 -80 -30 59 -29 -195 -276 -287 -127 -161 84 19 124 258 16 227 -130
3650 -130 195 60 240 -282 -49 122 -6 295 -91 218 -30 475 -88 -96 271 59 23 115 359 28 238
3671 238 82 -26 -8 -85 -4 -188 122 156 115 -123 -116 193 -192 304 -234 -4 -112 -55 -335 -352 -122 -17 -137
3694 -137 -324 160 -58 -120 -149 -357 -95 -227 76 -80 154 -273 114 -95 5 -372 -263 -87 -104 -20 -78 -76
3716 -76 -219 -4 -58 94 287 92 -5 190 -37 84 -284 91 12 248 -70 251 172 86 97 -6 203 34
3738 34 383 54 531 219 329 217 120 111 40 235 -83 363 39 206 -113 -12 -86 -38 236 -305 191 114 139
3761 139 -29 -174 23 -78 -111 -223 -189 37 -270 -382 -29 180 -240 -24 -101 20 -132 -122 55 -82 -174 -112
3783 -112 -49 -456 14 -194 12 -282 -185 -125 -111 -96 -118 -119 -69 29 -34 -47 1 -113 -120 -104 96 -12 -136 185 50
3808 50 189 57 305 109 54 -37 284 -67 -106 226 70 312 -72 231 -67 199 -34 147 52 122 16 7 544
3831 544 32 155 164 75 -107 2 -249 12 -74 -310 11 -257 -230 247 -192 69 -164 -54 -236 63 -64 124
3853 124 -83 -205 -109 -202 -70 -223 5 -121 -28 198 -53 -124 38 77 -223 -6 -203 -18 98 193 190 -253 256
3876 256 31 -34 15 94 101 5 208 -47 150 95 180 179 178 91 -139 286 211 177 -55 225 -21 126 262 -28 119
3901 119 -44 -66 -11 34 -32 32 37 -168 104 -184 28 53 -122 -80 -170 -161 -180 -62 -214 92 -165 -122 -111 -97 -27 -325
3927 -325 -149 -200 -127 -153 -81 -82 -187 -187 -75 122 -231 33 -116 28 315 157 -48 -191 129 267 117 -53 248
3950 248 27 -89 39 125 200 -11 168 7 -247 76 250 43 -6 203 -151 94 -87 207 -105 86 -21
3971 -21 -12 232 -141 122 208 39 29 -148 -48 -68 244 -287 238 -153 55 -182 -105 -25 -211 55 -313 -171 -68
3994 -68 37 193 31 -242 -290 92 -493 8 -205 -57 -285 -200 12 -176 -132 -261 -152 -208 58 118 -214 8
4016 8 60 -100 200 -216 -63 -16 387 165 -172 -117 -118 -256 117 -76 213 299 175 -59 151 223 1 214 203
4039 203 20 -39 247 -47 -37 -2 1 280 176 203 158 141 172 -88 241 -179 55 -171 106 48 172 291 138
4062 138 -29 -234 -184 -422 -120 -219 -6 69 -193 146 -436 -92 -130 203 -110 -41 -195 -258 -165 -518 39 -417
4084 -417 -184 -414 -76 -24 173 -27 -97 29 -45 -90 -56 -22 14 102 12 -258 304 -105 162 106 60 -25 143 240
4108 240 16 291 11 158 65 93 112 63 126 -67 328 12 316 84 -237 205 -135 77 -158 93 159 31
4130 31 -137 50 -79 -53 158 -25 98 -135 201 -127 32 16 -251 -232 -133 -157 -176 -94 -122 50 -317 -84 -105
4153 -105 -102 -54 -43 48 -126 2 -343 -273 -113 -408 10 -151 -92 8 17 -38 33 23 -62 192 -166 -121 -38 -144 185
4178 185 75 97 255 248 116 41 46 98 67 101 121 53 146 -117 227 110 98 110 112 36 207 212 -93 178 -176 216
4204 216 -101 -11 37 -63 -49 117 56 -224 19 6 7 110 -68 23 -70 -218 -91 -348 -77 -94 -197 -133 -52 77
4228 77 112 56 -94 -303 -41 -9 -166 26 -82 -104 8 -5 146 -55 32 -26 176 -88 133 -151 157 -83 -26
4251 -26 287 77 -35 11 215 112 43 54 93 145 132 382 111 224 102 218 119 -59 129 -10 139 10 117
4274 117 -101 161 -50 154 35 -225 -16 -125 -59 -104 -1 5 -59 -87 -105 -4 -302 -85 -78 64 -22 -101 34 -87
4298 -87 -272 -224 -276 -172 -22 -17 -173 58 -68 24 -65 69 50 -157 -121 -47 -86 -220 203 -310 -100 -144 54 -39
4322 -39 -2 181 144 -52 152 60 -109 262 177 -80 19 150 211 -41 112 -81 179 126 84 134 -104 79 -141
4345 -141 49 73 247 65 160 207 102 192 -85 106 -120 135 71 -353 105 -84 98 109 -81 -3 -171 61
4367 61 -234 -89 -193 -104 -165 -166 -120 -52 -120 51 -129 -76 106 47 -73 -260 55 1 -215 210 -75 139 25 -143
4391 -143 -31 -163 89 313 -137 -24 140 -108 127 58 149 -10 95 83 301 115 32 114 9 110 304 176
4413 176 88 132 73 15 -27 4 -13 33 267 314 56 336 35 282 15 93 52 -238 -3 -228 -82 -305 65 -335
4437 -335 -94 -95 -23 -20 -185 -41 -317 65 -65 122 -28 -93 84 -159 -65 -290 -304 38 96 -230 -49 27 -177
4460 -177 338 -46 53 -243 305 -241 -335 -151 -57 57 -33 -29 152 198 -79 112 69 232 243 -76 369 151 217
4483 217 195 183 120 -186 288 176 414 -160 225 151 103 100 240 58 -17 35 12 -148 -70 56 -148 41 264 -93
4507 -93 80 109 -40 7 22 -20 -1 80 -258 162 -253 243 -182 -4 143 -45 168 -410 32 -43 -21 -226 -250
4530 -250 125 88 -180 -49 -6 -352 81 -61 -5 161 -43 53 18 180 -155 -21 -1 145 65 -65 292 170
4552 170 434 76 113 -65 245 -94 22 180 88 233 -57 190 122 21 -64 -134 84 81 309 -95 144 259
4574 259 59 -54 171 -112 -131 360 -92 -3 -182 15 88 -256 49 -63 140 -214 -141 -186 -82 -47 3 -221
4596 -221 -169 130 -159 -56 -213 -42 105 -463 83 28 -117 -184 18 -114 5 -123 -73 190 -85 -93 46 170
4618 170 105 240 -77 -45 94 -99 -102 -23 37 -72 9 233 -5 141 25 249 25 166 126 124 165 114 166 -1
4642 -1 14 -54 -64 289 36 23 -90 197 -47 285 167 -94 -99 -120 -76 155 43 -73 210 19 -87 -183 -43 11
4666 11 -63 -119 -123 71 -227 -39 -188 -321 -287 -153 9 49 -138 -121 63 63 89 -53 32 -9 -35 54 -50 -1 -31 -82
4692 -82 -49 -89 179 -15 257 30 -46 -56 358 177 319 -121 95 32 23 141 133 23 -79 85 -69 -82 288 -107
4716 -107 -21 -32 230 130 173 79 -130 -22 -67 220 -14 -97 -144 30 102 -144 130 -22 54 -149 -9 8 -165
4739 -165 52 -170 -71 -31 -200 -30 232 -58 -24 -241 -58 36 -132 -149 -87 -270 168 -116 -48 -59 -42 -90 -95 -56
4763 -56 60 -249 95 299 135 -113 -129 28 -62 190 2 173 -141 -140 61 108 211 -68 -75 236 -8 42 -33
4786 -33 -107 26 11 -104 138 278 111 90 -131 -82 20 130 -404 230 -190 -92 78 253 105 -161 50 -89
4808 -89 -147 43 -188 -213 60 190 -9 -104 -10 -11 -29 -110 2 -193 -3 74 -135 -180 -82 -60 63 41 -278 -98 -5
4833 -5 -86 -176 -22 225 -257 123 -70 61 -51 105 -247 -175 81 86 61 -12 117 71 76 88 -30 193 154 105 133
4858 133 326 142 1 163 146 41 -133 33 30 153 -110 170 -37 -51 -72 -49 203 17 134 10 10 -23 88
4881 88 -17 -91 -18 -532 28 -223 -167 -88 53 56 -96 -105 -64 -172 -330 29 -137 151 -24 -254 -44 -310 196
4904 196 -260 -182 -222 -166 145 -50 38 92 117 -241 43 41 -105 -157 -141 -33 40 153 156 43 151 -23 134 -45
4928 -45 -49 70 54 166 132 -61 171 110 82 42 -249 71 -109 4 -244 382 -110 -90 -135 -89 202 80 -39 44
4952 44 -16 -94 107 86 -74 52 45 116 -94 48 -44 -39 -123 -128 44 -122 43 -51 -41 -123 -257 -129 -36 30 -162 -203
4978 -203 70 38 95 -146 104 -189 -56 -283 85 -218 81 14 -321 70 -118 6 -32 -170 5 -61 123 69
5000 69 252 51 169 16 147 -71 33 138 -18 157 -9 186 95 226 -62 90 -112 321 -35 43 122
5021 122 141 267 89 107 -98 -36 -171 -198 152 -64 338 -152 155 0 -20 -48 -119 -13 -302 164 -228 77
5043 77 -344 -185 -21 65 -82 23 49 -221 80 -105 -92 -25 -35 -111 -227 138 52 35 -36 66 -164 -71 -148 -32
5067 -32 124 -61 195 345 -84 -243 -95 315 207 343 140 8 -192 -98 209 -58 -97 38 79 5 130 17
5089 17 181 70 150 88 -150 -55 78 -105 -293 -103 -22 -28 -240 -66 129 -161 -120 -68 128 104 35 -60 29 -2 -118
5114 -118 96 -85 -203 -78 -35 221 -165 -148 -138 60 -246 -31 -53 107 59 25 -79 -29 72 58 75 -44 -98
5137 -98 26 50 201 139 133 -146 55 -144 0 167 -274 -79 118 297 146 174 189 177 215 -137 294 -117 296
5160 296 -28 108 219 58 156 26 157 105 1 119 37 56 -58 94 302 -178 -248 459 -7 146 -77 69
5182 69 14 -309 339 -55 -84 -146 -71 -69 -44 60 -104 219 -166 -97 -98 -55 83 7 52 -142 58 -169 -146 -79 221
5207 221 -61 -7 76 -11 -53 -75 -118 -145 38 12 -23 -33 58 -85 -159 184 181 -132 37 37 185 -275 18 82 80 63 166
5234 166 208 60 -86 -3 31 -15 106 -26 -11 49 -338 -166 41 155 -170 126 22 62 -112 -84 -54 177 -10
5257 -10 -127 -43 -119 190 387 142 -20 -137 125 -92 -43 98 -133 -198 -177 -130 -291 -12 -332 -57 146 101 -125
5280 -125 -16 132 -98 -27 -58 58 5 90 -226 -157 104 -153 -93 127 360 39 112 120 15 90 101 65 127 49 280
5305 280 -97 153 116 120 -76 175 39 233 -182 -105 159 -87 147 2 189 -77 -97 38 -223 180 27 -57
5327 -57 171 112 21 234 -99 -136 -6 -318 179 -262 17 -41 55 -166 -136 -80 -400 -31 -256 -186 -182 108 -159 -36
5351 -36 -93 -146 49 -256 50 -143 -282 -53 220 76 -254 7 -180 65 -43 119 142 -8 221 -63 127
5372 127 -48 249 176 93 7 388 184 49 183 17 23 -82 204 57 235 -31 -185 -22 -207 -8 231 205
5394 205 24 142 108 -123 -35 10 -44 -218 -218 77 116 -34 -137 89 68 -218 -18 -151 -2 39 -10 -111 1
5417 1 -68 -44 -109 -88 12 -58 -221 -226 333 -108 319 68 -82 -8 -78 -106 1 111 22 25 -70 181 138 29 102 -42
5443 -42 -96 119 -103 104 74 52 187 109 132 314 73 72 202 39 98 157 -124 145 179 -73 63 60 -181 -24
5467 -24 -18 0 11 -66 -70 -26 57 -46 -147 142 -75 -17 236 -66 -188 -55 -139 9 -114 -51 -48 -86 -331 139 -83
5492 -83 -281 -35 65 16 -138 30 201 37 -164 -6 -26 169 91 189 33 86 -8 -223 4 -164 109 230
5514 230 -62 -25 -157 223 -185 76 241 16 135 -194 208 65 20 78 256 84 238 249 204 -54 4 -46
5536 -46 -15 178 187 118 130 62 24 120 4 -98 -62 -175 115 21 77 -121 -215 17 -56 -86 -206 14 -31 34 -13 -253
5562 -253 -90 152 -124 -147 116 -117 -92 45 -21 -86 119 227 72 -274 73 -165 33 -42 -60 -237 102 -56
5584 -56 -35 -33 144 67 -227 104 -15 112 33 166 -11 100 76 28 13 99 -13 166 159 57 34 330 81 59 202
5609 202 -3 138 173 82 -38 -29 69 -122 75 20 43 14 -11 -6 121 -58 152 -94 109 -63 45 -201 -41 -295
5633 -295 21 75 -201 -29 -27 -29 -203 85 -124 37 35 6 111 -70 37 -2 -98 21 18 -222 -175 -20 -47 52 -177
5658 -177 -82 86 -62 -9 -219 -54 62 -39 84 60 181 -46 330 211 -76 -88 -24 -25 74 49 -33 76 176
5681 176 -182 175 112 -144 -65 155 134 80 94 -38 -184 49 104 96 205 -122 127 -36 -126 172 169 65 154 161 77
5706 77 1 -116 19 204 -123 -53 -146 -46 -204 141 -252 108 119 24 -11 -174 31 -63 -124 -102 211 29 -226
5729 -226 -102 -5 18 -159 -156 -325 70 -97 -70 99 -110 -158 113 55 -206 -115 -262 299 -142 -209 48 86 53 197
5753 197 -3 -48 -19 206 121 -49 36 80 -157 323 -198 105 -38 -192 -26 -18 44 128 9 89 -8 -18 86 -95
5777 -95 5 -32 73 118 -7 -89 -66 81 128 -220 -103 -3 198 -79 -26 -323 40 -59 -66 -17 28 15 -320 107
5801 107 -187 -36 -118 -298 -175 -272 -36 -35 -45 -156 144 262 -134 70 -137 -33 -45 207 59 -132 225 -197
5823 -197 86 7 -21 -22 55 135 -50 118 -51 429 177 -63 -24 276 227 117 -60 191 -19 56 -44 -32 -90 6
5847 6 -151 -36 13 -1 -102 -25 -41 6 -91 -98 -59 -212 52 18 -10 -118 -52 -113 -138 12 -188 -233 -157 0 64 -47
5873 -47 -379 283 94 43 -101 67 127 -79 43 -311 -254 170 23 -140 36 175 113 -157 -39 77 163 256
5895 256 -62 73 -114 91 290 -281 226 99 -63 -211 171 74 -102 -73 125 104 -78 -68 -7 -21 39 -37 -9
5918 -9 -86 27 136 -399 259 -49 -7 2 -18 29 -250 199 -118 -52 -161 63 152 -233 -58 -76 83 32 -149 -74
5942 -74 -130 -329 -58 -59 7 -14 34 -140 -2 50 -99 54 -43 313 90 -32 137 114 -253 -60 -136 -2 154 -4
5966 -4 -89 41 -206 -72 -68 11 167 181 74 -113 -84 49 122 204 -83 23 -57 211 178 191 213 175 187 -147 -98 38
5992 38 -54 -44 -220 -302 119 -67 57 -89 226 30 84 -70 -25 131 31 134 104 -66 -136 -61 29 -6 119 -141
6016 -141 -56 42 144 -60 -192 -31 -224 -7 -52 123 -333 -254 72 -116 -27 91 -16 -100 -118 58 -108 -143 -108
6039 -108 124 112 16 232 -22 -26 133 246 162 -96 306 108 -253 -168 180 -3 -280 112 -171 77 -56 -71
6061 -71 -4 -15 4 110 50 358 -262 -171 -85 -14 -114 -156 32 -137 -49 30 64 -371 -46 -165 -145 -154 -117 61 68 110
6087 110 -73 -29 -50 -118 -30 -252 113 -177 271 -101 152 -33 121 -61 28 -41 -68 137 -71 -162 102 85 60
6110 60 -159 -61 14 -36 -26 88 -42 67 300 197 -157 -105 -23 46 190 235 50 -42 11 139 72 55 -248 -82
6134 -82 -217 -90 101 29 176 -93 65 124 357 36 136 38 -109 212 -117 -143 -132 164 -61 -109 -79 -23 -75
6157 -75 180 171 49 -136 107 -112 -345 101 -181 -7 36 -107 -130 9 108 -219 -246 -27 -102 -48 -78 89 -153
6180 -153 149 -11 130 61 -75 -49 -42 0 -123 12 -9 124 -5 28 -93 22 14 115 119 135 -72 127 181 95 -123
6205 -123 -30 243 -133 241 -284 -19 -214 -101 198 -131 -120 33 65 220 235 -248 109 163 -156 160 -227 114
6227 114 75 128 153 121 63 -11 -164 -126 -46 -295 82 -32 46 -243 -20 -170 91 -139 99 -154 -66 55 93 -236
6251 -236 -289 151 54 76 26 91 150 -189 55 -47 -72 132 -28 -130 -262 41 189 -109 98 -121 89 -80
6273 -80 107 -42 -68 256 -94 123 -219 -60 224 197 32 25 -304 -13 -64 68 -61 -111 115 -168 -6 -33 38
6296 38 -105 3 -56 98 94 -112 10 -197 -15 -203 -24 -133 -75 99 -108 96 -140 133 -111 -163 -217 34
6318 34 -64 -106 -162 -56 198 160 -171 -12 -91 -221 85 22 2 96 70 -23 31 -4 58 8 9 17 150 158 -89 30 181
6345 181 11 184 -17 -111 158 30 77 7 22 -65 -172 4 -99 224 41 59 -18 -64 -28 105 162 53 135 -212
6369 -212 -134 -27 -101 39 38 120 106 -62 189 81 -89 -105 316 159 103 -215 -14 109 101 65 -17 35 -212 168
6393 168 -73 -267 -173 80 -226 127 -27 -147 7 -7 -57 -139 108 37 119 29 -44 64 5 32 -19 56 183 205
6417 205 59 -35 189 19 -6 245 -110 34 -42 -123 14 284 158 53 134 19 133 167 14 -32 84 6 18
6440 18 -279 -180 -61 20 -203 -224 -57 -79 49 -30 76 -1 102 -55 -49 186 -199 11 -49 -122 90 -126 -142 39
6464 39 5 -226 2 -272 -168 -68 -20 73 5 -59 -29 -41 -86 77 -181 -328 143 128 -164 -28 11 -230 100 -137
6488 -137 -15 180 -24 -3 283 -73 -264 -17 72 -124 208 19 71 116 -18 9 242 92 149 302 167 -219
6510 -219 191 41 -105 317 -111 -166 140 32 -56 -101 30 -186 88 -341 -31 -211 -66 53 -177 73 -283
6531 -283 -19 62 189 -219 -19 -103 34 -62 45 -53 -86 115 -33 -34 -193 -124 -18 -212 20 172 -73 180 264
6554 264 178 -145 22 -109 -53 -45 208 62 203 36 123 125 -232 49 -58 81 201 -146 295 -178 271 100
6576 100 173 113 190 24 -35 50 192 135 -124 -25 -214 188 -146 -28 58 45 -338 198 -91 -71 -63 46 77 196
6600 196 -123 -96 -58 60 163 144 -105 78 -90 -242 -133 27 153 62 -306 118 -166 -22 16 -100 20 19
6622 19 50 108 22 -38 85 52 371 -89 -4 -10 92 -35 -23 -14 77 62 13 98 164 264 130 37 102 79 109 50 250
6649 250 -140 -29 383 249 151 -93 -51 -122 -119 97 146 48 -47 14 70 54 35 102 -332 75 -79 -37 -60 -184 189
6674 189 75 -24 24 -115 65 90 108 147 84 -82 190 132 84 122 -380 56 165 -180 -169 116 -313 -296 118 37
6698 37 -97 -10 91 -243 -88 26 123 -93 -1 30 -73 -85 -46 11 183 -193 135 174 -203 49 86 74 -194 -188
6722 -188 73 87 -58 215 -68 20 168 374 14 39 335 50 151 -61 -56 -133 -132 -125 51 -164 145 -103 -203
6745 -203 45 -195 -243 -47 -39 -351 -92 -89 -62 193 100 -327 -149 36 -38 -148 -80 -306 92 -149 105 147 -92
6768 -92 156 63 77 -203 112 -53 -60 -106 -73 214 -333 3 272 16 -187 81 16 49 253 -111 92 -254 -10
6791 -10 -16 -135 -65 140 155 69 188 -5 -136 -16 184 -79 87 -16 -206 387 -34 -178 87 144 -201 -93
6813 -93 22 -94 16 -134 48 -107 127 -153 152 -147 57 41 -96 -23 -179 0 -76 62 11 -165 153 65
6835 65 22 -233 -160 -276 60 -29 -144 49 -161 -195 4 -142 -15 -136 -50 22 209 -54 78 -321 221 -207
6857 -207 -109 86 197 48 -21 -148 -43 84 -134 156 11 51 -196 -8 119 -162 -252 32 -25 -108 38 -70
6879 -70 -94 79 2 67 -91 59 171 108 114 -46 -35 49 122 -22 76 -126 70 214 -43 31 430 -121 45 -18
6903 -18 142 103 97 -12 -10 -119 138 117 -71 252 -221 -63 -154 352 -177 39 -8 -151 -62 -249 28 70 -34 -86
6927 -86 -2 31 -51 16 82 93 -185 45 -83 165 -50 22 172 -92 -33 51 56 -19 297 -37 56 41 -133 37 26
6952 26 44 -64 113 23 -90 -129 -102 -163 173 65 95 82 -18 224 17 -17 209 -101 -32 14 107 94 -200 39
6976 39 79 113 -159 58 72 -125 4 171 151 -112 -183 -65 -44 -208 99 74 126 -121 140 -108 -56 177 -18
6999 -18 296 -42 210 72 74 85 -15 173 -42 -179 44 47 167 20 -216 88 254 166 122 -174 211 -32 -19
7022 -19 136 151 240 11 -290 264 -60 -40 129 83 -99 261 -7 87 48 234 163 -195 -173 128 -21 -92 108
7045 108 88 -37 -175 15 8 -200 -28 25 -118 -156 -141 -267 22 52 -74 111 22 -162 -36 90 87 46 143 -34
7069 -34 136 -154 0 77 -286 -32 138 39 258 345 -154 -24 130 6 -29 -146 -11 275 29 126 113 -34
7091 -34 75 219 140 45 -191 326 128 -42 -140 33 -3 74 37 -142 28 -71 -62 -49 -43 84 -166 -154 -7 45 170
7116 170 127 157 184 -54 -70 -68 -62 -1 10 112 -32 -223 -45 -235 98 -137 26 183 -174 -80 -135 -178 178 -80
7140 -80 -95 2 -166 -115 58 -133 -213 -186 -77 131 84 24 13 61 56 158 -58 -174 169 65 42 102 48 151 -79
7165 -79 41 45 -81 81 -155 64 284 92 -142 -99 -167 -117 80 96 -27 8 -60 96 130 75 -38 18 249 -57
7189 -57 -74 -4 42 10 78 35 -26 16 100 116 -60 134 93 -20 -67 -16 -19 15 69 58 -232 -127 172 56 168 -96
7215 -96 233 84 -115 71 -97 15 -72 -84 183 -173 36 151 -97 99 66 50 150 -196 -66 -33 -10 -48 135
7238 135 -6 -86 -8 26 167 6 -150 138 146 -102 108 -40 145 176 -64 153 -155 1 -59 67 -63 -241
7260 -241 234 34 62 -46 -207 -47 34 -11 -73 182 -139 -67 76 -29 182 14 211 -204 3 2 -84 47 -28
7283 -28 -139 -35 57 -195 141 162 24 -101 48 -90 -203 128 35 124 -64 131 93 9 180 61 -48 71
7305 71 141 -80 -247 -16 5 97 231 -84 -25 460 83 203 -26 -170 -42 66 53 18 47 -139 192 -258 15
7328 15 52 -21 -32 -112 74 82 12 -94 106 172 38 -255 -265 210 -58 -10 -130 -65 -83 -104 -90 -340 160 -181 27
7353 27 181 143 -116 -88 -29 -178 -60 80 25 2 -268 -7 -125 57 -192 207 201 165 34 45 -150 -63 -173 48
7377 48 -30 110 93 53 -170 209 -306 -96 -70 -51 239 -31 -41 -245 -18 168 -90 -32 385 21 174 -157 -192
7400 -192 -47 -141 246 -5 142 -35 123 -88 -54 131 21 186 10 -43 57 120 -129 2 189 -113 151
7421 151 -78 -45 136 100 141 156 -93 -130 41 -171 60 -119 74 3 76 -303 116 -238 80 -133 -246 84
7443 84 -179 -62 169 -128 -191 -29 -141 -40 -112 61 -91 44 119 221 133 -177 85 62 114 -263 -66 193
7465 193 221 49 65 -34 -110 53 -208 -199 182 -104 -231 -134 -19 79 -39 -107 74 283 135 -91 -25 -7 -66 80
7489 80 147 -6 -211 137 -81 -56 -62 -107 -139 125 -148 18 86 197 -30 -10 -1 -206 -6 46 -152 14 -99 31
7513 31 -59 -15 -34 84 103 -112 84 35 -40 63 -85 -228 132 -297 303 6 49 35 122 -136 56 -28 111 170
7537 170 126 160 120 -161 59 -208 -49 138 -1 19 47 -77 -70 29 296 -23 96 92 85 92 -44 -210 107 114 84 192
7563 192 -267 -66 47 111 -157 25 -98 17 74 243 211 -119 93 79 -10 58 150 120 88 58 -31 -138 -233 20
7587 20 -238 13 -61 -165 82 19 134 -135 -175 -97 -177 -98 -40 -147 -91 43 -74 -107 -53 -77 105 -44 -75 -99 -40
7612 -40 70 12 -113 191 36 -115 103 -82 154 41 -99 111 43 164 41 -57 -64 -112 -103 153 127 108 11 -65
7636 -65 -73 -42 157 -132 41 4 -170 37 137 87 9 -13 -60 -136 -160 122 -123 -93 76 -82 63 -144 -23 -8
7660 -8 -131 73 -350 -77 274 70 69 251 -62 5 -173 -137 33 -53 84 -59 155 -83 -189 14 329 227
7682 227 -161 -93 7 -117 119 228 -15 -83 -26 93 92 24 116 -183 74 74 -134 27 -145 41 -96 -94 67 -103
7706 -103 -128 10 -162 53 156 -25 29 12 69 -40 -97 83 50 -45 83 -28 -46 -9 -150 -108 134 51 74 -112
7730 -112 -66 -113 -80 -304 -96 -142 1 -28 75 -42 54 -120 -98 -91 17 -235 84 -252 -8 -33 102 91 -28 454
7754 454 -181 -69 107 146 -25 100 156 133 -180 99 321 160 164 -79 -60 210 89 276 -55 38 -181 -44
7776 -44 -126 8 -136 -195 -79 -6 133 54 -14 194 221 187 -139 99 246 40 24 -69 -48 -172 -97 9 -137 -43
7800 -43 -154 -63 -94 -126 -101 173 -15 9 -82 -79 -103 183 -78 104 -42 175 206 197 154 -206 258 126 -30 242 -44
7825 -44 137 -142 96 50 127 -49 169 -91 177 166 -7 -129 47 -53 49 153 -258 85 169 -117 -313 65
7847 65 76 71 137 130 72 -7 181 127 31 116 -166 -104 85 -171 -118 108 265 -100 81 157 -255 99 145 -38 111
7872 111 51 102 142 84 -112 8 56 -155 201 45 -41 -29 -263 -30 250 -125 -57 -3 -73 61 -56 -333 -13
7895 -13 80 195 -248 -26 -144 -130 197 1 138 109 42 -49 -79 -88 -193 32 31 184 236 -28 -19 -4 -155 -108 136
7920 136 -56 151 -12 -104 -251 -98 -17 168 -110 118 -168 -191 45 -118 97 177 -8 128 -144 171 106 -42
7942 -42 39 7 -2 97 -29 -61 227 -180 -115 -83 -108 36 136 -172 -79 -15 73 -228 155 137 -64 -59 13 18 77 59 66 -21
7970 -21 -112 23 82 24 126 220 13 10 -5 10 203 58 154 42 131 6 -190 -60 -54 30 193 55 34 119 0
7995 0 119 48 -217 -8 -104 -45 139 346 24 125 -46 -70 189 -75 159 -113 2 15 34 41 -20 -166 74 77
8019 77 -149 -92 -8 -93 -180 19 -130 -84 -178 -58 81 95 147 129 80 -11 -124 30 -133 -31 16 -99 -91 209 3
8044 3 -101 4 -55 214 191 138 59 45 99 10 25 -31 -69 70 297 275 115 9 130 69 -20 -141 103 49 38 -394
8070 -394 -109 -76 41 103 196 -38 -212 -36 170 128 41 121 -63 16 -34 -18 -157 134 144 182 -132 -114 -133 130
8094 130 126 -543 12 70 -137 226 -169 49 -45 -129 -76 -285 -49 50 26 -120 90 -41 14 56 70 174 -7 141
8118 141 -43 -20 -64 183 94 -21 410 43 -14 -136 22 -30 -13 23 39 -104 -295 73 -134 219 -203 -34 150
8141 150 -36 132 14 -99 116 -144 58 -109 -5 96 54 89 105 51 -104 168 24 -197 -219 -51 -119 263
8163 263 -73 -84 -83 -100 31 166 60 -59 242 177 182 28 8 -38 60 154 -98 -57 -198 323 57 -18 99 256
8187 256 88 -73 -35 82
8191H2
##END NTUPLES=NMR FID
##END=
