##TITLE=1H_Pr Am-NH2
 CDCl3, 8 sc, 
 5.08.2021
##JCAMPDX= 6.0         $$ Bruker NMR JCAMP-DX V2.0
##DATA TYPE= NMR FID
##DATA CLASS= NTUPLES
##ORIGIN= UXNMR, Bruker Analytische Messtechnik GmbH
##OWNER= root
$$ XWIN-NMR		Version 3.5
$$ Thu Aug  5 11:29:05 2021 Russian Standard Time (UT+4h)  she@DPX200
##.OBSERVE FREQUENCY= 200.131506
##.OBSERVE NUCLEUS= ^1H
##.DELAY= (6, 6)
##.ACQUISITION MODE= SIMULTANEOUS
##.ACQUISITION SCHEME= undefined
##.AVERAGES= 8
##.DIGITISER RES= 18
##SPECTROMETER/DATA SYSTEM= spect
##.PULSE SEQUENCE= zg30
##.SOLVENT NAME= CDCl3
##.SHIFT REFERENCE= (INTERNAL, CDCl3, 0, 15.7039)
##AUDIT TRAIL= $$ (NUMBER, WHEN, WHO, WHERE, WHAT)
$$ ##TITLE= Audit trail, XWIN-NMR		Version 3.5
$$ ##JCAMPDX= 5.01
$$ ##ORIGIN= Bruker BioSpin GmbH
$$ ##OWNER= she
$$ F:/spectra/data/she/nmr/H-F/1/audita.txt
$$ ##AUDIT TRAIL=  $$ (NUMBER, WHEN, WHO, WHERE, WHAT)
(   1,<2021-08-05 11:27:56.98 +0400>,<she>,<DPX200>,
      <created by zg, POWCHK disabled, PULCHK disabled
       configuration hash MD5:
       00 E9 B6 7A A2 85 ED C7 34 08 36 98 17 FE 4E 26
       data hash MD5: 16K
       20 DC 98 A6 14 D2 36 C8 43 E5 8E 3A 74 BB 1C 92>)
$$ ##END=
$$ 
$$ hash MD5
$$ BE 4D 4F 87 7C 9C 92 BC AB 73 8C 29 0D 24 0B D5
##$RELAX= 
##$RELAX= 
##$RELAX= 
##$RELAX= 
##$RELAX= 
##$RELAX= 
$$ Bruker specific parameters
$$ --------------------------
##$DU= <F:/spectra>
##$EXPNO= 1
##$NAME= <H-F>
##$PROCNO= 1
##$TYPE= <nmr>
##$USER= <she>
##$AMP= (0..31)
100 100 100 100 100 100 100 100 100 100 100 100 100 100 100 100 100 100 
100 100 100 100 100 100 100 100 100 100 100 100 100 100 
##$AQSEQ= 0
##$AQ_mod= 1
##$AUNM= <au_zg>
##$AUTOPOS= <>
##$BF1= 200.13
##$BF2= 200.13
##$BF3= 200.13
##$BF4= 200.13
##$BF5= 200.13
##$BF6= 200.13
##$BF7= 200.13
##$BF8= 200.13
##$BYTORDA= 1
##$CFDGTYP= 0
##$CFRGTYP= 5
##$CHEMSTR= <none>
##$CNST= (0..31)
1 1 145 1 1 1 1 1 1 1 1 1 1 1 1 1 1 1 1 1 1 1 1 1 1 1 1 1 1 1 1 1 
##$CPDPRG= <>
##$CPDPRG1= <>
##$CPDPRG2= <>
##$CPDPRG3= <>
##$CPDPRG4= <mlev>
##$CPDPRG5= <mlev>
##$CPDPRG6= <mlev>
##$CPDPRG7= <mlev>
##$CPDPRG8= <mlev>
##$CPDPRGB= <>
##$CPDPRGT= <>
##$D= (0..31)
0 1.2 0 0 0 0 0 0 0 0.06 0 0.03 0 0 0 0 0.0002 0 0 0 0 0 0 0 0 0 0 0 0 
0 0 0 
##$DATE= 1628148476
##$DBL= (0..7)
120 120 120 120 120 120 120 120 
##$DBP= (0..7)
150 150 150 150 150 150 150 150 
##$DBP07= 0
##$DBPNAM0= <>
##$DBPNAM1= <>
##$DBPNAM2= <>
##$DBPNAM3= <>
##$DBPNAM4= <>
##$DBPNAM5= <>
##$DBPNAM6= <>
##$DBPNAM7= <>
##$DBPOAL= (0..7)
0.5 0.5 0.5 0.5 0.5 0.5 0.5 0.5 
##$DBPOFFS= (0..7)
0 0 0 0 0 0 0 0 
##$DE= 6
##$DECBNUC= <off>
##$DECIM= 32
##$DECNUC= <off>
##$DECSTAT= 4
##$DIGMOD= 1
##$DIGTYP= 9
##$DL= (0..7)
0 120 120 120 120 120 120 120 
##$DP= (0..7)
150 150 150 150 150 150 150 150 
##$DP07= 0
##$DPNAME0= <>
##$DPNAME1= <>
##$DPNAME2= <>
##$DPNAME3= <>
##$DPNAME4= <>
##$DPNAME5= <>
##$DPNAME6= <>
##$DPNAME7= <>
##$DPOAL= (0..7)
0.5 0.5 0.5 0.5 0.5 0.5 0.5 0.5 
##$DPOFFS= (0..7)
0 0 0 0 0 0 0 0 
##$DQDMODE= 0
##$DR= 18
##$DS= 0
##$DSLIST= <SSSSSSSSSSSSSSS>
$$ [...]
##$SUBNAM2= <"">
##$SUBNAM3= <"">
##$SUBNAM4= <"">
##$SUBNAM5= <"">
##$SUBNAM6= <"">
##$SUBNAM7= <"">
##$SUBNAM8= <"">
##$SUBNAM9= <"">
##$SW= 20.0188882624521
##$SWIBOX= (0..15)
0 0 2 0 0 0 0 0 0 0 0 0 0 0 0 0 
##$SW_h= 4006.41025641026
##$TD= 16384
##$TD0= 1
##$TE= 0
##$TE2= 300
##$TE3= 300
##$TEG= 300
##$TL= (0..7)
0 120 120 120 120 120 120 120 
##$TP= (0..7)
150 150 150 150 150 150 150 150 
##$TP07= 0
##$TPNAME0= <>
##$TPNAME1= <>
##$TPNAME2= <>
##$TPNAME3= <>
##$TPNAME4= <>
##$TPNAME5= <>
##$TPNAME6= <>
##$TPNAME7= <>
##$TPOAL= (0..7)
0.5 0.5 0.5 0.5 0.5 0.5 0.5 0.5 
##$TPOFFS= (0..7)
0 0 0 0 0 0 0 0 
##$TUNHIN= 0
##$TUNHOUT= 0
##$TUNXOUT= 0
##$USERA1= <user>
##$USERA2= <user>
##$USERA3= <user>
##$USERA4= <user>
##$USERA5= <user>
##$V9= 5
##$VALIST= <valist>
##$VCLIST= <CCCCCCCCCCCCCCC>
##$VD= 0
##$VDLIST= <DDDDDDDDDDDDDDD>
##$VPLIST= <PPPPPPPPPPPPPPP>
##$VTLIST= <TTTTTTTTTTTTTTT>
##$WBST= 1024
##$WBSW= 4
##$XGAIN= (0..3)
0 0 0 0 
##$XL= 0
##$YL= 0
##$YMAX_a= 485469
##$YMIN_a= -618532
##$ZGOPTNS= <>
##$ZL1= 120
##$ZL2= 120
##$ZL3= 120
##$ZL4= 120
##$ABSF1= 10
##$ABSF2= 0
##$ABSG= 5
##$ABSL= 3
##$ALPHA= 0
##$AQORDER= 0
##$ASSFAC= 0
##$ASSFACI= 0
##$ASSFACX= 0
##$ASSWID= 0
##$AUNMP= <proc_1d>
##$AZFE= 0.1
##$AZFW= 0.1
##$BCFW= 1
##$BC_mod= 2
##$BYTORDP= 1
##$COROFFS= 0
##$CY= 11.3945322036743
##$DATMOD= 1
##$DC= 2
##$DFILT= <>
##$DTYPP= 0
##$F1P= 2.36226072786647
##$F2P= -0.459571619588291
##$FCOR= 0.5
##$FTSIZE= 0
##$FT_mod= 4
##$GAMMA= 1
##$GB= 0.15
##$INTBC= 1
##$INTSCL= 1
##$ISEN= 128
##$LB= 0.24
##$LEV0= 0
##$LPBIN= 0
##$MAXI= 10000
##$MC2= 0
##$MEAN= 0
##$ME_mod= 0
##$MI= 1.114404
##$NCOEF= 0
##$NC_proc= 0
##$NLEV= 6
##$NOISF1= 3.799351
##$NOISF2= 2.8
##$NSP= 1
##$NTH_PI= 0
##$NZP= 0
##$OFFSET= 15.70392
##$PC= 1
##$PHC0= -13363.87
##$PHC1= 23.20099
##$PH_mod= 1
##$PKNL= yes
##$PPARMOD= 0
##$PSCAL= 0
##$PSIGN= 0
##$REVERSE= no
##$SF= 200.130013532006
##$SI= 16384
##$SIGF1= 3
##$SIGF2= 2
##$SINO= 400
##$SIOLD= 16384
##$SREGLST= <1H.CDCl3>
##$SSB= 0
##$STSI= 0
##$STSR= 0
##$SW_p= 3612.71676300578
##$SYMM= 0
##$S_DEV= 0
##$TDeff= 0
##$TDoff= 0
##$TI= <>
##$TILT= no
##$TM1= 0
##$TM2= 0
##$TOPLEV= 0
##$USERP1= <user>
##$USERP2= <user>
##$USERP3= <user>
##$USERP4= <user>
##$USERP5= <user>
##$WDW= 1
##$XDIM= 8192
##$YMAX_p= 0
##$YMIN_p= 0
$$ End of Bruker specific parameters
$$ ---------------------------------
##NTUPLES= NMR FID
##VAR_NAME=  TIME,          FID/REAL,        FID/IMAG
##SYMBOL=    X,             R,               I
##VAR_TYPE=  INDEPENDENT,   DEPENDENT,       DEPENDENT
##VAR_FORM=  AFFN,          ASDF,            ASDF
##VAR_DIM=   8192,          8192,            8192
##UNITS=     SECONDS,       ARBITRARY UNITS, ARBITRARY UNITS
##FACTOR=    0.0002496,     1,               1
##FIRST=     0,             0,               0
##LAST=      2.0444736,     0,               0
##MIN=       0,             -618532,         0
##MAX=       2.0444736,     485469,          0
$$ Real data points
##PAGE= N=1
##DATA TABLE= (X++(R..R)), XYDATA
0 0 0 0 0 0 0 0 0 8 0 0 -8 8 -16 16 -16 24 -32 40 -48 56 -66 80 -96 112 -135 158 -184 210 -242 280 -321 365
32 365 -414 470 -531 599 -672 752 -842 940 -1048 1163 -1290 1430 -1582 1748 -1929 2128
48 2128 -2345 2585 -2847 3136 -3456 3812 -4213 4661 -5171 5756 -6433 7233 -8188 9353
62 9353 -10814 12705 -15264 18934 -24667 34921 -58823 232820 -151295 -594021 220020 407001
74 407001 -144088 -272152 181686 138838 -140605 -91158 98722 62586 32377 -51784 -156019
85 -156019 -2537 262367 55541 -283802 -103350 239792 75804 -167662 -23901 106929
95 106929 -48837 -84042 54523 55756 -28736 -19525 -50880 -61929 97053 129425 -129608 -183492
107 -183492 101144 161966 -86196 -110096 65532 25208 -85345 11198 79635 -19841 -59878
118 -59878 -14647 -11292 30632 79515 -40449 -136014 29705 135824 -38063 -96906 67062
129 67062 34010 -120575 17962 168454 -48051 -178054 73011 144352 -100863 -75033 151554
140 151554 18086 -190695 24896 215937 -30671 -185194 42012 133871 -43147 -56905
150 -56905 66589 13825 -67941 13666 60921 -3094 -6713 5004 -46725 -2339 100800 19348
162 19348 -109446 -13700 100800 -2725 -68171 46535 49437 -79740 -34589 96591 31115
173 31115 -78076 -15997 42262 -11010 -4537 43068 -17125 -61396 18821 49855 -18624 -21133
185 -21133 20332 -18327 -36883 36731 40831 -43455 -38830 23685 6909 -12044 22496 -2892
197 -2892 -56201 193 55833 -15748 -46262 32578 13509 -71719 1339 95122 -17648 -113386
209 -113386 17034 97880 -31374 -77008 42315 45446 -62264 -32642 64999 26493 -54768
220 -54768 -28310 23647 23547 11377 -13646 -36101 6598 46743 -6763 -41901 25119 40907
232 40907 -44244 -36754 66284 43164 -63245 -35770 54827 28899 -27777 -1009 15558 -15583
244 -15583 1432 33539 -1757 -22940 16490 14945 -24058 4862 45629 -5444 -48586 7400
256 7400 48019 2707 -25567 -2184 6170 3472 12594 1790 -16637 4011 15877 -18084 -12294
269 -12294 36978 11280 -52669 -16426 54380 15077 -48801 -11513 31556 -5897 -23124 14805
281 14805 11195 -25476 -13135 15350 2025 -8933 2617 -9290 -20279 9550 21411 -14332
293 -14332 -24938 4738 8326 -8768 -30 6222 -15513 -12174 13763 4850 -13557 1915 6263
306 6263 -18735 -7814 28827 8306 -34378 -9219 30036 5282 -21185 4121 16015 -11326
318 -11326 -11481 17735 13049 -10790 -7600 4411 5993 9357 5358 -10117 -6011 15048 10367 -8550
332 -8550 1635 13792 -5400 -10776 16660 18260 -11944 -12616 12823 11006 -4351 3283 6571 -8059
346 -8059 -2987 14758 6459 -9429 -817 6925 -3570 -1867 11990 1991 -14092 -2148 11509
359 11509 2855 -5466 -1161 -2313 -4470 4280 5671 -6455 -7088 2180 -1035 -4767 4000 3286 -12085
374 -12085 -10280 8511 6364 -10623 -7369 2842 -2719 -6212 3208 3103 -9458 -8340 3325 2420
388 2420 -3359 -1991 -3539 -5751 771 4807 -2185 -6563 -524 842 -2372 971 4334 -3369 -7055
403 -7055 1537 6482 762 -3147 -1049 -675 1228 5897 2117 -4909 -287 6370 1655 -1936 4650
418 4650 6259 -4483 -4638 8710 10436 -1937 -7039 1579 9871 5443 -3525 -3056 5543 7301 -2434
433 -2434 -4243 8110 9562 -6965 -9176 9617 15063 -4170 -13241 3362 13089 639 -8482 -635
447 -635 6723 974 -5403 -1389 4441 2991 -4772 -7687 1774 8648 -261 -11817 -5602 8500 4907
462 4907 -8988 -7877 3865 3633 -5993 -5978 2600 2678 -6351 -6608 1001 3007 -1822 -5536 -4576 -633
478 -633 2338 1250 -5473 -7115 1550 5683 -2607 -7987 189 6254 -1883 -7658 1524 7713 -558
493 -558 -7262 -2139 5746 5224 -1408 -6180 -2738 8475 9205 -6914 -10937 9646 16399 -7270 -15854
508 -15854 11338 22192 -9154 -21538 11747 26813 -6087 -23808 6135 25156 148 -17796
520 -17796 402 16852 4862 -9741 -4645 8816 10328 -2472 -11939 -74 17954 6510 -18378
533 -18378 -10336 19826 14385 -18548 -15804 17571 16151 -16633 -16256 14126 14840 -13727 -15594 9391
547 9391 12622 -7123 -12379 771 6436 579 -5067 -5235 -1410 4154 959 -8564 -5796 7181 3486
562 3486 -12137 -7752 10601 5351 -14432 -7254 10931 2956 -12146 -2111 8645 -4481 -9596
575 -9596 7761 6614 -13145 -6260 15511 3499 -18344 -1363 20323 -664 -21074 3053 21583
588 21583 -2707 -18899 3303 17301 -339 -10854 1138 7543 2660 -347 -2539 -1797 7797
601 7797 8661 -7745 -9892 13225 16042 -12612 -15700 15846 20107 -12014 -17756 12997 19666 -8533
615 -8533 -15632 8667 16317 -4192 -13011 2815 12491 1441 -8880 -4067 6185 7444 -2179 -8911
629 -8911 -1233 9505 4169 -10874 -7012 10989 7470 -12985 -10459 12431 9863 -14690 -11823 12679
643 12679 8458 -14215 -8608 11017 2512 -12634 -1763 8941 -4601 -9934 4700 5447 -9307
656 -9307 -5476 8150 409 -11490 -818 9235 -2352 -9155 1149 5333 -1979 -3513 621 -880
670 -880 -959 3392 -1173 -6119 2591 8042 -3916 -9373 5825 11171 -5462 -10400 6375 11704 -3271
685 -3271 -9134 3120 9956 788 -6464 -280 7292 4870 -3806 -4299 5268 8035 -1528 -6585 2256
700 2256 9610 2343 -7184 -2356 8837 5999 -5718 -6494 6954 9777 -4882 -9810 6028 11648
714 11648 -4618 -11242 4919 11328 -4159 -9898 3103 8191 -2885 -6380 1627 3418 -1879 -2853
728 -2853 -550 -259 642 -377 -3557 -2609 2677 1173 -4892 -3200 2669 601 -4339 -1727 1405 -879
744 -879 -2561 -423 -389 -1768 -110 -292 -2943 -1257 2305 -407 -4108 -836 2794 -864 -3762 496
760 496 2105 -1001 -1682 685 635 -356 -165 479 393 682 1072 -99 193 1428 855 59 567 1181 607
779 607 732 1547 340 192 2101 1540 -780 756 2971 505 -1561 1550 3542 -137 -1804 2381
795 2381 2943 -1107 -1191 2161 1989 -967 -716 1534 1070 -567 -935 493 1388 437 -1181 -583 1106 631
813 631 -1992 -1371 1823 -14 -2659 -829 1765 -333 -2740 -730 1126 -978 -2183 -433 -71 -1513
829 -1513 -1241 -133 -923 -1336 -589 -596 -1657 -819 -208 -817 -1657 -720 -191 -178 -727 -973 -365 330 -104 -1347
849 -1347 -541 1396 22 -1451 -233 1634 509 -1628 -17 1409 552 -556 331 725 591 387 370
866 370 717 663 782 618 68 1138 1782 217 -145 1062 1886 411 -52 959 1495 508 176 216 1027
885 1027 981 130 -301 898 1647 -65 -1213 442 2044 -145 -1494 738 1614 -434 -1570 491 1355
902 1355 -1015 -1493 113 950 -522 -1326 -481 314 87 -1240 -1747 -148 389 -1283 -2035 449 426 -1779
920 -1779 -2034 87 355 -1755 -1670 -55 -246 -1140 -930 -464 -482 -197 -318 -914 -646 356 -309 -1526 -79
939 -79 1012 -184 -1261 -71 1235 -88 -695 341 492 170 466 28 190 888 825 -374 -599 1456
957 1456 1168 -228 -14 1722 865 -135 628 905 579 617 1149 128 200 1894 1019 -995 537 2471
975 2471 569 -1592 484 1955 420 -1215 328 1162 263 -105 -47 -257 608 690 -1114 -1311 1252 1327
993 1327 -1751 -1771 1311 1304 -1863 -1537 1093 754 -1346 -1433 -464 6 -133 -1214 -1784 258 1016 -1270 -2264
1012 -2264 726 993 -1742 -2084 970 281 -1663 -450 666 -1291 -898 1098 -381 -1805 449 1894
1028 1894 -1600 -2337 1814 1501 -2192 -1296 2136 601 -1609 562 1565 -621 -192 1637 -367 -1613
1044 -1613 2064 2580 -1987 -1476 3393 2314 -3068 -758 3508 1607 -2196 -205 2338 1283 -653
1059 -653 -625 847 1666 904 -706 -572 1878 1570 -1399 -1416 1849 1971 -795 -1530 522 1630 322 -1295
1077 -1295 -1353 1524 1852 -1964 -2872 2327 3066 -2897 -3248 2524 2590 -3612 -2340 2754 468 -3166 -382
1094 -382 1484 -1866 -1368 1489 -478 -3069 706 2256 -3132 -2810 3047 1468 -4205 -1220 4012 -273
1110 -273 -4046 930 2633 -2070 -2063 2387 405 -3052 555 2778 -1681 -2258 2533 1736 -3055 -1138
1126 -1138 3014 788 -2597 24 2292 241 -846 549 679 400 649 -191 -166 1154 1576 -511 -733
1143 -733 1369 1535 34 -470 541 1059 1475 -467 -1429 1375 2852 -910 -2653 2217 3547 -2281
1159 -2281 -3100 3426 2973 -2835 -2006 3047 1114 -2856 193 2019 -1039 -1024 1686 -336 -2494 1101
1175 1101 2006 -3328 -2104 3776 636 -4692 -937 3794 -910 -4283 1381 2670 -2697 -2283 2053
1190 2053 28 -2683 403 1314 -1658 -1584 1500 14 -2471 98 1948 -1527 -1782 1187 594 -1638
1206 -1638 -152 1205 -454 -962 958 407 -941 301 950 -537 -483 795 523 -398 187 533 -792
1223 -792 421 1325 -498 -578 1930 1075 -1842 336 2977 -368 -1895 1484 2550 -1218 -749 2316
1239 2316 896 -1450 778 1553 -1121 -633 2095 90 -1866 1109 2058 -1483 -1415 2438 946 -2756
1255 -2756 -139 2755 -1026 -2338 1310 1334 -2231 -654 1572 -626 -1625 1095 805 -2015 -739 1537
1271 1537 -703 -2229 595 1059 -2191 -1122 1485 -627 -2097 471 981 -1594 -1348 965 -110 -1652
1287 -1652 119 903 -1313 -607 1089 -323 -1888 664 936 -1628 -372 1608 -210 -1734 759 1390
1303 1390 -1215 -941 1575 374 -1330 688 1304 -794 -534 1318 347 -1165 968 1539 -839 -303
1319 -303 1689 606 -1409 823 1707 -662 -441 1568 570 -1105 643 1636 -1092 -564 1529 677 -1007
1336 -1007 422 1737 -744 -961 1395 940 -1473 39 1312 -278 -1286 771 727 -1290 -374 1415
1352 1415 -757 -1467 835 663 -1376 -432 866 -771 -1701 195 634 -1270 -1006 931 -748 -1198 638
1369 638 250 -1454 -765 967 -730 -1372 412 660 -1304 -738 588 -39 -1378 190 746 -922 -416
1386 -416 1028 -305 -1061 498 1044 -948 -297 1335 51 -948 373 1078 -460 -373 1137 569 -755
1403 -755 505 1091 -588 -409 1243 653 -1217 405 1362 -109 -464 881 876 -741 199 1180 -51 -498
1421 -498 1143 595 -673 431 1020 -341 -458 1114 455 -882 -115 961 -15 -1115 502 670 -1075
1438 -1075 -671 1029 -128 -975 510 305 -1301 -458 588 -254 -978 -4 538 -1030 -625 518 -319
1455 -319 -1206 -318 462 -792 -650 477 -44 -984 46 270 -673 -559 416 85 -411 40 303 -314 -622
1474 -622 487 79 -291 165 659 -261 -749 436 96 -480 380 627 -112 -100 757 270 -207 384 676 -97
1494 -97 -244 949 302 -518 288 1007 -4 -259 937 635 -60 146 824 23 -609 699 835 -548 89
1513 89 582 221 -572 165 318 -78 -225 371 198 -256 57 258 -122 -306 168 67 -130 -14 289 -157
1533 -157 -220 64 258 -292 -91 -42 -48 -161 -30 -360 -399 -261 -37 -417 -518 175 -433 -759 -192 126 -728 -271
1555 -271 -238 -101 -584 -214 -12 -390 -447 211 24 -429 8 371 -9 -429 345 424 -132 2 608 235 -370
1576 -370 5 310 281 -11 264 235 -174 355 104 187 -193 -45 392 256 -179 650 460 223 -24 252 583
1597 583 286 -156 194 406 80 273 384 231 52 72 395 -29 -183 252 423 41 -228 172 20 -308
1617 -308 25 497 -23 -754 -280 505 -196 -315 32 82 -362 -542 101 -109 -490 -145 -42 -336 -562 40
1637 40 -1 -419 -364 72 64 -784 -397 287 -297 -901 134 52 -737 -276 362 316 -493 -235 134 368 -544 -7
1659 -7 432 -146 -253 273 403 -383 27 573 422 -546 -105 486 190 -313 304 649 -225 108 663 208 -118
1680 -118 -180 616 173 -193 317 268 307 -308 703 309 12 68 650 95 -63 122 709 188 -198 244 346
1701 346 -67 -308 -42 181 -28 -103 332 283 -394 100 238 -74 -321 146 -208 -321 -334 242 -125 -549 -112
1722 -112 379 -450 -343 -105 79 -446 -260 -151 -100 -524 -402 346 -23 -463 183 -97 -513 -328 491 146
1742 146 -500 16 336 -14 -127 89 195 -280 -377 495 63 -29 158 493 53 -305 312 237 14 -66 170
1763 170 335 -125 254 148 94 80 187 340 210 71 106 93 98 -39 -70 317 159 367 195 -62 20 28 175
1786 175 -60 -40 315 65 92 -407 116 -54 -108 -249 265 170 -321 14 351 -60 -462 78 424 -90 -170 -48
1808 -48 11 -365 -301 -37 -317 -409 -236 -45 -485 48 0 -89 -419 -320 -67 -293 -203 262 -387 -190 -117 -76 12 -374
1832 -374 172 -123 49 127 -199 -45 78 -72 -69 -38 32 48 130 202 29 47 -76 58 -22 129 -46 138 -153
1855 -153 173 464 135 -293 -22 240 -191 -18 234 384 -71 -21 496 140 29 305 208 66 -55 95 17
1876 17 -217 488 209 -173 -218 202 144 20 133 78 -24 -63 203 279 -112 -16 171 -68 -236 195 -185 -202 -118
1899 -118 -196 -138 -204 177 10 -218 -248 -235 -222 -141 -163 29 1 -378 -590 -328 -29 -127 59 -322 -175 -234 -430 145
1923 145 111 41 -127 183 105 192 -27 137 217 -82 121 124 8 -185 33 116 -24 156 241 94 -142 171 378
1946 378 -90 -134 31 381 88 161 256 -1 143 178 153 9 -18 6 166 -3 143 348 247 93 -12 155
1968 155 -1 54 311 12 76 -33 -45 113 97 33 -185 49 49 136 -85 -261 -96 -156 -223 -55 -111 34 -210 -19
1992 -19 131 -91 -82 -117 -299 -39 -180 -412 -255 -62 -155 -120 -202 20 -1 -314 -150 -92 -54 -348 140 26 -31 10
2016 10 -143 0 -221 -290 127 -134 -170 -96 136 49 18 171 251 101 -83 316 9 19 262 -28 124 10 229
2039 229 220 -31 368 173 23 10 35 280 18 13 303 51 74 -135 413 158 231 -4 -6 -45 -117 9 168 114
2063 114 143 -323 13 20 -363 -23 114 8 -285 36 -71 -77 -192 131 -94 -244 90 -31 -188 130 -64 39
2085 39 -274 223 -53 -77 -253 -29 27 -461 -217 218 -58 -229 -68 -137 -14 -267 -21 -144 -66 -196 145 -111
2107 -111 21 -301 50 87 -284 -105 72 262 -108 294 54 -64 -86 -253 -193 138 3 235 210 -165 62
2128 62 138 435 -57 53 216 205 8 233 182 57 21 200 566 -283 -16 487 -96 4 145 293 123 -113
2150 -113 542 361 -88 -44 245 406 -201 152 -58 -94 -61 177 -63 -97 -231 76 17 27 -129 -43 -102 -322 -138
2173 -138 114 -106 -61 -58 -131 -231 -59 271 -162 -340 113 231 104 -185 -136 -226 -175 -22 -204 -129 -198 -104 119
2196 119 -245 -137 45 -283 -215 -251 -227 115 -36 -121 3 -69 68 -46 141 -54 19 159 13 -47 -174 45
2218 45 -9 249 78 162 57 224 2 173 72 50 77 360 -5 191 325 -116 189 327 513 0 -55 63
2240 63 82 15 -94 93 44 -186 -83 263 -22 72 81 232 30 252 254 69 -90 22 306 -141 -108 -16 47 114
2264 114 -142 -220 209 -74 -191 -195 -109 173 -23 -157 -92 -150 -221 130 -118 -295 -56 -128 11 -50 105 18 -426
2287 -426 -265 -16 58 -272 -212 181 -246 104 77 -103 -254 -104 -43 144 -424 -64 44 -262 28 -3 130 -398
2309 -398 20 383 134 -99 202 310 -21 -68 64 -150 176 -135 141 298 141 115 -179 -82 102 97 -170 -7
2331 -7 253 -94 -117 -55 272 -85 -76 296 -176 -223 173 -22 -137 71 354 -285 168 169 -207 35 123 167 -201 -204
2355 -204 102 163 -180 -110 192 -173 -337 1 76 -95 -372 92 17 -63 -115 256 34 -291 226 121 -65 -359
2377 -359 165 151 36 -25 -92 -300 108 -142 -156 113 -64 97 -53 -319 267 -163 -357 -59 204 -115 -21 -168
2399 -168 -176 3 182 72 40 156 51 38 60 242 -72 59 210 396 -152 142 323 -357 -45 200 314 162
2421 162 -257 141 -140 -196 -208 121 -87 -307 161 -13 -175 -97 328 -10 -166 325 81 99 -114 104 112 -492
2443 -492 163 159 81 -6 -114 210 -132 -29 225 -49 -101 425 160 -359 -347 -141 -169 5 53 -289 -123 -94 -106
2466 -106 24 -150 21 -178 -135 -8 101 -259 -283 32 103 -366 54 67 -36 57 155 132 -193 215 -1 95 -78
2489 -78 366 92 -253 -148 220 50 212 267 523 -219 109 369 91 68 174 158 33 147 415 40 31 12
2511 12 177 -96 -75 115 162 -131 90 529 73 78 57 235 290 76 -186 -139 -152 11 247 -28 52 160 17
2534 17 264 212 -148 39 35 267 -49 28 75 -65 -258 149 -21 -280 43 89 12 -286 -93 118 -284 -353 -143
2557 -143 43 -113 2 -130 -13 -122 61 -41 -562 -179 12 -121 -204 214 105 -69 -43 81 91 -225 279
2578 279 -149 39 84 78 118 111 212 -27 177 245 213 -116 -50 274 61 170 205 184 122 -43 223 259 156 -62
2602 -62 3 -57 -128 -98 -24 -76 62 227 94 6 368 235 140 476 -1 276 -155 360 290 -187 -86 91 121 -78
2626 -78 163 144 27 -56 66 70 -223 -21 -149 -156 -175 -43 -78 -159 145 149 -229 -353 44 -97 -118 -250 113 -55
2650 -55 -13 -258 -161 77 197 11 -116 7 310 -48 -250 103 84 -67 10 157 -218 -255 97 75 -71 -192
2672 -192 197 -175 -27 -5 73 176 105 228 176 6 -148 267 181 60 175 150 -102 18 -42 206 -136 174
2694 174 -30 12 -100 193 -6 40 319 250 -72 162 223 -138 29 -32 71 0 -93 9 -302 109 183 16 18
2717 18 68 -20 -15 -15 152 -51 -233 218 -102 10 -32 22 -206 -182 85 179 -113 -123 252 -100 -264 344 192 188 -269
2742 -269 82 -101 29 7 23 188 -232 112 6 -120 -1 -164 190 122 -123 221 -34 -152 -19 225 45
2763 45 68 192 60 231 166 -124 -21 -139 25 79 200 83 153 74 -30 221 217 20 -46 -149 137 4 307
2786 307 -60 152 403 150 34 -89 -86 -49 -63 139 156 51 -124 38 -48 174 -9 -10 -111 -170 -72 -28 -323 -65
2810 -65 -1 -193 17 65 14 -53 -49 3 -51 161 51 97 20 -224 -254 -67 132 8 -61 -74 -32 -153 74 -309 -196
2835 -196 -183 208 -259 -327 88 -158 -274 2 29 -135 62 -7 -150 -264 51 118 2 11 37 -49 16 7 70 31 201
2860 201 3 152 -24 243 235 -35 -31 246 32 234 162 119 -133 22 345 76 14 206 208 -257 76 15 260
2883 260 -10 7 -158 82 -7 -74 47 -16 -109 -248 55 208 -113 14 288 -169 -6 -113 67 -50 85 71
2905 71 -182 4 155 71 -66 73 28 -175 1 -203 54 -279 15 155 -46 -180 -36 183 -203 -4 -195
2926 -195 -164 -72 21 37 -127 -188 -12 -112 -13 183 -268 -205 44 -259 88 416 0 75 44 35 -19 -80 -62 229 -114
2951 -114 -113 179 93 165 -158 153 107 -34 233 19 307 31 206 78 115 116 203 43 -152 126 324 -189 -26
2974 -26 38 -12 201 49 111 -116 331 -114 -130 -66 95 156 -122 -139 165 116 -12 8 -305 72 12 -133 61 -35
2998 -35 -130 -245 -54 -323 -198 -50 -125 -131 -126 85 -18 82 -397 -258 64 -33 -275 -137 -175 -289 -27 143 297
3021 297 -51 -61 118 11 -187 26 163 -57 78 -71 -203 -190 290 79 -79 -144 132 -94 -24 -132 108
3042 108 26 -77 5 119 -5 117 327 -60 -17 -11 346 81 250 -129 -167 -179 53 27 119 -2 69 -35 117
3065 117 199 234 -3 126 95 -46 67 98 -216 -108 -160 -388 -106 -168 -207 -88 -193 -21 94 -148 -41 184
3087 184 -74 -295 22 -103 -53 -27 58 62 -22 -102 103 -274 -239 -1 -76 -36 -187 151 -37 9 84 -223 -98 -267
3111 -267 31 -96 -160 -194 -83 -169 212 -74 -4 -21 -52 228 176 -134 80 -114 -36 78 115 203 -150 -78 175 14
3135 14 118 -116 84 -36 -46 -52 323 183 -68 158 -14 209 283 -47 -103 -3 98 333 92 -163 209 -67
3157 -67 99 -90 47 116 -210 -103 -71 -221 16 -291 -255 155 -360 -383 12 -187 -157 206 -131 -39 62 -66
3179 -66 42 -35 -228 -110 -241 -142 -163 -130 -114 29 288 58 -321 -35 49 -291 -44 27 239 325 -50 -110 -4
3202 -4 -131 142 -170 -121 202 59 235 216 -2 77 -81 59 58 -80 -132 253 248 -89 128 -5 34 83 -29 -121
3226 -121 43 206 66 91 194 -7 -82 215 222 -76 -45 7 367 172 100 55 57 34 213 105 -7 -191 -35 231
3250 231 245 -163 64 159 -174 214 23 173 -193 108 286 -52 -104 -124 111 -23 19 315 47 112 10 -55
3272 -55 104 -328 -164 -19 -68 -133 204 40 132 -85 -181 -52 11 130 -153 46 -345 -82 -102 -147 43 -64 -207
3295 -207 -226 136 -81 247 -160 -48 181 181 9 -209 246 -142 70 146 -148 -25 166 209 401 -49 -11 160
3317 160 -209 -51 73 110 83 305 171 145 -257 74 101 141 269 498 67 0 126 -8 -70 57 -57 222
3339 222 15 -145 137 101 -204 114 187 -103 -207 78 -102 -113 -97 154 227 -262 62 1 26 -96 -170 13 -55
3362 -55 67 170 169 -335 128 68 -391 56 -37 45 14 -41 -242 -203 -49 114 56 -150 -219 17 -326 290 -50 -68
3386 -68 -150 -295 229 47 -4 165 -154 -106 -161 216 -68 130 -29 115 96 56 202 -192 -121 -364 -229 -12 229
3409 229 -82 23 16 2 14 17 122 -31 -15 66 29 -43 195 52 -53 291 195 292 58 -6 -22 76 94 -77 264
3434 264 -268 -277 41 -237 238 -79 -29 -12 -102 -91 -35 -24 101 -75 103 79 -129 -451 54 -232 120 167 304
3457 304 -164 -101 212 -193 -12 116 -73 -99 91 208 -300 219 -137 -224 -188 -59 57 -34 -137 -33 148 -119
3479 -119 -44 67 -116 119 -102 -18 68 29 -102 -221 124 -15 -56 -156 -89 132 465 -141 189 94 94 141 153 141
3503 141 29 371 181 409 85 121 185 -5 121 220 92 -144 152 199 -75 -112 -88 -34 -313 58 -23 168 -38
3526 -38 -266 16 29 4 -61 -183 21 5 40 -289 38 75 -170 -247 116 -348 -143 379 -256 -166 -228 -229 -109 -224
3550 -224 130 6 -483 -4 -81 -118 -375 -104 -54 -61 -187 90 -134 -69 98 84 168 -20 26 -104 -153 58 -139
3573 -139 179 270 134 205 125 148 93 -215 96 29 -59 -26 208 -101 -134 26 92 245 -5 242 88 185 157 130
3597 130 -215 -139 -54 49 -81 221 -51 -31 -13 9 -93 -115 159 80 -154 -297 81 -12 -38 26 142 -36 -143
3620 -143 135 -30 -83 199 -202 15 -37 82 -49 52 180 29 -63 -225 274 3 114 -370 -115 -88 -29 -65
3642 -65 -189 -199 -7 315 -100 -197 78 -87 -66 32 -118 -95 2 267 -35 16 -81 -223 152 291 -35 141 -22
3665 -22 -5 4 363 16 282 180 31 106 -144 -15 -187 -100 113 45 -20 102 70 -146 3 146 -186 8 192
3688 192 139 106 205 -60 180 64 87 71 -228 -189 66 -58 8 46 65 217 -62 -207 -111 357 -52 -47 -420 -29
3712 -29 126 -82 155 129 -90 -255 -47 -221 -286 -49 -22 259 -80 192 -259 92 54 1 127 -153 7 191
3734 191 277 -502 120 -9 -40 -125 273 -198 -268 -200 124 89 -37 74 -174 -169 -20 -176 123 -297 203 50 -209
3757 -209 102 -77 101 19 27 232 245 3 -207 -131 325 113 -5 303 14 16 37 185 25 222 -33 251 15
3780 15 56 -279 117 222 -180 123 -3 37 258 -153 -108 -180 -193 350 39 31 256 113 -141 -40 72 -104 49
3803 49 -172 -139 -396 -58 186 -226 108 184 -41 -48 161 213 -41 -397 -135 56 17 -302 -21 140 -9 33 88
3826 88 -134 50 -138 -81 -203 -175 -75 20 177 -38 -271 209 -40 255 28 153 -26 -101 64 114 -25 -308
3848 -308 281 160 167 118 -8 -17 -37 223 124 173 181 -234 -294 -288 -131 68 -53 -87 -145 206 193 77 224 164 259 20
3874 20 138 -39 -67 -24 -79 57 201 -1 -90 -47 -21 98 124 -288 -109 92 -119 -97 -64 161 -134 174 106 -217
3898 -217 -248 -154 -170 -27 -293 14 -250 -106 89 89 -113 -106 110 20 -108 -79 86 -140 -249 -20 2 46 -118 -89
3922 -89 -108 -12 -55 56 -161 -284 -206 46 76 68 73 -205 -214 -95 583 -100 49 -9 85 102 -168 -35 -30 101 -147 127
3948 127 -45 256 -72 -30 350 98 80 177 124 -12 186 -157 35 227 67 7 283 -88 63 -32 -184 -64
3970 -64 56 -121 -64 137 207 286 145 -44 -148 -153 -57 -26 -188 -84 169 37 7 -452 -18 87 81 18 -36 -100 -43
3995 -43 -3 -194 -5 18 -48 176 -249 -216 -308 134 18 28 -90 20 -15 55 -196 56 -34 -64 -83 143 100 1 179
4020 179 -76 99 -83 -140 -35 177 29 41 -15 70 12 74 -39 221 12 -17 -139 47 -16 12 225 38 227
4043 227 51 116 136 -82 175 256 31 -59 22 67 106 81 254 225 -99 7 -8 94 130 128 321 94 72 319 143
4068 143 -280 98 -298 -34 216 175 87 -150 -136 -198 -181 -227 34 -99 -168 7 -29 22 125 216 -91 -219 -90
4091 -90 123 -19 -138 -210 -261 -149 -240 -218 -152 -66 -4 -229 -15 -96 23 -282 -131 51 -258 39 220 -147 -154 75
4115 75 55 -137 212 -26 165 113 -53 82 395 -59 -360 -5 24 -27 -92 71 4 -6 56 290 191 103 7 125
4139 125 -49 137 87 28 -89 236 -309 73 92 44 -47 -16 -103 -65 -66 -153 157 -171 6 -10 79 -69 -221 -71
4163 -71 -21 -94 181 31 161 -165 43 212 -156 53 -165 74 172 -107 -5 -191 141 13 120 -186 -348
4184 -348 -241 -254 94 -138 -113 -51 -18 -36 65 -220 24 45 54 -13 -185 110 203 -37 -437 51 -150 20 -187
4207 -187 118 -279 -205 110 -126 134 -84 90 -47 128 -136 57 -105 -109 297 100 198 49 32 -105 81 91
4229 91 45 -159 133 110 -22 0 -108 86 -46 150 28 19 -95 213 246 -164 59 -42 4 157 118 -17 66
4252 66 29 -41 -258 -161 -24 -68 51 39 -34 -136 -70 -254 -30 -85 -8 121 -94 -136 -272 -414 128 -9 86 -45
4276 -45 -255 -27 -174 -66 -179 154 -235 -214 127 301 -73 34 -24 151 -94 -77 69 -30 135 114 -320 24
4298 24 56 100 -133 106 224 -36 154 100 38 -138 -11 142 103 -107 112 -191 83 129 19 241 232 223 163 -32
4322 -32 -11 127 111 111 -129 75 194 -191 -34 147 -148 -19 215 -11 102 73 -49 200 56 -115 -198 8
4344 8 -111 -127 -79 -208 -7 -119 171 -71 -89 72 -69 -88 -176 54 -17 -45 -205 -139 -80 -194 -92 -147 -232 151
4368 151 -217 -130 -10 -94 178 -98 60 192 39 -319 37 -149 45 63 191 -140 6 -90 132 212 -132 -84
4390 -84 81 319 119 -44 14 11 226 238 -115 162 -108 -211 34 29 316 153 55 72 214 184 3 263 17
4413 17 20 -26 141 105 -189 -13 275 -286 33 176 -33 114 225 -159 38 -106 -152 -102 54 -43 140 -119 -38
4436 -38 -134 -33 -122 -224 -152 -216 -88 -155 -58 2 73 -47 73 -212 -114 -178 -73 -296 -175 213 12 -348 189 -17
4460 -17 7 -43 -337 -145 7 -43 -190 -12 58 -4 72 -7 -33 66 139 243 -152 -61 -53 52 360 -33 132 81 2
4485 2 226 -118 -112 -101 4 -13 -30 175 94 8 37 92 -20 -148 166 309 133 136 264 -53 261 194 49 -176 181
4510 181 80 -6 -57 116 239 93 150 133 -247 -5 -181 62 -41 -22 -226 61 -262 -177 3 -80 -50 109 -2
4533 -2 -188 -64 109 187 -58 -56 -130 13 -134 -267 -246 -60 73 23 -19 -25 29 10 -67 -86 104 -206 50 254 -165
4558 -165 -482 -156 61 20 -44 61 66 220 117 -67 50 231 208 -11 256 114 30 219 318 -153 54 -22 240
4581 240 112 170 -88 211 162 34 -57 -26 323 192 253 259 88 201 -41 -30 -147 1 16 -21 59 -54 31 -110
4605 -110 -42 -104 290 -38 124 -118 21 -104 -28 -35 -93 -31 -52 10 -324 176 40 68 -3 51 112 -37 -63 109 -253
4630 -253 -387 -141 -236 -129 -174 -211 -152 -320 -98 15 -24 116 57 -24 -34 16 -50 108 -7 22 -83 14 -210 -14
4654 -14 11 59 -42 169 371 -15 53 -11 60 -18 -4 267 -50 -112 81 193 126 87 94 132 117 233 -85 -104 193
4679 193 183 -23 32 -47 98 10 -73 59 60 51 24 -147 28 -46 34 -217 57 -133 30 126 194 -83 -25 74 -47
4704 -47 80 -124 162 -89 92 -93 -153 194 -117 -62 49 -187 84 -213 -197 -107 -103 -108 24 -21 -266 -12 -20 -169
4728 -169 174 -149 -186 -94 -159 -138 -246 -161 -169 -193 163 -154 -16 122 15 -182 -184 -162 58 217 -95 -117 -298 -184
4752 -184 -127 -181 51 298 -61 150 271 147 142 57 194 -72 158 364 50 153 -51 307 13 100 153 22
4774 22 215 -29 -141 169 40 -163 185 23 36 -104 -18 -105 -74 96 369 -172 -255 -70 -8 -323 139 -118
4796 -118 34 61 78 -193 217 213 -206 -226 -30 92 -246 -150 -206 -575 -252 -294 27 -43 -332 251 -52 -56 -259 -208
4820 -208 -104 37 -231 -12 244 -76 -75 -133 -224 43 -162 -55 28 -130 -106 -52 162 -143 231 -98 258 39
4842 39 95 319 197 1 -28 -95 127 13 169 -30 204 18 93 36 202 -77 67 76 178 328 179 134 173
4865 173 175 -29 41 -264 186 -187 82 -15 -177 79 104 185 -11 -43 159 -84 158 -64 148 -136 -82 -71 -273
4888 -273 2 233 -116 63 116 -25 -150 -275 153 88 -151 -69 -93 23 -353 43 180 -118 -89 -42 -28 -117 -177
4911 -177 -48 108 -107 -314 -395 -83 64 -46 19 149 -19 269 191 -52 79 -186 14 112 100 -61 248 -57
4933 -57 73 53 -24 42 -119 173 166 102 11 -5 -189 96 246 151 117 224 -61 145 74 75 -9 -49 11 34 100 134 -145
4960 -145 120 208 -8 60 -110 43 26 305 319 96 -357 -141 -145 -70 -2 178 -123 94 179 -161 109 -90 -153
4983 -153 217 20 -108 -152 114 -189 -2 15 87 34 277 -3 -347 -327 -97 -285 -134 4 25 208 108 -6
5005 -6 34 -414 108 135 32 -359 -63 -102 -248 -178 -310 3 -163 95 116 32 24 51 20 -87 -313 204 215 19
5029 19 126 -73 161 159 -6 12 86 110 259 -34 -165 202 137 156 86 260 109 60 -39 -97 10 -105 109 27
5053 27 3 -39 -70 115 63 86 -184 -228 -98 39 72 -58 -122 110 -268 -60 -78 -179 103 -11 0 -17 -241 -36
5077 -36 -75 -100 75 39 -90 201 -230 -116 -82 -125 -11 -4 -59 -249 -56 -300 -160 124 18 -181 -3 -61 153
5100 153 24 181 -34 186 -136 7 60 -85 291 -140 225 222 1 103 57 -60 42 110 129 -8 -41 212
5122 212 -169 -100 98 -88 78 17 114 -129 -122 99 53 -7 -94 81 -3 229 -299 84 119 140 226 -131 37 -295
5146 -295 56 -94 -52 60 -31 -123 49 -382 177 41 31 265 158 130 -131 -133 118 -43 -326 236 40 72 132
5169 132 85 -23 -1 59 59 -85 117 -227 -37 -280 110 68 123 -138 57 -232 -191 11 -42 125 -289 -55 6
5192 6 -18 4 52 -181 11 41 -124 60 -91 67 30 73 169 -47 -151 -53 -91 236 1 66 37 27 144 -129 -154
5217 -154 151 96 -74 156 -100 20 104 66 162 -57 -201 56 231 194 -93 24 -33 28 31 -156 47 28 135
5240 135 -41 -64 177 222 91 219 -242 -34 -30 -136 -43 -309 -92 34 -19 -97 42 -94 -172 78 403 123 -93
5263 -93 -96 80 -288 62 137 32 -241 -191 111 -67 -48 -110 -87 79 -341 58 14 -72 -79 -158 -124 147 47 -222 51
5288 51 63 -22 -121 -179 -131 83 243 -39 148 -221 78 -239 98 -178 40 236 14 322 -74 -126 85 -199
5310 -199 -133 162 -63 245 246 83 -22 114 -286 73 38 199 240 -95 -75 -60 203 -130 -180 28 -131 -135 59
5333 59 -131 2 -232 -77 -53 82 -197 -210 181 -59 13 -181 -249 22 -26 -192 -349 -192 -77 129 -135 -11
5355 -11 -62 163 -233 -56 24 -301 -232 -107 -164 -100 -14 -22 22 80 322 -104 -88 -91 -200 -94 -64 113 169 -214 -33
5380 -33 11 -37 -68 -250 305 -162 147 -36 213 -29 253 172 216 57 300 137 -32 -124 120 293 6 -83 99
5403 99 -40 -275 282 43 16 -117 152 137 168 124 28 -41 58 29 25 2 -55 -43 56 31 -56 175 -8 223 86 90
5429 90 449 35 -91 68 32 433 -62 74 171 -75 -164 -137 85 -179 -104 71 -14 -19 -172 -70 79 103 -19
5452 -19 -142 -116 -1 204 -297 156 -24 102 126 80 -403 93 -140 195 -46 -86 -204 -93 -233 -61 106 -42
5474 -42 -12 -73 6 55 -80 -74 188 263 22 64 137 85 -36 -34 199 358 238 19 -193 342 -100 5 49 -58 134
5499 134 211 -88 -76 -59 151 251 -129 209 -165 72 -190 210 85 54 182 -86 -34 41 -77 -137 44 -124
5521 -124 48 -179 -368 -93 -54 201 -56 9 155 38 -268 3 86 -77 -59 -198 -78 -135 -237 -53 220 -111
5543 -111 -262 -5 9 -419 -191 -276 -193 -193 -25 -99 23 -110 28 48 104 13 367 244 -145 -228 -32 -190 199
5566 199 297 -142 256 189 237 -69 -35 -14 49 232 50 65 161 -16 209 131 -45 140 115 -58 22 59 7 320
5590 320 -124 86 104 -193 146 -191 -90 -172 104 169 111 -227 102 222 84 195 2 -112 -166 -369 -26 -223
5612 -223 35 -18 -43 184 -196 -69 -148 99 35 76 8 -137 -201 -353 -55 36 43 -31 -252 -71 92 16 -117 -270
5636 -270 -218 -23 14 203 36 -4 138 90 -226 -233 -221 73 215 117 -277 -42 -173 -47 -82 74 44 -121 -141 -189
5660 -189 186 78 13 -122 -73 231 -63 90 99 110 168 -165 53 219 32 211 352 110 -169 54 70 193
5682 193 -49 22 129 -203 255 223 200 -156 165 84 11 -306 -24 -58 42 -143 36 43 -194 -60 -210 -245 -57
5705 -57 -34 -154 -212 -245 -170 -92 -21 101 -184 -104 -87 28 -50 -132 77 99 -116 -10 55 -41 -243 197 -1 44 -225
5730 -225 -317 -55 -135 160 -228 8 210 -25 173 161 -145 29 -143 206 -108 112 18 -18 -24 -54 65 -17 114
5753 114 -278 -133 -109 -19 -216 49 75 -37 144 373 -81 -59 194 89 269 45 51 297 67 64 192 83 119
5776 119 154 -5 -101 -215 -102 131 94 -220 -14 -89 -209 -76 -16 139 -133 43 52 120 -122 -324 -184 -224 -405
5799 -405 -219 -303 36 -135 -129 -235 -128 -24 -43 -61 -198 28 3 -8 -300 -216 -17 17 -15 -95 -146 267 65 123
5823 123 -66 137 52 -14 116 61 -16 -21 252 -65 -60 47 77 -262 -175 41 77 111 -116 56 138 23 226 154 135
5848 135 -112 -157 126 146 -31 -77 87 -203 304 5 119 149 45 -91 126 344 -197 347 25 20 -78 158
5870 158 392 -32 61 -46 -8 27 30 -1 8 91 27 -127 387 -534 4 -213 35 -164 1 -96 -112 112 -27 -363
5894 -363 232 -193 222 -243 -329 -4 -190 -233 -172 79 75 40 145 -69 -106 -99 -110 -11 -91 19 152 179 49 -158
5918 -158 78 171 110 107 -75 41 -192 311 -97 30 -245 -136 -152 13 -39 364 191 263 22 45 13 110 -72
5941 -72 -57 183 327 3 52 -30 -44 26 86 -33 152 -173 -65 107 70 -97 303 41 126 18 249 -282 71
5964 71 -3 -21 13 -156 135 206 -62 -38 -143 -47 -122 85 63 -82 -115 68 -79 -117 -199 -123 -153 137 121 50 65 -2
5990 -2 -133 -196 28 -24 8 -20 64 69 -91 -157 -171 -85 -23 -71 -76 278 55 342 74 -78 -23 -138 121 -76 -208 199
6016 199 -127 -46 -74 60 256 36 100 157 -24 -312 161 -168 -51 170 139 36 211 108 27 -226 -35 -123
6038 -123 145 65 77 -86 128 197 -29 107 187 301 118 105 -53 -256 -67 -27 -115 368 88 124 127 65 47 16
6062 16 137 15 -324 -168 -119 -76 114 -151 -87 -291 122 -226 -74 -174 -136 -80 -98 208 -198 -268 -57 -165 -267
6085 -267 -49 178 124 -161 -137 -250 -62 136 -286 -102 -82 -264 -31 -371 101 -1 20 -58 -30 42 -34 201 -168
6108 -168 265 214 31 107 -130 -168 49 -28 -16 209 -240 179 -250 13 -149 98 -27 -159 54 2 67 154 -75
6131 -75 205 147 -39 -57 90 109 76 388 -80 -117 109 155 -10 -83 69 -119 232 -170 115 393 90 -85 -142
6154 -142 -46 -187 -168 227 -114 30 -9 -6 -151 93 -1 169 -151 -171 226 -226 -75 115 72 -117 -188 103 -363
6177 -363 154 30 -26 162 36 4 69 -3 -139 69 84 -70 -274 -179 -51 103 -89 129 -51 -73 -175 -41
6199 -41 55 -141 11 -120 169 -145 244 -10 43 184 -142 -39 177 55 -232 93 -213 -7 254 -209 31
6220 31 -53 -11 3 7 167 -8 -90 117 -195 -63 173 197 6 -16 -28 18 -102 -105 127 -130 -98 -174 -12 58 -120
6245 -120 -128 148 281 -1 -254 -44 106 -77 78 -86 124 -234 -215 55 -5 12 -154 -18 -276 -227 -184 42
6267 42 -6 89 70 220 37 71 -73 -149 101 3 144 -86 -41 73 6 37 27 23 36 -119 -62 -145 -73 -7 -98 204
6293 204 48 166 -64 -82 207 -17 -206 233 76 47 153 115 -90 424 -235 -141 262 10 -70 323 -18 27
6315 27 141 72 30 81 280 -163 -98 -172 -136 40 355 -50 111 -228 53 97 -108 -119 21 -78 169 -152 -196 161
6339 161 -81 -203 -48 -6 -130 -249 -49 114 -11 -52 -34 77 -288 166 -136 -14 -66 -247 -50 -273 -165
6360 -165 -9 -115 -223 -265 43 -262 -248 133 41 -99 -7 54 181 0 -143 117 -14 1 125 -246 -121 45
6382 45 -135 69 -45 -33 199 11 74 327 38 37 180 36 -41 57 19 206 -186 -135 77 4 112 -23 -135
6405 -135 202 -95 -8 61 59 -91 172 29 -12 -10 -73 163 -8 347 236 42 -59 254 5 -6 93 66 2 -197
6429 -197 -134 326 -6 -86 -93 -36 47 -63 -222 -403 -7 -146 -202 -1 -126 -28 -57 147 -216 -28 -333 9 -129
6452 -129 -15 -81 -118 -44 -11 167 -35 62 -92 -123 -127 -6 -78 22 31 76 146 -62 3 -16 -33 143 195 -61 -83 70
6478 70 54 114 -71 345 -103 -167 50 -27 -133 -4 281 -91 78 -176 52 128 -59 148 68 302 -281 -49
6500 -49 -189 140 -182 -91 44 66 -92 -69 343 39 77 60 -137 85 -61 -16 225 -43 -195 181 -72 66
6522 66 -25 -157 204 -41 200 -11 -110 -18 -131 -159 -35 -64 235 -236 141 216 -263 55 -137 -26 62 188 -221
6545 -221 20 13 280 14 30 54 135 223 -94 121 133 6 41 -67 191 50 -63 -49 -209 229 -225 -17 13
6568 13 378 -37 -145 87 74 16 162 319 87 105 -60 40 106 70 -79 -212 46 21 -331 -180 28 168
6590 168 25 -152 39 -19 36 -189 -36 -183 -123 -134 64 -179 -91 96 -175 307 -42 -13 5 33 -55 -126 -164 33
6614 33 -105 168 -92 -97 -6 78 -169 24 159 -114 117 84 -85 -216 -195 24 47 11 158 38 -14 -129 -22
6637 -22 -340 -221 -197 -52 362 170 -174 117 131 -138 -73 59 204 -38 42 258 173 152 -4 -6 -22 111 52 110
6661 110 -110 -11 -50 36 68 -61 -44 -32 30 49 68 -181 -91 11 202 -12 316 148 -68 -7 125 124 -89 297
6685 297 -64 78 -16 -136 150 -132 -327 108 -69 -4 -189 -124 74 134 112 96 220 44 -72 11 -15 105 116
6708 116 -160 -5 -81 -90 2 94 28 -220 186 -176 -121 -130 -111 -166 46 215 -176 229 98 -163 90 83 49 -72 -48
6733 -48 -19 -140 57 67 0 146 2 172 140 76 -135 39 47 -73 42 18 82 -84 -60 198 40 -33 150 173
6757 173 -25 -178 158 18 16 -19 95 65 -28 258 47 73 17 -78 70 2 53 -82 37 -60 8 108 -199 -191 -91
6782 -91 151 -123 -73 -221 152 -100 -343 -51 288 -90 -59 183 -118 -103 116 -117 -54 -190 70 -101 220 230
6804 230 -67 -13 -4 -198 -176 -82 30 -54 -184 17 56 44 -50 104 7 223 26 225 -80 -174 -45 -223 29 -20
6828 -20 -55 59 -15 149 180 226 209 -168 306 186 -67 84 73 254 -187 35 70 261 -42 150 125 -85 -140
6851 -140 13 -15 -98 -59 140 217 -87 114 205 -50 -102 65 236 141 -1 141 96 -35 -78 -239 26 -56 -108 8
6875 8 -24 -83 74 -74 -37 -10 -92 118 -32 119 68 -103 -122 -99 -280 49 65 185 81 212 -60 158 22 209
6899 209 39 -96 -82 69 -112 132 -196 -22 -49 -12 -174 -92 302 115 116 -171 -368 4 44 10 -34 498 177
6922 177 18 -258 -53 -128 -104 39 18 115 8 190 -48 -107 180 -87 -30 70 379 54 25 62 -64 139 6
6945 6 -109 26 104 60 148 -136 309 -204 -174 -193 22 72 60 110 -212 120 -64 -251 85 39 -109 -81 -140 25
6969 25 67 -150 -79 92 121 93 -110 120 -112 -13 -140 -196 -178 -171 54 -72 186 -66 -185 -29 281 -143 262
6992 262 -38 184 -7 -236 120 -157 -26 -117 -70 115 78 43 321 -108 -160 191 -180 161 -130 -41 69 317
7014 317 -133 132 -45 60 -55 -46 262 27 -149 114 -4 -11 -6 8 86 196 32 115 94 -42 111 204 39 59
7038 59 110 136 183 -19 62 -135 -135 135 -81 94 -11 198 -149 -264 148 128 99 -138 -137 -11 -10 20 114 -141 -58
7063 -58 115 -74 139 -149 184 229 -92 82 -63 -250 241 -28 -82 -70 400 -21 15 61 65 -174 -30 -81 -21
7086 -21 103 72 328 35 -92 -64 -208 40 173 61 21 31 -105 220 187 -190 -44 42 2 -5 271 -189 -1
7109 -1 83 -13 303 144 439 -68 240 -104 166 21 -114 90 -56 235 -21 33 -111 -5 -63 -270 34 -162
7131 -162 -100 61 -79 241 147 -93 40 19 -9 2 0 -37 -13 182 143 -128 -39 62 39 192 -51 57 104 -49
7155 -49 -310 -27 -21 45 145 -165 -139 145 -211 228 -181 8 -230 -121 -12 3 -143 252 -143 12 -40 -146
7177 -146 120 -189 87 18 251 -36 58 -149 -145 -18 2 -243 161 250 96 98 34 -158 29 -174 86 117 7
7200 7 -64 178 -107 151 128 -178 87 35 219 -83 81 23 -72 -100 29 155 257 14 292 -84 76 209 83
7223 83 135 -13 8 -2 125 15 10 -12 -4 4 20 14 -304 149 -18 7 -162 -54 38 255 -242 -73 20 10 117 -251
7249 -251 -49 -168 -334 -98 -154 -150 52 -109 -97 50 72 -291 -18 -17 -102 -30 232 -53 116 -52 -26 -107 -4 -1
7273 -1 131 -90 175 117 257 -33 32 121 -6 76 117 -246 -359 161 17 311 200 141 -142 9 51 -55 -72
7296 -72 74 71 -14 182 239 169 230 -7 -87 323 -88 -92 162 46 -5 128 -204 17 230 29 201 8 -39 -117
7320 -117 212 -43 -81 -59 -5 -85 -5 309 237 -187 -77 -45 184 83 157 -99 -48 106 -118 91 -362 115 -61
7343 -61 -148 171 429 -60 -82 -177 -200 -16 61 -164 80 204 -136 143 -208 51 -11 -82 -221 -209 -76 -247 88
7366 88 -144 104 283 117 224 97 2 53 52 54 85 -40 -46 226 121 -141 66 -75 5 -5 -82 325 246 43 49
7391 49 9 49 110 352 294 -139 33 294 -43 -68 -86 219 114 67 9 -98 77 56 44 -234 -77 48 -94 327
7415 327 53 -301 46 46 15 -29 122 -140 -80 -228 45 304 -76 92 50 -148 82 -200 -131 -225 23 -81 0
7438 0 34 255 -83 -180 171 16 -71 41 78 137 268 236 251 -71 160 248 -4 153 -1 1 86 261 -1 117
7462 117 -72 -89 -26 -66 106 -48 135 196 190 30 -153 142 -36 128 -166 -179 -159 -52 -96 141 -180 275 -49
7485 -49 163 30 -58 -122 -87 33 -159 182 -9 114 -45 -26 -157 96 -104 -37 97 -375 237 -188 137 -7
7507 -7 -68 93 -200 244 -43 -5 -48 -170 -237 -39 -25 -182 -259 -88 -132 -59 -242 70 17 62 -102 53 -2 -7 -12 -19
7533 -19 -46 -129 196 -28 120 114 162 37 -24 -45 74 -152 -98 258 135 -119 -34 -81 90 113 85 -124 70 114 -16
7558 -16 171 -60 -22 -80 57 68 26 -148 85 -126 362 15 85 54 137 114 -38 -81 162 16 46 -20 161 -77
7582 -77 -55 211 -228 64 -2 -218 -119 -71 271 12 2 -116 -160 419 -7 105 -124 243 -68 142 69 -145 -5
7605 -5 -64 102 -168 -181 -268 -24 -57 261 -37 31 61 169 -141 -108 -259 60 52 -63 -38 -83 139 -67 -150 -35 -131
7630 -131 173 110 -137 28 -230 24 -304 -187 194 0 -49 139 -90 -89 -153 -188 94 229 324 -264 -14 -160
7652 -160 195 164 204 162 -263 84 64 173 85 261 63 -243 127 -25 -20 91 -143 57 -104 -26 -7 -140 -50
7675 -50 18 -44 199 75 -144 79 -184 -116 36 54 94 -106 -27 -5 -141 -284 15 69 -106 -42 -2 -123 -43 183
7699 183 -38 231 73 44 126 -205 -119 67 36 241 -257 -242 -54 -55 -126 -71 42 52 -156 6 -68 40 117 66
7723 66 125 -345 90 -61 -75 -192 -144 -225 373 40 -248 -126 12 -255 126 52 16 55 178 -118 -135 132 -323
7746 -323 -32 222 -22 -34 -50 -124 105 -44 29 -10 13 29 77 102 190 -21 -406 44 12 100 179 44 -83 104
7770 104 53 -263 -36 78 -10 -10 -47 -163 92 -91 -147 -171 -166 20 81 -146 -138 -84 269 -217 -1 208 -153 206
7794 206 -193 182 59 68 -34 -34 -153 70 127 40 45 -43 -44 102 94 127 6 -72 232 -179 -241 452 -18 -69 -142 4
7820 4 107 171 -2 12 -6 -15 83 -32 -5 81 -190 263 69 200 156 94 200 26 104 18 -407 -173 -49 77 -181
7845 -181 -1 105 -65 -73 -262 77 -53 -321 -223 -4 -84 204 -159 -117 -99 -147 -27 -108 141 -67 161 -108 24
7868 24 -132 -68 -48 -85 131 -131 59 68 191 67 180 163 -98 -73 -115 -119 -21 -209 31 -416 79 165 1 -16 198
7893 198 -101 -2 104 -18 -59 -188 4 119 -233 97 191 273 70 73 72 109 -105 37 173 161 -50 66 74 -185
7917 -185 189 -71 70 166 -84 245 -90 -9 -2 -43 173 -252 -107 -193 69 234 -251 209 -309 32 102 108 48
7940 48 -65 -52 84 114 -145 231 -261 204 -58 -242 145 -116 -39 125 66 49 5 -243 106 -156 121 -302
7962 -302 -182 444 11 12 -99 12 -105 -9 -51 71 -7 -141 -209 29 -73 73 -115 7 -289 -64 22 -37 129
7985 129 -214 -83 366 44 -25 -122 -206 44 -119 124 160 19 -117 121 -33 -152 -79 86 -269 -7 -151 144
8007 144 114 28 -32 -105 -283 274 165 -60 -42 -41 200 -223 23 -185 29 -43 51 214 -49 75 -11 -73 78 73
8031 73 20 -125 -133 115 -153 30 36 32 51 -198 40 214 195 -79 197 -49 129 -207 -133 106 -32 -169 -63 74
8055 74 12 133 -322 119 -69 199 -149 -212 37 -204 149 -31 -329 -264 -36 -103 62 -276 -339 -1 -31 -112 101
8078 101 -21 110 29 -266 26 -109 194 35 -158 22 304 -56 -213 -170 -131 -200 -82 -49 172 -66 228 -128
8100 -128 238 365 1 -109 127 18 133 172 43 273 98 141 -155 -16 179 147 273 51 143 -186 -200 47
8122 47 81 -91 -323 -396 -17 -15 -6 -44 243 216 159 0 -35 -79 -193 125 -60 -104 -82 -103 -8 -8 -188 130 -82 -126
8148 -126 138 27 -16 -47 -29 263 59 -100 69 -114 -47 -204 27 -107 -404 103 24 149 48 105 -3 -233
8170 -233 124 100 -146 184 47 -213 -57 -157 113 74 -101 -25 -69 -317 -22 -71 -150 -78 145 -18 -21
8191b1
$$ Imaginary data points
##PAGE= N=2
##DATA TABLE= (X++(I..I)), XYDATA
0 0 0 0 0 0 0 0 0 0 0 0 8 -8 8 -8 8 -16 16 -21 24 -32 34 -40 48 -56 69 -80 91 -104 120 -139 157 -179 204
33 204 -229 259 -289 327 -362 406 -452 502 -557 617 -682 754 -831 917 -1011 1113 -1225 1350
51 1350 -1486 1643 -1814 2007 -2227 2477 -2770 3114 -3523 4021 -4646 5451 -6529 8054 -10372
66 -10372 14282 -22087 43463 -218287 -618532 211879 485469 -171260 -351998 163219 186313
77 186313 -166808 -118786 124605 64854 -41946 -68440 -99148 20070 212194 21569 -287589
88 -287589 -92365 264377 90462 -208175 -58820 129189 -20885 -95875 54507 68382
98 68382 -51636 -44008 -12430 -20085 74952 96102 -120360 -162993 117807 180131 -92818 -139799
110 -139799 73388 67664 -73053 151 86864 -18147 -72342 6768 30604 27753 49271 -34539
122 -34539 -109049 38635 146460 -27048 -116906 53085 70085 -87809 -1215 151574 -31083
133 -31083 -175038 64737 170773 -81142 -107320 128846 47711 -169204 10712 211064
143 211064 -27368 -203596 38816 164940 -39358 -93298 55587 32832 -68679 4119
153 4119 68830 -10062 -37675 2447 -20450 -3384 75874 9588 -111506 -20677 105844 6014
165 6014 -87804 20896 54710 -67942 -43853 88574 29749 -94330 -28511 58088 609
176 609 -25369 24129 -12180 -58304 16376 55901 -21936 -40331 15328 -1976 -30830 27688
188 27688 37878 -44467 -44224 32906 23428 -18582 6262 2484 -42023 825 58876 -6740 -52867
201 -52867 22678 30344 -50886 -3818 86144 -9313 -105422 19102 110272 -21291 -86216 38517
213 38517 62922 -50198 -34730 68503 31615 -59552 -24726 43570 29651 -2504 -15831 -22465
225 -22465 12242 46205 -2410 -42363 17182 43810 -32043 -35837 58608 41727 -65264 -38926
237 -38926 62188 35226 -40528 -14919 21500 -7601 -5876 26709 -2454 -30701 7961 19051
249 19051 -20460 -5219 33845 -7545 -50097 5092 48361 -4573 -40088 -5746 13121 811
261 811 1783 -3294 -19108 -2761 14367 -12863 -16551 24376 8511 -48663 -16218 52165 14001
274 14001 -55155 -16805 38282 1073 -28787 9203 14787 -22965 -13403 20740 6879 -13677
286 -13677 -766 -1055 -11930 10142 21855 -12823 -23692 9689 18092 -5346 -2965 8764 -6975
299 -6975 -8198 17121 11232 -11937 -251 12157 -7806 -4295 26749 10434 -30058 -6600 35446
312 35446 10488 -23345 1629 20704 -5660 -10900 17590 14811 -13082 -8850 9985 9019 4786
325 4786 1525 -9220 -4822 14214 9945 -10882 -4493 11259 -3007 -11859 11731 14670 -14921
338 -14921 -16847 11902 11814 -9462 -5312 4168 -7348 -6329 10722 3038 -14258 -6075 6282 -3179
352 -3179 -6107 6091 -839 -16186 -4421 11344 526 -10927 -4739 -448 -3420 1507 3320 -7508
366 -7508 -8476 2755 1556 -4639 1237 2462 -9661 -7983 10024 7905 -10447 -7819 6305 1846
380 1846 -4250 3430 4777 -6493 -5275 7314 6376 -2520 -1519 575 -879 3867 7081 58 -4503
395 -4503 1899 5700 891 1788 5550 -891 -3751 4856 9049 1608 -3526 598 2829 2925 5009 2110
411 2110 -4392 364 7225 2564 -2846 2830 5131 -3853 -4396 7848 8267 -4916 -9042 2088 9094
426 9094 2116 -7008 -5153 3993 4968 -4344 -6289 4426 5878 -8987 -10464 7341 10975 -8670
440 -8670 -16213 2384 12200 -2779 -12660 -2601 5701 -810 -7473 -2772 2991 277 -6397 -7046 1659
455 1659 6696 -2849 -12281 -3935 8909 4224 -9776 -7748 5376 4816 -5266 -5471 3513 3730 -5117
470 -5117 -4433 3963 5101 -1129 -4176 -809 3062 4342 1774 -3184 -3595 4455 7710 -632 -5500 2854
486 2854 8277 438 -5255 3408 9388 568 -5855 1153 8686 5459 -2103 -4525 1153 9205 7552
501 7552 -6636 -8998 9382 14834 -7191 -15293 10392 19879 -9871 -21030 11089 24665 -8758
514 -8758 -25317 6453 24394 -3280 -21763 -456 16682 1753 -14103 -5736 8380 6407 -6781
527 -6781 -12534 65 13771 1757 -19648 -9899 17554 10991 -20720 -17078 16573 14643 -18376
540 -18376 -17177 13745 13947 -15746 -16691 10310 13005 -9412 -13771 2940 8666 -743 -6594 -3793
554 -3793 1110 4302 1241 -6908 -3744 8066 4762 -9748 -5475 11850 7398 -12072 -6006 13609
568 13609 6310 -10937 -1619 11350 76 -7767 7446 9596 -9277 -5307 15659 6475 -15537
581 -15537 -1080 21013 1508 -19407 3466 22971 -1828 -19196 4217 19144 -750 -12880
593 -12880 1827 10113 1254 -3129 -1794 -555 5666 5377 -7297 -8772 10879 13148 -13342 -16081
607 -16081 14530 18163 -14247 -19551 12128 18340 -11752 -18310 7965 15193 -7448 -15433 2473
620 2473 11804 -2010 -11780 -4057 6329 4406 -5470 -9295 -636 8065 1452 -11036 -6924 9541
634 9541 6322 -13049 -10093 11806 9066 -14545 -11953 12925 9619 -14157 -9214 12296 5153 -12110
648 -12110 -2504 10548 -1612 -9659 4849 7839 -6651 -4811 9019 3424 -9134 -19 11020
661 11020 -98 -8545 2767 8188 -604 -3171 2289 2277 548 3281 938 -3888 3302 8434 -2231
676 -2231 -7619 6091 11231 -4545 -9891 7075 12245 -4036 -9348 4137 10183 -458 -7808 -365
690 -365 7276 2929 -5167 -4008 4788 6103 -3398 -7538 1644 7762 -222 -9158 -2802 7633 3794
705 3794 -7782 -7314 5430 7192 -6765 -10643 4185 9512 -6248 -12623 3533 10490 -5383 -11739
719 -11739 2426 8320 -3797 -8420 1203 4008 -2613 -4070 -251 439 -138 -561 -2661 -1800 2635
734 2635 1475 -4056 -2842 3629 1867 -3651 -1247 2732 337 -1730 458 1213 -440 565 1294 -782
750 -782 266 3189 998 -2383 891 4321 911 -2278 1157 3883 245 -999 1924 2495 224 97
766 97 1410 1409 1043 1047 236 333 1553 866 -174 560 969 487 137 694 75 -376 956 915 -1307 -295 1879
787 1879 -94 -2458 345 2342 -1354 -2940 585 1832 -2181 -2588 903 642 -2355 -1899 530 191
803 191 -2118 -1771 -246 -262 -700 -2087 -1299 651 -180 -2362 -1489 1118 -133 -3060 -898 1905 -458
820 -458 -2724 -809 1567 -310 -1835 -62 777 -1060 -759 531 120 -761 410 436 -271 -2 1096
837 1096 547 -404 479 1308 789 394 165 1052 1281 1186 119 633 1821 1231 -570 651 2327 1040
855 1040 -732 600 2248 728 -390 691 1474 787 224 406 842 626 766 120 -167 601 1265 -85
873 -85 -896 654 1266 -537 -1143 -183 648 -542 -819 -416 -46 -273 -810 -1416 -425 511 -903 -2102 -406
892 -406 891 -1037 -2481 -232 841 -1217 -2296 -167 584 -1374 -1953 -81 299 -794 -1587 -718 274
909 274 -279 -1097 -1286 -38 548 -1000 -1493 631 1065 -1156 -1261 551 1259 -1209 -1062 1024 840 -147
927 -147 -182 498 509 479 324 217 436 1183 946 -597 849 1894 679 -531 482 1988 514 -177 859
946 859 1073 693 630 478 459 1068 914 70 -39 1354 1269 -802 -147 1524 856 -676 1 794 -205 -245
966 -245 129 -398 -525 668 405 -1693 -660 1580 46 -2517 -444 1511 -355 -2364 -150 625 -746
983 -746 -1126 -683 -729 -160 -140 -1390 -1650 503 842 -1948 -2055 1099 821 -2313 -1653 1078 626 -1472 -862
1002 -862 75 261 -251 -827 -907 299 1037 -1000 -1775 1111 2032 -1347 -1516 1478 1206 -1407 -309 1581
1020 1581 123 -179 1494 784 -1175 702 2490 -733 -1491 2255 2573 -1400 -987 2569 1716 -1282
1036 -1282 335 1940 71 -110 1562 198 -1005 1461 2141 -1619 -1461 3017 1799 -2885 -1291 3184
1052 3184 1303 -2914 -946 2378 611 -1375 -871 416 1099 -323 -1547 -1107 1084 709 -1948 -2028
1068 -2028 962 1339 -1636 -2248 55 1156 -495 -2078 -1283 1081 1434 -1972 -2698 1744 2419 -2982
1084 -2982 -3488 2430 2682 -3522 -2999 2795 1121 -3301 -850 2586 -707 -1714 1509 208 -1985 656
1100 656 2608 -2138 -2470 3138 2406 -3674 -1137 4667 706 -3721 949 3981 -1097 -1824 2728 1720
1116 1720 -2294 540 3300 -775 -2179 2568 2591 -2153 -866 3328 1318 -2504 62 2721 630
1131 630 -1274 447 869 441 352 -206 -96 978 767 -229 -1119 919 1358 -459 -994 81 549 209
1149 209 -1173 -1450 1089 2059 -1509 -3285 1464 2980 -2674 -3555 2420 2768 -3332 -3107 2833 1278
1165 1278 -3475 -1097 2186 -1333 -1882 1161 -224 -2396 761 2171 -2444 -2680 3438 1246 -4393
1180 -4393 -974 4008 -221 -4365 1167 3382 -1910 -2444 2413 1341 -2396 30 2312 -997 -1513
1195 -1513 2199 921 -1924 272 2288 -580 -1422 1568 1669 -1427 200 1953 312 -892 1093
1210 1093 1212 -795 396 1649 -61 -164 1344 727 -317 494 828 -288 281 1421 -354 -900 1633
1227 1633 1061 -1770 -222 2287 -127 -2546 654 2079 -1666 -1970 1443 604 -2226 85 1544 -1017
1243 -1017 -1406 1238 211 -2073 367 1790 -1781 -2181 1999 845 -3004 -850 2433 -828 -2760
1258 -2760 868 1517 -2191 -1227 1730 -181 -2079 698 1297 -1812 -645 1740 -471 -2032 847 1500
1274 1500 -1649 -926 1759 349 -2062 453 1592 -738 -1305 1690 706 -1226 227 1694 -788 -557
1290 -557 1558 440 -944 765 1753 -797 -415 1709 374 -1482 778 1838 -700 -947 1649 831
1306 831 -1185 172 1660 -533 -710 1439 476 -1213 385 1617 -622 -802 1702 425 -1442 179
1322 179 1365 -745 -1257 918 548 -1418 -102 1394 -822 -1426 990 608 -1677 -427 1163 -928
1338 -928 -2041 617 636 -1468 -604 1209 -543 -1747 366 493 -1360 -599 1161 -313 -1751 275
1354 275 754 -1117 -796 1285 92 -1421 368 1001 -997 -844 1130 202 -1251 368 1259 -679 -624
1371 -624 1208 304 -1034 522 1091 -674 -528 1419 595 -1085 384 1157 -45 -528 1142 568 -741
1388 -741 631 1230 -279 -429 1192 806 -969 258 1419 -211 -747 1376 772 -920 309 1232 -293
1405 -293 -936 1006 696 -1264 -181 1249 -320 -918 698 883 -803 -397 624 -110 -1246 248 241
1422 241 -1105 -424 620 -578 -930 685 553 -1199 -821 678 -229 -1367 195 656 -958 -818 624
1439 624 -43 -1489 95 372 -836 -836 693 175 -1010 416 782 -713 -648 609 315 -663 41 590
1457 590 -546 -766 676 331 -469 191 654 -239 -272 662 473 -393 249 650 -3 -170 846 405 -432
1476 -432 298 761 46 -595 605 479 -64 255 844 49 -62 608 540 -385 358 800 -290 -316 654 535
1496 535 -646 -13 726 -216 -671 426 494 -864 -283 598 -15 -519 371 413 -566 -703 520 109 -994
1515 -994 -50 428 -535 -583 27 -92 -518 -207 -4 -626 -573 58 -195 -606 -597 43 -139 -683 -53 -28 -260 -443
1537 -443 -217 -75 -123 -16 -23 -284 146 -230 -212 -46 167 -197 -324 46 588 -50 -241 411 207 -1 -13 527
1559 527 169 179 711 381 -133 116 541 312 -450 375 397 -32 -147 698 371 -223 108 348 192 -8 304
1580 304 529 156 -18 272 407 -49 125 369 124 -338 118 462 132 -316 144 68 91 -273 -170 172 -25
1601 -25 -153 -74 153 -237 -617 98 -152 -418 -116 -54 -506 -353 -83 -111 -407 -222 422 -225 -693 -55 154
1622 154 -170 -457 38 226 -285 -375 -153 -204 -315 -239 50 335 -272 75 299 -256 -213 462 335 -437 49
1643 49 375 188 -467 453 764 -284 -332 238 580 -195 -223 606 486 -488 249 552 132 -297 378 530 -332
1664 -332 -171 596 551 -325 -133 623 174 -81 242 802 -67 -445 188 297 -313 -184 404 -328 -454 400
1684 400 329 -479 -250 444 -103 -441 -264 105 -17 -763 -392 140 -401 -388 -41 228 -413 -252 -276 33 -301
1705 -301 -187 -12 -24 -448 -270 153 -443 -606 -79 122 -336 -346 372 -72 -369 -102 312 72 -540 119 426
1726 426 -288 57 263 244 -589 -301 668 65 -6 265 170 -100 -159 494 242 -346 201 501 -2 -330 402
1747 402 410 -225 -159 289 460 -64 403 515 240 -22 135 630 -151 9 263 148 -153 -137 273 183 -26 -17
1769 -17 399 -43 -199 52 172 26 -87 51 219 -31 -278 -92 -384 -179 -32 121 -259 -197 -267 -114 -323
1790 -323 -288 -164 -40 -179 -138 57 -140 -221 -139 174 -151 -565 1 2 -393 -234 -359 -138 -6 35 12 -102 -239
1813 -239 161 -5 -323 -154 416 168 -171 142 -198 -24 63 286 66 -166 146 306 2 -42 9 25 -14 -54
1835 -54 475 42 89 101 174 231 261 66 283 95 179 40 100 326 87 226 -68 234 9 -35 151 154 -46 238
1859 238 179 -259 251 147 176 -63 2 156 -380 -68 71 -71 -314 -274 157 -196 -124 8 -18 -302 -641 58
1881 58 33 -285 -477 -134 -193 18 -88 35 -177 -248 137 -197 -259 -135 267 -44 -244 0 52 -391 -122 -82
1903 -82 0 53 -73 -128 12 -207 -134 -57 74 197 43 299 -36 -54 -178 -42 187 100 -56 86 281 90 51
1926 51 164 -31 103 201 52 209 39 394 151 -32 313 146 -5 109 -205 -21 -198 -13 148 124 -51
1947 -51 23 186 -203 153 -87 87 204 19 308 -5 -139 -44 154 -170 134 -231 -224 -265 69 -360 -39 93
1969 93 -106 5 -128 -67 -240 45 90 -82 14 108 277 -164 -390 -240 -76 28 -288 110 -142 -71 -182 262
1991 262 16 320 -158 -9 -102 25 45 -64 -108 5 5 -127 -8 282 188 -27 247 201 327 15 -82 169 -25
2014 -25 -52 249 -139 -23 271 108 13 121 120 108 83 92 113 297 269 138 40 41 321 228 61 -282 -288 16 0 161
2040 161 93 275 31 -138 146 91 68 -117 -111 -26 20 87 -71 48 -132 -44 -83 7 -310 -50 10 -178 -175 46 -74
2065 -74 -138 126 -74 95 -364 -278 26 -159 -425 -86 190 99 -256 102 15 -96 -326 208 108 -279 -337 -34
2087 -34 7 -477 -81 77 -140 -136 23 105 -227 -41 -19 -133 50 277 446 -77 153 185 184 74 -2 112 106 102 -220
2112 -220 33 93 -77 160 289 -32 -18 164 -137 93 -52 180 -211 220 -129 81 -47 -59 88 429 56
2133 56 -175 57 6 30 -74 24 -277 -268 -90 201 60 -40 -1 -108 -226 -303 274 -14 -138 -75 184 194 -279
2156 -279 -96 175 -233 -5 3 1 -275 -353 -106 46 -18 -129 83 -174 -140 -208 -87 -194 -140 -64 -107 -167 -19 158
2180 158 97 -109 -212 82 -45 -158 101 -289 255 192 -88 107 199 106 246 -55 -92 241 371 -40 -39 -142
2202 -142 58 229 -49 -66 206 90 -65 397 378 5 -163 312 196 -1 0 256 -157 -85 157 272 -57 23
2224 23 248 79 -192 78 218 48 73 136 8 -68 59 308 -29 -328 80 52 81 19 105 122 -124 -114 -70 -47
2248 -47 -211 -201 -237 -81 -226 -90 -113 -221 180 58 108 -232 -192 -165 153 -123 -190 82 -118 -74 138 -164 302
2271 302 -93 -18 35 68 -27 -5 103 -283 295 122 -100 129 491 -23 -54 -167 531 85 -137 108 389 184
2293 184 11 -51 24 78 246 207 271 -288 126 396 -12 -111 117 429 46 10 116 344 9 257 -81 66
2315 66 347 -91 195 -157 99 -224 31 -106 -16 205 -12 -158 164 18 -43 -16 -153 -27 -33 -170 -281 -152
2337 -152 197 -33 -93 24 -289 -30 109 201 -101 -166 60 -187 -228 -214 197 -238 -142 3 146 60 -81 195
2359 195 -184 16 140 145 -140 -260 441 82 -153 208 166 206 -251 -63 -13 -131 -142 490 -47 93 16 -90
2381 -90 -167 69 98 -35 22 120 223 91 -49 134 88 97 159 217 114 118 201 232 87 218 111 -48 -131 -13 31
2406 31 -128 274 196 -165 213 11 54 -40 73 105 -126 -45 57 -277 -223 345 346 -144 -72 25 -199 -243 -16 324
2430 324 -254 -51 131 -158 -268 -93 -81 -200 -139 -55 -154 44 95 -28 -234 -19 50 108 -42 -61 -87 -89 40 73
2454 73 64 -132 -71 -1 86 -106 55 234 -180 -65 -41 -199 -159 -32 31 -103 189 220 98 107 249 273 61 -111
2478 -111 273 102 135 262 389 -43 291 193 -215 -137 293 309 -22 51 61 -23 -75 203 135 -47 -122 497 187
2501 187 -207 -8 349 -231 -111 186 171 109 191 194 134 -132 341 -192 -109 109 60 -180 -296 -34 22 -218 105
2524 105 528 -319 -191 83 106 -382 55 -26 -298 -13 149 -176 -319 -42 -12 81 -235 67 -205 -391 -119
2545 -119 118 -194 35 72 -146 -128 -169 395 -282 118 323 469 -185 -35 420 188 39 307 162 -249 -82
2566 -82 152 25 -94 229 300 -83 -53 107 6 191 237 245 -45 178 92 23 -95 146 45 -101 -193 -62 30
2589 30 -136 231 -2 118 7 172 -74 190 -206 -19 -70 -3 218 89 14 176 156 -58 84 248 -253 -200
2611 -200 -76 127 -286 -156 72 49 -15 -350 30 -248 -226 -251 -52 76 24 -42 -254 -281 106 -50 -68 -327 25
2634 25 -12 -104 58 70 227 -129 -272 -217 -93 -406 151 231 -357 2 -141 -90 -81 -177 11 75 331 -183 200 141
2658 141 6 141 126 57 46 67 256 285 -145 251 172 -246 -76 158 -55 128 270 -21 -67 -185 168 214 -314
2681 -314 50 -88 -5 -132 392 118 -191 83 102 -101 -84 -179 176 -105 119 181 174 -49 151 331 -100 -349
2703 -349 -174 129 94 -29 -60 -103 -74 -358 24 125 -306 -8 47 -35 -167 -185 37 -69 -96 -50 -184 -44 87
2726 87 110 150 -18 -222 -105 -55 -289 -39 -89 -11 167 112 180 113 -42 -238 92 30 11 5 245 119 82 -110 295
2751 295 74 220 219 245 -101 145 124 77 419 94 -56 -149 -186 22 151 164 194 233 61 139 -86 46 -130 -107
2775 -107 50 -90 -168 279 -237 57 119 72 11 -100 -16 -64 95 -105 -59 -5 81 -19 -74 19 -216 -325 -143 -235
2799 -235 237 -143 -160 11 -29 108 -20 -54 -66 -143 53 -28 -156 227 57 -91 -41 -155 4 -169 27 86 137
2822 137 -3 -46 -115 -63 202 -222 -132 10 132 168 -30 -65 -49 93 -123 139 -107 -110 -61 147 -5 143 82 213
2846 213 99 147 -7 151 209 327 -35 268 -186 -68 -33 188 49 446 28 20 -226 85 5 24 187 78
2868 78 49 -251 414 -133 -190 -61 -62 -63 104 42 -23 -368 6 -13 -232 -214 123 35 -157 -74 -152 140 -335 -182 -151
2893 -151 108 -343 -84 101 173 -140 165 20 53 -68 -48 -130 29 -54 98 -6 15 117 -1 -55 -128 143 29
2916 29 55 166 -281 -14 115 -1 -63 183 76 235 184 93 177 150 -206 -121 -99 81 430 -61 296 338 163
2939 163 -233 71 153 23 -39 87 248 9 -202 46 48 95 175 149 -284 -78 151 -67 -121 -192 -144 -102 239 -26
2963 -26 159 -228 139 -1 21 76 240 7 -253 32 -44 97 -219 -158 -118 119 -139 -35 0 12 -34 -196 -113
2986 -113 -132 1 133 76 -162 -14 -143 -4 -151 32 -189 104 210 -125 -123 -60 -130 139 3 -61 -241 -82
3008 -82 72 -148 -42 -43 137 -63 -147 237 -445 182 163 -124 16 148 250 -47 -339 43 249 -129 319 98
3030 98 -209 -21 36 -64 328 86 213 99 145 124 43 -55 -68 263 173 35 -34 111 -237 73 137 112 -253 -108
3054 -108 283 -23 138 -252 192 77 -146 -215 23 -84 -205 -36 -105 -369 130 14 -45 92 201 -85 87
3075 87 -17 -91 13 -7 -84 151 -113 6 -372 -100 26 -283 -280 -26 203 -122 -48 50 46 -24 -189 66 14 101
3099 101 -121 128 -293 -14 88 201 63 -76 135 240 124 97 141 -150 255 87 -113 4 215 200 7
3120 7 21 26 79 96 51 179 -102 201 -6 339 -268 77 85 -59 -159 -222 -228 87 -91 -153 115 13 162 82 -100
3145 -100 -354 -173 -51 29 -43 -258 63 152 55 -364 -20 67 -181 -229 111 230 -36 -245 -110 -62 -135 -106 -183
3168 -183 -242 -206 17 -118 -290 -93 168 -203 -108 -72 32 19 125 99 95 -282 149 15 -122 -36 -33 -53 125 24
3192 24 74 66 -220 283 346 83 70 95 -184 -227 -109 228 139 -6 -149 99 17 55 15 -121 -380 49 144 134 -178
3217 -178 180 -18 110 82 -157 14 116 23 -270 3 41 -62 110 11 21 -136 -130 -179 101 14 23 179 -413 97
3241 97 -23 65 -46 -20 -90 -66 -70 324 45 128 65 65 -128 -289 94 36 -154 17 19 133 -252 -94 -103 -202 -98 -22
3267 -22 -9 155 37 -188 -142 13 40 -132 -314 -160 37 -66 13 300 11 -259 -44 61 -243 7 -192 157
3289 157 -6 -135 132 42 241 -93 -247 -46 -16 -137 -28 288 279 201 138 78 23 307 233 285 54 149 126 58
3313 58 -101 -246 139 -36 -105 -73 -82 116 113 -28 -17 -102 -205 -212 -139 -118 -188 -88 105 -354 19 84 111 406 -65
3338 -65 -206 111 -231 -119 -155 -19 88 113 -79 -137 -173 76 -255 58 -93 -63 -316 -27 126 249 -49 -145
3360 -145 -183 48 268 25 -113 230 -253 -228 6 -65 78 89 131 -140 220 87 -113 329 174 115 -19 232
3382 232 315 -196 371 26 -246 -36 0 -34 -22 167 92 109 -221 170 -295 54 196 199 87 -202 76 261 85
3405 85 95 1 23 121 -43 21 80 -82 114 87 129 98 -116 322 -40 142 -168 -150 89 22 297 34 -155 -162 -132
3430 -132 112 -68 -169 155 34 -73 -107 197 -126 59 -9 -31 -22 27 -234 -212 -48 41 -49 -264 95 154 63 41
3454 41 26 -116 80 114 192 -40 180 -47 -113 -254 -23 27 -70 -43 175 360 23 81 71 372 142 126 168 122
3478 122 -33 34 -221 180 287 -25 18 188 164 158 82 69 151 104 199 153 155 -156 123 37 155 326 -51 1 300
3503 300 -92 -105 241 40 20 -81 -296 84 -76 -143 -24 202 133 123 -61 112 18 -226 150 -11 -86 -236
3525 -236 -84 -15 152 221 -22 -251 78 -153 -277 -404 11 125 -39 322 -79 -118 150 45 -21 -64 308 -297
3547 -297 223 268 -226 -196 21 109 -37 -75 -169 26 177 76 95 -212 -196 -271 -84 14 178 86 154 -235 12 -25
3571 -25 -57 5 226 -21 4 -129 190 -59 70 23 79 -138 47 77 175 -211 17 157 -48 -85 2 271 -290
3594 -290 195 -9 41 -50 215 -141 101 -109 244 -24 75 66 25 -335 203 -50 156 -187 -6 -328 -222 132
3616 132 -218 -211 15 80 -171 218 -99 265 -179 -189 -117 -55 -166 -85 -91 95 -1 149 -21 -212 198 129 78 95
3640 95 -127 29 -145 -147 260 14 -293 -36 99 196 69 412 95 18 1 -52 102 81 -14 -75 -199 -173 -143 -78
3664 -78 18 184 460 164 119 -54 146 -52 -86 11 18 -53 226 78 178 8 -12 238 -154 -76 -89 -252 62 -17
3688 -17 139 19 -206 -43 -44 90 181 -241 222 223 31 -279 -178 202 -34 88 -62 -162 55 -61 -381 37
3710 37 -69 58 -18 -42 45 -138 40 -88 -126 -8 -62 -143 66 -88 47 -55 -193 176 -98 -197 71 -203 404
3733 404 63 32 136 106 99 -63 254 -59 -132 -203 312 -86 37 -259 151 373 -46 170 186 -114 261 174 199
3756 199 -89 67 112 -67 123 59 -11 79 240 99 -128 184 86 -182 234 47 -174 -18 -131 61 -54 -80
3778 -80 91 -166 -182 46 -85 -153 293 93 46 -163 -13 -319 -73 -100 51 50 -105 -329 387 -323 -223 -103
3800 -103 13 -131 -48 -267 -86 -265 70 46 -188 178 -118 -167 -70 -281 -268 -291 57 73 -65 -94 -418 15 -57
3823 -57 195 -5 332 63 55 99 6 -147 149 369 52 327 181 134 -44 51 91 -191 23 258 -118 -101 19
3846 19 23 167 -90 -20 -52 89 104 -296 -47 103 103 57 194 -32 42 29 17 -28 -382 -216 -125 -44 -62 146 89 -15
3872 -15 110 -30 -295 164 247 -56 -274 -102 -58 -45 3 -22 -7 -14 -61 -350 -107 13 -15 42 164 -71 -144 10
3896 10 -169 -352 130 231 -102 80 -250 -131 -135 -185 -107 6 224 7 10 323 -399 15 -120 199 -49 -155
3918 -155 109 -79 144 184 -111 175 30 28 124 90 126 344 -94 191 50 24 195 100 -40 -300 -82 -65 253
3941 253 207 -4 -35 250 48 -87 -56 157 -151 96 35 178 34 -273 114 14 45 25 106 -189 -232 -27 185
3964 185 171 206 -168 22 68 60 274 -185 -82 -15 58 55 -2 183 262 8 -144 -365 -122 -333 -45 58 -310 -37
3988 -37 -103 23 -91 93 277 -12 132 -135 37 -54 22 -67 -227 -166 118 -182 95 129 69 -248 -253 -73 92
4011 92 63 180 -30 -67 66 83 102 78 90 -183 -19 172 -221 -16 37 -133 412 -64 -195 -70 97 -80 -44
4034 -44 171 161 -38 -150 -28 355 93 346 -165 209 -4 -209 -26 -256 -373 -262 16 -29 146 -64 -256
4055 -256 62 -44 -93 -38 -254 5 -180 -50 -2 -195 122 -123 -137 15 23 21 -129 -130 -45 -8 -110 -38 -292 -321 -139
4080 -139 210 -29 111 86 37 -140 35 132 -1 -216 163 -271 -10 -15 -42 91 30 -174 -56 75 -184 100
4102 100 -144 123 -69 -35 49 -105 -79 207 -7 -3 66 137 242 210 69 -33 84 54 -43 1 -49 122 -229 77
4126 77 65 46 189 -75 -31 -35 -4 106 109 21 -101 -271 -303 61 84 -25 -335 90 -198 -169 216 83 -278 71
4150 71 -2 -28 -185 -216 -221 -92 -268 -95 148 -68 -144 -127 -178 -85 -18 4 -48 -21 -43 -301 -102 54 -14 -218 -311 -140
4176 -140 209 194 -16 182 -101 -31 -53 3 112 -75 87 -138 281 40 210 -177 -207 193 -71 243 126 -58
4198 -58 232 72 71 38 189 -140 67 146 292 46 60 33 -51 -176 67 285 -202 43 30 -73 -187 -191 -116 -18
4222 -18 -123 -59 263 -197 -91 -60 -109 148 -43 -21 -92 -118 -130 48 -72 -205 275 116 -184 41 185 -426 -192
4245 -192 115 13 -107 189 -209 -113 -98 -120 -181 34 -23 -15 27 30 106 -26 198 -118 -77 -30 -54 207 166 52 71
4270 71 275 53 -11 89 100 -246 158 156 -125 0 -36 121 -106 11 -21 38 252 63 89 -215 220 156 32
4293 32 -54 104 88 -31 88 -29 10 102 143 -3 25 99 276 -8 -104 58 238 -155 -140 90 -74 -127 -116 230
4317 230 -89 -40 47 -15 110 -111 -37 -205 263 -179 -220 -10 -205 -24 -159 10 246 -22 -176 170 -182 135
4339 135 -241 -358 63 -23 -204 -4 -427 44 117 6 62 -57 -9 3 -30 183 159 334 11 -92 -110 -9 341
4362 341 -127 97 -16 -43 214 -30 -116 223 -105 -148 156 -57 -35 127 14 305 -271 21 68 117 146 67 117
4385 117 274 81 -13 265 -49 170 162 -56 47 -11 182 -33 75 -205 20 -171 -78 55 -141 175 -96 -123
4407 -123 72 -265 -129 63 32 -96 -122 -103 137 19 33 191 -79 -23 -151 -5 -254 -119 69 -155 95 233
4429 233 -268 -117 50 -92 -44 -496 329 -93 -11 -35 -100 -218 -151 -127 159 -56 166 256 -156 6 324 254 -263
4452 -263 -131 -210 85 39 189 70 119 145 138 251 -134 -34 246 167 76 29 182 -16 131 250 -106 61 368
4475 368 135 189 189 83 -234 -2 163 2 -161 120 315 143 126 243 -91 -158 3 47 -3 -208 -14 17 -30
4498 -30 171 5 -129 10 115 -31 -242 -110 -176 -21 16 -148 135 -155 -201 -473 -265 -261 1 35 -201 -73
4520 -73 -47 76 -16 60 -32 153 -96 -105 -226 -229 -36 -47 -227 -47 -269 261 123 -72 162 13 251 3 346
4543 346 -18 -70 158 30 146 -18 -273 -107 -101 9 -91 -122 179 116 161 353 -19 207 3 -37 171 150 -8
4566 -8 -169 37 -73 238 423 22 227 235 -75 -287 -80 -1 195 157 92 -111 174 161 -92 120 -236 151 -271
4589 -271 -58 -128 125 218 114 -268 -63 -91 120 -154 -164 -57 67 -6 181 -158 -73 -81 -40 -216 32 -157 -39
4612 -39 173 40 -417 -20 69 -7 -54 -88 -80 -92 -95 -285 -62 237 192 -90 32 225 131 133 72 -112 -190 -64 195
4637 195 -28 45 -44 96 242 118 -48 121 4 71 -32 57 34 -186 9 -131 28 249 103 80 240 -43
4659 -43 313 -81 6 -17 -83 139 166 288 118 -133 247 103 241 -200 -5 42 134 34 2 -268 143 154 -97
4682 -97 127 32 110 -115 48 115 97 77 298 -73 -333 -66 113 -220 45 -84 -48 -169 18 -160 -145 -69 41
4705 41 -168 -212 -156 87 144 13 -75 -90 202 13 -100 -23 -300 -14 -101 -107 -12 -181 238 -114 147 -29 -142 154
4729 154 143 13 -81 106 -27 215 -159 -218 50 42 30 412 -97 -78 246 28 187 -1 38 158 202 111 -102
4752 -102 -62 -119 235 -53 332 93 349 30 -57 4 91 -133 97 109 -166 -119 155 -122 -122 -136 -46 43 123 -197
4776 -197 -174 -288 -80 153 -77 11 71 48 67 -157 -187 -103 -83 -121 47 -337 -102 287 244 -290 -286 140 62 -242
4800 -242 105 -209 -259 63 -28 -191 133 73 -202 -94 -89 8 284 -1 76 36 -216 156 -169 3 145 96 250
4823 250 49 26 86 -59 -51 66 153 26 261 130 -154 154 107 339 -247 120 -27 31 -223 -54 7 70 106
4846 106 -148 201 -161 -1 403 -59 104 123 -239 36 59 -44 -308 62 -165 -144 -24 -392 -41 -224 245
4867 245 -238 -81 -40 146 -68 -206 39 -36 238 -69 -220 -237 -157 -83 -179 -154 -195 58 -14 -187 195 -26 186
4890 186 -127 -234 -3 -93 -129 -174 38 -51 -16 10 -129 53 -130 -96 -16 -139 1 -72 -214 77 134 -169 279
4913 279 280 -111 -98 194 211 -107 177 -119 44 -252 -85 53 -36 109 165 345 109 -59 95 126 148 294 -69
4936 -69 -138 50 3 -59 8 -32 216 -113 -56 -115 -103 -15 31 227 -98 190 -87 -358 111 143 -297 -112 -9 -47
4960 -47 -211 47 -147 -28 -130 -134 48 158 87 121 -157 98 298 -149 -77 -42 126 -20 -278 -166 -19 163
4982 163 -236 -51 -143 66 -149 -80 -197 -180 -210 26 -65 -330 -97 -4 75 71 -28 -240 -75 330 85 180 110 -165
5006 -165 23 252 307 66 302 -310 175 -50 -123 -92 -91 -67 79 -134 -41 -120 -113 26 291 69 -121 255 48
5029 48 108 121 141 -353 63 258 140 89 9 -29 -63 52 -188 -21 91 265 -52 25 25 74 77 39 -43 49 -122 66
5055 66 157 105 -136 56 -46 -52 -180 29 -217 -125 79 -293 -285 -79 -273 -3 65 -77 77 -181 -63 -233 -159
5078 -159 -6 138 160 -363 -83 211 -347 -129 -263 129 86 48 -324 30 -124 -30 171 66 68 60 -14 82 156 -268
5102 -268 -162 -170 -21 169 47 -102 60 -208 -131 125 182 240 121 -85 263 131 -67 -82 -74 45 108 57 45 -174
5126 -174 -28 -73 -87 -167 -197 -207 -162 81 31 158 31 10 36 -69 -291 84 43 74 -178 -138 19 -307 -115 201
5150 201 -58 -198 -298 21 -14 -31 -71 -91 -174 -226 -22 -81 -305 -163 106 -123 -124 352 82 -29 165 -3 56
5173 56 -89 -141 -185 75 -294 -150 -91 104 168 -101 44 242 -90 -2 13 91 13 -154 -151 190 71 93 9 -47 68
5198 68 67 38 -69 53 39 125 -133 287 176 -219 -81 -72 1 -216 -25 -225 49 -198 241 -2 -77 4 7 -24 -58
5223 -58 -20 -7 101 -11 -231 -129 68 10 71 158 88 -130 -38 -323 -141 -73 122 -40 73 89 -352 -107 -112 -13
5247 -13 -29 -238 -204 -155 107 144 -113 -123 -104 16 102 146 -68 -287 -22 117 -13 -28 188 -44 9 105 234 190
5271 190 147 182 52 275 -23 274 85 -181 -15 -80 196 255 -79 266 168 7 177 -17 -19 235 -4 199
5293 199 -36 -119 152 -112 75 -142 69 -279 -84 218 85 -2 -280 -221 28 -74 -13 8 20 158 1 -27
5315 -27 175 -30 -163 -52 -131 -93 -136 302 -334 -94 114 -140 36 -119 -71 -77 -312 -313 -11 43 -109 14 -243
5338 -243 -168 -19 -66 38 -206 69 -17 -15 -5 -125 -118 150 -35 272 105 -178 -57 -28 -3 10 -18 -232 -48 181
5362 181 -16 72 -4 103 220 -98 186 1 88 -94 242 234 98 36 109 185 233 76 234 72 -17 -6 -291 1
5386 1 367 240 106 48 -104 -46 -68 -98 4 82 -25 -37 130 83 231 3 -173 65 220 13 193 -142 132
5409 132 -129 -197 35 -90 46 -155 -19 59 -145 319 56 -130 -32 -12 -259 -101 -95 -137 207 63 -180 72
5431 72 -118 -68 51 155 -19 -86 38 152 -247 62 -189 -186 -49 -223 364 -13 -171 -408 37 -81 -62 -17
5453 -17 -70 -71 -214 60 33 150 -124 -83 -204 4 35 -339 -35 78 75 98 -126 186 253 243 136 197 36 56 64
5478 64 41 201 154 144 26 -116 5 213 -152 -207 171 -203 136 30 19 135 152 -164 -178 160 154 -106 -284
5501 -284 -196 -182 28 131 117 -370 108 147 -96 38 272 -57 -126 241 -223 -300 -59 -74 -38 -109 -79 -20 69 115
5525 115 -154 17 -79 282 198 -284 54 -118 -38 -218 127 -117 -174 214 -266 230 -128 17 -197 33 63 -10
5547 -10 -262 129 389 -119 279 -13 -146 -65 198 169 2 56 358 -22 134 -137 55 5 -201 3 -45 10
5569 10 -178 -63 67 -126 130 -16 16 9 220 -190 105 -116 -49 -169 21 150 -107 -107 -210 45 -57 316
5591 316 -114 -174 -120 271 -28 -91 57 140 72 -32 -57 -285 -151 -77 164 289 186 -62 25 -317 -194 -40 -213
5614 -213 -117 -269 85 -275 47 -18 -143 -3 13 76 -319 -52 290 -18 -51 -8 -196 -121 -74 190 138 31 -81
5637 -81 -19 236 283 -233 221 69 39 -174 117 28 -10 285 14 82 -166 82 53 -177 -22 96 176 74 77 -69
5661 -69 -133 100 40 50 45 -63 -31 80 -16 51 -140 53 33 -31 -11 -186 -81 -39 31 23 49 -139 -79 194 135 13
5687 13 -159 -390 71 178 -87 17 -355 42 -92 -259 136 -5 -451 -296 -42 -33 65 -168 128 -10 142
5708 142 232 19 -121 126 224 -199 -55 -25 -52 12 -21 -330 -183 -12 -117 -88 201 -58 86 26 -163 176 -3
5731 -3 1 61 23 -169 -227 90 212 162 162 -128 127 56 156 -182 68 -44 92 5 93 57 65 -147 176 323 36
5756 36 35 177 -34 -227 -188 -7 99 -160 -41 31 -250 107 78 132 -186 149 -12 194 -98 -90 -47 -149 58
5779 58 23 -6 158 -350 -7 67 -142 121 104 -61 -248 -16 74 106 129 76 -120 -290 125 -131 47 -28 54 -107
5803 -107 -164 -65 -34 5 -121 54 -35 -45 115 -283 -11 55 -17 207 69 78 60 -58 -170 167 -181 32 97 185
5827 185 148 -9 -282 137 -49 70 -35 24 326 -68 -213 76 31 169 251 21 229 25 113 -62 201 61
5849 61 20 -15 36 257 227 219 -53 -11 -128 -161 177 -89 65 -36 3 6 -206 -5 21 27 131 -144 149 -101 -199
5874 -199 108 263 -17 4 84 18 182 -187 35 103 -241 -52 -300 -107 16 -258 -97 -73 -55 -317 -331 46
5896 46 -201 31 38 -81 157 113 97 196 151 -138 -23 -20 -241 -120 220 -235 -67 -15 139 -50 165 437 -81
5919 -81 -93 179 -58 92 -316 232 -87 36 96 -60 216 46 -167 -12 -95 -183 51 -72 -15 11 138 52 306
5942 306 215 -52 355 54 19 36 -24 -16 61 196 -72 -100 -155 -32 114 69 -18 -174 -118 45 5 227 -45 254
5966 254 36 -103 -302 -318 -79 205 142 -150 169 3 -24 199 -55 6 214 -240 114 -199 151 -314 186
5987 186 -181 -154 -20 0 -82 -36 -203 181 -2 -113 -150 -247 35 62 -200 1 135 158 -161 19 77 -40 196
6010 196 126 201 88 -25 62 96 36 83 103 -114 336 108 65 -115 -20 265 -246 95 -11 -95 -34 83 13 114
6034 114 -243 12 110 88 -128 -16 180 -34 -74 -19 7 -107 -132 -158 8 -134 102 -41 -56 31 -166 -2 200
6057 200 71 85 -31 -89 70 147 -75 -104 31 -304 -226 164 -42 -223 -194 -340 276 223 -155 -181 -73 -40 -8
6080 -8 -11 339 -147 36 -169 105 108 75 -82 87 -13 104 96 171 77 235 -128 143 -64 -147 49 -196 44 404
6104 404 103 39 12 73 195 -232 406 104 243 189 -90 90 29 -23 22 -291 131 27 266 -5 -100 71 210
6127 210 -133 -59 224 104 114 -19 -87 2 -230 129 -48 -107 -101 -115 56 32 2 -67 -145 -169 -1 21 46 -252 -8
6152 -8 91 -202 -168 21 -63 75 69 -115 -3 200 -41 -76 -130 -66 -123 146 -16 216 83 -214 -71 78 94 -90
6176 -90 66 226 170 -106 -99 53 150 -1 -14 -100 -63 -78 -179 109 -157 -82 -159 -63 -114 94 71 91 -57 -42 30 113
6202 113 91 -129 -6 -17 99 41 34 -58 -95 39 -6 -52 -50 -25 -35 -82 235 -116 81 -70 -377 -73 -193 42 217
6227 217 -8 143 -53 83 -2 -99 345 13 -82 -76 -125 -115 -142 -139 -120 -258 72 -62 46 5 38 5 165 -164 107
6252 107 -222 -22 -22 145 -49 208 237 250 27 -75 -98 -169 -52 1 225 -3 -6 117 19 -33 -181 196 -32 -77
6276 -77 64 160 -106 -97 7 211 257 5 12 6 187 192 -20 -51 -63 310 267 -44 -105 202 186 96 -72 -154 257 97
6302 97 -36 106 437 168 13 160 -83 -125 -246 -137 -108 212 -88 -109 223 54 -64 70 68 -49 -301 -186
6324 -186 -17 -35 -88 -253 -159 -223 -159 -116 -211 77 -130 -65 -167 -95 -141 105 230 18 -92 -85 -198 13 142 -124
6348 -124 20 -25 -70 -225 -51 -136 -218 -159 -95 -203 -17 103 -42 -94 -3 -81 52 37 -163 105 83 83 67 -238 290
6373 290 -57 4 184 142 56 25 302 121 115 -8 150 141 -56 21 -242 102 -108 -91 320 -120 43 43 202 -38
6397 -38 130 -176 15 -152 63 -59 37 -70 -240 -84 53 -61 21 -342 -135 -132 -91 -347 -286 -147 -27 63 -201
6420 -201 113 -272 46 39 -195 -20 118 20 -72 -3 -293 -145 31 -39 -130 -238 -109 65 -106 -85 32 18 215
6443 215 47 121 303 60 19 -141 65 162 72 32 131 -206 59 72 282 107 -111 -106 -82 -11 200 -19 -199 94
6467 94 160 63 214 -210 -413 6 55 -31 119 -23 -38 211 11 78 119 194 -224 170 -197 -228 -159 16 -63 114
6491 114 147 -70 112 -14 39 23 -139 81 -86 -39 -71 89 82 -112 1 -84 58 -50 -142 161 109 16 -47 -24
6515 -24 -133 7 -8 67 192 38 273 -10 140 26 65 293 171 214 -110 114 120 -150 -187 171 194 80 -65
6538 -65 53 -132 195 -91 65 84 -282 239 215 -191 67 -51 -165 -186 -61 381 198 125 -35 8 -169 -185
6560 -185 126 16 233 100 -204 98 -315 26 -3 207 -13 330 -6 -57 73 -84 -224 191 -147 194 -137
6581 -137 -31 42 35 -48 13 -105 -263 -154 -24 -51 65 33 -150 126 -62 35 -372 185 1 -80 -260 -376 -61
6604 -61 -302 -30 256 -93 -13 176 -21 96 -309 -87 102 -121 45 -96 177 -24 73 -83 -42 16 -159 136
6626 136 176 173 122 -198 -11 -47 167 -206 82 71 -22 -84 79 87 -3 184 -122 45 -15 -131 -160 29 30 167 77
6651 77 -82 -66 200 53 108 112 18 2 170 54 -263 -37 -78 -175 141 5 -89 8 -91 36 -185 -59 297 123
6675 123 -180 91 33 -38 -99 96 74 -196 -24 -65 76 15 220 44 123 -56 -208 103 -22 245 -2 1 -234
6698 -234 74 -73 130 8 -129 135 33 -56 -18 -153 21 -207 -92 168 191 -3 -114 46 100 59 218 -208
6720 -208 60 64 41 20 88 -58 142 -45 89 180 79 14 -5 -61 -23 116 33 69 -6 37 -76 25 186 -252 14
6745 14 -153 -55 -180 -123 270 115 102 -111 49 6 -17 292 -51 31 -33 -177 158 111 -15 138 -199 113 -220
6768 -220 -156 -181 160 253 19 -40 -222 -51 45 -130 -189 67 61 -100 -173 -79 -286 241 103 -100 -100 -95 259 -69 -94
6793 -94 -102 180 -261 10 -7 29 -38 87 -89 -115 -22 -46 179 -78 79 162 143 -65 -101 124 -105 -187 110 -113
6817 -113 76 248 129 -15 -59 40 -196 76 19 -18 258 -213 117 44 83 57 168 -107 94 -157 169 21
6839 21 94 33 -123 181 119 -36 -21 154 4 -75 -7 -121 98 107 -123 -313 -231 202 -131 139 -208 -184 41 -294
6863 -294 -14 -141 295 3 -167 89 -28 -52 3 90 -43 51 -92 90 -75 53 122 -76 -23 15 46 206 275
6886 275 -60 243 -13 158 -157 228 -78 149 -160 142 29 -206 194 64 -87 70 231 85 112 56 169
6907 169 155 169 -177 -46 -92 116 226 162 17 111 20 86 -153 255 47 8 234 193 195 -188 121 -225 148 145
6931 145 -47 -26 136 -91 30 100 -60 -67 -69 168 -165 -90 -23 -262 11 -225 32 140 -72 74 176 52 -83
6954 -83 -126 -190 -218 -80 96 -57 -279 -2 -171 -328 -171 -106 -21 -98 -59 -166 -119 -53 -22 -48 132 -135 -31 -84
6978 -84 14 237 -112 -226 -15 124 -37 352 -190 -22 -20 -110 -151 153 -2 -457 211 -205 -53 336 234 27
7000 27 -157 -170 -119 272 -29 173 -77 -76 -162 -183 -92 -29 355 114 154 135 104 195 34 -197 6 82 -109 172 204
7025 204 -172 -50 -269 -246 50 -217 -22 134 -206 118 -149 116 -3 88 45 -132 167 95 201 -177 130
7046 130 150 -314 56 13 -97 -146 103 -27 -96 197 -143 182 -74 217 -7 205 -83 -85 118 -25 -151 152
7068 152 -66 71 -94 15 -86 -110 65 -160 38 -51 62 -81 117 -73 63 -102 -149 -78 63 -109 -220
7089 -220 -66 134 -134 -182 123 -47 63 163 144 67 -111 195 -12 20 -137 -34 194 117 -43 -142 -94 133
7111 133 -179 56 120 196 -71 1 52 414 -351 -45 80 -103 -85 -71 11 49 -84 21 -134 25 -195 -97 25
7134 25 -150 7 -79 -89 -137 -127 13 133 -59 -288 -319 217 -51 64 -41 -96 -149 -63 -1 -73 24 -280 -63 -49
7158 -49 17 -160 131 0 -192 20 -88 -157 -227 -72 133 41 7 -83 -150 -72 -254 103 -39 91 119 67 -353 8
7182 8 102 -18 57 115 -196 19 173 50 81 253 -4 107 126 -252 270 -73 -35 128 70 52 153 -17 12 -91
7206 -91 61 -317 -39 -15 -37 -178 7 54 -68 35 -315 -280 -104 25 -81 -52 -116 -207 -183 234 84 135 -73
7229 -73 -124 108 26 -62 -229 262 -234 -151 11 -77 -120 128 -59 57 -131 86 229 -119 65 -184 -26 59 -238
7252 -238 158 12 96 -23 282 -15 -58 -79 115 122 -65 116 158 -200 -83 16 -210 126 138 205 -371 243 -75
7275 -75 25 -15 -77 -103 152 26 197 -33 28 -4 -24 155 133 -151 -195 334 7 120 197 -112 97 174 46 -96
7299 -96 39 -59 -203 -41 1 65 32 -96 57 12 15 -62 -129 -129 155 -192 -31 -20 -232 23 -153 -205 -98 -33 45
7324 45 -317 71 -106 -200 -55 85 68 -264 11 -101 65 11 -13 -168 -11 -9 28 -129 207 243 -57 10 -145
7347 -145 -31 187 -98 -23 -305 123 50 114 12 -84 64 -160 -234 154 218 -29 -108 22 -7 -91 269 -324 80
7370 80 132 229 -21 -115 62 -27 393 118 -15 -150 2 -94 -19 65 126 -240 111 -102 -249 -113 -139 72 -228
7393 -228 195 -155 -70 -18 -303 -197 192 167 48 282 60 206 -3 -99 -79 118 -123 -177 310 134 -163 -313
7415 -313 -73 -210 229 -147 -35 47 51 -233 -69 -104 57 169 73 46 -82 68 20 -101 32 -164 -82 68 56
7438 56 53 -32 303 -67 1 543 67 281 -101 -63 154 185 -149 60 139 254 -37 -115 170 -291 -138 -148 43
7461 43 -138 72 140 -86 171 37 22 1 -90 -147 -39 -220 145 98 -148 189 -97 -121 -55 7 -131 1 103
7484 103 237 195 -18 151 197 -175 -169 29 -52 -192 -72 234 143 -208 -150 -192 -226 56 -12 63 -117 -47 -107 65
7508 65 -33 -30 118 -159 40 7 -184 26 287 133 7 -145 -174 -52 76 53 237 -150 -186 80 35 -77 -156
7531 -156 18 173 96 168 -104 66 52 -29 -68 -191 -6 90 204 -34 39 107 30 282 -186 41 -9 2 167 -166
7555 -166 113 195 -12 -110 -72 -74 -5 -103 -129 -39 -139 -77 55 69 21 99 -23 -113 143 -146 -120 -136 30 55 -24 -100
7581 -100 -147 -43 -72 186 20 145 75 -96 -147 -109 109 -116 221 67 -2 -47 120 -22 -166 -112 6 -107 -146
7604 -146 85 -81 82 47 65 130 -56 100 -129 110 152 -184 -90 -16 69 97 0 7 -28 174 88 57 -381 163 58
7629 58 30 -50 48 36 -283 -20 -4 90 55 -209 87 -130 -63 -131 161 -224 -59 -69 -33 -92 -148 3 206 83 -32
7654 -32 106 122 237 -45 54 210 -97 43 59 -216 -385 28 -22 48 -354 12 115 -205 -211 21 215 -23 -29
7677 -29 -228 -71 -109 -104 192 -128 65 -32 -42 -181 -70 31 -116 -207 -182 99 122 84 -24 -69 120 -218 78 199
7701 199 -16 47 -5 -77 64 -46 -146 -1 -74 70 64 100 -48 -55 -152 -82 36 -30 131 199 -168 58 291 -6
7725 -6 47 10 121 182 135 -262 -65 -198 -113 -103 170 -54 22 134 -92 3 10 188 35 -51 86 -152 -240 -79 -7
7750 -7 -19 -258 135 3 4 64 -72 40 56 -129 232 -315 174 -29 190 -241 72 48 -101 -1 -273 -158 153
7773 153 278 -103 79 -84 -153 -34 198 -89 347 34 176 -89 214 -55 127 76 -54 253 37 -360 -27
7794 -27 270 -47 -190 -82 66 -78 -318 -13 227 53 -158 110 89 -80 -53 208 64 -69 56 -78 43
7815 43 100 135 41 17 -143 -90 130 -243 -6 2 101 101 100 190 187 130 72 -93 115 241 6 -218 111 -79 -77 -149 -241
7842 -241 -85 14 -157 118 -182 -208 -88 -85 -16 111 276 52 -144 126 -122 43 -62 -67 -29 -27 63 -111 353 -217
7866 -217 -76 -202 -112 -184 -57 -155 -78 131 -79 60 103 151 -128 156 -71 45 -87 -53 -43 -108 178 -20 -144
7889 -144 357 -157 164 34 117 -105 255 175 197 -93 -68 113 -24 102 87 -7 73 31 15 147 -77 409 -68
7912 -68 290 -207 30 224 -207 69 -150 -61 -26 -64 -91 209 -347 -36 -119 263 129 218 144 -73 44 5 83
7935 83 117 -1 -15 -127 -57 -69 -41 -236 -375 49 -201 40 -276 41 -38 -5 150 80 -28 -19 -101 -115 -65 81 39
7960 39 109 -31 41 71 19 147 -149 68 -63 -17 -374 138 -53 64 31 164 -300 164 21 -263 -91 -133 -166
7983 -166 164 -24 -39 150 -169 94 43 29 -162 373 116 112 -48 155 217 1 -6 59 204 89 -52 -88 -18 -58
8007 -58 -208 123 -122 5 34 -20 127 54 -134 227 -7 -28 135 236 272 157 321 1 -20 1 155 -14 -216
8030 -216 -173 -272 215 -277 -62 -202 -112 12 -7 39 133 48 32 121 113 -75 146 -137 15 154 -178 -120 -261 2
8054 2 65 -181 37 -114 -299 69 -4 219 14 38 -15 -16 14 -52 21 59 160 178 93 82 -27 173 76 -73 109
8079 109 131 52 -213 78 213 280 -37 107 -141 15 238 46 0 133 5 185 -104 -32 300 232 -208 -223
8101 -223 -110 86 -106 -219 -104 34 318 50 -243 -184 6 -7 42 -108 -146 -220 20 -124 -174 -192 105 148 94
8124 94 184 -57 -122 -56 -85 -102 120 -22 -258 181 -108 -133 -213 221 -138 240 94 -231 69 143 -34 -51 5 -43
8148 -43 147 26 -188 190 42 -98 -40 -193 -207 80 197 4 -236 53 -229 99 264 -68 288 200 171 -155
8170 -155 -111 -18 -49 -123 -55 -82 68 -279 -146 -49 -93 66 6 -210 49 106 -50 165 -158 82 -116
8191a16
##END NTUPLES=NMR FID
##END=
