##TITLE=1H_Pr Am-NCS
 CDCl3,8 sc, 
 20.9.2021
##JCAMPDX= 6.0         $$ Bruker NMR JCAMP-DX V2.0
##DATA TYPE= NMR FID
##DATA CLASS= NTUPLES
##ORIGIN= UXNMR, Bruker Analytische Messtechnik GmbH
##OWNER= root
$$ XWIN-NMR		Version 3.5
$$ Mon Sep 20 11:39:59 2021 Russian Standard Time (UT+4h)  she@DPX200
##.OBSERVE FREQUENCY= 200.1314
##.OBSERVE NUCLEUS= ^1H
##.DELAY= (6, 6)
##.ACQUISITION MODE= SIMULTANEOUS
##.ACQUISITION SCHEME= undefined
##.AVERAGES= 8
##.DIGITISER RES= 18
##SPECTROMETER/DATA SYSTEM= spect
##.PULSE SEQUENCE= zg30
##.SOLVENT NAME= CDCl3
##.SHIFT REFERENCE= (INTERNAL, CDCl3, 0, 15.7039)
##AUDIT TRAIL= $$ (NUMBER, WHEN, WHO, WHERE, WHAT)
$$ ##TITLE= Audit trail, XWIN-NMR		Version 3.5
$$ ##JCAMPDX= 5.01
$$ ##ORIGIN= Bruker BioSpin GmbH
$$ ##OWNER= she
$$ F:/spectra/data/she/nmr/H-F/1/audita.txt
$$ ##AUDIT TRAIL=  $$ (NUMBER, WHEN, WHO, WHERE, WHAT)
(   1,<2021-09-20 11:38:39.96 +0400>,<she>,<DPX200>,
      <created by zg, POWCHK disabled, PULCHK disabled
       configuration hash MD5:
       00 E9 B6 7A A2 85 ED C7 34 08 36 98 17 FE 4E 26
       data hash MD5: 16K
       73 C0 CA 41 89 F5 FC 0D E4 AD D2 2F 13 AD B8 C7>)
$$ ##END=
$$ 
$$ hash MD5
$$ B2 4C 19 54 0A B6 9A 9E C9 0E 35 9A C1 35 EE 19
##$RELAX= 
##$RELAX= 
##$RELAX= 
##$RELAX= 
##$RELAX= 
##$RELAX= 
$$ Bruker specific parameters
$$ --------------------------
##$DU= <F:/spectra>
##$EXPNO= 1
##$NAME= <H-F>
##$PROCNO= 1
##$TYPE= <nmr>
##$USER= <she>
##$AMP= (0..31)
100 100 100 100 100 100 100 100 100 100 100 100 100 100 100 100 100 100 
100 100 100 100 100 100 100 100 100 100 100 100 100 100 
##$AQSEQ= 0
##$AQ_mod= 1
##$AUNM= <au_zg>
##$AUTOPOS= <>
##$BF1= 200.13
##$BF2= 200.13
##$BF3= 200.13
##$BF4= 200.13
##$BF5= 200.13
##$BF6= 200.13
##$BF7= 200.13
##$BF8= 200.13
##$BYTORDA= 1
##$CFDGTYP= 0
##$CFRGTYP= 5
##$CHEMSTR= <none>
##$CNST= (0..31)
1 1 145 1 1 1 1 1 1 1 1 1 1 1 1 1 1 1 1 1 1 1 1 1 1 1 1 1 1 1 1 1 
##$CPDPRG= <>
##$CPDPRG1= <>
##$CPDPRG2= <>
##$CPDPRG3= <>
##$CPDPRG4= <mlev>
##$CPDPRG5= <mlev>
##$CPDPRG6= <mlev>
##$CPDPRG7= <mlev>
##$CPDPRG8= <mlev>
##$CPDPRGB= <>
##$CPDPRGT= <>
##$D= (0..31)
0 1.2 0 0 0 0 0 0 0 0.06 0 0.03 0 0 0 0 0.0002 0 0 0 0 0 0 0 0 0 0 0 0 
0 0 0 
##$DATE= 1632123519
##$DBL= (0..7)
120 120 120 120 120 120 120 120 
##$DBP= (0..7)
150 150 150 150 150 150 150 150 
##$DBP07= 0
##$DBPNAM0= <>
##$DBPNAM1= <>
##$DBPNAM2= <>
##$DBPNAM3= <>
##$DBPNAM4= <>
##$DBPNAM5= <>
##$DBPNAM6= <>
##$DBPNAM7= <>
##$DBPOAL= (0..7)
0.5 0.5 0.5 0.5 0.5 0.5 0.5 0.5 
##$DBPOFFS= (0..7)
0 0 0 0 0 0 0 0 
##$DE= 6
##$DECBNUC= <off>
##$DECIM= 32
##$DECNUC= <off>
##$DECSTAT= 4
##$DIGMOD= 1
##$DIGTYP= 9
##$DL= (0..7)
0 120 120 120 120 120 120 120 
##$DP= (0..7)
150 150 150 150 150 150 150 150 
##$DP07= 0
##$DPNAME0= <>
##$DPNAME1= <>
##$DPNAME2= <>
##$DPNAME3= <>
##$DPNAME4= <>
##$DPNAME5= <>
##$DPNAME6= <>
##$DPNAME7= <>
##$DPOAL= (0..7)
0.5 0.5 0.5 0.5 0.5 0.5 0.5 0.5 
##$DPOFFS= (0..7)
0 0 0 0 0 0 0 0 
##$DQDMODE= 0
##$DR= 18
##$DS= 0
##$DSLIST= <SSSSSSSSSSSSSSS>
$$ [...]
##$SUBNAM2= <"">
##$SUBNAM3= <"">
##$SUBNAM4= <"">
##$SUBNAM5= <"">
##$SUBNAM6= <"">
##$SUBNAM7= <"">
##$SUBNAM8= <"">
##$SUBNAM9= <"">
##$SW= 20.0188988654967
##$SWIBOX= (0..15)
0 0 2 0 0 0 0 0 0 0 0 0 0 0 0 0 
##$SW_h= 4006.41025641026
##$TD= 16384
##$TD0= 1
##$TE= 0
##$TE2= 300
##$TE3= 300
##$TEG= 300
##$TL= (0..7)
0 120 120 120 120 120 120 120 
##$TP= (0..7)
150 150 150 150 150 150 150 150 
##$TP07= 0
##$TPNAME0= <>
##$TPNAME1= <>
##$TPNAME2= <>
##$TPNAME3= <>
##$TPNAME4= <>
##$TPNAME5= <>
##$TPNAME6= <>
##$TPNAME7= <>
##$TPOAL= (0..7)
0.5 0.5 0.5 0.5 0.5 0.5 0.5 0.5 
##$TPOFFS= (0..7)
0 0 0 0 0 0 0 0 
##$TUNHIN= 0
##$TUNHOUT= 0
##$TUNXOUT= 0
##$USERA1= <user>
##$USERA2= <user>
##$USERA3= <user>
##$USERA4= <user>
##$USERA5= <user>
##$V9= 5
##$VALIST= <valist>
##$VCLIST= <CCCCCCCCCCCCCCC>
##$VD= 0
##$VDLIST= <DDDDDDDDDDDDDDD>
##$VPLIST= <PPPPPPPPPPPPPPP>
##$VTLIST= <TTTTTTTTTTTTTTT>
##$WBST= 1024
##$WBSW= 4
##$XGAIN= (0..3)
0 0 0 0 
##$XL= 0
##$YL= 0
##$YMAX_a= 86724
##$YMIN_a= -114980
##$ZGOPTNS= <>
##$ZL1= 120
##$ZL2= 120
##$ZL3= 120
##$ZL4= 120
##$ABSF1= 10
##$ABSF2= 0
##$ABSG= 5
##$ABSL= 3
##$ALPHA= 0
##$AQORDER= 0
##$ASSFAC= 0
##$ASSFACI= 0
##$ASSFACX= 0
##$ASSWID= 0
##$AUNMP= <proc_1d>
##$AZFE= 0.1
##$AZFW= 0.1
##$BCFW= 1
##$BC_mod= 2
##$BYTORDP= 1
##$COROFFS= 0
##$CY= 11.3945322036743
##$DATMOD= 1
##$DC= 2
##$DFILT= <>
##$DTYPP= 0
##$F1P= 2.36226072786647
##$F2P= -0.459571619588291
##$FCOR= 0.5
##$FTSIZE= 0
##$FT_mod= 4
##$GAMMA= 1
##$GB= 0.15
##$INTBC= 1
##$INTSCL= 1
##$ISEN= 128
##$LB= 0.24
##$LEV0= 0
##$LPBIN= 0
##$MAXI= 10000
##$MC2= 0
##$MEAN= 0
##$ME_mod= 0
##$MI= 1.114404
##$NCOEF= 0
##$NC_proc= 0
##$NLEV= 6
##$NOISF1= 3.799351
##$NOISF2= 2.8
##$NSP= 1
##$NTH_PI= 0
##$NZP= 0
##$OFFSET= 15.70392
##$PC= 1
##$PHC0= -13718.47
##$PHC1= 14.4009
##$PH_mod= 1
##$PKNL= yes
##$PPARMOD= 0
##$PSCAL= 0
##$PSIGN= 0
##$REVERSE= no
##$SF= 200.130013532006
##$SI= 16384
##$SIGF1= 3
##$SIGF2= 2
##$SINO= 400
##$SIOLD= 16384
##$SREGLST= <1H.CDCl3>
##$SSB= 0
##$STSI= 0
##$STSR= 0
##$SW_p= 3612.71676300578
##$SYMM= 0
##$S_DEV= 0
##$TDeff= 0
##$TDoff= 0
##$TI= <>
##$TILT= no
##$TM1= 0
##$TM2= 0
##$TOPLEV= 0
##$USERP1= <user>
##$USERP2= <user>
##$USERP3= <user>
##$USERP4= <user>
##$USERP5= <user>
##$WDW= 1
##$XDIM= 8192
##$YMAX_p= 0
##$YMIN_p= 0
$$ End of Bruker specific parameters
$$ ---------------------------------
##NTUPLES= NMR FID
##VAR_NAME=  TIME,          FID/REAL,        FID/IMAG
##SYMBOL=    X,             R,               I
##VAR_TYPE=  INDEPENDENT,   DEPENDENT,       DEPENDENT
##VAR_FORM=  AFFN,          ASDF,            ASDF
##VAR_DIM=   8192,          8192,            8192
##UNITS=     SECONDS,       ARBITRARY UNITS, ARBITRARY UNITS
##FACTOR=    0.0002496,     1,               1
##FIRST=     0,             0,               0
##LAST=      2.0444736,     0,               0
##MIN=       0,             -114980,         0
##MAX=       2.0444736,     86724,           0
$$ Real data points
##PAGE= N=1
##DATA TABLE= (X++(R..R)), XYDATA
0 0 0 0 0 0 0 0 0 0 0 0 0 0 0 0 -6 8 -8 8 -8 8 -16 16 -16 24 -24 32 -37 40 -48 56 -64 72 -81 94 -105 120
36 120 -134 150 -169 186 -209 231 -258 284 -314 347 -384 423 -465 513 -567 624 -689 760 -838
55 -838 927 -1029 1146 -1281 1439 -1630 1862 -2153 2532 -3042 3779 -4938 7028 -12017 53509
70 53509 -11197 -105804 9505 74672 37084 -44995 -34099 24662 28340 237 14938 -12135
82 -12135 -34581 15799 52886 7001 -48004 -36874 47361 58887 -35604 -59077 15719 39813
94 39813 7186 -24856 -24194 6138 13603 1128 2677 -21308 -27739 22356 26995 -24075 -31135 -454
108 -454 21149 5797 -25629 -9606 12849 -11145 -5343 18107 -8385 -26173 218 22645 13337
121 13337 -26189 -26835 28252 26404 -23345 -15020 13809 8957 -2558 -2927 12785 6460 -23225 3332
135 3332 42069 -1342 -37785 1817 36963 18756 -24465 -24262 26979 28150 -15289 -10148 8543
148 8543 1157 5090 7085 -1282 -5625 -9509 10226 22462 -14093 -25757 10440 18465 -2304 -15324
162 -15324 -11454 10477 8980 -13063 -4657 1120 -10770 2846 8493 -11199 -12243 -370 7474
175 7474 3389 -17279 -8531 15659 -2246 -15705 4525 5449 -6137 -5991 -530 10657 215 -17382
189 -17382 3876 16847 -4828 -7095 3915 3493 4009 -1069 1993 9610 -7266 -6382 20479 9252
203 9252 -15251 -5338 13437 17052 -1737 -18989 4700 21402 -1432 -6780 1099 -1049 6537
216 6537 8123 -3157 -5151 -5385 4781 16798 -6223 -20870 3670 14187 1736 -9958 -13471
229 -13471 4109 13035 -7205 -9849 -547 -4498 2481 5846 -9627 -10740 -1079 5872 7043 -12721
243 -12721 -16758 11028 10884 -9922 -8293 -911 4167 4866 -6293 -3180 4354 -3389 2569 7904 -6235
258 -6235 -3769 6765 4902 2694 -4024 -4334 12079 6624 -7982 2444 6539 1042 2922 67
272 67 2328 5608 -3489 1984 9664 -3852 -3671 7674 1585 -1260 -127 -1356 4825 245 -6095
287 -6095 4540 2022 -7670 1545 2749 -3710 -1441 -4271 -346 4784 -7147 -6710 4994 -1866 -5032
302 -5032 -1162 -3463 145 -748 -6265 1774 115 -7799 2299 3064 -6964 -2009 1234 864 1634 -5615
318 -5615 -1979 8037 -1335 -4365 3855 231 853 3644 -2156 1496 4040 -1286 4363 3477 -4664
333 -4664 3709 6562 -678 1228 -2 1434 7839 -1410 -3808 6799 1850 -1989 3304 -756 -271
348 -271 2987 -1687 1537 878 -5279 2912 3913 -6268 -1827 1707 -1937 793 -3319 -4723 3509
363 3509 -1764 -5361 1270 -2309 -3088 1192 -3685 -2353 918 -4735 -186 2100 -5971 -1501 2720
378 2720 -3006 -229 -316 -2203 3472 -634 -3827 3858 549 -1821 4069 -282 -1426 4402 248 568
394 568 3295 -1873 2641 5358 -1943 1293 3466 -463 3979 1980 -2393 3948 2513 -1693 3939
409 3939 632 -2543 3718 869 -613 1415 -3173 586 4455 -3941 -2522 2051 -2440 184 473
424 473 -5109 -611 533 -3224 630 -2488 -5076 2108 -110 -3655 -558 -4308 -2209 4117 -2774
439 -2774 -4673 231 -1637 1059 1637 -5692 -1535 2979 -29 1434 -1718 -4187 4486 3875 -2899 1165
455 1165 -96 88 5877 1192 -2156 1919 370 4118 5446 -4106 -1683 6120 2892 1985 -1044 -4366
471 -4366 5195 6272 -2773 -1252 450 531 5320 -830 -4428 1560 -93 639 3733 -4505 -4609 3042
487 3042 1220 -158 -2231 -7043 989 5081 -3483 -4578 -3047 -1355 4403 -1398 -7649 -324 945
502 945 -1243 1208 -3555 -4220 1631 -37 75 660 -5892 -1091 5694 451 -2070 -2636 -1977 7044 4122
519 4122 -6283 -1562 4363 2964 2795 -2420 -1979 5607 2041 120 3646 -1600 -1517 5595 3274 616
535 616 -1678 -3246 5722 7454 -4116 -4705 1744 4300 4540 -3943 -6093 4308 3610 -2302 -178 -2833
551 -2833 -2471 2606 174 -1357 -1764 -5787 789 5825 -3245 -6342 -2571 832 5022 -1826 -10460 -691
567 -691 5462 64 -3220 -5302 -1355 5057 -577 -4109 568 -1752 -318 4082 -543 -2261 -767
582 -767 -828 5450 4116 -6863 -2947 6070 5164 984 -4993 -1690 8836 3977 -4255 141 2208 1723
598 1723 3610 -271 -113 1449 -1452 2696 5666 -3324 -4015 2633 3792 3414 -4144 -6663 4691 6285
614 6285 -3820 -4248 -1386 1104 3791 -2853 -4655 431 -1122 5 2301 -3987 -4273 706 128 1259
630 1259 -1771 -7773 78 5733 -963 -4273 -4650 124 6799 -646 -7504 -296 2954 1758 863 -3805
646 -3805 -1508 3924 570 144 1349 -2733 597 4843 1396 -314 -1849 -281 7231 3183 -5487
661 -5487 -764 4605 3074 1421 -3061 -811 5557 1005 -1607 1541 -674 -114 2682 -1065 -191 -115
677 -115 -2467 2286 2491 -3705 -2131 338 -152 990 -2910 -3578 2029 307 -2801 -152 -2376 -1632
693 -1632 1536 -2121 -2109 509 -2752 -750 1486 -1993 -988 -549 -2160 2318 418 -3990 439 2005
709 2005 -104 985 -1859 -1171 3508 566 -1601 1665 -262 910 2867 -786 606 2204 -741
724 -741 2525 2803 -2057 615 2703 797 1607 -874 -763 3712 964 -1418 1593 -375 61 2632
740 2632 -1487 -926 1315 -1084 152 1272 -2523 -389 509 -1792 298 -808 -2699 1144 -197 -2742
756 -2742 305 -969 -2375 537 -1462 -2095 503 -1915 -636 884 -2287 -752 1166 -1690 244
771 244 1108 -2090 700 1216 -1036 1158 -47 -1077 2218 532 -1053 1775 -265 394 3263 -614
787 -614 -290 2440 -49 1154 2128 -1493 1261 2592 -197 1361 501 -969 2565 952 -1515 1528
803 1528 286 -842 2028 -639 -1651 1431 -380 -480 536 -2366 -303 1372 -2161 -948 -23 -2126
819 -2126 462 215 -3312 -134 48 -1812 67 -1431 -1966 1119 -1403 -1743 870 -1602 -722 1266
835 1266 -1970 -636 1382 -866 214 1035 -1417 1181 1107 -1179 1313 862 -760 2377 525 -894
851 -894 2315 543 -156 2032 -60 732 2520 -391 399 2159 -367 1118 1598 -1230 1158 1280 -1193
868 -1193 1070 664 -1349 1226 243 -1108 1013 -934 -1173 1033 -1309 -1329 1070 -1759 -858 568 -2198
885 -2198 -634 238 -2339 -440 120 -2053 101 -757 -1842 598 -879 -1901 1280 -680 -1578 1059
901 1059 -707 -553 1302 -1315 120 1277 -1018 486 1349 -1315 1431 1281 -984 1356 1242 -383
917 -383 1644 700 -427 2028 461 -147 1964 -72 251 2212 -302 584 1743 -894 945 1801 -1290
934 -1290 159 938 -702 603 -89 -1901 1307 -295 -1744 840 -1078 -1620 1024 -953 -1407 501
950 501 -1349 -386 653 -2187 -1027 311 -1864 -158 -187 -2354 362 73 -2017 354 -520 -1300 1225
967 1225 -258 -1277 858 -316 52 1124 -1135 13 1901 -665 486 1550 -802 761 1719 -183
983 -183 1568 456 -390 2642 700 -1014 1520 706 341 1696 -792 132 2338 -461 -324 1860 -669
1000 -669 -354 1105 -482 732 -379 -1663 1467 657 -2540 259 147 -1159 537 -1519 -1680 595
1016 595 -1067 -944 562 -1649 -880 814 -1690 -485 391 -1951 331 490 -2145 -84 -186 -1215
1032 -1215 1045 -366 -1834 980 381 113 793 -1111 108 2857 -1121 -895 1833 113 525 1070
1048 1070 -207 1436 847 -1055 2358 1502 -1361 788 1684 623 872 -1271 -126 3044 -306 -1666
1064 -1666 1324 505 189 439 -922 1080 668 -2085 656 1145 -1906 -978 428 -599 295 -1709 -1914
1081 -1914 1654 -509 -2074 -133 -1050 -861 727 -2154 -1111 939 -1310 -599 239 -1463 8 103
1097 103 -1251 838 361 -1567 811 970 -357 727 -736 -115 2764 -699 -1683 1521 1476 562 50
1114 50 -818 2261 1877 -1728 766 2576 -673 245 1110 744 1432 -1135 -839 2675 172 -2098 895
1131 895 1070 398 -260 -1462 736 1976 -2176 -891 1639 -887 -616 -90 -872 339 -989 -2235 922
1148 922 35 -2121 48 -417 -617 337 -1313 -1382 840 -808 -497 155 -1447 82 607 -1350 -57
1165 -57 849 -1054 238 212 -337 1308 -97 -967 2010 576 -1038 927 969 1096 876 -1018 1042 2866
1183 2866 -1218 -395 2232 312 25 248 315 1736 242 -1216 1704 830 -1428 398 494 192 330
1200 330 -1433 -117 1884 -1517 -1240 1123 -287 -937 -160 -998 312 -249 -1796 591 -116 -2396 311
1217 311 -7 -1417 -33 -920 -794 472 -1184 -860 892 -1118 -514 1006 -817 -972 952 -350 635
1234 635 295 -1044 1245 1121 -1267 700 1111 -332 1017 48 543 1841 -499 -265 2211 -323 -458
1251 -458 1551 222 340 663 -339 1253 877 -1165 977 1090 -929 384 646 -564 556 -699
1267 -699 -569 1544 -831 -1267 1149 -256 -956 86 -1033 -269 161 -1761 191 433 -1772 -293 608
1284 608 -1285 -483 -501 -498 540 -1060 -1133 1345 -499 -1520 823 -196 -378 366 -707 256 801 -1086
1302 -1086 593 1267 -819 125 1123 -18 974 -125 -529 1625 156 -491 1914 285 -626 1253 434
1319 434 125 950 -341 902 1076 -1380 247 1280 -752 -23 413 -519 620 -273 -1071 1158 -306
1336 -306 -1604 330 52 -1116 -237 -957 -405 424 -1717 -580 869 -1435 -924 388 -648 -262 -298
1353 -298 -999 976 -388 -1738 853 146 -1292 668 -17 -511 657 -469 138 1263 -934 -92 1415
1370 1415 -500 339 935 -477 1024 352 -625 1304 469 -832 1339 687 -179 776 319 188 1099 -564
1388 -564 312 1548 -840 29 1102 -355 -44 366 -487 313 -236 -1126 953 109 -1235 413 -48 -978
1406 -978 75 -897 -859 602 -1415 -897 797 -1073 -897 372 -827 -135 125 -1068 372 179 -1491
1423 -1491 563 383 -926 302 183 -352 649 -433 -182 967 -422 -492 1213 -38 312 802 -171
1440 -171 902 1031 -627 919 1252 -426 634 524 -254 790 375 -260 1069 194 -154 1215 -44
1457 -44 -477 1001 -134 -241 424 -953 248 405 -1096 405 241 -1181 -44 -171 -789 202 -506 -1214
1475 -1214 454 -945 -1047 754 -983 -770 428 -1067 -370 213 -968 324 529 -1135 42 437
1491 437 -958 125 160 -594 640 11 -579 917 -392 -361 977 -167 -366 1228 -45 510 905 -442
1509 -442 606 1103 -379 501 857 -486 711 222 -634 950 109 -588 1004 87 -459 638 -280 -204
1527 -204 333 -866 -52 741 -902 -89 317 -1219 -127 243 -1120 311 -131 -1134 267 -309 -855
1544 -855 414 -482 -728 382 -812 -550 464 -779 -213 542 -708 170 272 -665 302 702 -700 371
1562 371 251 -293 936 150 -402 1111 -21 -379 1181 300 -84 600 -118 656 1131 -783 545 1337
1580 1337 -247 612 470 -473 515 312 -346 923 333 -588 609 -132 -375 768 -659 -336 755 -611
1598 -611 -521 348 -484 -27 -114 -1319 -225 223 -904 -518 -95 -783 317 -620 -691 829 -708 -1000 609
1617 609 -359 -741 27 -578 63 536 -963 181 1051 -458 58 169 -530 758 28 -729 1239 458
1635 458 -282 490 331 85 766 78 270 1250 -443 -396 1160 340 -82 481 -538 604 556 -886 104
1654 104 574 -616 409 -125 -587 508 -420 -625 457 -348 -727 21 -537 -263 -53 -1185 -465 308
1672 308 -1090 -612 301 -639 208 -73 -1207 572 -3 -1077 138 42 -409 166 -451 -55 456 -585
1690 -585 -254 997 104 -164 423 -208 464 517 -466 699 818 -355 348 691 70 795 226 156 1139 -7
1710 -7 -86 916 -61 -364 305 -227 296 529 -489 203 299 -565 449 146 -760 309 51 -830 12 46
1730 46 -481 91 -485 -182 461 -542 -547 291 -723 -495 -163 -887 147 -52 -1089 98 472 -778 -69
1749 -69 -116 -459 358 -361 -264 701 -226 -306 858 -109 -262 596 -29 641 476 -488 858 897 -474 469 617
1770 617 -156 699 51 -173 1080 192 -181 645 98 -285 458 14 146 744 -269 272 557 -770 131
1789 131 458 -914 -15 381 -499 66 98 -813 350 -330 -822 52 -492 -598 167 -530 -857 266 -833
1808 -833 -346 146 -933 -50 399 -731 -268 124 -459 379 -144 -455 488 308 -556 478 -275 -141 590
1827 590 -275 165 656 -336 303 1007 -323 1 578 -64 556 570 -401 551 481 -550 794 432 -431 567
1847 567 285 102 372 -173 50 538 -567 87 539 -482 -111 211 48 -72 -274 -671 114 -58 -1022
1866 -1022 119 -329 -772 32 -479 -621 7 -738 -555 425 -472 -286 89 -488 -324 -121 -591 371 332 -881
1886 -881 458 518 -685 157 108 -272 256 -250 151 1081 -306 122 884 77 -13 414 -52 283 493 -572
1906 -572 523 836 -6 497 376 -117 413 -60 -327 375 -525 -174 595 -376 -707 245 -522 -234 132 -589
1926 -589 66 347 -832 -11 260 -902 14 13 -907 -309 -244 -488 -41 -241 -722 507 -218 -603 299 -370
1946 -370 -87 290 -472 62 456 -518 223 391 -338 143 131 99 659 -47 -153 736 109 -249 746 265 -209
1967 -209 631 4 541 534 -117 375 469 -412 264 230 -282 225 318 -236 548 126 -483 558 -180 -439 295
1988 295 -237 -371 143 -602 -103 246 -917 -171 160 -895 -232 -16 -453 95 -286 -290 84 -278 -842 403
2008 403 -221 -507 314 -297 -402 297 -392 -61 467 -142 247 522 -441 -176 642 -230 428 224 -251 800
2028 800 330 -425 563 360 -16 598 217 275 744 -310 131 680 -204 116 549 -336 123 84 -570 634
2048 634 187 -220 458 196 -542 316 -41 -144 281 -617 -459 158 -458 -310 240 -445 -138 36 -526 92
2068 92 -71 -621 209 81 -773 164 -184 -446 136 -230 -268 263 -55 -38 618 -273 -216 446 -297 27 232
2089 232 -123 558 511 -135 670 402 -409 702 117 59 498 109 7 706 -58 -37 435 123 -101 506 -113
2110 -113 -56 299 -693 280 434 -530 260 -26 -360 395 -312 -483 403 -154 -530 263 -122 -360 170 -687
2130 -687 -341 66 -434 -222 -54 -621 -20 -18 -716 -34 -115 -434 94 309 -459 145 55 -67 244 -306 -351 406
2152 406 56 144 321 -145 418 588 -29 197 750 -106 22 282 -290 336 -25 -202 602 389 -369 486
2172 486 -61 -5 346 -328 152 600 -155 -134 163 -264 158 1 -754 74 46 -782 35 59 -571 -35 -370
2193 -370 54 40 -431 -610 164 -419 -266 160 -669 -41 113 -508 154 -80 -671 35 34 -135 154 81 -431
2214 -431 427 144 -102 327 221 -21 622 -203 86 641 -203 218 510 -411 237 605 -416 624 254
2233 254 -475 323 182 -330 361 -305 -137 388 -169 -397 475 16 -10 73 -279 137 427 -624 -107 413
2253 413 -617 -320 -11 -679 50 -364 -419 99 -388 -571 107 -174 -488 -69 -363 -120 248 -608 -365 373
2273 373 -86 -12 342 -357 -125 63 -389 253 19 -299 446 98 -339 334 -106 4 640 -5 -192 554
2293 554 42 117 282 -100 383 445 -167 428 265 -322 232 347 -289 496 177 -326 273 -5 -447 178 -236
2314 -236 -149 448 -459 -526 548 -204 -196 111 -208 -104 -43 -382 277 85 -450 160 -452 -270 -167 -237 -206 219
2336 219 -230 -260 271 -332 -215 507 -247 62 123 -260 113 303 -394 480 141 -158 407 277 10 544 98
2357 98 -7 518 -45 -88 931 -331 -88 294 -168 -46 220 -371 380 172 -421 321 146 -499 -44 -188
2377 -188 -299 222 -152 -269 411 -475 -317 79 -366 -26 80 -101 -47 9 -656 -69 2 -396 21 447 -512
2398 -512 315 -204 -355 473 7 -248 461 -162 -142 410 -75 -78 278 -331 158 371 -179 238 286 -173 60
2419 60 31 -238 510 -148 -57 294 204 -312 593 503 15 588 152 135 373 -54 215 186 -121 79 297 -412
2441 -412 -247 -29 -134 140 -189 -570 119 -220 -416 336 -160 -215 116 -535 43 282 -663 -79 35 -481
2461 -481 -340 83 -407 239 0 -48 29 -201 -284 159 162 -398 100 51 -152 197 11 237 170 -413 290 418
2483 418 -211 -242 381 16 278 216 25 374 170 -143 328 575 -175 169 176 11 283 -102 -191 227 -290 -92
2505 -92 535 -279 -5 -131 -144 133 -156 -266 382 -67 -326 45 -212 -39 -24 -207 -338 30 -407 -199 187
2526 187 -421 -210 184 -140 -90 193 -320 21 -164 -356 54 -41 -277 -125 -79 13 467 -122 118 693 -23
2547 -23 21 462 -81 62 350 200 485 191 203 366 340 -342 141 57 138 450 217 -247 110 5 88 560
2569 560 -314 -91 223 -68 -4 253 -691 196 233 -691 -85 -173 -241 330 270 -411 -17 -111 -584 309 -336 -420
2591 -420 106 27 -265 294 -205 -287 225 -329 9 302 -130 -126 256 -309 196 58 -109 174 86 -134 174 42
2613 42 -285 314 83 59 713 -105 161 621 133 359 280 -48 336 -109 -190 232 25 -415 265 -89 -402
2634 -402 394 71 -289 68 148 -357 46 -445 -280 385 -545 43 159 -200 -170 151 -218 -28 -120 -373 197
2655 197 -56 -318 61 270 -119 69 -392 -50 156 -352 18 290 -399 -20 293 -201 146 -14 -216 299
2675 299 92 52 385 12 -259 29 218 -219 295 30 42 321 42 84 279 -95 262 340 -150 304 298 -166
2697 -166 156 -29 -28 388 99 -377 245 -285 -337 567 -359 -266 400 -25 -304 24 -370 -196 -68 -109 -152 -21
2719 -21 -637 94 -113 -301 147 141 -197 235 107 -373 95 3 -245 258 -184 -42 221 -169 -24 339 100
2740 100 190 161 20 120 123 19 294 100 -155 419 -18 -159 393 -57 62 386 0 103 440 -109 135
2761 135 244 -186 -125 78 -338 101 113 -269 76 90 -13 -61 -148 -129 218 -218 -337 100 -433 -187 -27 -38
2783 -38 -363 58 -253 -89 248 -176 128 -281 -361 219 131 -174 325 -142 -211 -25 -407 -112 -65 -118 -55 236
2805 236 -43 -214 170 -131 298 232 -144 154 273 -195 187 97 -272 254 -106 -92 475 -17 -70 405 -265
2826 -265 13 36 34 -147 317 -162 -206 3 -233 131 -41 -226 234 -229 -379 117 -139 -183 97 -41 -268 245
2848 245 -220 -105 -15 -162 -285 -69 -187 -7 412 -439 -133 360 -408 183 251 -104 144 -138 -125 451 -55
2869 -55 -283 472 13 -3 312 53 -138 357 -214 143 519 -208 270 279 -166 100 116 27 383 51 -287 218
2891 218 120 35 47 151 156 212 -79 -250 -44 -298 -119 39 -306 -2 86 -388 -181 156 -460 152 55 -118 -211
2914 -211 50 -144 128 -194 -134 194 -315 35 -44 -203 69 247 122 42 127 -96 121 -47 -154 254 -113
2935 -113 -109 356 -202 -120 275 309 122 416 -36 32 607 -244 6 444 -115 -22 188 -274 217 64 -300 211
2957 211 21 98 0 -21 -63 45 -246 -222 224 -296 99 57 -323 -150 182 -403 100 -176 -358 -17 -78 -385
2979 -385 219 77 -325 142 -69 -133 165 -110 -133 341 -190 -291 91 -134 251 12 -272 -118 -60 20 278
3000 278 265 -282 -103 225 -62 53 -144 -55 579 28 152 442 -123 -132 -103 68 -57 11 8 40 224 -194 -6
3023 -6 111 -249 330 -224 -139 369 138 -271 306 -151 -87 395 -308 -164 -201 52 3 -68 -341 109 126 -219 -178
3046 -178 129 -102 -1 -65 -292 162 52 -193 272 103 -28 92 -75 149 246 -187 -161 145 -197 142 498
3067 498 -83 125 -8 -53 290 -108 -52 377 -50 -95 180 251 -182 443 14 34 402 -339 -64 37 -154 64
3089 64 261 -70 116 6 -182 -71 -109 -447 192 -195 -314 55 -76 72 -53 -61 -161 120 -40 405 6
3110 6 60 -12 102 -200 -81 -227 -467 185 -232 -180 257 66 -245 105 35 81 234 -55 284 123 -151 -194 331
3133 331 -214 179 262 5 353 66 73 304 -40 27 440 -110 -109 361 331 76 182 -72 -117 340 -186 -17 -224
3156 -224 -124 -50 145 -152 215 299 -438 -185 146 -82 -26 20 -365 18 -96 26 52 -296 -230 120 -268 -199
3178 -199 185 -215 335 16 -388 261 409 -38 72 -31 -108 -202 283 -117 3 -287 -152 68 -308 -260 202
3199 202 -73 82 202 -140 182 113 -18 226 479 -163 151 0 99 -226 45 104 89 -71 -244 342 72
3220 72 -213 37 -129 -375 -207 -315 -56 88 -50 180 -144 -224 -32 -88 -390 29 -145 -232 -143 87 -111 79
3242 79 -412 -85 388 -151 -182 -61 -154 -140 6 -188 -24 132 -182 103 -28 15 137 267 -85 233 115 -260
3264 -260 271 63 -189 241 60 -34 384 174 -215 23 41 59 51 -195 -10 -69 107 -164 -295 -135 347 -167
3286 -167 -136 -28 -112 -286 69 -255 -342 101 -16 -164 19 -258 66 69 -281 -185 -74 -246 61 179 -21 -66
3308 -66 91 -182 -99 146 32 -50 -261 72 252 -210 -100 -15 -29 103 213 57 293 282 -263 124 257 152
3330 152 0 -1 19 -188 -236 -65 280 231 245 89 -28 6 166 -24 165 213 -114 55 186 112 135 122 -119 292
3354 292 -153 -178 48 -228 -304 58 -23 -358 37 -233 -306 276 -409 -219 -185 -382 -176 58 -299 -125 -167 -212
3376 -212 15 -46 -318 172 85 -91 13 -49 -112 254 35 -97 -55 -140 89 92 -138 199 121 21 386 -181 -118
3399 -118 310 90 -78 330 94 -263 7 -38 -24 145 8 214 -57 90 -72 396 -336 79 -117 -89 181
3420 181 -265 -240 -68 2 -285 93 112 -388 96 -67 -257 210 -194 -167 -167 -509 235 91 -320 -75 -144 -117 -36
3443 -36 -204 -241 83 -25 -350 194 -14 187 331 -147 -129 81 -134 268 266 -98 -160 76 -55 192 98 -168
3465 -168 82 -184 -175 113 117 82 -86 -47 -109 273 -64 -152 329 -102 -11 69 -289 83 48 -181 42 28 -103 212
3489 212 161 -59 -332 -154 -134 347 -43 -210 -35 -46 -142 7 -149 -102 253 -193 32 254 -223 -26 110 -209
3511 -209 234 115 -334 364 104 -166 244 -128 -141 65 -147 58 272 244 89 304 -196 65 313 -11 -41
3532 -41 289 -150 198 256 202 110 -88 14 -14 116 128 268 -7 -35 -199 -279 133 -88 -180 20 132 -232 14
3555 14 241 -371 -61 -2 61 55 -37 -500 293 -4 -319 221 -29 -117 105 -136 -159 243 -199 -155 126 -230 -77
3578 -77 292 -255 37 276 -180 -14 -27 -244 -148 -72 -66 277 -10 149 272 107 14 283 -11 17 261 -208 306
3601 306 20 -20 197 214 -116 247 68 2 -21 69 -10 106 -145 157 278 -20 -130 26 16 208 43 -80
3623 -80 71 -135 -324 116 18 -138 -38 39 80 17 95 -193 251 -112 -131 97 -186 -14 151 -72 146 168 71
3646 71 147 -95 -11 42 -14 -248 259 34 29 -15 104 -327 132 215 138 72 -94 1 172 -90 -16 269 -356 14
3670 14 -81 -248 188 -204 -320 255 0 9 120 13 2 4 198 58 173 -10 48 7 -212 48 52 -189 -319 -240
3694 -240 -247 -229 129 -260 -268 -143 -6 105 -81 -115 0 182 -246 -36 10 -299 -10 -312 253 48 -154 165
3716 165 58 -79 36 170 -294 633 -69 58 129 163 128 349 387 -58 141 -11 -84 95 -145 -141 9 9 122
3739 122 307 -9 -72 188 -231 -31 26 61 -82 -134 -177 104 8 -144 245 31 -252 -58 -353 -126 14 -208
3761 -208 -258 162 -199 72 20 -103 -124 -1 -28 365 63 -284 71 92 -214 105 -257 -176 332 -159 218 341
3783 341 -93 46 -111 -7 161 -23 92 85 123 -72 180 321 -287 -11 162 22 127 -127 -180 -98 -324 96
3805 96 326 -242 103 367 -334 -168 -127 -180 88 -294 -95 -83 -204 -215 -187 23 -211 -69 -309 -289 1 -148
3827 -148 224 -59 -37 -59 29 -112 152 178 -193 413 -130 -206 285 100 -106 -150 -158 94 21 -144 -13 214 220 -12
3851 -12 237 244 -7 150 -196 -21 5 -90 78 154 -243 217 165 -29 77 -90 -38 71 -80 0 176 -22 -122
3874 -122 232 168 26 -90 -96 -118 178 -311 -103 -195 154 -164 -262 -275 9 97 -102 161 -346 -196 233 -40 187
3897 187 206 77 -142 -39 -51 -79 78 -230 70 -265 83 154 67 -221 78 27 -110 -18 -48 123 158 157 61 200
3921 200 -135 7 186 33 -18 -3 -99 -26 49 -82 156 19 -87 -29 -184 -87 119 -253 -122 157 184 -156 181
3944 181 -216 67 52 -181 -197 88 -100 -58 208 -184 211 80 -343 46 -335 -264 -252 4 -214 -75 68 -107
3966 -107 92 75 -18 138 -76 -172 111 43 -130 26 31 81 199 -92 191 7 26 178 -37 -29 133 -50 -299
3989 -299 -67 25 40 237 -108 271 183 -106 48 141 -275 -78 54 -357 195 155 258 102 -20 -167 316 -220
4011 -220 22 14 -101 -203 -8 -175 -20 13 -69 26 -64 -213 267 173 -364 139 -414 -229 107 30 -394 -87 151
4034 151 95 144 -27 50 201 182 113 211 8 154 93 -350 166 174 80 438 218 148 238 205 264 88 -38 46 212
4059 212 81 -125 -192 -203 165 226 -436 -138 97 -177 11 189 -84 -11 -230 -276 -2 -249 -316 266 -215 -308
4081 -308 -79 -166 -136 134 -17 -48 196 -107 -160 146 -70 105 143 -322 250 9 -301 171 -90 -109 188 261
4103 261 113 -155 -263 -65 133 -24 253 117 -27 9 128 -18 213 113 -156 38 -62 -203 168 -79
4123 -79 51 189 -124 -307 154 -53 -225 46 -232 -55 70 -394 -175 384 -136 -96 -277 -91 -28 40 -348
4144 -348 189 -4 -38 13 3 -369 -123 -42 152 -72 -225 -207 110 -156 32 -158 -166 -130 145 -194 -7 -33 -119
4167 -119 79 -232 -379 244 -53 -97 -140 -8 -213 265 162 166 170 -28 121 92 40 128 134 28 -55 103 -320 132
4191 132 79 -85 106 -317 -22 207 66 65 378 -200 73 151 -25 -137 200 -94 12 -49 -136 -59 17 -270 4
4214 4 20 -159 132 -204 -208 73 -214 -121 417 -189 -25 38 -210 53 180 -84 280 189 -168 82 54 -55 -60 -21
4238 -21 -48 54 179 -21 290 -107 103 378 28 124 136 -119 7 329 -216 177 145 89 95 27 -35 238 -99
4261 -99 128 307 71 -15 4 86 -50 161 -298 -89 61 -445 17 135 -232 -4 -81 122 -78 58 -316 74
4283 74 -139 -247 198 25 -78 -99 -332 -495 158 -66 -19 68 -94 -50 -82 -170 205 -117 -202 101 46 60 93 106
4307 106 54 198 313 108 198 90 153 146 -14 31 487 -194 56 108 8 -153 74 -163 473 -49 -311 36
4329 36 113 -294 272 -51 -73 66 -217 -209 302 -86 44 -41 -131 -197 -66 -95 -155 -180 -375 22 -104 20 24 265
4353 265 -234 29 193 -73 61 -216 54 188 -31 31 -31 -140 194 134 58 11 290 119 311 60 63 463
4375 463 196 106 365 268 -119 299 -97 -73 146 -215 8 307 -189 -79 -396 109 195 107 -299 -219 92 -114
4397 -114 114 -158 -289 160 -170 -93 151 -1 195 153 -307 -123 57 -56 -98 150 -163 -317 -79 -58 -131 -116
4419 -116 -496 136 -39 -321 76 62 182 182 125 68 26 -129 211 100 -83 -3 141 -104 37 178 -132 -43 46
4442 46 -88 274 -77 -309 358 63 29 188 -19 144 206 -106 40 -1 -38 18 131 -178 30 269 -36 208
4464 208 24 -115 -22 -124 -291 -14 -199 -151 -143 -185 -107 -115 -1 -302 -9 119 86 182 -446 41 -21 -263 44 188
4488 188 -248 83 144 -133 147 12 -128 303 -63 72 371 101 -149 140 -34 138 257 82 -18 337
4508 337 -2 38 60 89 124 -163 -73 150 248 99 148 -16 68 86 -143 101 305 -140 -139 162 -19 218 -22 -419
4532 -419 108 -63 -219 226 -168 -178 -41 -251 -166 54 -82 121 -40 -390 -50 85 -71 257 -160 -272 18
4553 18 383 -132 -27 72 -108 235 150 -69 27 3 -87 141 99 -204 359 -85 -235 33 91 -24 240 -139 -7
4576 -7 45 -244 -56 -10 199 263 1 117 187 10 -72 129 60 -98 248 -244 110 339 0 -237 7 -118 26
4599 26 115 -76 -184 16 -211 47 90 -422 24 -254 -254 -138 17 -132 184 -289 71 155 9 -8 228 -320
4621 -320 30 -109 -5 -83 116 -169 91 104 -161 264 126 31 198 -9 1 63 -209 84 327 -325 -55 194
4643 194 -93 243 -171 -144 -38 153 -132 23 69 -172 217 36 -93 180 -88 -60 153 -140 -105 319 -258
4664 -258 319 1 -258 -306 170 -286 19 -106 -161 102 -104 -275 95 -6 -246 -16 -32 43 89 -183 -80 132
4686 132 -186 -249 203 -71 205 278 -212 -107 -43 142 225 179 -38 -56 162 -54 184 142 97 176 53 -13 84 50
4710 50 58 228 -242 140 52 104 9 -191 -211 190 293 -12 46 -38 -182 -32 -354 79 41 -291 -453 90 -112
4733 -112 -266 100 -133 105 154 -82 -47 -17 -69 -58 -236 -341 39 -218 148 37 142 -26 92 -114 104 66
4755 66 -163 -18 147 150 9 40 -9 -78 211 -23 109 -40 217 50 -49 -17 9 -235 30 19 -28 -37 -32 -205 -102
4780 -102 -81 -161 -199 -26 -40 -147 -38 -91 -121 -26 -94 -107 -120 41 34 -143 -189 164 -292 -368 93 -199 -461 -133 -96
4805 -96 -334 84 23 201 -120 -63 57 -43 -58 70 160 -148 64 -8 -21 27 -10 106 293 -3 -26 43 -192 -242
4829 -242 -228 6 -211 327 9 -26 11 -29 61 211 -139 123 216 -239 280 35 -73 401 164 87 146 -168 -48
4852 -48 72 -374 110 -16 -271 -42 17 -407 -29 -94 -200 -167 -111 -203 -125 -63 -85 185 -347 -196 67 71 -187 19
4876 19 -4 127 4 -196 -271 253 -23 60 -192 3 372 -44 -215 315 -10 -24 327 183 -77 -11 -22 -4 166
4899 166 -74 111 130 23 -104 -34 23 82 49 68 125 194 -21 163 -32 -129 230 -223 15 149 -123 -35 -21 -85
4923 -85 -222 98 -157 -78 -136 -245 -7 -95 54 142 42 -250 -107 -51 -337 -101 -186 -266 375 282 -110 446 -197
4946 -197 131 129 -85 47 65 52 89 -70 -89 270 10 -119 294 3 -221 86 -125 62 193 18 190 258
4968 258 135 -178 120 87 17 74 106 166 148 -212 -190 196 -73 2 3 -308 258 -183 -150 254 154 -12 -202 -284
4992 -284 -112 -40 -72 1 42 -6 -237 -89 -286 112 21 -319 -142 52 -19 88 -343 -1 239 -6 118 -146
5014 -146 -161 -242 82 -59 154 33 -49 283 111 -80 177 316 59 92 3 34 -139 232 -70 272 -173 -67
5036 -67 75 -61 103 115 -156 131 47 -23 319 -66 -184 84 135 -246 137 10 85 234 -36 -281 51 -187
5058 -187 -1 58 24 160 233 -28 35 -17 -288 -76 25 -178 117 -105 -229 203 18 -49 2 -111 147 206 19
5081 19 182 37 -32 148 -14 32 -156 -9 61 61 32 318 325 7 -247 139 42 91 255 -193 115 -177 -147 6
5105 6 -50 -128 -53 232 57 287 44 -277 46 -184 -162 165 12 -171 135 -74 -228 77 -39 -81 118 -106
5127 -106 -159 174 -81 170 -193 -102 -34 56 -222 125 42 -22 -76 180 -128 23 -168 -256 117 -120 81 145 -178
5150 -178 176 -17 -141 120 169 3 291 101 28 189 27 -165 43 215 260 217 -142 185 81 -37 -181
5171 -181 122 301 135 -124 36 97 122 -194 -113 -145 -312 -404 -84 -225 -11 25 13 -10 -176 -90 12 90 141 32
5195 32 9 275 53 -66 -2 196 32 168 -228 -30 -11 -97 -166 -8 73 -176 481 -40 82 92 -4 -142 136
5218 136 -122 191 190 326 -47 134 -50 -30 -127 -147 122 72 66 178 1 22 -118 -191 -124 345 -208 2 116 -142
5242 -142 9 -54 -34 9 218 -66 63 294 -136 23 162 -82 67 19 -319 -90 -79 -248 -2 -147 -76 188
5264 188 -89 -144 157 -180 -133 97 -205 313 -52 -47 335 184 72 25 152 -107 -100 -103 65 171 132 315 187
5287 187 210 14 0 -21 -48 267 -147 163 114 -139 64 18 -170 34 154 0 4 -4 -98 102 -85 -21 -136 -53
5311 -53 41 14 -105 -23 236 -276 0 -92 -210 67 -70 -146 42 97 59 -25 56 -164 -80 32 86 104 -95 -79 11
5336 11 -25 7 107 -260 -91 -81 -185 132 26 -220 54 61 -42 154 -230 82 -7 56 45 332 156 -47 103
5359 103 -170 58 387 66 -22 111 -226 -33 119 -39 -40 140 -407 6 -128 80 -64 -36 112 8 -70 -59
5381 -59 65 19 -35 -40 -69 171 -169 -228 -73 -214 -173 279 86 -273 107 -121 -274 -27 -78 284 83 80 -192 56
5405 56 66 -240 13 31 205 6 -10 218 233 -109 92 -29 37 184 10 92 80 142 32 -9 -103 -35 362 -97
5429 -97 -80 418 60 157 -37 -186 103 -77 -339 10 -141 -97 -46 -142 35 202 40 15 130 -120 -46 33 -145
5452 -145 -142 189 -2 -281 -104 -308 289 -78 -212 39 -435 -71 34 0 -255 2 -38 -237 30 -47 88 34
5474 34 -185 74 283 245 127 159 43 119 409 -158 -117 237 -127 250 -99 49 -42 29 232 138 -105 -133 -22
5497 -22 31 67 -137 146 -66 95 51 208 301 118 -28 -108 -99 -315 119 -64 -24 16 98 55 -51 -309 94 -25
5521 -25 -29 229 -96 -21 107 -31 -104 340 154 64 -166 -267 -44 134 126 28 -449 -109 89 -45 -56 117 -274
5544 -274 -53 212 357 -73 180 -144 102 113 59 164 -77 64 12 16 -305 203 -223 -37 -293 77 -238 157
5566 157 -215 -50 206 -125 -47 73 66 -52 -97 -34 -18 -73 1 109 -235 -262 -182 -22 151 -22 -5 -87 28 -24
5590 -24 102 -56 -245 -292 173 -254 38 144 -267 89 77 48 -11 -18 162 -25 -65 -72 -65 -137 -269 297 -305 -68
5614 -68 160 -106 250 33 -93 133 222 -17 258 -75 -126 -12 128 -170 68 40 -148 -295 68 78 28 -100
5636 -100 60 132 -18 -101 239 -269 -153 38 29 149 -223 -30 -41 -51 -13 5 15 -380 -43 189 85 250 -116
5659 -116 -120 38 -105 -45 -141 -148 -42 -70 -31 45 88 35 229 278 23 205 -296 -298 -61 -24 -39 444 23 101 93 -179
5685 -179 -56 235 -97 49 179 -50 -41 109 -63 -284 -5 63 157 -69 275 -20 -231 34 -6 -99 -35 181
5707 181 -321 201 21 9 87 -44 -20 142 -219 -262 107 -152 -102 100 -312 -147 107 -380 9 -133 -116 39
5729 39 9 -151 -206 -39 -123 16 -38 -133 2 75 -19 359 152 -65 -116 -180 17 -183 -172 196 298 -85 -49 147
5753 147 64 179 60 -175 -58 236 -8 359 204 -85 -150 -14 98 -7 93 -139 233 -7 -274 -160 53
5774 53 -67 34 -419 -2 -153 -157 231 -156 -335 -5 162 -180 25 -179 -139 -102 80 -194 163 2 -68 -77 -79
5797 -79 -49 273 -193 0 16 -280 252 -89 -69 57 -195 -58 296 -45 -45 275 -129 -27 94 -119 261 91
5819 91 -186 75 -96 7 39 82 -46 141 -107 -141 184 77 -72 5 -191 -159 85 -140 -23 -97 81 109 251
5842 251 129 18 -259 -284 101 154 -50 -234 40 -3 454 -28 5 -101 -21 24 197 8 -41 11 -210 108 191
5865 191 -92 63 58 -256 218 97 -118 -17 168 130 281 79 189 152 284 199 -15 -113 19 432 110 185
5887 185 212 -163 201 204 -193 3 78 0 161 -103 -97 165 -378 -11 113 -39 -201 13 -234 -152 70 -195 -235
5910 -235 282 -151 7 -265 -82 -182 150 -54 -29 -223 49 147 -56 -7 66 108 -96 126 -161 61 -56 266
5932 266 62 219 -193 -27 -28 65 -63 26 -482 171 203 -76 421 110 -57 125 100 -226 143 176 -73 42
5954 42 -192 -102 -6 70 147 165 -149 -62 92 -118 55 -49 -132 24 -157 -79 -133 13 -94 -50 -142 -279 24 111
5978 111 -167 27 -16 -235 29 -117 29 129 -76 58 -38 -194 -367 123 104 48 117 237 277 -50 -237 143
6000 143 159 -14 -49 -238 -5 -11 -101 -65 268 -69 84 186 -332 248 181 -129 378 155 79 2 -164 -83 51
6023 51 -196 -224 289 75 -48 57 -155 -53 -232 -294 -33 76 -227 -37 -12 -161 -80 94 -271 130 -110 -101
6045 -101 194 -557 238 -73 91 -115 194 177 -63 -195 -125 -128 87 63 138 218 -93 44 -1 -4 118 -117 -105 38
6069 38 72 -36 98 205 183 -133 -96 173 140 -28 125 -86 -29 13 -28 -129 -110 93 -242 181 -149 -232 502
6092 502 -115 82 115 9 90 80 114 -97 -10 -57 31 231 -277 -274 -168 -150 188 -135 -97 139 60 13 -105 62
6116 62 -255 194 -140 -15 -3 -180 177 135 -169 41 33 -39 94 197 -244 30 122 -250 225 42 -96 99
6138 99 -88 377 -21 -54 -90 -77 122 -217 54 -127 -52 8 112 103 35 131 120 -56 -261 60 -52 0 297 -110
6162 -110 -73 40 -101 94 97 -75 143 -260 -114 233 187 -244 -298 -56 -252 -102 -281 -83 -42 44 151 266
6184 266 -214 -54 -51 -108 -115 62 124 -1 -1 26 155 -126 -196 248 11 -112 -1 231 -61 116 48 -119 257 171
6208 171 90 43 114 -219 143 -36 -102 10 -139 124 20 39 -61 121 -40 347 165 -23 218 -47 -61 1
6230 1 -6 88 1 108 24 248 -60 -29 -1 -78 55 -207 39 -91 -114 -158 201 -29 -280 -10 -322 -223 -25 -85 -28
6255 -28 37 -27 74 246 -10 -149 179 197 261 -90 -190 169 322 -323 95 -24 107 29 6 -116 266 84
6277 84 -328 90 68 -66 -170 43 -32 209 -252 -233 -6 -143 -16 149 -39 95 -173 -127 -98 117 -237 -157
6299 -157 231 61 -45 -354 -70 -22 113 95 24 -125 213 287 -140 24 267 5 -125 37 -93 285 24
6320 24 -96 18 116 169 346 199 -93 -53 292 146 -63 297 29 60 -61 198 196 61 219 120 -33 -225 -54
6343 -54 5 12 -7 27 -48 58 71 79 102 36 -49 -178 21 -182 18 83 -88 -69 -51 -8 -167 -294 -104 18 182 -43
6369 -43 -439 73 51 -193 82 9 -167 218 -141 7 31 -182 104 9 -24 50 -240 48 -35 135 -133 115 207
6392 207 -218 133 -166 121 81 -273 273 -79 -98 154 -21 238 172 69 3 54 11 -201 250 496 51 -25
6414 -25 182 140 -44 129 -132 116 -111 92 -184 -55 157 -186 30 -13 -59 -54 60 410 -178 333 119 -32
6436 -32 -184 -49 -122 -4 -229 -271 13 258 -201 -217 -119 -138 4 -58 23 -171 -37 105 -36 -140 72 -129 148
6459 148 189 -65 -158 -134 106 -211 45 -11 63 75 293 -127 236 37 -192 -69 -205 -77 50 -158 323 -39
6481 -39 -227 145 198 172 -91 24 -199 87 -56 -33 46 -158 1 -13 -194 -12 -82 33 25 -42 -144 86 -143
6504 -143 -97 203 -148 -17 -120 -319 -170 11 -380 -204 -58 -58 41 242 -127 128 -146 -37 -8 78 19 145
6526 145 -382 330 -33 -7 -38 -58 122 -45 -104 -250 103 -137 94 255 -37 -22 -65 -2 -91 -109 -33 -324 60
6549 60 -99 -93 146 370 61 92 -37 72 -24 -309 38 24 -169 -165 174 -72 -129 -83 -38 -148 83 -77 -146 120
6573 120 -49 26 53 -21 282 -16 -132 23 73 -79 189 -138 192 -44 -284 31 -140 22 243 -108 -32 -148
6595 -148 -8 -54 -83 106 39 23 234 -118 -29 7 -341 294 -80 -205 -50 -275 225 39 -100 -78 -131 250 245
6618 245 171 -50 -85 180 132 79 138 -106 -59 85 147 84 -166 -84 101 -171 -250 -63 -207 130 32 -10 68 -107
6642 -107 -142 50 -88 11 313 101 -312 115 -194 -2 -75 188 -144 291 -7 -165 -224 -47 136 -85 -224
6663 -224 154 -198 -216 16 -69 131 392 -29 2 87 149 -148 41 -76 273 -100 190 135 91 -58 -88 152 -164
6686 -164 183 189 75 67 114 261 -234 -218 83 -18 234 58 196 112 -13 0 235 26 -336 -57 150 -35 -307
6709 -307 189 -10 96 51 -58 -183 106 129 250 168 -13 177 78 -298 -87 -137 -22 223 356 75 130 -175
6731 -175 100 -122 191 -162 -118 -38 28 142 -158 30 20 -135 -118 144 -139 40 -59 -258 -203 -76 -97 -212 -152
6754 -152 34 -385 -17 -5 111 42 92 12 -30 -64 61 -69 -114 52 42 -39 241 -207 -240 277 -117 115 168 -5
6778 -5 52 -100 -73 -66 16 59 -10 89 29 4 -72 -119 184 18 -42 -332 156 141 200 -44 63 160 105 -196 -114 143 17
6805 17 210 -274 127 -71 -117 143 -59 163 63 -109 -135 -60 -282 -47 250 48 -102 -249 168 -38 104
6826 104 -319 29 203 66 -185 3 -32 128 -129 -21 114 -74 -16 -3 -130 111 -35 -73 186 -77 -259
6847 -259 74 71 88 -38 4 -165 239 184 170 85 198 217 23 270 -263 -274 -24 13 -39 -199 103 68 153 223 -179
6872 -179 -112 42 11 126 11 -99 -75 -50 7 87 63 -27 -55 -61 -19 -362 -16 225 48 -123 29 -26 22 -9 210
6897 210 -285 -121 -69 -34 -211 -283 -204 -105 -87 -194 -10 12 -178 95 33 94 -231 211 135 -16 104 47 130 -9
6921 -9 77 -17 81 68 128 -49 -181 -130 -57 -30 252 -291 89 -12 -1 97 -131 -79 -47 -170 174 121 -359 21 -152
6946 -152 279 -238 86 302 112 130 -117 -89 -28 -224 -361 -172 121 29 -188 -43 -124 31 -180 -180 77 -51
6968 -51 162 35 -279 -121 -52 -104 15 189 -128 188 227 199 -126 -99 -189 130 -124 -185 -96 -58 12 -35 45 189
6992 189 56 -46 -55 143 -130 -44 -170 -97 114 -183 96 -103 -397 53 342 -67 423 79 -80 -90 6 -93
7014 -93 56 17 -17 175 -227 -33 -131 -205 -85 -38 -55 25 8 180 215 -161 99 55 -15 -22 -152 -19 -229 124 -288
7039 -288 -105 -20 -169 -172 33 -100 -102 -142 -31 102 261 -168 42 91 -127 141 -242 350 49 85 -63 -151 -257
7062 -257 -105 -85 -21 87 -105 38 -237 8 62 31 124 -167 -25 13 186 37 -138 -179 64 43 -15 0 -19 84
7086 84 44 -52 -243 -121 13 134 -54 -320 25 158 20 101 -172 215 -130 67 -328 27 -31 -157 178 255
7108 255 38 139 -160 245 -28 -253 -269 -60 -115 -39 -269 33 198 -64 108 -203 70 -28 134 -179 25
7129 25 258 5 319 -66 -20 38 -58 74 115 450 126 193 -13 -65 -8 -76 272 51 26 -72 89 100 -239 72
7153 72 154 -244 -2 -42 -110 169 -119 2 -132 34 -63 -91 -152 -77 114 -31 102 29 242 40 -10 -259 78
7176 78 118 -46 -60 -295 -187 42 240 14 50 68 -49 19 142 -55 -129 163 -224 -8 -112 25 -164 183
7198 183 87 212 52 325 25 92 -154 145 275 104 129 -160 245 -44 316 110 -44 243 -10 -64 101
7219 101 154 2 -147 169 73 -81 -19 -8 171 -177 126 65 96 -147 110 -77 -71 -141 -28 -122 -53 95 -278 240
7243 240 28 -22 -58 -18 163 18 150 98 148 -36 -39 26 42 -38 -36 -1 -214 114 99 200 -71 222 109 -35 180
7268 180 9 131 21 -227 -36 344 -117 -89 51 -265 -175 -135 0 -61 -19 -67 -145 27 -109 1 -80 -148 188
7291 188 314 40 28 213 -56 60 -125 -413 -70 -19 29 -18 193 -112 20 -149 87 -163 -47 -16 123 -247
7313 -247 48 39 79 -32 -154 -66 69 81 -118 170 107 -118 40 -141 -11 131 171 20 -106 -55 -17 -280 -27
7336 -27 -57 -247 -7 -42 -171 26 207 -84 122 -29 21 -173 -16 -228 -78 -75 282 35 -185 -261 -121 -90 -43
7359 -43 -168 -227 85 81 188 -99 3 -65 -67 -7 -89 65 -145 130 -117 206 -136 -105 149 25 250 -60 67
7382 67 164 86 -45 -300 -5 97 -185 62 -179 80 -173 -18 16 29 208 29 -167 -60 153 -121 -288 8
7404 8 211 69 -82 -298 -44 -66 -81 -124 113 -97 -104 -272 56 -212 -236 -38 55 -26 -74 -98 63 165 172 -25 55
7429 55 -171 -124 -111 -381 34 285 51 3 107 -191 82 -39 217 32 37 -99 -257 165 94 76 -92 199 108
7452 108 208 -75 290 165 -281 88 -12 -12 168 55 176 73 308 34 18 -44 159 -111 -101 -135 76 -42
7474 -42 63 -69 -232 -257 6 -335 -15 -63 -8 295 376 36 -196 -76 -9 90 -64 31 19 94 -107 318 111
7497 111 121 -223 -184 -64 88 -116 105 -48 -86 90 0 204 407 -37 62 -26 -53 57 -240 -43 -348 66
7519 66 -91 75 -9 -76 -150 99 56 4 -111 166 -77 163 158 -7 -30 146 206 -149 -24 -149 -286 192 116 -97
7543 -97 177 21 150 -242 -204 17 92 -19 182 -101 -104 124 129 125 106 15 201 136 -23 3 -3 242 43 -83 -56
7568 -56 -92 -19 -1 27 66 -166 46 -164 245 -76 -37 1 28 223 2 -73 -12 -11 -10 85 -6 114 111 -192 -43 -44 -63
7595 -63 -280 -112 -18 -59 25 -86 -84 169 -195 154 163 79 92 42 95 -3 -62 -334 131 -26 120 180 -309 101 111
7620 111 -155 -141 281 -40 214 -108 -90 -154 105 -165 -242 163 2 -67 -51 13 -91 101 35 -20 -20 -157 127 -93
7644 -93 -224 -211 26 -2 60 -34 -102 -76 24 -82 -30 49 -22 -134 86 -92 -94 155 -167 -109 -57 7 249 12 112
7669 112 -25 23 257 -201 109 49 -110 142 -182 -46 -203 -95 -103 -179 29 224 49 25 258 176 239 320 199
7692 199 7 -104 110 -153 -133 -162 1 166 195 -41 -100 66 357 123 110 136 -91 -132 -134 107 -89 -172 -207 2
7716 2 202 -17 93 131 38 142 -91 105 171 12 -83 -82 -72 -151 -162 130 169 -50 -105 214 -39 -116 -18 -33 10 238
7742 238 36 -13 -103 76 -54 33 -42 -90 98 -112 -24 -117 142 244 121 319 -11 236 15 93 -28 -115 68
7765 68 -36 135 215 -137 -159 216 -73 11 -75 68 180 144 -147 -202 -163 208 -148 113 -173 166 101 289 -70
7788 -70 133 -208 128 -11 45 189 11 135 -39 -9 117 -17 63 29 153 -16 -97 344 110 93 -40 -20 -311
7811 -311 55 -100 -5 47 -62 -59 95 136 -175 21 20 -142 -94 -151 -44 215 179 -48 -21 -83 74 -74 213 144
7835 144 77 96 86 7 168 -251 130 7 -86 -50 256 -187 -169 -118 -139 -54 95 -396 -160 37 -42 -150 216 25
7859 25 -76 -17 -146 -11 216 189 20 98 124 163 -112 72 41 71 120 -69 21 175 -112 -8 -69 111 -55 304
7883 304 -211 -263 103 137 -238 -170 -83 -401 -107 -12 26 71 -345 -84 121 137 -5 4 -379 -66 -170 -236 -30 -37
7907 -37 80 -120 156 53 41 -56 107 -17 -248 -184 -57 64 -65 -62 236 -41 49 -7 -119 90 79 196 342
7930 342 24 159 173 32 -1 -2 54 173 254 -52 61 -84 200 76 -288 104 -30 -106 -274 -68 8 -90 -32
7953 -32 140 284 147 -195 -78 94 -25 207 -63 -151 -40 -8 -235 136 -59 -196 -48 -185 -179 172 191 -256
7975 -256 133 17 34 -95 102 -5 76 -189 29 -157 -66 70 37 -21 -22 -70 21 -104 30 -83 63 -102 -60
7998 -60 34 246 -44 267 87 -81 91 22 -192 32 -52 -108 62 219 -91 152 37 160 81 -73 -56 -40 281
8021 281 -317 178 131 20 -277 -93 199 -40 39 -75 -21 -96 116 -54 109 -2 -54 -55 126 -88 -20 -77 51
8044 51 -58 -254 203 -52 50 77 178 -53 122 162 -58 -218 -159 132 -144 -145 267 15 -25 -10 33 -2 -151
8067 -151 -242 -160 -35 120 -156 -42 -187 -186 -113 133 -180 -16 39 41 172 145 -36 76 235 148 258 193 68 -48
8091 -48 127 -65 -8 6 103 -112 260 225 73 -126 -170 -8 -41 -118 89 -104 -79 -48 35 75 -122 32 -81 -101
8115 -101 -361 -89 51 0 144 -73 102 251 -98 22 84 43 146 -183 -30 -40 -231 91 15 225 -13 47
8137 47 114 -47 -313 19 -221 59 64 162 18 -49 68 -79 -93 -154 -16 -35 -54 -109 -148 185 -15 -154 342 75
8161 75 -279 -300 -38 195 -241 -84 -40 220 -164 -179 82 -184 -69 44 -103 14 52 -333 31 -118 -184 155
8183 155 -27 -26 255 -132 -4 -232 -213 21
8191B1
$$ Imaginary data points
##PAGE= N=2
##DATA TABLE= (X++(I..I)), XYDATA
0 0 0 0 0 0 0 0 0 0 0 0 0 0 0 0 0 0 0 0 8 -8 8 -8 8 -8 16 -16 16 -18 24 -24 32 -32 40 -41 48 -56 63 -67 75 -86
40 -86 96 -105 115 -129 141 -155 173 -190 209 -230 254 -280 309 -341 377 -420 466 -521 585 -661
60 -661 755 -872 1021 -1221 1506 -1932 2654 -4086 8001 -40979 -114980 16809 86724 17326
74 17326 -60812 -37112 34111 36726 -11131 -4633 -5318 -23211 18939 49400 -3629 -47139 -18290
87 -18290 52349 54147 -37893 -57831 31367 54128 -58 -28367 -14546 18628 25099 -113 -3279
100 -3279 -9029 -14493 24913 30147 -24430 -29152 12347 26032 3897 -24473 -10880 18519 -2089
113 -2089 -11682 12672 -5487 -26166 3211 21137 2722 -27577 -25022 23918 24610 -30533 -24492
126 -24492 15422 7862 -10013 -8004 3146 2403 -19500 -3990 32348 -4501 -42500 2617 37922
139 37922 8008 -29972 -21762 26787 29147 -20262 -17619 14608 7241 1742 6662 -1852 -3460 -366
153 -366 10586 19954 -8993 -22715 16493 25330 -4273 -13396 -2793 14890 14337 -10232 -6312 9131
167 9131 -2517 2197 11415 -7892 -10581 5921 8564 1557 -13603 -8532 15421 1811 -18718
180 -18718 1743 8237 -8684 -7163 -14 4708 -1957 -17590 -1561 15126 -7858 -15206 2350
193 2350 2121 -1697 -3385 -4026 3522 -5586 -9935 13716 7316 -19394 -6652 14644 11038 -6395
207 -6395 -17776 4151 22539 -1863 -13163 3615 4126 5301 8079 -3518 -4708 2385 7345 14032
221 14032 -2775 -17398 8158 20972 603 -9623 -6056 8321 16163 -4278 -11001 4735 3277
234 3277 2454 6386 -6763 -8922 4551 7331 3382 -10035 -14285 10982 12707 -12865 -11452 2579
248 2579 3392 1579 -7916 -7656 3641 -2378 -3683 3902 -7425 -8880 5213 1839 -4086 -5464 -5885
263 -5885 7019 4986 -11567 -2792 7443 -1612 -1454 94 -937 3850 -1735 -1355 8504 -1687 -5438
278 -5438 8410 4049 -2798 1866 1511 4402 3843 -3643 4408 6956 -4920 2292 7520 -1458 -106
293 -106 1570 1478 6431 -2464 -5220 7816 2919 -5158 1287 480 104 1843 -4504 111 2813 -6470
309 -6470 -61 4833 -7089 -4352 2575 -1262 -1644 -4961 -4481 5305 -1732 -9127 1328 367 -3914
324 -3914 782 -3463 -3147 2687 -2648 -978 1945 -5684 -277 5679 -2907 -2182 957 75 5280 -224
340 -224 -5233 5929 4230 -3070 3023 2086 -476 4825 1312 1093 3718 -1880 2575 7112 -3091
355 -3091 -1060 5976 1106 1406 1088 -2181 4533 2717 -4355 2395 1800 -2430 2396 -766 -2502 2317
371 2317 -2454 -1964 3113 -4633 -3198 3480 -2868 -3307 -186 -3340 376 -903 -6097 625 607 -5403
387 -5403 656 -786 -4955 1131 -262 -3397 841 -2460 -1428 3660 -3073 -2609 3483 -1160 481
402 481 2167 -2911 2110 3822 -2240 2065 2760 -2020 3641 3357 -1080 2610 692 1050 6317 -839
418 -839 -1917 5041 1467 592 3478 -1778 530 4452 -900 709 1372 -3252 2781 2803 -3460 11
434 11 -610 -1747 3818 -1019 -5728 952 81 -1075 786 -5444 -3699 3319 -1274 -2488 -2004 -5198
450 -5198 1774 3317 -5968 -2967 118 -2244 2168 -539 -5779 106 1133 13 2369 -4680 -3962
465 -3962 5789 2456 -1806 -992 -2825 3987 6968 -3233 -2765 2901 2276 4471 912 -3784 3015 4042
481 4042 815 3981 -1031 -3130 5723 4472 -474 -664 -2834 2781 7436 -1770 -4562 1216 1263 4242
497 4242 277 -7013 202 4461 -1547 -631 -2002 -4213 2041 1122 -2258 -835 -4800 -2859 4957 -911
513 -911 -5713 -2879 -1442 3397 2084 -8558 -4208 4695 1076 -1519 -3720 -3571 3899 1932 -3212
528 -3212 903 -1241 -2670 4463 2817 -2618 -1251 -1317 4375 7205 -4466 -5173 4672 5738 2605 -2648
544 -2648 -4493 6103 6937 -2359 -177 1094 143 4551 2508 -1502 337 -1423 1902 7031 -1968
559 -1968 -6232 1147 3326 3775 -1014 -8520 151 7689 -836 -5083 -3511 -647 4567 -462 -6439
574 -6439 -666 57 -2044 2111 -1849 -4894 -940 -623 1806 1679 -7411 -4500 5825 2994 -3486 -5942
590 -5942 -2482 6875 3021 -7674 -1847 3378 798 1606 -589 -1672 2123 271 1373 4999 -2780
605 -2780 -4073 4696 5392 1332 -2354 -4197 6125 8304 -3293 -3977 2546 3774 4033 -767 -4016
620 -4016 2775 2875 259 2421 -1849 -3308 3179 2295 -153 -1171 -5274 443 6661 -1205 -5845 -2490
636 -2490 1078 4648 -1180 -8741 -852 4341 -376 -2170 -4053 -2848 3477 -7 -3651 -388 -2508
651 -2508 -1423 3212 -688 -3642 -2030 -923 4204 2282 -7042 -2026 5692 2065 -978 -2833 -730
666 -730 5403 1740 -3292 1534 1417 267 3186 508 -529 2307 -312 2230 3877 -2060 -1276 3665
682 3665 1743 1391 -492 -2177 3452 2650 -2532 450 700 -675 2629 -418 -2200 1307 -683 -1189
698 -1189 1888 -1643 -2052 401 -1739 463 363 -4652 -1092 1965 -1710 -1506 -1767 -2427 1930 70
714 70 -3821 -30 -346 -1392 1368 -1717 -1890 1327 -1499 -106 1987 -2815 -1144 3102 349 -362
730 -362 -47 -883 2957 1810 -1611 1671 1756 48 2654 571 -1056 2608 994 254 2697 -625 192
747 192 2971 -103 435 1566 -1286 1503 2007 -1917 756 1091 -1558 1331 526 -1904 722 -175 -1371
764 -1371 967 -1660 -1842 1296 -1736 -1631 1079 -2446 -1387 1296 -2023 -1006 -221 -2605 431 182
780 182 -2980 -84 -340 -1653 1349 -1270 -2372 1258 -119 -1132 1220 -1373 -781 2292 -546 -148
796 -148 1096 -672 1885 2152 -1895 1178 2209 -257 1912 1070 -1207 2628 1573 -497 1914 -70
812 -70 249 3220 -281 -688 2237 -429 719 1581 -1968 393 2157 -1068 -10 396 -1413 1445 143
829 143 -2400 560 -235 -1891 1106 -1536 -2246 1189 -1349 -1644 223 -2186 -817 746 -2088 -927
845 -927 323 -1605 424 204 -2605 523 748 -1884 619 -133 -861 1683 -389 -1127 1848 -128 -5
862 -5 1963 -764 511 2272 -636 802 2224 -744 1394 1788 -659 1641 1065 -361 1870 630
878 630 -794 2504 110 -722 1835 -476 -258 1853 -1063 -476 1429 -1101 9 728 -1816 408
894 408 449 -2185 588 153 -2564 602 -560 -1917 374 -1035 -1900 754 -1423 -1581 624 -1920 -626
911 -626 875 -2028 -722 1130 -1695 40 446 -1559 715 735 -1226 1331 -72 -609 1686 38
927 38 -532 1588 -351 301 2172 -492 -195 2263 -88 822 1563 -555 1750 1492 -770 1427 1298
944 1298 -985 2103 791 -930 1550 126 -439 1640 -996 -905 1508 -617 -516 625 -1403 165
960 165 841 -2247 -589 332 -1937 368 -191 -2449 119 -269 -1586 171 -1663 -1777 1259 -1157 -1527
977 -1527 608 -1464 -1050 939 -1231 -668 297 -1131 1199 864 -1892 549 1519 -593 822 -87 -492
994 -492 2313 21 -614 2294 397 -315 1936 265 504 1044 -429 1460 2192 -1362 415 2140 -214
1011 -214 617 306 -741 1569 524 -1008 1090 -68 -792 1541 -495 -943 939 -1372 -431 1178
1027 1178 -2018 -966 513 -1345 210 -229 -2760 -49 606 -1594 -409 -1151 -930 1460 -1361 -2615
1043 -2615 1214 -244 -1257 409 -710 -192 662 -1325 718 1655 -1924 -123 1996 181 176 -374 -216
1060 -216 2563 339 -1999 1731 1809 -164 699 166 864 1834 -653 611 2461 -874 -813 1966 539
1077 539 531 7 -1220 2099 1062 -1758 341 636 -369 1092 -591 -1060 1344 -484 -1447 699 -1264
1094 -1264 -626 458 -1601 -656 -67 -2125 -554 788 -1345 -855 -960 -1003 1499 -897 -2941 748 1106
1111 1106 -1296 -854 -905 398 1532 -1918 -134 2419 -670 -1225 1254 501 404 -127 -806 2366 1220
1128 1220 -2012 804 2287 392 338 -425 977 2650 -909 -981 2522 842 -609 1499 279 553
1144 553 529 -903 1685 1361 -1538 301 1108 -559 546 -568 -1051 1100 -66 -1708 553 -728
1160 -728 -869 736 -1555 -1174 901 -1154 -914 368 -1558 -295 -219 -1637 815 97 -2276 -209 602
1177 602 -491 -394 -1317 31 2111 -1571 -1728 1923 192 -977 661 -75 748 661 -1384 1139 1929
1194 1929 -1510 261 1845 166 580 -319 168 2389 -168 -1184 2346 704 -538 1074 139 358
1210 358 1026 -786 715 1187 -1699 241 1214 -1012 -329 288 -986 586 -494 -1038 619 -863 -1127
1227 -1127 506 -760 -1494 479 -866 -595 90 -1412 -6 649 -1703 -673 787 -1165 -404 -206
1243 -206 -686 502 -587 -1356 1563 -192 -1404 1356 743 -482 724 -421 844 1328 -1120 736
1259 736 1797 -821 79 1474 106 704 562 -439 1769 460 -1068 1397 969 -680 649 133
1275 133 424 936 -891 26 1476 -1110 -484 1627 -889 -416 517 -403 415 -469 -1868 840 -145 -1742
1293 -1742 146 -122 -1493 267 -700 -1032 425 -1714 -714 834 -1083 -916 754 -439 -385 84 -893
1310 -893 451 458 -1314 757 336 -978 878 496 -452 751 -281 301 1487 -704 -135 1999 110
1327 110 -266 1146 168 463 769 -363 1159 652 -995 1140 1291 -637 718 333 -57 1121 -607
1344 -607 -404 1292 -568 -830 976 -370 -585 226 -677 16 -96 -1571 47 560 -1898 -356 318
1361 318 -1203 103 -625 -991 565 -1085 -1238 874 -734 -1190 798 -865 -498 496 -1005 248 838
1378 838 -1180 420 1145 -1030 239 468 -97 1053 -123 -206 1653 -102 -789 1738 438 -242 970
1395 970 170 500 808 -739 613 1106 -762 605 916 -341 465 -177 -241 797 -283 -885 1043 -230
1413 -230 -1133 602 -559 -565 342 -782 -79 559 -1404 -75 602 -1454 -290 110 -858 -44 -606 -1152
1431 -1152 517 -435 -1282 689 -305 -1148 141 -605 -360 461 -883 -132 1017 -763 -264 830 -708
1448 -708 327 562 -627 1027 258 -634 1120 342 -470 1045 791 -245 947 185 182 1225 -405 176
1466 176 1115 -391 325 1087 -382 592 792 -437 647 119 -501 561 -115 -798 89 -222 -493 268
1484 268 -750 -396 404 -1137 -626 664 -967 -529 128 -979 141 -268 -1066 119 -42 -1248 418
1501 418 -279 -1075 560 -354 -713 588 -662 -92 931 -576 -244 846 -374 -182 769 -791 656
1518 656 894 -353 780 493 -499 929 676 -88 822 196 41 850 -195 -94 1075 -169 92 482
1536 482 -387 143 978 -536 219 568 -689 381 345 -683 723 -235 -1023 667 -329 -866 410 -417
1554 -417 -679 333 -672 -365 246 -943 -174 20 -977 -1 -5 -1011 137 61 -1346 412 18 -778 178
1573 178 -181 -145 783 -466 -315 1109 97 -111 936 -426 339 570 -548 684 755 -252 695 639
1591 639 -74 881 62 -268 1360 121 -579 920 140 15 543 -712 215 882 -619 -233 460 -516
1609 -516 -62 113 -843 452 -222 -914 406 142 -1048 288 -300 -384 264 -1032 -916 755 -779 -907
1627 -907 244 -668 -138 -40 -1089 132 301 -1424 108 221 -481 47 85 -330 678 -213 -537 929
1645 929 -10 -210 659 -14 229 1015 -406 320 964 -286 343 822 17 765 304 -423 1020 557 -256
1664 -256 589 394 186 644 -572 -23 900 -397 -547 372 -241 21 130 -833 367 416 -1328 1 109
1683 109 -839 124 -520 -555 261 -679 -1089 776 -388 -1061 11 -402 -291 -22 -995 -40 577 -723 -395
1702 -395 342 -400 241 -308 -479 889 42 -676 667 261 -273 269 8 -17 638 -201 513 1238 -85
1721 -85 157 691 -186 820 821 -138 493 710 -301 290 260 -92 740 44 -625 536 59 -660 397 -454
1741 -454 -219 220 -734 102 756 -1037 -519 154 -597 -223 -382 -648 598 -339 -1074 363 -251 -883 349
1760 349 -336 -433 101 -629 -371 648 -463 -567 403 -281 183 359 -555 515 119 -772 508 513 -263 373
1780 373 63 76 708 43 116 785 -295 45 854 100 191 665 -185 211 416 -634 402 189 -368 332
1800 332 400 -573 415 219 -400 459 -425 -166 555 -509 -784 405 -614 -624 232 -605 -142 -64 -819 -60
1820 -60 344 -731 22 304 -868 -231 -317 -715 62 -411 -505 843 -185 -606 597 -447 -69 518 -258
1839 -258 352 481 -338 282 542 -298 351 387 174 648 314 121 1019 -5 -395 808 326 113 637 -95
1859 -95 128 607 -169 575 584 -502 379 498 -585 297 140 -354 115 -275 -267 573 -481 -610 235 -302 -647
1880 -647 -17 -373 -259 -21 -824 116 326 -661 -255 375 -442 -57 -31 -586 297 -238 -739 654 -310 -778
1900 -778 469 46 -163 580 -112 43 660 -548 267 642 -278 298 609 -196 620 320 -221 850 153
1919 153 -385 740 252 -126 743 -47 62 589 -309 97 436 -375 -172 513 -451 -194 338 -691 318
1938 318 -111 -870 384 -151 -745 87 -450 -542 223 -690 -476 341 -637 -158 519 -693 -512 -105 -608 2
1958 2 117 -301 391 -48 -495 155 167 -374 300 191 -152 265 -172 146 832 -261 -128 775 -161 136 253
1979 253 -239 196 518 -327 612 401 -300 629 240 -29 616 -315 -80 873 -478 -108 643 -351 -192 614
1999 614 -59 -130 110 -425 262 34 -617 -66 68 -638 111 -218 -635 133 -302 -453 76 -493 -605 325
2019 325 -395 -132 130 -396 -204 150 -387 26 137 -588 -37 30 -531 423 20 -167 588 -310 120 706
2039 706 -100 -400 600 157 394 545 39 112 194 -264 462 355 -252 406 477 -178 564 260 77 748 -71
2060 -71 -215 529 143 -280 340 -185 -13 -20 -451 -287 211 -666 -188 -14 -648 28 -203 -404 174 97 -395
2081 -395 32 -290 -357 143 -279 -390 262 -404 -188 275 -671 108 387 -630 -102 271 -142 509 90 -377
2101 -377 524 -201 -347 480 227 -106 537 -72 -71 658 68 296 732 -350 -56 612 -26 213 505 -115
2121 -115 347 352 -97 227 212 -88 536 -76 -339 246 -200 -52 437 -352 -238 248 -451 41 251 -784 -346
2142 -346 53 -571 -276 -130 -451 144 -111 -573 -42 -370 -322 155 -211 -184 485 -338 -99 354 -445 49 153
2163 153 -48 292 220 -647 495 225 -420 408 537 -124 594 84 57 545 210 -123 858 292 247 151 -205
2184 -205 623 400 -449 -48 664 -133 120 234 -125 407 -109 -329 436 -73 -512 304 -231 -403 189 -531
2204 -531 -348 299 -464 -463 224 -61 -312 -284 -514 2 -195 -634 -63 -124 -860 -184 -185 -277 309 -129 -309 0
2226 0 -190 -165 337 -122 153 640 -432 148 460 -269 166 415 -172 607 192 -282 387 242 -587 343 199
2247 199 -110 529 -175 95 734 -277 -42 691 -199 9 365 104 423 95 -486 268 402 -810 108
2266 108 24 -319 68 -287 -316 392 76 -563 184 -251 -650 -42 -461 64 59 -527 22 8 -205 105 42 -355
2288 -355 237 -91 -507 81 -125 -262 266 -124 -76 546 -120 -6 247 229 425 417 -8 245 526 -381 585
2309 585 406 287 708 394 129 360 25 -179 580 179 -136 519 -48 -165 9 9 138 -25 -250 186 475
2330 475 -399 -119 -36 -388 179 -307 -382 412 -291 -635 162 72 -556 313 -679 -202 89 -293 -420 349 -496
2351 -496 17 154 -614 243 167 -410 160 9 -386 611 138 -168 420 274 -79 177 -40 81 292 -195
2371 -195 306 407 -221 279 454 26 93 297 -166 550 206 -371 551 133 -283 419 -56 -146 273 -411 134
2392 134 191 -349 -186 408 -303 -334 91 -267 110 -121 -643 -100 -6 -497 192 -50 -157 330 -205 -374 660
2413 660 -262 -216 85 -233 -486 175 -364 -170 195 -64 478 67 -267 320 317 -352 228 146 -400 340 156
2434 156 -80 650 -12 -80 430 -13 25 521 -23 433 328 -111 715 275 -288 506 471 -336 204 -38 -158
2455 -158 436 -214 -93 388 -300 -138 619 -137 -351 388 -400 135 45 -656 53 29 -657 -88 227 -530 215
2476 215 -307 -279 31 -393 -441 195 -235 -564 208 -122 104 -85 -504 434 343 -421 86 203 -185 336 333 80
2498 80 191 -6 -170 632 84 -163 599 -224 -153 450 150 -86 379 -260 48 554 -311 206 122 -162 32
2519 32 74 -81 325 -71 -215 338 -437 -306 166 -131 -99 -238 -261 -72 118 -671 -164 89 -459 -246 0
2540 0 -379 -34 -176 -353 201 -93 -392 241 -41 -187 365 -25 -55 103 -280 256 513 -287 138 -86 -145
2561 -145 217 477 6 210 32 -220 388 -110 -91 450 343 -6 387 136 128 393 -264 158 118 -77 -32 302
2583 302 -287 64 -30 -214 -110 -198 -368 367 75 -234 270 69 -407 71 -418 -478 -4 -265 -256 91 -50 -55
2605 -55 -99 -627 43 -380 -499 260 -145 -218 118 142 -4 130 -118 -51 304 -168 189 240 -258 216 289 -283
2627 -283 -78 489 -212 217 439 -67 -16 254 -197 21 153 20 145 -10 -4 295 -27 255 357 -87 35
2648 35 351 -465 119 300 -179 31 214 -390 152 155 -384 -10 -245 -457 444 -284 -238 75 -459 -399 89 -66
2670 -66 51 -139 -625 -82 -92 -252 -170 252 -345 -260 23 -133 329 365 -265 264 -56 -187 249 -136 48 609
2692 609 -174 -92 674 -80 262 311 -228 157 66 -99 433 250 -135 186 237 -180 388 -59 -258 174 -130
2713 -130 21 156 -178 -206 136 -147 63 96 -327 -129 123 -3 1 -26 -323 54 -169 -333 287 -114 -373 -192
2735 -192 -137 -44 256 -450 -369 309 -394 -225 120 -134 24 123 -172 -125 286 -110 159 193 -301 360 204 -275
2757 -275 273 -11 41 549 113 -189 361 -23 127 294 -176 100 231 118 278 72 -168 73 145 -210 443
2778 443 17 -216 167 214 -53 108 -249 -311 8 -432 -308 8 -215 249 -8 -300 -95 82 -480 0 8
2799 8 -215 161 -324 -51 317 -167 -200 84 -353 -18 40 -127 -91 205 -99 -1 195 1 -130 -85 -183 622 272
2822 272 -115 379 400 -235 206 124 -26 258 -148 2 437 -61 62 201 77 138 489 -22 76 191 -75
2843 -75 -165 -60 -73 236 -62 -227 188 191 2 30 -2 -194 70 -52 62 42 -527 -187 94 -233 55 -171 -457
2866 -457 265 -118 -517 248 -45 -399 86 59 -120 273 -179 -319 296 -210 95 180 -337 242 88 -35 347
2887 347 294 -465 154 324 -64 234 65 100 229 57 90 323 72 -51 383 -178 29 412 -19 20 211
2908 211 -89 126 1 -250 267 154 -36 92 -58 -383 -23 -22 -42 -236 -331 -510 181 -357 -178 46 -110
2929 -110 -162 -146 -286 21 -63 -434 124 152 -75 12 111 -282 110 46 -153 272 -228 -39 152 -140 181 412
2951 412 -151 -86 448 -82 43 64 -72 127 262 -134 214 100 -38 429 -63 -88 22 -60 -222 318 -168
2972 -168 -122 130 -160 363 193 18 -137 144 -397 -31 54 -91 -141 -74 -70 125 -123 -237 213 -192 -170 22
2994 22 -290 26 16 -111 -78 -222 -316 -67 197 -164 19 18 -259 169 -42 -105 268 25 -327 364 165 -60
3016 -60 68 -127 355 298 60 -60 365 -176 -12 242 190 63 135 -100 217 291 7 146 208 59 35 83 136
3039 136 111 61 -142 19 75 -292 21 -220 -191 -49 -16 -206 -297 -526 294 130 -1 -3 -48 -362 30 -117 -15
3062 -15 329 -147 -42 5 -108 -331 -110 -266 -93 -176 -206 279 137 -201 237 -47 -283 275 210 176 133 55 302
3085 302 534 17 -24 450 -61 -119 168 24 156 390 13 134 249 -436 59 206 -42 4 61 -156 214
3106 214 26 -166 475 -196 -233 13 74 14 262 12 -20 -20 -87 90 338 -362 161 -151 -327 -132 -72 -278 -68
3129 -68 149 -253 152 -83 -122 119 -224 -119 139 41 228 252 -439 40 267 -205 182 186 -368 162 -2 -204
3151 -204 323 62 -304 302 154 -184 395 113 98 184 -163 213 365 -274 -102 34 -248 117 241 -28 75
3172 75 97 -195 360 -6 -379 343 -66 -80 82 -202 -117 375 -361 -102 -73 -174 -150 -37 -505 118 143 -274
3194 -274 -45 53 -392 -103 80 -205 209 -143 -24 500 -260 47 462 77 72 244 -107 -180 264 267 225 -45
3216 -45 132 143 137 -133 142 48 71 5 -90 66 277 -188 -178 162 -124 36 134 120 -5 15 -168 -38 342 -310
3240 -310 120 68 -107 188 118 -525 44 -31 -38 271 -254 -140 -80 4 -44 179 -240 -62 56 6 -16 -175 -172 9
3264 9 -179 -185 43 -62 -28 326 31 94 65 154 -95 31 -23 90 -68 -45 219 319 -67 312 -138 -11 431
3287 431 31 104 337 -78 41 456 30 107 223 75 171 142 -330 -105 134 -200 -75 39 -260 189 -207
3308 -207 -173 297 -113 -323 68 -73 -97 215 -338 -281 172 -456 -17 9 -338 -57 376 -407 -46 231 -197
3329 -197 -1 153 -294 35 38 6 268 174 -97 359 186 -37 -179 122 -64 466 187 218 284 -97 -50 200
3351 200 -29 -186 -34 -217 360 65 -272 99 145 -115 350 -32 -184 529 -31 -268 433 -148 -111 259 -284
3372 -284 32 -51 -173 106 44 -167 -233 -92 -228 37 111 -107 17 -10 -196 164 -332 44 20 -211 -327 233
3394 233 -154 -154 209 -100 -60 244 -246 348 224 -9 297 146 -116 184 91 -116 313 97 -12 196 -39
3415 -39 -103 -154 -81 244 132 -225 103 141 -246 294 -24 -79 102 -191 -15 306 -116 -307 63 -30 125 346
3437 346 -168 95 65 -220 48 -14 -223 33 341 -392 -98 246 -159 0 -137 -207 -11 -136 -356 22 -48
3458 -48 -294 211 -270 -204 285 -112 -31 298 -79 101 -72 -36 112 303 -64 39 106 -216 124 186 -61 531
3480 531 294 263 177 -151 -230 33 55 35 354 202 -21 64 -153 67 151 -295 151 125 -150 41 12 -366 169
3503 169 -86 -223 -23 34 64 156 -150 -105 190 -462 -85 54 -265 204 -124 -328 187 -196 -181 -73 -107 -149
3525 -149 314 -173 59 269 183 -166 224 -158 79 420 -49 173 131 -3 46 289 -23 160 141 -283 387
3546 387 -111 -279 103 -178 14 166 -213 -106 191 -77 3 120 -58 206 159 -414 309 -176 -212 67 -25
3567 -25 -330 57 -154 -239 81 -18 -48 -98 -254 -143 52 -279 -245 54 -282 -206 -68 141 -52 62 -349 36
3589 36 284 -119 2 -84 -22 261 87 -303 162 25 -143 118 -291 -84 39 -7 280 152 -215 354 319 -195
3611 -195 173 222 42 449 -83 -169 136 85 -180 267 -37 8 211 -12 -59 332 -152 165 217 -123 -270 -310
3633 -310 -184 424 -91 -267 237 23 -20 220 -201 -147 91 -360 -309 -242 16 -373 58 -46 49 259 -42 206
3655 206 121 -94 -133 217 74 291 -17 95 238 -19 -110 148 39 13 35 -100 132 258 -10 81 263 -198
3677 -198 111 226 -106 405 255 -207 339 315 -167 -33 134 -297 13 -135 -123 47 -122 -318 113 86 233
3698 233 -76 97 113 187 -376 80 -42 -302 -17 42 -18 186 -153 -192 82 -127 -45 185 -79 69 250 -193
3720 -193 103 275 29 43 275 -63 -227 223 -123 201 73 -182 221 137 70 486 -41 -40 -6 -46 -53 61 -164
3743 -164 -5 121 54 82 -76 -56 267 157 113 -44 333 58 0 260 -13 145 -107 73 276 -33 274 184
3765 184 -68 235 105 -303 -10 -185 -431 -26 -278 -75 -22 -10 -304 -70 -258 -32 47 -128 -45 92 -151
3786 -151 -72 -35 -302 361 215 -128 -115 -84 -106 -145 303 -88 188 -175 -307 21 5 122 638 24 -249 364
3808 364 -242 12 191 -248 -15 247 -47 123 -72 118 114 16 -323 170 -191 -79 338 -19 -195 154 -180
3829 -180 -244 265 -38 4 270 -492 -312 221 -13 -66 -248 -542 -195 45 -201 -20 -164 -343 117 -190 -136
3850 -136 -190 -103 -136 118 -196 -345 99 18 237 99 72 81 202 -347 202 210 -135 32 17 -18 299 103 -205 60
3874 60 -13 -218 239 -160 124 151 32 -26 245 -108 -63 52 9 189 69 -308 192 169 -195 92 -49 0 118
3897 118 -82 -211 108 -475 -70 146 -186 27 -75 -413 -2 82 -271 13 145 -85 185 -141 -50 -140 -179
3918 -179 -302 -17 89 -220 292 127 18 233 12 -73 105 68 -20 181 -207 107 160 251 238 224 79 426
3940 426 -57 -76 190 29 44 122 -137 -52 97 -141 -64 3 -422 -142 170 -164 -51 -8 -261 -15 6 -188 416
3963 416 178 -60 -102 2 -25 157 39 58 159 -119 -181 169 -57 130 114 24 111 -98 -70 55 259 -249 112
3986 112 270 17 -7 -63 -121 -86 89 114 315 322 119 218 -1 -129 177 -400 66 265 -43 -30 29 -116 148
4009 148 39 -228 -72 45 19 203 -272 -32 135 -195 -388 15 -347 35 81 -115 -81 89 -200 -205 -140 97
4031 97 8 24 -116 -7 29 -359 -9 -282 -108 208 14 -59 37 -158 -104 177 -176 -153 -80 -390 35 -93 133
4054 133 127 -96 59 -163 62 -85 462 120 -103 49 -47 -36 136 25 226 164 30 56 122 -25 214 205 -200
4077 -200 165 -132 -302 -36 -125 -246 -15 -231 -191 -95 -242 -12 8 -218 -14 103 -478 45 166 -197 -154 59
4099 59 -131 191 165 4 469 -24 129 180 -243 -209 -18 -140 157 -20 -117 266 175 -76 86 239 -36 -56
4121 -56 71 -97 121 5 -76 -120 99 201 82 127 -29 59 -83 -257 -46 -28 144 270 -59 68 -77 104
4143 104 391 -30 135 218 131 -115 -157 -114 271 185 -179 -240 377 -12 159 -60 -92 -116 110 -300 -328 46 -238
4166 -238 -20 8 -215 -85 29 -40 217 -256 -236 138 -65 -54 536 -326 -91 268 -52 -49 53 107 128 225 -101
4189 -101 53 142 11 -92 20 -84 26 -182 41 503 -134 149 253 163 144 144 68 49 531 -118 -29 -8 -246
4212 -246 141 113 -109 135 -8 -109 -55 109 -8 276 -215 8 123 16 -95 -47 -78 -142 119 -166 1 12
4234 12 -373 38 -100 -71 278 -25 -250 61 243 125 5 -49 228 222 101 217 299 73 -105 143 74 57 334
4257 334 -26 36 80 -45 256 19 210 -116 282 -182 232 -225 -179 341 276 112 -65 -118 33 252 -150 21
4279 21 145 78 -267 -194 105 185 -70 49 42 -108 -139 92 -101 -213 -56 -146 31 152 -385 -63 110 -127 41
4302 41 52 -305 85 -53 -484 174 212 -221 351 125 54 -41 3 194 389 -63 18 90 97 -93 78 272 -3
4325 -3 136 -44 228 102 -33 143 226 -241 213 155 291 231 -3 -37 41 57 -145 118 -178 -108 -16 -106 37 123
4349 123 -166 -115 -86 -189 20 80 -9 -107 75 -187 99 -336 -139 -375 18 -119 -135 14 -128 -73 -145 -213 103
4372 103 59 52 161 -117 114 -225 -59 -26 168 -251 223 81 -258 231 -339 92 -60 -65 100 220 187 -103
4394 -103 482 126 63 -3 -182 -55 240 -174 106 94 -104 141 174 -40 425 128 146 24 62 -53 85 -353
4416 -353 -226 101 -115 -171 22 -410 154 -45 -333 -164 -53 -278 62 144 -15 224 -226 -22 99 -154 200
4437 200 39 34 -252 -180 -108 102 176 -331 72 121 48 14 207 -109 222 -34 21 15 -89 196 229 83 -61 293
4461 293 -156 35 -32 68 254 0 -84 259 96 -37 -27 53 -151 172 -25 -220 -52 -340 -240 -184 155 -84
4483 -84 -58 135 -88 57 -86 157 -133 -309 113 108 -11 180 87 56 199 155 -209 131 81 -169 172 167 -144
4506 -144 60 -40 -29 212 -57 50 88 -24 88 118 -276 89 248 -132 283 108 -217 282 22 234 423
4527 423 -22 -10 451 -234 135 192 114 85 603 -121 -100 -292 -119 109 123 -87 -105 45 -96 247 -158 129
4549 129 282 -55 -115 180 -79 -141 93 -302 -64 -110 -363 -254 155 37 -65 90 -130 225 -180 -48 -31
4570 -31 -377 82 209 -55 -209 107 74 -4 27 -108 332 119 112 271 236 -126 165 91 -11 146 170 -166 170
4593 170 129 -74 186 28 72 260 -196 -17 -18 -80 -53 90 -113 -162 -127 -209 243 -66 -542 -45 -65 -477 -34
4616 -34 -153 -334 141 -410 -431 138 -59 -78 118 -209 -106 -6 -59 -56 36 -152 231 -97 145 268 59 -103
4638 -103 208 -156 -61 -68 -110 12 65 -81 134 78 99 -92 104 -108 342 26 -216 363 172 115 195 242 -66
4661 -66 -12 -235 58 -33 -69 178 246 -248 99 198 -103 -90 438 -96 16 423 -23 141 70 -266 488 -189 -122
4684 -122 -119 -66 -210 27 -88 -74 -61 -245 -8 417 -231 52 191 -59 -199 -151 -5 249 -43 -121 56 193
4706 193 214 170 151 -180 145 5 335 -213 -162 260 92 39 164 112 144 -116 75 -51 37 -47 -36 322 31
4729 31 -126 349 -136 -204 421 -247 120 140 -133 28 -104 -46 -132 75 -422 27 281 -40 -110 161 -35 74
4751 74 47 -145 27 -108 -162 -61 -22 -23 361 -177 -12 146 -46 -45 10 -3 37 183 3 41 -47 -16 275 -29 -119
4776 -119 164 -224 15 196 115 -59 52 188 -244 16 -104 234 109 74 147 -122 -208 116 116 -245 103 80
4798 80 -104 5 -111 -137 88 -107 -43 28 130 -44 129 -298 -205 29 -268 -62 -348 -452 160 53 -35 99
4820 99 50 -299 -38 -131 -144 335 -310 -23 38 -58 -35 -37 -29 -111 301 -39 173 -54 -197 -23 17 -156 14 -56 -316
4845 -316 83 -6 -202 77 12 -13 143 -1 -147 242 53 111 39 -180 149 99 -77 193 178 3 241 -264
4867 -264 38 44 -122 -416 97 -188 -221 -234 -139 91 -67 -239 -40 138 -230 -137 -26 -276 -127 46 -170 -69
4889 -69 -203 -157 -135 28 -8 246 2 -283 107 -58 -162 98 147 -35 349 -223 58 130 64 5 -144 76 95
4912 95 53 -174 88 12 -112 94 13 -84 201 6 157 179 -287 -45 77 -318 215 325 -37 121 132 12
4934 12 -93 -194 -230 190 -20 -225 8 23 -262 118 -313 -110 30 -373 18 14 -35 107 -71 -8 -190 31
4956 31 -170 243 -92 -141 223 -188 39 -3 -240 -76 436 7 62 393 -160 53 157 11 -80 203 -131 270
4978 270 309 70 333 -227 124 143 155 -195 -133 46 44 242 -196 157 253 24 -226 21 -82 -106 162 152 172
5001 172 45 -246 67 -237 -24 -29 82 -5 87 -235 -31 0 -168 -146 19 -77 -29 -113 -414 104 -115 -15 121
5024 121 177 -71 130 20 -112 174 3 -272 36 -5 280 341 40 136 -149 52 -190 109 -183 143 -164
5045 -164 159 122 119 -5 288 153 -109 31 57 150 43 50 -202 96 -336 -89 -9 70 171 253 -288 265 -83
5068 -83 -77 -115 -29 -219 -172 21 -267 26 -31 5 79 -11 -422 34 -170 -33 219 186 352 -105 -353 -262 76 -305
5092 -305 27 209 -44 183 136 -99 12 -144 148 72 -61 -2 208 96 141 501 14 230 79 -258 369
5113 369 46 -174 -76 144 36 237 252 54 61 -3 -269 -84 -93 -135 166 53 62 236 -9 -138 44 -190 37
5136 37 166 -14 0 121 -119 -73 131 -147 158 233 -356 13 45 -219 -99 -252 48 -105 -259 -144 80 -13
5158 -13 -41 200 -91 53 -96 -225 -94 249 -166 -70 92 -158 196 -198 -219 210 -40 -168 171 9 58 -123
5180 -123 100 42 -69 -37 171 118 100 -137 -178 139 63 72 -116 140 -32 -137 157 -124 90 204 -416 -65 -186
5203 -186 -182 141 160 -263 -314 -148 -235 154 -295 -245 -24 89 -13 48 -168 -295 20 -81 -227 -11 -11 -73 301
5226 301 -78 107 -80 -171 -36 -51 -214 55 46 -92 61 372 215 112 -25 -31 402 -4 -23 195 -115 126
5248 126 241 -77 -138 -159 -201 74 268 -314 104 -100 -259 -95 82 224 119 12 -107 43 -270 -42 -278
5269 -278 -233 -55 -118 -159 219 164 -172 14 16 -213 227 49 -2 -86 -173 -13 23 124 -247 131 -33 -268 165
5292 165 -7 34 224 -137 19 286 -117 262 199 216 207 237 -118 -172 -26 -31 353 250 -4 288 94 234 77
5315 77 -54 192 220 -304 -152 -142 -373 -121 215 -201 -39 88 -255 -138 86 205 110 -90 -254 107 19 -128
5337 -128 -14 -61 -116 76 -166 -99 -10 -274 -118 104 -38 -196 -200 145 212 -146 -102 72 -14 -171 172 306 -115
5360 -115 284 144 39 -59 100 176 178 -153 97 94 -155 68 151 63 300 -130 -73 320 -161 66 10 116 -179
5383 -179 93 -356 5 104 -290 -211 -30 -159 -153 229 -123 78 -30 -13 -33 -135 104 40 -142 -54 1 -6 -69 152
5407 152 -112 108 230 -350 110 163 20 -23 343 -133 187 63 -50 -110 19 -221 -115 -97 62 285 -116
5428 -116 59 275 -42 -21 279 18 144 98 109 -41 52 -34 -190 157 -24 200 149 227 -50 -40 -240 209 -166
5451 -166 -140 -11 30 -53 138 -167 66 -139 -127 -164 -73 -96 36 -14 63 135 -72 103 220 -225 -39 218 -244
5474 -244 -172 174 -40 11 -95 -37 77 38 -4 -398 -84 -60 -191 -29 -43 -42 111 79 124 41 36 -102 -355 52 166
5499 166 -2 -180 172 121 -81 -83 -326 164 -82 47 29 -255 -277 280 -45 164 329 -99 34 71 21 41 163
5522 163 68 25 99 -313 -169 91 -392 -89 130 -180 -63 120 -141 105 -150 -299 101 -223 -161 59 43 -18
5544 -18 -196 128 -85 10 -50 -54 -103 -191 147 4 -44 -140 -17 128 73 61 109 276 -105 23 45 -197 19 156
5568 156 152 -9 53 54 77 49 129 -77 -53 -221 -68 135 48 393 -68 -64 92 234 -271 44 163 -104 86 -93
5592 -93 -14 10 141 -32 196 -42 -130 40 99 -50 -176 -43 -227 -197 -244 30 82 25 186 30 77 246 -56
5615 -56 -93 108 -312 -46 98 -45 -228 196 -224 67 163 -163 74 -28 171 91 74 87 294 -138 -164 -73 -119
5638 -119 -175 187 -45 354 67 -13 260 -28 8 100 -52 -46 -94 168 -188 103 -87 -383 -46 -134 -56 303 -68
5661 -68 35 79 -65 -170 -22 -256 47 -36 -187 124 56 -150 -143 -132 -183 31 37 -133 -163 257 -49 87 -282 181
5685 181 59 56 299 90 -269 195 121 -29 21 202 49 109 161 77 298 -103 163 324 -55 -242 274 71
5707 71 94 370 -50 -114 18 -272 175 220 -354 -88 27 -83 8 85 320 138 -234 97 280 -1 -182 -115
5729 -115 -45 26 15 -246 -329 130 -320 -220 -76 -131 -78 -50 180 107 15 279 27 35 -66 -133 -140 -220 -263 -36 -232
5754 -232 106 -68 53 113 -53 27 253 158 152 286 -18 153 -44 -2 197 -104 -147 231 -65 -268 102 -51
5776 -51 -84 220 311 -59 126 30 -129 162 78 36 22 -271 -1 -204 -51 276 -38 -32 -368 9 -35 199 -53
5799 -53 -324 279 -279 -161 -128 -248 -45 19 -165 110 -141 -34 8 169 153 -86 -99 156 235 -226 -161 12 36
5822 36 -183 -164 -70 -83 179 -256 183 221 60 -156 120 -105 -106 -10 99 245 342 -69 314 -200 175 269 -62
5845 -62 -50 -22 -17 -9 184 -174 -58 34 -350 77 291 -191 89 14 -94 86 -105 -69 241 -148 -121 -237 -77 -381
5869 -381 125 -281 -38 -78 -67 -62 -224 -237 102 12 11 264 -30 -53 10 84 108 103 -274 106 201 119 -101 -56 -264 176
5895 176 -119 19 87 342 25 -65 -280 -23 159 403 -73 222 176 -31 146 -4 48 -33 -21 118 64 -124
5917 -124 -154 -121 -88 106 -140 13 -164 35 -308 -100 0 -175 -6 -289 -37 -19 190 -356 127 -74 -11 39
5939 39 -44 13 -51 95 -32 -25 128 231 156 -128 157 38 250 -93 -115 -8 111 4 2 65 -171 -55 104 32
5963 32 -18 371 -7 118 160 -6 -128 122 190 91 -127 -119 144 -258 -3 -62 155 -163 -96 4 -68 -13 -210 -30
5987 -30 64 -114 58 -91 -37 66 -243 94 44 75 -101 112 -235 156 -112 -57 -154 174 -72 -76 293 36 93
6010 93 176 -127 19 4 -369 3 26 -112 84 73 -3 61 32 -270 -92 -172 74 -67 -227 33 372 -29 36
6033 36 131 67 -41 16 59 260 -12 -140 36 -30 -108 82 95 -103 278 -77 -137 46 -26 -58 84 -85 -45 218
6057 218 -134 164 -87 0 -75 141 -51 -3 -342 -8 7 -15 106 -17 49 43 -120 -75 -191 -110 137 -60 38 -240
6081 -240 -41 137 85 -47 234 -24 36 39 -203 140 245 -126 96 -24 -41 70 -152 -317 45 21 -356 -26
6103 -26 -39 -33 -79 -24 169 28 -153 -137 -226 -4 13 95 -263 -208 -65 -315 145 -111 -166 19 -11 -184 17 -213
6127 -213 -202 -3 -225 -65 -36 -153 -241 -93 -13 -140 143 237 -22 75 179 424 74 82 58 158 86 -75 46
6150 46 -9 144 55 -32 -11 149 -30 39 -70 -46 190 -115 63 118 -6 77 -141 -226 -14 90 187 274 -118 -134
6174 -134 -74 262 77 -57 114 179 -129 -166 4 -159 -177 6 -3 -67 -37 -80 104 85 -192 -228 26 -491 16 64
6198 64 -169 -51 48 175 145 104 -80 38 85 -318 -11 -46 -96 -6 -84 -60 298 31 -100 318 -178 1 -100
6221 -100 -79 245 37 101 542 -77 -43 -107 35 62 49 -42 -196 -80 107 43 187 -127 77 87 -58 -9 110
6244 110 90 48 223 -4 -12 42 -267 -292 -11 31 -165 -82 -200 187 -104 -223 9 22 30 -56 -342 -173 151 -141
6268 -141 107 88 -141 -176 331 31 62 -10 70 150 -86 -4 57 -135 230 7 -64 12 54 18 79 -57 103 120 52
6293 52 133 51 -16 -4 80 -253 -75 -115 -324 -230 228 14 -203 -58 -17 233 114 -142 -216 329 -107 128 325
6316 325 -66 -5 -200 -94 199 -97 -50 225 224 45 75 -117 37 -77 -141 -87 69 96 -206 -166 26 -83 191
6339 191 210 -134 78 -73 -1 49 -118 29 21 -83 -231 -97 106 118 -98 -155 98 47 -170 107 50 379 7
6362 7 -54 -133 -99 -260 156 -59 -66 -87 -184 -251 99 135 -140 248 115 -5 92 -230 -43 362 -6 45 64 -104 -322
6387 -322 -17 231 337 149 -33 78 42 -54 53 51 138 113 -73 36 -60 19 -85 -185 -358 13 -148 -152 -69 230
6411 230 -211 269 245 24 47 132 223 50 -119 -25 166 13 10 -20 15 3 82 -160 132 -259 -61 -38 356 -146
6435 -146 41 -106 -158 -121 -81 135 94 -201 69 99 -83 -68 -210 -88 -138 -32 -86 230 -86 -140 -59 -23 -288 16
6459 16 -122 -175 41 42 59 262 -128 -60 141 -231 -56 -271 153 -417 142 72 -152 65 -27 -102 208 -130 122
6482 122 -2 -32 133 129 193 42 5 -126 103 -3 -116 -281 -176 59 -111 269 208 -48 -82 -289 35 -81
6504 -81 -130 270 -135 143 -253 -95 20 146 186 -27 -32 -42 -60 -281 -195 -70 86 -27 140 53 196 -83 -105
6527 -105 85 -112 -350 245 -222 -372 18 -205 65 95 -76 -279 34 -35 164 19 148 199 100 -46 283
6548 283 247 49 140 76 -60 -70 217 107 110 -50 -201 161 -103 -138 24 -96 125 111 -133 129 134 -281 187
6571 187 32 60 219 185 129 89 98 -143 -96 -109 -187 -162 -288 -48 -42 -113 -140 -33 -246 -57 -41 256 185 51 -292
6596 -292 -213 -113 232 74 58 21 73 -1 -266 130 109 -20 135 -165 -63 -1 38 -230 -32 -286 -129 -193 92
6619 92 51 -139 -153 -4 232 -32 261 160 130 78 92 -180 84 47 -137 -68 -77 8 -33 33 59 144 -115 -267 163
6644 163 -150 -52 -26 154 -10 254 -10 138 -4 -113 78 -104 15 -57 55 102 -78 -311 -32 -218 76
6665 76 -352 84 -94 48 -5 -191 118 85 -147 -5 -122 103 -18 48 -186 -68 -211 148 128 -273 -96 -38
6687 -38 75 123 -36 -363 15 140 88 -146 -144 -31 233 -5 78 -38 155 -72 -157 -179 -69 -115 -96 -53 16 -355
6711 -355 68 55 -408 169 202 -223 -69 -221 -205 -73 15 11 -30 -93 -22 -10 -197 -151 55 -107 55 52 32 189 61
6736 61 110 29 55 -194 1 30 -102 -41 -17 49 7 88 191 51 188 32 376 168 -41 -211 155 148 86 -84
6760 -84 -104 -12 -38 0 -157 174 123 169 -98 -98 129 9 -28 29 30 -276 -315 -3 -177 -154 -217 16 -217 -8 -216
6785 -216 -25 1 -217 26 263 -140 -122 169 -182 -97 121 203 168 -132 -160 -36 -181 125 134 207 120 225 -68
6808 -68 -130 130 62 -426 56 -37 144 -137 -306 -25 10 109 3 99 -48 -244 -241 10 -232 -12 110 129 154 -38
6832 -38 175 245 -187 -56 -45 189 63 -186 -150 136 -190 -47 -50 48 71 233 -140 62 -36 -314 195 -146 -79
6855 -79 202 -127 -184 15 -116 30 -71 20 -32 33 -102 -175 47 -41 -165 -91 -108 310 -10 190 27 -5 207
6878 207 170 -61 82 80 -229 -355 23 -38 -3 350 153 -104 190 -1 -61 -115 -93 56 -117 35 -161 303 -228
6901 -228 -85 -38 -68 283 87 76 -100 -91 52 -348 -135 61 67 -256 -317 9 -83 -38 114 -1 222 10 -212
6924 -212 207 -127 29 -203 -60 -9 103 -101 -138 249 32 -163 -148 -121 -201 -59 -9 196 -8 356 64 -131
6946 -131 33 276 124 -257 116 151 63 114 -218 -84 22 -175 131 65 -37 69 72 -94 -21 189 -124 -6
6968 -6 -286 -38 93 -190 122 -16 -75 -117 127 -156 19 107 -216 -212 -57 86 -44 -180 -148 253 84 5 -26
6991 -26 176 -46 141 -52 -171 87 150 -104 -33 50 92 270 237 -3 38 -75 -47 132 2 237 190 -19 -132
7014 -132 -199 -68 -293 -2 85 -227 42 91 -72 -102 47 -15 -267 161 -42 171 -4 -154 -169 71 4 -40 -95
7037 -95 -39 -139 30 5 -30 53 297 17 -6 -11 1 155 -57 -281 42 111 -458 -263 -74 -3 -88 -10 -90 -199 137
7062 137 171 307 -66 52 -122 158 434 147 -24 -198 -105 50 -83 18 55 230 -108 94 135 -82 151
7083 151 -126 -24 177 45 1 -62 -204 -36 -39 19 -87 -83 219 -164 -173 -77 116 -231 64 -79 -119 58 -75 172
7107 172 -130 -59 -179 -214 -80 147 -192 196 2 169 -158 -113 32 99 -6 67 14 -71 285 -140 84 272
7129 272 1 33 73 72 -96 136 200 -31 316 142 84 -46 -10 -88 177 -256 -175 -80 -132 -77 -268 -72 -114 -30 132
7154 132 -148 -61 170 -2 -150 128 -39 -246 262 -171 150 -141 -13 -120 -282 -109 -19 -24 60 247 -88 -57
7176 -57 -151 -61 -24 16 67 -306 72 51 -76 78 65 -41 52 -15 35 195 -57 11 48 -106 25 197 19 106 -285
7201 -285 115 -198 -12 313 -63 -154 94 -39 8 305 -12 23 184 117 20 64 46 -88 -2 80 64 -118 -94 194
7225 194 -107 -72 -388 -86 -155 -199 -116 9 -231 -231 155 -173 14 74 329 143 289 133 -130 2 18 16 52 361
7249 361 6 212 153 -178 -51 117 42 9 329 91 79 -237 -133 -146 80 -85 -22 -143 180 157 66 238 14
7272 14 18 161 -6 146 80 38 -149 -168 20 216 -159 -161 -167 30 -85 -84 41 -85 -142 96 -195 -36 -176 98
7296 98 96 24 33 198 -72 -47 -110 5 442 -321 -158 55 153 -141 3 -63 182 -57 -10 46 -6 232 -66 21 -141
7321 -141 300 243 48 82 -303 -231 -100 -234 -29 -208 -265 382 -147 -107 50 -41 -77 -94 195 122 -56 89 138
7344 138 112 -176 -90 156 75 -195 188 -38 -81 -172 -25 -172 -12 -242 -212 101 -211 -62 -19 6 -77 2 -66 -50
7368 -50 -339 -16 332 -104 -157 -88 -38 -108 -39 105 -236 -43 -125 43 -195 -144 122 -14 8 41 -182 -216 62 -99
7392 -99 190 81 -92 30 -154 -110 266 -299 -21 0 -206 -300 -74 57 159 39 107 29 -126 -284 209 -65
7414 -65 -338 176 127 -25 109 256 -175 360 -113 -92 20 151 -17 -88 14 -23 120 178 -107 130 -18 -167
7436 -167 235 245 -43 51 221 -25 210 69 -106 33 -219 -99 -110 103 216 31 -24 -65 155 -162 187 136
7458 136 41 -81 109 -24 -248 26 -76 141 102 77 46 197 -12 -192 58 -45 -35 -70 -96 35 74 94 190
7481 190 4 -188 -183 30 -4 -181 43 26 -140 -3 47 -268 52 44 28 129 81 -124 214 238 135 89 -148 95
7505 95 -66 -40 77 110 73 8 268 -26 75 96 -17 -289 -84 -69 155 271 -120 126 108 81 -220 26 -331
7528 -331 4 -65 104 -144 112 111 286 76 159 65 -43 -361 -226 67 -204 220 -1 40 178 -172 -139 -230 -9
7551 -9 238 -58 17 10 125 93 264 -20 -46 69 304 -63 142 -15 86 8 -122 -210 284 117 -183 84 -3
7574 -3 120 -219 -124 98 147 52 3 -77 93 150 -63 -61 134 -25 -180 -108 143 -61 36 121 -302 -225 -271 -94 270
7599 270 -119 -38 152 -150 -189 -34 -133 -167 -335 -230 -91 227 -155 -78 96 198 51 134 181 -115 -196 -13 -89
7622 -89 -146 -43 105 113 98 -71 -321 -301 -107 -184 155 257 103 -60 45 1 176 -123 122 -167 133 -220 10
7645 10 24 53 61 19 402 29 -98 -34 38 181 -62 -68 30 258 -286 0 181 -68 -77 22 -94 118 17 -254 -101
7670 -101 50 -50 152 -193 -156 199 -32 64 -84 -256 88 -154 -439 41 -103 -15 206 -218 75 11 -124
7691 -124 55 -53 116 53 -376 121 -98 -95 54 -62 12 118 2 -51 130 155 -35 31 108 120 9 -47 413
7714 413 -9 129 -58 -153 82 -129 -26 -104 94 89 -15 -174 -93 253 -212 8 145 -299 -105 -12 -195 -195 -176
7737 -176 70 187 125 92 -283 -239 224 179 83 72 -29 186 130 -239 -93 -34 -27 129 -68 -40 -277 237 62 39
7761 39 -67 207 -220 -19 -182 11 227 17 132 -118 -198 -16 50 59 173 -92 112 28 -112 -126 -111 22 123
7784 123 -48 107 -33 100 29 -176 -25 -148 -95 66 -74 192 91 67 95 54 63 102 290 255 166 -1 -31 54
7808 54 94 59 66 211 -175 144 -246 -251 141 -213 -219 65 -169 33 -116 29 212 38 205 -93 -52 -71 1 -387
7832 -387 -122 141 27 54 -214 -112 -356 168 80 24 -86 -101 -24 47 -146 8 156 -214 199 -43 191 177
7854 177 163 56 299 263 -104 42 -41 94 2 61 151 -209 203 61 116 -236 -380 230 -95 104 -175 0
7876 0 116 174 -142 -110 -60 -133 -157 -216 50 54 -385 207 122 -45 -35 -137 -12 40 -113 96 -207 -161 103 -26 256
7901 256 169 -82 100 -37 -14 -170 -109 69 -39 273 361 -36 -175 271 -210 -11 102 -82 63 -70 47
7922 47 -7 67 -168 194 -63 223 237 -117 53 -343 -202 44 44 -14 41 233 54 90 19 -80 -135 -100 0 53 53
7947 53 122 -12 180 318 -33 44 8 -84 -214 17 -29 -163 34 123 -232 11 -41 66 21 -8 -89 -43 1 207
7971 207 -67 -196 -121 -287 -157 -181 15 134 -47 -95 51 -44 214 78 103 -139 -14 -133 -316 -31 -106 -12
7993 -12 -311 -139 27 137 -221 19 249 -204 -58 -167 -94 -55 -171 115 225 193 -216 240 110 147 -18 -130
8015 -130 -100 -37 6 -95 102 258 86 48 -108 -9 74 22 34 53 -76 -92 181 -10 -122 222 -130 118 85 -183
8039 -183 -57 -176 -65 -270 -160 127 -41 455 -137 94 233 -38 -131 -257 -1 41 -108 220 237 5 53
8060 53 43 7 70 66 -174 135 71 -13 -71 -27 114 181 169 15 -35 -12 -83 -118 -55 -15 -144 -137 -154 104 16 -91 -11 104
8088 104 39 58 99 -191 -22 -20 13 295 165 -121 351 -53 103 255 -102 223 -226 -111 74 -153 -35 84
8110 84 86 47 -157 -147 141 -32 -328 271 -15 151 -16 202 159 -58 289 -93 -201 108 301 -107 -74 9 36
8133 36 27 203 119 190 -71 -197 -142 -1 63 -161 -82 114 124 -50 -197 -129 278 -112 215 -86 158 -118 46
8156 46 43 -15 -12 -71 124 -64 -31 -60 -130 -165 -65 84 8 -25 178 73 -226 59 -10 41 -32 -349 -12 -275 51
8181 51 90 -75 63 64 -294 -112 208 73 -178 -71
8191g1
##END NTUPLES=NMR FID
##END=
