##TITLE=1H_Pr Am-Me
 DMSO,8 sc, 
 5.04.2021
##JCAMPDX= 6.0         $$ Bruker NMR JCAMP-DX V2.0
##DATA TYPE= NMR FID
##DATA CLASS= NTUPLES
##ORIGIN= UXNMR, Bruker Analytische Messtechnik GmbH
##OWNER= root
$$ XWIN-NMR		Version 3.5
$$ Mon Apr  5 11:57:19 2021 Russian Standard Time (UT+4h)  she@DPX200
##.OBSERVE FREQUENCY= 200.131506
##.OBSERVE NUCLEUS= ^1H
##.DELAY= (6, 6)
##.ACQUISITION MODE= SIMULTANEOUS
##.ACQUISITION SCHEME= undefined
##.AVERAGES= 8
##.DIGITISER RES= 18
##SPECTROMETER/DATA SYSTEM= spect
##.PULSE SEQUENCE= zg30
##.SOLVENT NAME= CD3CN
##.SHIFT REFERENCE= (INTERNAL, CD3CN, 0, 15.7039)
##AUDIT TRAIL= $$ (NUMBER, WHEN, WHO, WHERE, WHAT)
$$ ##TITLE= Audit trail, XWIN-NMR		Version 3.5
$$ ##JCAMPDX= 5.01
$$ ##ORIGIN= Bruker BioSpin GmbH
$$ ##OWNER= she
$$ F:/spectra/data/she/nmr/H-F/1/audita.txt
$$ ##AUDIT TRAIL=  $$ (NUMBER, WHEN, WHO, WHERE, WHAT)
(   1,<2021-04-05 11:56:11.87 +0400>,<she>,<DPX200>,
      <created by zg, POWCHK disabled, PULCHK disabled
       configuration hash MD5:
       00 E9 B6 7A A2 85 ED C7 34 08 36 98 17 FE 4E 26
       data hash MD5: 16K
       D9 FA 86 28 BA AE 11 54 46 8A 71 1F 43 CC 52 91>)
$$ ##END=
$$ 
$$ hash MD5
$$ 37 29 69 9C E7 92 0A BB 4A EB 99 B3 18 E2 B8 BF
##$RELAX= 
##$RELAX= 
##$RELAX= 
##$RELAX= 
##$RELAX= 
##$RELAX= 
$$ Bruker specific parameters
$$ --------------------------
##$DU= <F:/spectra>
##$EXPNO= 1
##$NAME= <H-F>
##$PROCNO= 1
##$TYPE= <nmr>
##$USER= <she>
##$AMP= (0..31)
100 100 100 100 100 100 100 100 100 100 100 100 100 100 100 100 100 100 
100 100 100 100 100 100 100 100 100 100 100 100 100 100 
##$AQSEQ= 0
##$AQ_mod= 1
##$AUNM= <au_zg>
##$AUTOPOS= <>
##$BF1= 200.13
##$BF2= 200.13
##$BF3= 200.13
##$BF4= 200.13
##$BF5= 200.13
##$BF6= 200.13
##$BF7= 200.13
##$BF8= 200.13
##$BYTORDA= 1
##$CFDGTYP= 0
##$CFRGTYP= 5
##$CHEMSTR= <none>
##$CNST= (0..31)
1 1 145 1 1 1 1 1 1 1 1 1 1 1 1 1 1 1 1 1 1 1 1 1 1 1 1 1 1 1 1 1 
##$CPDPRG= <>
##$CPDPRG1= <>
##$CPDPRG2= <>
##$CPDPRG3= <>
##$CPDPRG4= <mlev>
##$CPDPRG5= <mlev>
##$CPDPRG6= <mlev>
##$CPDPRG7= <mlev>
##$CPDPRG8= <mlev>
##$CPDPRGB= <>
##$CPDPRGT= <>
##$D= (0..31)
0 1.2 0 0 0 0 0 0 0 0.06 0 0.03 0 0 0 0 0.0002 0 0 0 0 0 0 0 0 0 0 0 0 
0 0 0 
##$DATE= 1617609371
##$DBL= (0..7)
120 120 120 120 120 120 120 120 
##$DBP= (0..7)
150 150 150 150 150 150 150 150 
##$DBP07= 0
##$DBPNAM0= <>
##$DBPNAM1= <>
##$DBPNAM2= <>
##$DBPNAM3= <>
##$DBPNAM4= <>
##$DBPNAM5= <>
##$DBPNAM6= <>
##$DBPNAM7= <>
##$DBPOAL= (0..7)
0.5 0.5 0.5 0.5 0.5 0.5 0.5 0.5 
##$DBPOFFS= (0..7)
0 0 0 0 0 0 0 0 
##$DE= 6
##$DECBNUC= <off>
##$DECIM= 32
##$DECNUC= <off>
##$DECSTAT= 4
##$DIGMOD= 1
##$DIGTYP= 9
##$DL= (0..7)
0 120 120 120 120 120 120 120 
##$DP= (0..7)
150 150 150 150 150 150 150 150 
##$DP07= 0
##$DPNAME0= <>
##$DPNAME1= <>
##$DPNAME2= <>
##$DPNAME3= <>
##$DPNAME4= <>
##$DPNAME5= <>
##$DPNAME6= <>
##$DPNAME7= <>
##$DPOAL= (0..7)
0.5 0.5 0.5 0.5 0.5 0.5 0.5 0.5 
##$DPOFFS= (0..7)
0 0 0 0 0 0 0 0 
##$DQDMODE= 0
##$DR= 18
##$DS= 0
##$DSLIST= <SSSSSSSSSSSSSSS>
$$ [...]
##$SUBNAM2= <"">
##$SUBNAM3= <"">
##$SUBNAM4= <"">
##$SUBNAM5= <"">
##$SUBNAM6= <"">
##$SUBNAM7= <"">
##$SUBNAM8= <"">
##$SUBNAM9= <"">
##$SW= 16.9725357007746
##$SWIBOX= (0..15)
0 0 2 0 0 0 0 0 0 0 0 0 0 0 0 0 
##$SW_h= 3396.73913043478
##$TD= 16384
##$TD0= 1
##$TE= 0
##$TE2= 300
##$TE3= 300
##$TEG= 300
##$TL= (0..7)
0 120 120 120 120 120 120 120 
##$TP= (0..7)
150 150 150 150 150 150 150 150 
##$TP07= 0
##$TPNAME0= <>
##$TPNAME1= <>
##$TPNAME2= <>
##$TPNAME3= <>
##$TPNAME4= <>
##$TPNAME5= <>
##$TPNAME6= <>
##$TPNAME7= <>
##$TPOAL= (0..7)
0.5 0.5 0.5 0.5 0.5 0.5 0.5 0.5 
##$TPOFFS= (0..7)
0 0 0 0 0 0 0 0 
##$TUNHIN= 0
##$TUNHOUT= 0
##$TUNXOUT= 0
##$USERA1= <user>
##$USERA2= <user>
##$USERA3= <user>
##$USERA4= <user>
##$USERA5= <user>
##$V9= 5
##$VALIST= <valist>
##$VCLIST= <CCCCCCCCCCCCCCC>
##$VD= 0
##$VDLIST= <DDDDDDDDDDDDDDD>
##$VPLIST= <PPPPPPPPPPPPPPP>
##$VTLIST= <TTTTTTTTTTTTTTT>
##$WBST= 1024
##$WBSW= 4
##$XGAIN= (0..3)
0 0 0 0 
##$XL= 0
##$YL= 0
##$YMAX_a= 301765
##$YMIN_a= -191055
##$ZGOPTNS= <>
##$ZL1= 120
##$ZL2= 120
##$ZL3= 120
##$ZL4= 120
##$ABSF1= 10
##$ABSF2= 0
##$ABSG= 5
##$ABSL= 3
##$ALPHA= 0
##$AQORDER= 0
##$ASSFAC= 0
##$ASSFACI= 0
##$ASSFACX= 0
##$ASSWID= 0
##$AUNMP= <proc_1d>
##$AZFE= 0.1
##$AZFW= 0.1
##$BCFW= 1
##$BC_mod= 2
##$BYTORDP= 1
##$COROFFS= 0
##$CY= 11.3945322036743
##$DATMOD= 1
##$DC= 2
##$DFILT= <>
##$DTYPP= 0
##$F1P= 15.9154993809931
##$F2P= -4.1035820241983
##$FCOR= 0.5
##$FTSIZE= 0
##$FT_mod= 4
##$GAMMA= 1
##$GB= 0.15
##$INTBC= 1
##$INTSCL= 1
##$ISEN= 128
##$LB= 0.24
##$LEV0= 0
##$LPBIN= 0
##$MAXI= 10000
##$MC2= 0
##$MEAN= 0
##$ME_mod= 0
##$MI= 1.114404
##$NCOEF= 0
##$NC_proc= 0
##$NLEV= 6
##$NOISF1= 3.799351
##$NOISF2= 2.8
##$NSP= 1
##$NTH_PI= 0
##$NZP= 0
##$OFFSET= 15.70392
##$PC= 1
##$PHC0= -11121.45
##$PHC1= 13.60092
##$PH_mod= 1
##$PKNL= yes
##$PPARMOD= 0
##$PSCAL= 0
##$PSIGN= 0
##$REVERSE= no
##$SF= 200.130013532006
##$SI= 16384
##$SIGF1= 3
##$SIGF2= 2
##$SINO= 400
##$SIOLD= 16384
##$SREGLST= <1H.CDCl3>
##$SSB= 0
##$STSI= 0
##$STSR= 0
##$SW_p= 3612.71676300578
##$SYMM= 0
##$S_DEV= 0
##$TDeff= 0
##$TDoff= 0
##$TI= <>
##$TILT= no
##$TM1= 0
##$TM2= 0
##$TOPLEV= 0
##$USERP1= <user>
##$USERP2= <user>
##$USERP3= <user>
##$USERP4= <user>
##$USERP5= <user>
##$WDW= 1
##$XDIM= 8192
##$YMAX_p= 0
##$YMIN_p= 0
$$ End of Bruker specific parameters
$$ ---------------------------------
##NTUPLES= NMR FID
##VAR_NAME=  TIME,          FID/REAL,        FID/IMAG
##SYMBOL=    X,             R,               I
##VAR_TYPE=  INDEPENDENT,   DEPENDENT,       DEPENDENT
##VAR_FORM=  AFFN,          ASDF,            ASDF
##VAR_DIM=   8192,          8192,            8192
##UNITS=     SECONDS,       ARBITRARY UNITS, ARBITRARY UNITS
##FACTOR=    0.0002944,     1,               1
##FIRST=     0,             0,               0
##LAST=      2.4114304,     0,               0
##MIN=       0,             -191055,         0
##MAX=       2.4114304,     301765,          0
$$ Real data points
##PAGE= N=1
##DATA TABLE= (X++(R..R)), XYDATA
$$ [...]
1924G02N44j579l65J023P16j538n48J488N81j632p57J638M54j269m14J503L9j263
1942f77K18J115k13j179L44J447j34j916L40J965k36k045L44J794n35j266J15
1959e19J645n15j657L59J362j08j909M86J848m31j531j87J884o3j263j96J194
1976C99j01q52M43P07m50p38R61Q7l50p35N18Q88m44j227O12R53q40p74J267J76
1996E00j311l34J722K40j226j078J880R62j379j032J148J258j373j011J151J161
2012A278r87j077J445N64j422n34J298L74j743l30J123P98j210o39Q29O29o76
2029b80n09R80P5j001j01J770l27j773L97J597J72j765K84J671k83j342P7J228
2047H70l35j298M44J555r34j210O66R54k87j311L32J223l16j268K14J073j75p92
$$ plain form
1924 702 1246 -333 -698 325 1041 -497 -1045 443 1024 -608 -1365 273 727 -542 -956 547 586 -677
1942 -677 -459 656 443 -736 -392 1055 921 -995 -655 1310 1074 -971 -627 1167 632 -634 -519
1959 -519 1126 611 -1046 -687 675 567 -1342 -856 992 561 -970 -1157 727 664 -599 -795 399
1976 399 298 -554 -111 596 146 -592 369 456 106 -629 -111 777 333 -894 -282 671 -169 -943 324 500
1996 500 -811 -1145 577 817 -409 -1487 393 1355 -24 -1056 92 1350 -23 -1034 117 1278
2012 1278 291 -786 659 1223 -199 -733 565 939 -804 -1134 -11 787 -423 -1062 -233 396 -280
2029 -280 -789 191 266 -735 -836 934 607 -1166 -769 828 1000 -765 -481 1190 907 -435 -358 870
2047 870 535 -763 -319 1236 302 -908 -242 712 425 -886 -554 669 353 -915 -701 372 197 -595
2065e95M70O28p57l50O43R42j223o04J112J082j263r10Q24J082r95j032P56Q98
2083G08r83p37R54Q19j399p26J428Q21j124j428J596J049j125r60J218Q88r12
2100H7m60N11O71q35l14O84O62j123o18J295J71j023l61J241r2r93m6Q32M4j287
2120i54R01N35n31j019O47J443n89j436K65J810m81j713N26J592m56j603Q31J233
2138A001o61j137M76J125n74j129M01J165o25q04K40J074m27p96N62M76l59l61
2156c53M81P05j023l83Q69R26j124m94O73N44n76o72O21R64j045o42R68K70j057
2175c48m67R35N01j031k31P01Q11j064q13R31O83r32n75J237n6o68J25P57j11
2194C85r95J79J151o1j319K08J149j86q68j72J311m82q15J0J129l26j394Q46J147
$$ plain form
2065 -595 -125 503 -254 -604 39 981 -242 -846 266 1348 85 -825 -1 1081 86 -946 -190 708
2083 708 -275 -1012 -58 761 -638 -1364 64 885 -239 -1667 -71 978 -147 -1107 111 999 87
2100 87 -373 138 809 -26 -340 344 1006 -117 -735 560 731 -292 -653 588 496 -497 -543 289 333 -954
2120 -954 -53 482 -49 -1068 -421 1022 433 -1003 -738 1072 591 -1122 -596 996 540 -1063 -232 1001
2138 1001 340 -797 -321 804 230 -899 -498 667 42 -762 -522 552 125 -671 -109 367 8 -353
2156 -353 128 833 -190 -573 296 1222 98 -396 277 821 245 -427 194 1158 113 -529 439 709 -348
2175 -348 -815 120 621 -410 -641 60 871 -193 -1006 -75 608 -324 -899 338 282 -386 -261 496 385
2194 385 -610 -431 720 659 -660 -452 697 511 -357 -529 782 300 -515 -505 624 298 -1096 -250 897
2213H97m16j794O38J610k78j392J82J407R5j440j02J267m01o06J69P95k65j009
2231f43N21Q91j68j271N54P24q86k15N86M5n44o0O50K35j056J29P92K26p37m14
2251f41J275M04j587J4P32M55p24m63Q23N46r54l62Q22O3o91m39J133K66j021
2270c49k51R85K99r82m42R79L69p45l25R76j15q07k93J262k87q13Q4J215qj244
2290d92j54J207k11o68j38O30j56o95K69J126m84r90J87J436n06j234N05Q44k00
2309B76r37K32P56j95o63N48L55l13l03M89K74o64m26J079K89p14o57P04M64o00
2329fo54J188J79j087k77Q46N01j345J7Q83L14q72p38J236O88r13q11Q86O65p21
2349b1n71O05N69p79l87P21N69j033m51P92N43q08l76P19L26l95l73L08K20n50
$$ plain form
2213 897 481 -1313 -675 935 657 -735 -553 854 949 -491 -593 674 273 -333 -164 631 366 -643
2231 -643 -122 769 601 -670 -116 608 -278 -493 93 138 -406 -466 184 419 -637 -508 284 510 -227 -641
2251 -641 634 1038 -549 -535 197 652 -72 -535 288 834 -120 -482 340 403 -288 -727 406 672 -349
2270 -349 -600 385 684 -298 -740 239 608 -137 -462 514 399 -408 -701 561 274 -539 -455 760 752 -492
2290 -492 -646 561 350 -318 -456 174 18 -677 -408 718 234 -756 -569 867 361 -873 -368 476 276
2309 276 -661 -429 327 132 -531 17 372 59 -244 245 519 -145 -571 508 797 83 -574 130 594 -6
2329 -6 -660 528 707 -380 -657 189 690 -655 -638 245 559 -313 -1051 185 873 -40 -851 35 700 -21
2349 -21 -592 13 582 -197 -584 137 706 -327 -778 14 557 -251 -627 92 418 23 -350 -42 178 -372
2369c72L50L85p6p47L66P12k44q81O4J081k65p45jP55j27q08K88R43o05p77N61
2390a43N32p05l90N41O85n94n39M05O14l75m88K51N42k08o12Q07M02p42m48P25
2410B60O67j053m72O26P74r17o38Q11L88p24l65R31K51j022p7P72K22j020o6P72
2430A20N27q46o56R60M15m91n89P08J54l22j43K25L09q00N78K62l53m80K38N28
2450C44j60p13K4N58Q1q76O10O95p60l43M98O75n43n70K36J036l61j186M08J096
2470G49l76p21M5J085n47q27N27M60l47p79M85O05l59o39K33Q73l67p08L45Q62
2490E99n89l64M38L25m52l01M43O4l28k87N99O44p87n23N46M46p43lO35l8o19
2511b95j90O09L29p72n04J016K21q35J80O63J05q68k34Q19l2m26K6O41k82l19
$$ plain form
2369 -372 -22 363 287 -460 -94 618 374 -507 -443 638 373 -372 -373 382 255 -553 -265 678 73 -704 -143
2390 -143 389 -316 -706 -165 520 -74 -613 -208 406 31 -457 -206 336 128 -484 323 725 -17 -465 260
2410 260 927 -126 -598 28 802 -115 -753 58 446 -278 -643 288 539 -483 -560 212 434 -586 -652 120
2430 120 647 -199 -855 105 520 29 -560 148 302 -20 -163 62 371 -429 149 411 58 -422 -184 344
2450 344 184 -529 -505 53 134 -742 -132 563 -197 -540 -42 633 90 -480 -244 792 431 -755 -347 749
2470 749 373 -348 -303 782 235 -592 -65 395 48 -731 -246 359 0 -639 -406 467 100 -608 -263 599
2490 599 10 -354 84 409 -43 -344 99 163 -165 -452 147 791 4 -519 27 473 -270 -273 362 324 -295
2511 -295 -485 124 453 -319 -823 193 414 -421 -241 422 527 -341 -575 244 212 -214 -188 453 171 -148
2531a48K3P05n07m88J37Q95l52j071O29M80j04p72M31M92P8q91L05N77k28j031
2551h40M56P98r9q37K33P31p8p18K60L81jm06K10l2Q3m94J82O73o72j74L63K7
2573D6O5l29J38M03m37l82N79L28o73o7K84L73n61k34Q18K49j046l90J082K71
2593E17q76l4M85Q9o51n0P95J93n64k97O08O3o31r8O10K15n35j77N59K07p13L64
2615G9N3Q2m57K39M87r1l83kM66k48n20N7O04k27l87l9O13j60r31N40N64q8j009
2638g58M81O05l01p26L45Q19l54n93J94Q03l05p21P10L6l63l87P83K96o04m00
2658d40N63J77o58j30N39k0j40l77M46M87p36m56R70K91o56l70Q82K25j020k47
2678f70R03N60j217j23O49L26m63k39K72L04m26p8K78q7l36J18L68M0p11J09P93
$$ plain form
2531 -148 -125 580 73 -415 -278 617 265 -806 -177 303 199 -573 -142 350 428 -463 -158 419 191 -840
2551 -840 -384 414 315 -522 -289 442 364 -354 -94 287 286 -120 90 58 141 -353 -171 502 -170 -344 19 46
2573 46 111 -218 -80 323 -114 -496 83 411 -262 -329 -45 328 -233 -467 351 600 -446 -836 246 517
2593 517 -359 -393 92 181 -470 -520 275 468 -96 -393 215 278 -353 -451 159 374 -161 -338 221 428 -285 79
2615 79 132 214 -243 -4 483 392 9 7 473 225 -295 -238 366 139 -248 -287 326 166 -765 -225 339 251 -758
2638 -758 -277 328 27 -699 -354 465 111 -482 -288 515 210 -511 199 235 -128 -515 268 564 -40 -440
2658 -440 123 300 -358 -488 51 31 -109 -486 -40 447 -289 -745 225 516 -140 -510 372 597 -423 -670
2678 -670 233 793 -424 -547 102 428 -35 -274 -2 302 -124 -202 76 -11 -347 -229 139 179 -532 -423 370
2699C70j70o27K53K37j33l55K76O51n49l29J32R73p09l91L87O32l23n72J18M17
2719B88q7o80L03L91k67l20M02N34m16o85K27M85j50n29K50M95j69o62N55L00
2739B65k29k98K39L21l86j93L88M28n47m68N83J48k67m00N61O9m48L0M04K39o92
2760b53j45N36L16p93j57O35M06r20l7O84M4o54M73j11L55l94l63O25j25k54j28
2781b60O40j04o68J76M20kp58N41L17k33n76K47M79k82l67L88N25n05l54K92N45
2802D61k67m04O8M38k6l09l05P45n0p69M13N55m62m34L00M08l53m06L41L14j54
2823A04n60M47J70k10j52K56J36k57k58O45p2n52q6O86J46n94m2L71R2m70j16
2844c16P44j96n39n8M59J64l76j80O42j27n07o6M19O5m41K4M80Rl02K93J65k00
$$ plain form
2699 370 200 -427 -174 63 -70 -425 -149 502 -47 -376 -244 729 20 -371 16 648 325 -247 -129 288
2719 288 201 -479 -176 215 -52 -372 30 564 148 -537 -310 175 25 -504 -254 241 72 -590 -35 265
2739 265 36 -262 -23 298 -88 -281 107 535 -12 -480 103 251 -16 -416 145 214 -234 -204 200 439 -253
2760 -253 -398 138 454 -339 -496 139 545 -375 -412 272 316 -338 135 24 379 -15 -378 247 122 -132 -260
2781 -260 380 276 -392 -216 204 202 -556 -15 302 69 -507 -260 219 -63 -430 -42 483 -22 -376 -84 461
2802 461 194 -210 -142 296 270 -39 -344 401 351 -418 -5 550 88 -346 -46 362 9 -397 -56 258 104
2823 104 -456 -9 161 -49 -201 55 191 -66 -324 321 249 -303 -389 297 443 -151 -193 178 270 -200 -316
2844 -316 428 232 -307 -365 94 258 -118 -298 344 217 -290 -356 63 128 -313 -289 191 200 -102 191 356 156
2866A56k27j15K02L74o32J69O49o37j14J1N07m18k70LN41j69m01L78p1p1l72N68
2888F1N46o47k82J10O58j76n89K83L50k56j74K84nj02m73O00M7l45r2M8L95l22
2910h1l4l09Q33l90j90K95J5k91r1O63k3n58k36P26k4m27j15N59K33n97o40R44
2932B62J00m34j55N54N9q12Q2N76P9m41n8J87L09m90k29L27rj50k2L01J5l68M40
2955A23J13j7j89O9K26k78l03K86J85j63l84J02L98k40l75K39P12n62n77O30N18
2976E13k58o80M77J25k22m76O60J05j82j58N9M63n14K4M16l6n15p3J96qJ38k08
2998a54K28K09m73q3N29Qn83j00N30Q7n81J81N60j73l57qM40k47k87q0M62J57
3020B65m03J42K15n3m20J17L73j79j65k75M75M7m84L24O9J23k22j86N99l83o2
$$ plain form
2866 156 -71 -186 16 390 -242 -73 576 -61 -175 -164 343 -75 -345 -342 199 30 -371 7 -64 -135 -507 61
2888 61 607 -40 -322 -212 446 270 -319 -36 314 58 -116 168 163 61 -412 188 235 -110 -202 -154 241 -81
2910 -81 -115 -424 409 19 -171 124 139 -152 -243 420 397 -161 -397 329 305 -122 -237 322 555 -42 -682 262
2932 262 362 -72 -227 327 386 -426 -344 232 311 -130 -188 -1 308 -182 -411 -84 -93 -243 -265 36 51 -317 123
2955 123 236 219 30 99 325 47 -256 30 215 52 -332 -230 168 -72 -447 -208 504 -58 -635 -5 513
2976 513 255 -425 52 177 -45 -521 139 244 62 -96 -37 426 -88 -64 352 316 -199 -272 -76 -84 54 -154
2998 -154 74 283 -190 -273 256 264 -319 -419 111 198 -383 -202 358 185 -172 -180 260 13 -274 -354 108 265
3020 265 -138 4 219 166 -254 -137 236 57 -108 -383 92 139 -345 -21 48 171 -51 -237 362 -21 -83
3041h3J70M0k63l5J89N46n62m07L15N84m56m90K50L71N4m23K12M0Oj54J03k2P9
3064F4l08J20K78j71l02O3N57l36k97L58J07k3l51N30j98j65o4K95K52n45k82
3085d18N68J28m41R8J92j9k26k63M85m7n00K19M78O6n23p7K33K97l93q8M78J58
3107D05n63j52N52p7j64j45L87J01k63j27K55J19o31J27L61J67o17K08K26j09
3127F0m97M29K76j88j67J49J91k1p29L95L21j28l71K17L76j91o16M23L82n74p0
3148c33L77J59k53k31M60p4j44N4k46N65n89K15J17p0k50r8N67L9k55l3qNl9r1
3172a56L30J34n33J44J99K44m35k90N74J8k69p4L54j51j50k91O60j61k57J45M57
3193D92l49n93J96K82K20j01%M8j9k59K82n7Kl42K01pP4m84M87L1m7r8l01L97
$$ plain form
3041 -83 87 127 -136 -171 18 564 2 -405 -90 494 38 -452 -202 169 223 -200 12 52 58 -96 7 -15 64
3064 64 -244 -124 154 -17 -319 -256 301 -35 -332 26 133 110 -241 289 91 -74 -138 157 409 -136 -418
3085 -418 150 278 -163 -65 127 108 -118 -381 104 57 -443 -224 254 320 -203 -280 -47 250 -143 -231 247 405
3107 405 -158 -310 242 165 1 -144 243 344 81 -46 209 328 -303 -176 185 352 -265 -57 169 60
3127 60 -437 -8 268 80 -87 62 253 232 -497 -102 219 91 -280 -63 313 122 -494 -71 311 -263 -333
3148 -333 44 203 -50 -281 179 105 -39 15 -231 334 -255 -40 77 7 -243 -341 226 265 10 -23 -31 -26 -65 -156
3172 -156 174 308 -225 -81 118 362 -73 -363 211 229 -40 -114 240 89 -61 -352 308 147 -110 35 492
3193 492 143 -450 -254 28 248 147 147 195 176 -83 199 142 144 -198 3 -4 70 -414 73 104 57 -41 -342 55
3217E5L68n07k9J63k68l8K2L70m03rK38K69k10k60L08K87l44o27P12J38j76l73
3239c14N20j2k29k70M67k8k25k55K81K85n51l7M35J37m32J89j73N07n30J21M98
3260C84j83n41M07L35k69o3l91O02k13j95j98N91j45Oj21K82k13l08J33K33j20
3281A3l07K51j75M36k38j34J80J49j54j58M22n4k93J52J04J1l15j4L29r4n08L17
3303h0J35l6k31P5J24J48m35M3N95k73k75K78k2j28oN6K50j69n69N17J8J30l75
3326b30M52p5k7m88L52K84m14K1L48N3m48L8K79q4j09k64L67j07j64N9K37K42
3348C22n77K18J59J94j54j02L4k7k36J04L09J44n76K36L56m20J45k11K87K7l85
3369a53J28J1K04n73M87L5j18j44J46J91j73m29N9N91l07qJ01Q1M8j38KK92k50
$$ plain form
3217 55 423 -84 -113 50 -218 -256 -234 136 -267 -276 -38 231 21 -239 69 356 12 -615 97 235 59 -314
3239 -314 206 194 -35 -305 162 134 -91 -346 -65 220 -331 -368 67 204 -228 -39 -212 295 -235 -114 384
3260 384 201 -340 67 402 133 70 -321 281 68 -127 -325 266 121 127 6 288 75 -233 -100 133 13
3281 13 -294 -43 -218 218 -20 -154 26 175 21 -137 285 231 -62 90 194 205 -110 -124 205 111 -397 -80
3303 -80 55 19 -212 -137 -13 135 -300 -257 338 65 -210 68 46 -82 -88 -32 218 49 -520 -3 15 145 -230
3326 -230 222 147 120 -368 -16 268 -146 -125 223 276 -172 -134 145 61 -48 -312 55 -52 -216 -157 80 322
3348 322 -255 -37 122 316 162 60 94 67 -169 -65 244 388 -188 48 404 -16 129 -82 205 232 -153
3369 -153 -25 -14 190 -383 104 139 21 -123 23 214 41 -388 -329 262 -45 -53 48 129 177 39 41 333 83
3392H3j15N1J34j72k03J7M90k57k22J36J43K31n12J6K02j5k94J67K27p0j33J62
3414F6Q3l22J7R6K29j61j05L96o2k69r7L21j40M9k57L29k09N1k48L18N9l38o3
3437b57K54L38o55K73R8J95l38j02L64K15l42n2Q8J36k99j23J37jk23j1L55o9
3459a9m7J60pj32j17J4K92j04k78K12P9Nj33r8M70k21k34K39K17j45l01K95R9
3482B46p2k40K8L83l58o5j2L81k62k46K52J87o73K52K63o9m9j9r5M69m51J32J97
3505A79j70R0j54J86J31l37l9L42O0l14j00L44j27Kk91K38q3q8J51L5J13m46j54
3528d32L66rk70K79J50M2m35M05n1L15o14J19J35J61k71k4L23k33p3L08R9j77
3550A13j09r8L98n00R9R8J46k43M4R5K30l44k47K11J82K5l29J76L39j49k48M6
$$ plain form
3392 83 -32 19 153 -19 -222 -205 285 28 -194 -58 85 316 -196 -180 22 7 -287 -120 107 37 -96 66
3414 66 149 -173 -156 -60 169 8 -97 299 237 -32 -129 192 52 101 -156 173 -36 15 -233 85 144 -194 -257
3437 -257 -3 335 -320 -47 51 246 -92 -194 170 385 43 -9 79 215 -84 -207 -70 -71 -294 -305 50 -19
3459 -19 -66 94 87 -45 -162 -148 144 40 -238 -26 53 58 -75 -173 297 76 -158 81 298 153 -148 147 246
3482 246 174 -66 -38 345 -13 -78 -90 291 29 -217 35 222 -451 -199 64 -5 -54 -73 -168 301 -150 -18 179
3505 179 9 99 -55 131 262 -75 -114 228 288 -26 -126 218 91 93 -198 40 -43 -131 20 55 168 -278 -432
3528 -432 -66 -75 -345 -66 84 126 -309 96 45 360 -254 -135 0 161 -110 -134 189 -44 -117 191 290 113
3550 113 4 -94 304 -196 -97 1 147 -96 -52 43 273 -71 -318 -107 75 100 -229 -53 286 137 -111 -65
3572f5J40O9l21M18k14K15l10j07L42m18r2J4L73m4n4j05K29j97J80m4K17k73
3594d7n4L56j61q4K01k06J10k34j27L73k44J35k7K4K96n08P8K6L30k91QK04m7
3617A11k65K14j57Q8p6k17L62N3o0l4K8qk02K43J6k23k70N53j24P1rm6K16k82
3641a8M8j81J95R6m16J18J65q9j66K20j26K05j19P2K76j98k1k07J43J73l9q8K64
3664C07l87j25J61K59p3q0J43j77j96J84n5J19k71O6Q7J82k55J05J02J28n18Q9
3686b05K35j67M7m1M68l75J64k61J93J55l63r8K25O7L2J4J00j85L8l01L59j35
3708c4j8K2L23k32o5O3Qk07Pn7L74j60j58L80j81j01P6n4K92m11J64j66K60j38
3732a3m02L70L09k61l92L16J7J21m12K80J08j69K33k9L15k92l0j8J32l37j0J26
$$ plain form
3572 -65 75 144 -177 241 27 242 -68 -175 167 -251 -343 -329 44 0 -54 -159 70 -127 53 9 226 -47
3594 -47 -101 255 94 10 211 5 115 -119 -246 127 -117 18 -9 15 311 -197 -119 -93 237 -54 -46 158 111
3617 111 -154 60 -97 -9 -85 -302 60 113 53 19 47 39 -163 80 96 -127 -397 156 32 103 94 48 264 -18
3641 -18 30 -151 44 140 -276 -158 7 -82 -248 -28 -154 51 -68 4 280 82 61 -146 -3 170 131 43 307
3664 307 -80 -205 -44 215 142 62 205 28 -168 16 -39 80 -191 -125 -38 144 -111 -6 96 224 -294 -205
3686 -205 30 -137 -90 -131 337 -38 126 -135 58 213 -150 -248 -23 44 76 90 190 5 43 -258 101 -34
3708 -34 -52 -30 293 61 -4 59 67 -140 -133 -190 184 24 -134 246 65 -36 40 -14 278 -133 31 -135 125 -13
3732 -13 -415 -45 264 3 -389 -73 -56 65 -347 -67 41 -128 105 76 391 99 69 51 183 -154 -164 -38
3754c8J06j87M6K85k90k5j28M11lk58p2R3K72o0k50K33k92n5K21l6K37k60%L67
3778C17m16J18n40N67J37n96K76Q5J28j95m2J06K08k47m4K64q9k08J98K5j80l2
3800a60K21P1j79k89K70J75j3l14L8K77J8q3k6L38j21m02R9J00K31l24R8k0J74
3823A79l67K48k23K78k17J26K13l04l0j26L14k72J12q2L26o0j22o8K67j42J73
3844B23k67L3m1k87N58j29o7J08j64J25j43O7r7J79p4j11k0%j16J97j53L83k00
3867DJ23Lj8l73M45Oj64J81n1J9j13j14M9K97k19k24J69L28m00k93K46J92j0K0
3891A03J23M1l88PRK86j96m4J09j16J48l49R9K64j2l37L53n7q2L5L19j07k25J05
3915H8k44N03l49m28M12J0R0R1l8j73o8J42J39j10j32J22K0J38l46Q4Q8J83k38
$$ plain form
3754 -38 68 -119 -73 212 -78 -103 -231 180 177 -81 -153 -60 212 152 -98 135 -157 -212 9 -27 210 -50 -50 317
3778 317 -99 19 -521 46 183 -413 -137 -52 76 -119 -161 -55 153 -94 -138 126 37 -171 27 52 -128 -160
3800 -160 61 132 -47 -336 -66 109 96 -218 -180 97 115 32 6 344 223 -179 -80 20 251 -73 25 5 179
3823 179 -188 60 -163 115 -102 24 237 -67 -97 -223 91 -181 -69 -151 175 115 -7 -75 192 50 223
3844 223 -44 -11 -52 -339 219 90 23 131 -33 92 -51 16 -81 98 24 -87 -107 -107 -223 -26 -179 204 4
3867 4 127 130 112 -261 184 190 26 207 156 175 62 -52 -3 294 75 -149 20 348 -52 -345 -99 93 83 103
3891 103 226 267 -121 -114 -105 181 -15 -59 50 -66 82 -267 -168 96 84 -253 100 43 -39 -4 315 208 -17 88
3915 88 -156 347 -2 -430 -18 -8 82 173 135 -38 -106 36 175 65 -67 55 75 213 -133 -49 39 222 -16
3938a6M0J57J6l21J28N1j83P6r6J48K14m21J78K75l26K9J07J51k02j48k8K49n4
3961B4K0j36J97q9p4k9L6O7q5k9l1N9M72o07K53k32j33K21K21m71K82k7J68Oj28
3986d5L1R0q7k1K9O4J17k94J64j83R8l61K36K74q5j14J25K32k19J4J03k28l3j81
4010b74L25mJ05k09N9J8O7j93N6K13n02J09J26J13j49O7O5K19l50K29m01K81n6
4033h6l0K44P3m67J29L03k83P7j07L17j70P4j44K75p2k48MK30r3o3M38m60K85
4056B26k46J09R8l24P5po6K6l4K3K73l17K29j42P2k87J48M6J88J77k18m2p2P9
4080A4j03J40Pq0M7j33L18J0k08j15K65k79N2P9J31l20P5Q6Qk9L2j87K52o9k41
4105b48M30j35k32k57L77J69n5l09L94j41o8J47N7k4j92k34M27k5l60L51n9M8
$$ plain form
3938 -16 24 181 197 -124 4 55 -128 -52 -148 0 214 -207 -29 246 -80 -51 56 207 5 -143 -171 78 24
3961 24 44 -92 105 16 -58 -87 -51 16 -69 -98 -129 -70 402 -205 48 -184 -317 -96 125 -346 -64 -91 77 83 -45
3986 -45 -14 76 -11 -32 -3 61 178 -116 48 -135 -37 -398 -162 112 27 -87 38 270 51 65 168 -60 -93 -274
4010 -274 51 47 152 -57 2 20 87 -106 -50 163 -339 -230 -104 9 -140 -73 -8 211 -139 90 -311 -30 -86
4033 -86 -116 128 201 -266 -137 166 -117 -40 -147 170 0 74 -70 205 133 -115 -111 119 26 -37 401 -59 226
4056 226 -20 89 187 -137 -62 -69 -135 -109 -143 -120 153 -164 65 -77 -5 -292 -144 -98 90 267 49 7 -65 14
4080 14 -89 51 58 -22 25 -108 210 220 12 -103 162 -117 -65 14 145 -175 -100 -14 -6 -35 -3 -190 62 -7 -248
4105 -248 182 47 -185 -442 -65 104 49 -260 134 -7 -75 72 129 105 -87 -321 106 81 -279 72 13 61
4127F1k1j09K23k03n4j5J78n6j52j8J02K43k20J53J52j39j18r1Q9q7R3r1O1L38
4151C19k97J15M1Q2l11K5%O6p7j81L34j96j26K12K2J80k86M4m9p0o6m3J70l9J89
4176E8p4o1K10l04N5k14M26mm2Q5j44L3M3j33P8j21n8J61K8j36P8O7M7l7J4j2
4202D3L4l6k73K03m5J57l47L13k4J92j9k70J90k18O9J94k79J21l4q3j81J81K37
4225A25q7Q4j52o4O4J32j39L20k18m14L98P7j18J93j17J6M0K2P6n2n0M1k64L28
4249B41k34j69K65j54J07m01M43j12Q4j72L08n6J21l50P0J43k13j65K61N3j6j06
4271e2M5k03K63n3p1J96K6k71J11J30l20R8L34m07Q3M3J02P4l7k39J33J24j11
4294bJ61l45M06l35L32j84n8l7J05j38j50L96j3L4j42j87m1L90n2j47j33Q1j27
$$ plain form
4127 61 40 -69 154 -49 -103 -118 60 4 -148 -166 -64 179 -41 112 264 125 7 -84 5 -82 11 -80 -19 319
4151 319 22 137 178 260 -51 -26 -26 40 -37 -218 116 -80 -206 6 28 208 -78 -34 -83 -153 -219 -262 -92 -131 58
4176 58 -16 -77 133 -171 -116 -330 96 92 50 135 -9 24 67 -66 12 -109 -167 -6 22 -114 -36 31 78 41 55 43
4202 43 77 41 -232 -29 -74 83 -264 49 25 217 198 -72 118 -100 -31 163 -116 5 -29 -112 -293 -112 125
4225 125 38 122 -30 -94 -30 102 -37 283 65 -349 49 126 8 201 84 100 140 162 238 186 136 177 -87 241
4249 241 7 -162 103 -51 56 -345 98 -14 70 -102 206 150 271 -79 -9 134 -79 -244 17 70 54 -52
4271 -52 -7 -210 53 0 -71 125 151 -120 -9 121 -199 -101 233 -174 -91 -48 54 128 91 -148 -15 109 -2
4294 -2 159 -186 220 -115 217 33 -25 -62 43 -95 -245 151 138 172 30 -157 -198 192 140 -7 -140 -59 -186
4317a86J17J19Q4J50m28J08J3J01j2J47k07J56j50m5P5K5k1k95L81j8j19j05K41
4340A31Qj09lj69J39j83P9J85lLj0j5m9k64J4J34J51J12R9k0l7k61k7J73j08j4
4366d4j49J63l6j4K13Q3l83K10j11J8P3j24P7K25l36j47L89j34k48K41p5J32j05
4389h2L73k86J05k84K23r9R7j96K26p0k29K93kr6j00J93n6j93J19l3K01l27N62
4412C39m72K00J1j21k0J36j88Q0j14R4l6r6L41j51k02K93j03j61M48k18k32R1
4434h1P3r1J75m7Mj06J37j02J13K4j88L27j94J33j10k9P3J7n6k96O6n3K7K66j13
4459c1N1j67Q9l0P2k58K80j82K16o4l01K41J10l81J00M24k77J15Q7j79N5J3jJ0
4483hO4n9K03l9l71K13kJ27j40r8j76L15Q8J07J25k12J6k07R9Q5l59K15K49k33
$$ plain form
4317 -186 -69 50 134 284 -144 -36 -23 78 66 213 6 162 12 -33 42 67 46 -249 132 114 -5 -110 131
4340 131 139 30 27 -142 -3 -186 -107 78 75 78 68 53 4 -260 -246 -112 39 151 250 230 193 -68 -95 78 -30 -44
4366 -44 -193 -30 -66 -80 133 216 -167 43 -68 -50 23 -101 -24 201 -135 -282 107 -27 -275 -34 -109 23 -82
4389 -82 291 5 110 -174 49 -50 47 -149 77 7 -222 71 69 -27 -127 66 10 -183 -64 -97 104 -223 339
4412 339 -133 67 78 -43 -63 73 -115 -35 -149 -55 -91 -187 154 3 -199 94 -9 -170 278 60 -172 -81
4434 -81 -8 -99 76 29 33 -73 64 -38 75 99 -89 238 44 177 67 38 111 128 72 -224 -158 -211 -184 82 -31
4459 -31 20 -147 -58 -88 -16 -274 6 -176 40 -24 -325 -84 26 -355 -255 169 -108 7 94 -85 -30 -17 -18 -8
4483 -8 56 -3 200 161 -210 3 1 128 -12 -110 -286 29 117 224 349 137 153 -54 45 130 -229 -14 235 2
4507Bj60Q9q2j99M28k13m4J90l6J39m6o0J60m44N34l59J34j97R0J60J48k10m5
4530b1j6J45j51O9R1q0m06L37J65k14K84l32K80l50M6K25m8j32R9j68J85k7O8
4553D9j11J65l59L4M36j31l5k71K90O7m18K06L35l5l64K88j61K00j84L8Lj45j6
4576a19J04P7J34l50k9K70j42J49k56N7J18j9L5L1j38J62j51K43m06J04k04L52
4598B2k01J07J28k67J58J27r9M6j44J03K3Qn8o4Q2j1K11k58J70q6K90m32J61K36
4622B52K2l89J35K1J80k98j40L06J70l81k5K08j79L74Rl00O4k91L10q4Q1k71M72
4645B46l45O3J80j29m3M6r7J21qk06L08j88Q6j9J19j32J78m69K42J36K3j60k56
4668c04K14P6j30P6J22q7O6l7j6%M2j81K42k44N9K78j72K44k35K5L3j04r3K5L15
$$ plain form
4507 2 -158 -69 -151 -350 78 -135 -179 11 -25 114 68 8 168 -276 258 -101 33 -164 -74 86 234 24 -21
4530 -21 -37 108 -43 26 117 37 -369 -32 133 -81 203 -129 151 -199 -153 72 24 -108 -9 -177 8 -19 49
4553 49 -62 103 -256 -222 214 83 48 -223 67 134 -284 -78 257 222 -142 146 -15 185 1 39 42 -103 -119
4576 -119 -15 62 196 -154 -183 87 -55 94 -162 -105 13 -6 29 60 -78 84 -67 176 -230 -126 -330 22
4598 22 -179 -72 56 -211 -53 74 -25 21 -123 -20 3 11 -47 -111 -29 -40 171 -87 83 -3 287 -145 16 252
4622 252 274 -115 20 41 221 -77 -217 89 259 -122 -147 61 -118 256 265 -35 29 -262 48 -36 45 -226 246
4645 246 -99 -36 144 15 -28 18 -79 42 34 -172 136 -52 34 15 134 2 180 -289 -47 89 112 -48 -304
4668 -304 -90 -14 -144 -68 54 -33 33 -4 -20 -20 22 -159 83 -161 -102 176 4 248 13 38 71 -33 -126 -101 214
4693B14k3l13J47M6j16R8l02J67p4J71J8m0k52K6L70l15K15P3n6n4L36m56R7N7
4717C4k1O3k3Qj32j38J55K77j63N2j49J97k22O0k13K95j30m09M44L33l49p5j8
4740a24L33k59K51k82O9Q9j25N0K13l77Q8J56q6L2o0J86J16l02R9j69K30p5j86
4763a33R6J66k88j5J59n3J13J51K3l0m24J16M92n12r9K20R3r1J63n9K6l00K86
4786A00o9K30j72k58J51J42J19k48K8j10Q1p2J57R9k67L5K05O4l31p2K03J42k84
4809a27O6l0J53R0pO7l50Q1R0O9K9k23K2m4J07j71J40q6J68j16k79M17J47n6j38
4834A9j46J95j58PQ1J66j97K7q6O3K64k57k2j80J33p5M18l44q8P9J25k6J42j76
4858c6J30k70K58j13J01o3pO6r7K05l26j4J48j23M8K15J10k12k09L55j7J16l62
$$ plain form
4693 214 191 -122 25 71 -45 53 -249 -82 -156 15 33 -7 -259 -233 137 -178 37 110 54 0 336 -120 -23 34
4717 34 13 76 53 61 -71 -209 -54 223 60 112 -37 160 -62 -2 -215 80 -50 -459 -15 318 -31 -106 -124
4740 -124 209 -50 201 -81 -12 77 -48 2 215 -162 -74 82 -4 28 -32 154 270 -32 67 -102 128 53 -133
4763 -133 -37 129 -159 -174 -15 -68 45 196 219 189 -235 -119 373 -139 -238 -18 75 -16 147 88 114 -186 100
4786 100 31 261 89 -169 -18 124 243 -5 23 -87 -6 -78 79 178 -89 -54 151 215 -116 -188 15 157 -127
4809 -127 -61 -91 62 152 145 212 -138 -57 33 102 131 -92 -70 -114 -7 -178 -38 -124 44 -72 -351 66 213 157 19
4834 19 -127 68 -90 -83 -2 164 -33 -6 -92 -29 235 -22 -44 -224 -91 -166 252 -92 -180 -101 24 -2 140 -36
4858 -36 94 -176 82 -31 70 7 0 66 -31 174 -152 -166 -18 -141 -93 122 232 20 -189 166 149 265 -97
4881i7n0K81k22OJ59J9J40o4j55j0J4j72K05Q3k60M0jOR9p2O7M2j44N2J99j92
4907b7j75R0K12k8j28j41J77J04O3j9j22j37K37k9k18P4J39j69K44j70l8J68j7
4930I0j41J84J7k30L17l95J06K08Q2k61r9L21l22N1J33R0k37j46R0R4R1j06K21
4953A58J53k61k50J41j60M96j94k1k0r2j03P5J26M0J0N4K7l72J51p2J51k40J24
4976g9J22R1k49j91M80l30O3l2p1M12K2k00J24o2k44j0Q0K57r0j40r2J31j40M
5000a44J02K63l85o5M26j75k32j20L71m1k25L54k14J49q7l05K71L8pl9L71m40
5022a34K02k61k7L04j20M4K10k23j05J74N6k52j61M17L6P4l75K93J12k88J80Q
5044A64j85Nk7N2J65q9o6J09m4k7k13J05M04l36j92N4L45k07m66K59L60Mk47J44
$$ plain form
4881 -97 -147 134 -88 -82 77 96 236 172 17 7 21 -151 54 137 -123 -83 -84 -78 21 -51 16 58 -86 -34 165 -27
4907 -27 -202 -112 100 72 -56 -197 -20 84 147 128 6 -131 106 77 -141 -67 72 -97 147 -23 -61 107 90
4930 90 -51 133 150 -80 237 -158 -52 156 238 -23 -122 199 -123 -72 61 151 -86 -232 -142 -48 43 -63 158
4953 158 311 50 -200 -59 -219 277 83 62 42 -50 -153 -78 48 88 98 152 179 -193 -42 -114 37 -203 -79
4976 -79 43 134 -115 -306 174 -156 -93 -125 -196 216 238 38 162 100 -144 -154 -74 183 93 -47 -139 -8 -148 -144
5000 -144 -42 221 -164 -229 197 22 -210 -330 41 0 -225 129 -85 64 -23 -328 -57 -19 -26 -65 306 -134
5022 -134 68 -193 -220 84 -36 8 218 -5 -110 64 120 -132 -293 124 160 234 -141 152 264 -24 156 164
5044 164 -21 -16 -43 9 174 85 19 128 84 57 -156 -51 353 17 -175 -121 224 17 -449 -190 170 174 -73 71
5068G1r9j76k5K02l0K14l15J23J06L4n3n9j7Q1J07l1r1Q9p5j47K27k29J68mL1
5093A02k6k44L49o7k90L14k45J4j3r3L27r0L1j28J1K8k2M7L1j74m0M5M5N2l7P6
5119CK10l0l26J8L14j16k92J00P0J6l0J27j73K89l93N8K08q2n5J65j10j34J3J89
5143C9R0k9l22K27r1m6J21o9K77Q6n29N1K50Q7k49J30K09j31l4n5Q7j12M6m9m6
5168f2j18J96J34j68K7l07M66J1j09m7l4n8K42j44J32j73j36r6J89K27k22J94
5190A44j49J99n16L23r0K19l37K32J56q1r7m6L17ql33L1L74r0l96M30j88k32K06
5213F8R2j3m0O7k22M07m59J08k0K6j54K88k51J56j78lQ2K99j66k57O6J74k02P6
5237e6K36k48J28j00j16J44m2N9Lj88J32R8j66L11k48N6J56l49M8N4O3O1n6M3
$$ plain form
5068 71 -28 -204 -229 -27 -57 157 -158 -35 71 105 52 -7 -24 57 164 133 42 131 56 -91 136 -93 75 71 102
5093 102 76 -168 181 114 -176 138 -107 -93 -106 -199 128 38 69 -59 -48 -20 -42 5 36 -138 -178 -133 -88 -36 -73 3
5119 3 213 183 -143 -125 189 73 -219 -119 -49 -33 -63 64 -109 180 -213 -155 53 -29 -84 81 -29 -163 -150 39
5143 39 129 100 -222 5 -86 -132 -11 -80 197 283 -246 -195 55 142 -107 23 232 101 67 12 99 -13 33 -16 -62
5168 -62 -180 16 150 -18 9 -298 168 179 70 23 -11 -69 173 29 161 -12 -148 -244 -55 172 -50 144
5190 144 -5 194 -322 1 -89 130 -207 25 181 100 3 -43 274 266 -67 -36 338 248 -148 282 94 -138 68
5213 68 160 147 107 174 -48 359 -100 8 -12 14 -140 148 -103 53 -125 -128 -46 253 87 -170 -104 70 -132 -56
5237 -56 180 -68 60 -40 -156 -12 -54 5 8 -180 -48 50 -116 195 -53 3 159 -190 -142 -88 -25 36 -20 23
5261B3J11qk89K36J63k42P6j03J40J9k03K20l5J06k53J08j50rr6M96p7o9j39k10
5285a85K18J7q7K09J2k1l11J60L21m68R0j15K40M0k74M53j46o9Lj05K07j57l14
5308b82KL57P6q4l0j04r8K55k57M86k53k95K00K85l98L43j45N4P7m10J33l7p7
5331b02J23K04j6j73k01J48J77j9k93K13j11Q4n7k11J87p1J21L5J43j1k46J17
5353e9J51l26L14n7o9j87k3J81K17k74J9O8J74l42Nq8L45l2ml1K8q5M4J03K49
5378C21k97n7J02q7K50k89K38J86l11j22J32m2l40K62j1R9Om3K4Q0k03m6J06j2
5402e4k0n5j5K48l6l28K00K31j23j41R5J22n5j00p8J64r9p9J62nl3n6Jk84J61
5427a77J02J22n3N6m4p4k34J41N25m45j8k7k4K25j46j47M12J4l19J63J16J5j55
$$ plain form
5261 23 134 126 -163 73 236 -6 70 -33 107 126 -77 143 108 214 -39 69 -81 -90 -186 310 233 164 25 -185
5285 -185 33 50 -37 172 184 163 -148 12 333 -135 -45 -160 80 120 -154 299 153 84 87 -18 189 32 -282
5308 -282 -280 77 153 69 39 -65 -163 92 -165 321 68 -227 -27 258 -140 203 58 112 189 -221 -88 -125 -202
5331 -202 -79 125 109 -64 -265 -117 60 41 -252 -39 -150 -66 -123 -334 -147 -218 -97 -62 81 70 -176 -59
5353 -59 92 -234 80 23 -46 -233 -256 -75 142 -132 -113 -45 129 -213 -208 -296 49 17 13 -18 10 -75 -31 72 321
5378 321 24 -33 69 -18 232 -57 181 367 56 -66 66 24 -316 -54 -65 34 40 -3 21 101 -102 -148 -42 -54
5402 -54 -74 -129 -144 104 68 -260 -60 171 48 -93 2 124 69 -31 -109 55 -44 -123 39 34 1 -55 -54 -338 -177
5427 -177 -75 47 -6 50 6 -68 -302 -161 364 -81 -99 -126 -150 75 -71 -218 194 208 -111 52 168 183 28
5450B8j2O7l9j15q5J86j22j27mL33ml52J64J06l3M2r1p1J46J26j50j51N44n22
5474a36kK46P9k12N9l8J52k19j8K16j66p2j48M00k40K07L6L1k39L9J26K21l06
5497A6J6J74J52l90k66K13J80j66R4J00Lj22J7q6m1K41k39K7J30rl9LK36j65k99
5522b20L18m0l0j63L15j31%jJ76l20L89k63J05j29r1J47J35q1k05Q4Q6L8J7q3
5546E3l0o5l81K89L46j54j93nM45j80j72j11K28%j68JK32r9k09M39p0j06j10K53
5570B33l90j15R4J2M16j36j68j65J87J20j58J82r0J1j80J25j71J97q4J41K2k20
5592a37J8Q2J9p4J90l8j03j6J0k42M32k81R8R7n6K9j67J05j40k2J76o0L06j65
5616F1r7Q4K12k44j23L04j06Q2k90L24j42j82k57L05Q9j28M40k13k29J59j29O3
$$ plain form
5450 28 16 83 44 -71 -156 30 -92 -219 -223 110 106 -246 -82 24 -9 33 -58 -129 17 143 -7 -158 386 -136
5474 -136 -138 108 187 -25 34 -4 148 -71 -89 127 -39 -111 -259 141 -99 108 144 175 -64 -25 101 322 16
5497 16 32 206 358 -32 -298 -85 95 -71 23 123 126 4 21 -65 -106 135 -104 -77 53 44 5 8 244 79 -220
5522 -220 98 58 28 -135 180 49 49 48 224 -96 293 30 135 6 -85 62 197 116 -89 -5 81 119 136 53
5546 53 23 -42 -423 -134 212 58 -135 -140 305 125 -47 -158 70 70 -98 -97 135 36 -173 266 196 90 -20 233
5570 233 -157 -272 -178 -166 250 114 -54 -219 -32 88 -70 112 22 33 -147 -22 -193 4 -80 61 83 -137
5592 -137 -119 -37 -18 -92 98 60 -43 -59 -49 -291 141 -140 -42 55 -1 28 -139 -34 -174 -196 -20 -80 226 61
5616 61 -36 48 260 16 -107 197 91 173 -117 207 65 -117 -374 -69 20 -108 332 119 -110 49 -80 -17
5638a7l7k51L21J57k79M4j14K67j83j78L73K14m37P2j71N37j17l31j1J6o8j03
5660b96L13J38Nk85Q6J47j44j6j79L89l01q6R2K01j8j74J65J09k17J07K07k34
5682IJ27o4N1K3j76n4M0L75k31m68K84J98j80k9Q1K03l68j94M83q8k17J06J28
5705C9J05l26M06o2J97m49J22l2J48k61j19M16q2j50q6J23J87j95j0K32j12k91
5727b00L1Q0KN6P8J63K3l13R9n9J86k81O2J78p5j16m0K42j50L5n7L57m71J19K
5752d9K35k53J21k06N9J80l30L5L00k71n1L47k87J23j85J04L27k6j91l4P7L1q
5775D8O0j16k09J49J11n7K9k62M10L11o30K48j63j9j15j22L44l3Q6j36K48O2l43
5798i9j33L23N8j14n3J26J3j16q3J61J86l37L96n45K26M3P3q8n3j6N7K22l71j41
$$ plain form
5638 -17 -54 -305 16 173 -106 -62 -176 91 -92 -270 103 317 -120 -48 -219 318 201 -130 -141 -125 -193 -296
5660 -296 17 155 160 -125 -39 108 -36 -52 -231 158 -143 -229 -137 64 46 -128 37 146 -71 36 243 9
5682 9 136 72 123 146 -30 -84 -44 331 100 -368 -84 114 -66 -95 -14 189 -179 -373 110 22 -195 -89 39
5705 39 144 -182 224 162 359 -90 32 0 148 -113 -232 184 102 -48 -134 -11 176 -19 -29 203 91 -200
5727 -200 -169 -89 -87 -31 47 210 233 -80 19 -40 146 -135 -73 105 30 -86 -126 116 -34 1 -56 301 -170 -51 -49
5752 -49 186 -67 54 -152 -93 87 -243 -208 92 -179 -230 117 -170 -47 -232 -128 199 173 -18 -52 25 56 48
5775 48 108 -8 -217 -68 43 -14 15 -247 163 474 -156 92 -71 -90 -205 -327 17 -16 70 -66 182 244 -99
5798 -99 -232 91 149 35 -18 108 121 5 -78 83 269 -68 328 -217 9 52 125 37 -16 -32 25 247 -124 -265
5822b65J4K35r4p6K42n5O6n1p6P3J1P8q5O1J34m11rM29k16k49L54j19O0m00L88
5847C9Pl14J87K05j96J30l44J25l3J84j7K36k44K96r8k04J24k34l3R4L39m11L7
5870a25L27k48N1r8K89J70m30j98L55k1k16JK90k90J81r1M2R6k56K4J3lO2p8M45
5895B92k03m1j37K16J1j79n7R3K1j37J25L30l22k01J17L22j50j55k02K93l9k34
5917b37K2M57l05j8j09K30l6j9O4J06k20o0J12J02n0O4rJ52m06K84l6r1n3m4J25
5942B5j96J36L2Pkm0j00J37J19r2r5M27k60j96q7L09j43j5jJ68Jj91J82k90K46
5967H1k70K55j12m7k9R6j12p7J19L4O7N1R2l22M4J26l93L06L14N5K0k57J70l23
5991a12R8L10l07k1o3J70J04j58j09J48k93J57K74j31M6n4m8j21P0J45j83J56
$$ plain form
5822 -265 -251 -16 -110 -186 56 1 67 16 -60 13 24 102 17 78 212 -199 -208 221 5 -244 110 -9 51 -349 39
5847 39 46 -268 -81 124 -72 58 -286 -161 -194 -10 -27 209 -35 261 163 -41 83 -151 -184 -90 249 -162 -125
5870 -125 202 -46 5 -93 196 366 -64 -262 93 72 -144 -143 147 -143 38 -53 -11 85 -171 -147 -134 -137 -75 -153 292
5895 292 89 48 -89 127 138 -41 -98 -5 16 -121 4 334 12 -189 -72 250 100 -55 -257 36 -3 -237
5917 -237 -215 242 -63 -81 -190 40 4 -15 49 155 -65 -125 -13 89 39 103 94 246 -160 124 88 -3 -56 -100 25
5942 25 -171 -35 -3 4 2 -38 -138 -1 118 26 -69 358 98 -98 -185 124 -19 -34 -35 133 134 -57 125 -165 81
5967 81 -189 66 -46 -93 -122 -26 -138 -215 -96 -62 5 56 148 -174 -130 -4 -397 -91 223 278 298 41 211 -112
5991 -112 -14 296 -11 -32 -95 75 179 21 -88 60 -233 -76 198 67 113 59 11 -110 -40 105 -78 78
6013G8n1q6p5K72k61K40l18L83n9k09k3L69j28m65J65K0N06l11j83L52j38p8p6
6036g6m4p1M4J35k12K46l19L86j63J04j95J96r8K9J88r1j57O7j40K06o2J7n8j40
6060b08J69M06l31j48N20n63M08l64K69L5m07Q3J62l76J81J26Q5r2M1L2J15o7
6082G6k57m5J65M9J34m25M24l1j68K3K48l41j57M66j11Q4k15K0J38j80k4jK43
6105A15P4k15n0K64l2r0j14L57l24O4J03m5k8L1L1l66L79j39K93j76o0l22L59
6128A09j30l7q3L01j35j59K62l16K21q0K8n7P1L2j31M24q6j35k05J02J35k55L58
6151B34j87k04P7K60l78M1K8J54N6j74l03J00M09n4j9j70N23m62K18j16J05k13
6173g5j07j73N70l05j12K74q0J64j99J09Q6k54J60R8j6l05n0j8J81k7J06j0K14
$$ plain form
6013 78 27 -59 -134 138 -123 117 -201 182 123 -86 -109 260 132 -333 -168 -148 358 47 -136 216 78 0 -76
6036 -76 -120 -191 -147 -12 -224 22 -297 89 -74 30 -165 31 -67 -38 150 59 -98 -31 -171 35 -27 -10 -68 -208
6060 -208 -39 367 36 -112 408 -155 253 -111 158 193 -214 -131 31 -345 -164 -38 47 -45 -4 28 143 76
6082 76 -181 -226 -61 -12 122 -303 121 90 -78 -55 193 -148 -305 161 50 134 -81 -61 77 -103 -127 -128 115
6105 115 189 -26 -76 188 156 66 -48 309 -15 49 152 107 79 110 141 -225 154 15 308 132 72 -250 109
6128 109 -21 -58 -141 160 25 -134 128 -188 33 -47 -19 -76 -5 27 -104 320 234 99 -106 -4 131 -124 234
6151 234 47 -157 -80 180 -198 -157 -129 25 81 -93 -396 -296 113 59 40 -130 393 -69 149 33 138 -75
6173 -75 -182 -355 215 -90 -202 72 -8 156 -43 66 152 -102 58 156 140 -165 -215 -233 -52 -79 27 17 231
6196B31k49RJ02l27K98N0o6j09n0J90q6K96k12j9O9K2n2j32L3P4j69m2J11J90
6220A62j37j10K2r8K16j50M86k34l15R1M19l01m6J33k94m4R0J29M1J10l04%J10
6243b4M9MN0J3k35k6J00kK04j52LK23m2l68J78N9r2k08K96P9j19K2N6O4j31q8
6269h7J41q3O4K3q6K01p7rO6k45j05K09j54J57j97j15J94K33j29k25K22J14k17
6292a05j14K0L49j49O9j40J15j04J78K0K7l03j12J92K6mP0Pj46n8K62k74J76M3
6316D5l8J70k22J19j34L7P9j20mJ08j55K33j16K10k19L6j40K26j31O2k7O3J98
6339B80l26q0K3J45k86K45J29k82J49j9R9j12n4q8j9j17N52j04nj1j55R6M3l3
6363G0q9J08J33k38K17k38j26j19J29m9M5J7M4o6K00j07LJ20j90n5J63J86l88
$$ plain form
6196 231 -18 -9 93 -234 64 114 48 -61 -111 79 -7 289 77 58 127 149 97 -35 -2 72 -97 -139 -28 162
6220 162 25 -85 -63 -161 55 -95 391 157 -158 -67 352 51 5 138 -156 -200 -110 19 60 170 -134 -134 -24
6243 -24 25 29 79 92 -143 -169 -69 -71 133 -19 -16 207 165 -203 -25 34 -58 -266 30 109 -10 12 68 132 1 -87
6269 -87 54 -29 35 58 -28 173 96 87 153 -92 -197 12 -142 15 -182 -297 -103 130 1 -224 -2 112 -105
6292 -105 -219 -199 150 1 70 -70 45 -59 119 139 166 -137 -249 -57 -31 -35 35 42 -104 -162 100 -174 2 45
6316 45 7 177 -45 74 -60 -23 56 -64 -68 40 -115 118 2 212 -7 29 -111 115 -16 46 19 82 280
6339 280 -46 -126 -103 42 -244 1 130 -152 -3 -22 77 -35 -89 -177 -196 -313 239 135 130 119 -36 60 103 70
6363 70 -19 89 222 -16 201 -37 -163 -282 -153 -202 -157 -140 -96 -162 38 -69 -66 54 -136 -191 -28 158 -230
6386b30L59q6L8k88R4j87M33j10j24Q4J0P5j63K46j17Q8l15J76P4j25K29k66P3
6409c2M2j90K17R9Q5l14K30k5J3j86L0K60j75k49K81L5k06K72k73L82m20K01k85
6432b08K79Rl36J84L8K39l95K09P4j80J60j51L59l91J88k6j09J38l37K07J61k45
6454a33J51J43k42K24j93K4J05k23K11N5q7j38K0J32k45j15J40L65k13L3j36P2
6476e0J3oP6n4l1L6p8L19k19j44L6J76q2q4j2J37j31K65M8n2j61j56O1J74N1k52
6502a20K36Q8j53k26J13Rj08K98n7np0l8k4M39m87J36J19j34j02K01l00K73k45
6525a57J3M31k54k01L03k24J72J8j09K39l07Q3k48K97K84m44j40K59p9K10L5k40
6547e9L7J18l20L36P7%k14J43j70L3n2J22O2Q5j41j03J49J6k36P0m5M1mJ45j01
$$ plain form
6386 -230 129 43 81 -207 -113 -300 133 23 -101 -17 -7 68 -95 151 34 122 -193 -17 57 -68 161 -105 -32
6409 -32 10 -180 37 136 221 -93 137 112 125 -61 -31 229 54 -195 86 121 -85 187 -86 296 -124 77 -208
6432 -208 71 80 -256 -72 -34 205 -190 19 93 -87 73 -78 281 -110 78 52 -57 81 -256 -49 112 -133
6454 -133 18 161 -81 143 -50 -26 79 -144 67 122 35 -103 -83 49 -196 -311 -171 194 -19 14 -122 -50
6476 -50 -37 -43 33 -21 -52 -16 -94 225 6 -138 -102 74 -8 -92 -104 33 -98 167 215 163 2 -154 -93 81 132 -120
6502 -120 116 204 51 -175 -62 -53 -161 137 80 75 5 -33 -57 382 -105 31 150 16 -86 115 -185 88 -157
6525 -157 -144 287 33 -168 135 -89 83 101 -8 231 -76 7 -241 56 340 -104 -244 15 -64 146 181 -59
6547 -59 -22 96 -224 112 189 189 -25 118 -52 -19 -71 51 113 198 57 -46 103 119 -117 -47 -92 -51 -55 90 -11
6572a1k08K84l5j3k8J31J61l18J16l61J80K46m03O3K19o3j11M35j77j28r2P1K46
6595B04m68J24j22M84q1n8k13L32j26l09N63j69k90k00M65p2j02l7N9J24m4j71
6617a07J59k16K52q2PK3o5L6J04k3l20J46j15L06j54l0L7J35m04K76J75m01P3
6640a88J45L01j59k68R6J45q5J78k44j21K42M5k22K43j18O2l2M8j40p1K71m2J1
6663I7k20J48r3m9j1J88j22K36k50K81l12P2Qk21L36Po1k36J08J78Lj60j5l0N
6688a13L39j12j72J25j82O6j80L96k78K80j53K8K31k98j9l37L44k7M9j41K51o9
6710B8l2K28q9p2j91J77J8qq2J84j90J21j53P8J93j15q4R6lJ97l00J37j40j03
6734a05j12K92j09J12o3o6L77n13K05j43K28j21J57j44q3k2J86j95L64p0m61K41
$$ plain form
6572 -11 -219 65 30 17 -11 120 281 -37 79 -282 -102 144 -259 -196 23 -40 -151 284 107 -21 -113 -42 204
6595 204 -264 -140 -262 222 141 83 -130 202 76 -233 330 161 -129 -329 136 64 -38 -75 -16 108 64 -107
6617 -107 52 -164 88 6 13 36 -29 7 111 88 -232 -86 -201 105 -49 -79 -42 93 -311 -35 140 -261 -188
6640 -188 -43 258 99 -169 -73 72 -13 165 -79 -200 42 87 -135 108 -10 52 20 68 -72 -143 128 86 97
6663 97 -123 25 -68 -117 -128 60 -62 174 -76 205 -107 -35 -27 -248 88 95 34 -202 -94 84 87 -73 -88 -118 -113
6688 -113 226 114 -58 67 -115 -49 -229 167 -111 169 16 44 275 -23 -42 -379 -35 -62 -13 -154 97 28
6710 28 -4 224 135 63 -128 49 67 59 -23 161 -29 92 -61 17 210 95 11 107 104 301 1 138 -2 -105
6734 -105 -217 75 -34 78 15 -51 326 -187 18 -125 103 -18 139 -5 -88 -110 76 -119 245 175 -286 -45
6756d5J30k7n8r2q4R1j22M53k78K80l84L75j77L03o45L05j47P9J31L8N0k18r8
6779a40K65M9k27J18m3p4j73K40qJ68k78m3N9R9k23J57L71n9k36L9k46J06J13
6802C4j38K47j89PQ7j45J56r4J03O0Q9k35R3j52J51M0k09J33j07r2J00R2k3O6
6826G4j23J6j11j28n6M69%j69l5K74l78K98j97J81l7n2J21Oo0k75J74R1k15Q2
6850e0k5L1N6j38K95j33l41J39lK21m9k48M29j41O7K10k60K71m27J22j5Q4n0o8
6874b3J22r0K9j19K32j25j10r7R8O3k32Q7K48O3k68J18j54K08j14j37P9L14l61
6897a69N9o5L04O4j96J04Q7k99l1L55k89J6Q1O2j54k15L50L05m45O1n5o6L40l99
6921a95L41J68m45LK82J05k32j20N1j33M64k46N5N1o2j84K64j35q0N2Q2K6k87
$$ plain form
6756 -45 85 58 0 -92 -176 -85 -207 246 -32 248 -136 239 62 365 -280 25 -122 -43 88 126 176 -42 -140
6779 -140 125 174 -53 65 22 -52 -225 15 7 175 -103 -146 -87 12 -211 -54 317 258 22 61 -185 -79 34
6802 34 -104 143 -46 -39 48 -97 59 -35 68 128 217 -18 75 -77 74 114 -95 38 -69 -161 -61 31 8 74
6826 74 -49 -33 -144 -272 -328 141 141 -28 -63 211 -167 131 -66 115 78 26 147 153 93 -182 -8 83 -132 -50
6850 -50 -75 -44 12 -126 169 36 -305 -166 -169 52 3 -245 184 43 110 320 60 331 -96 26 11 95 45 -23
6874 -23 99 9 38 -81 151 26 -84 -181 -83 -20 -252 -165 83 146 -122 -4 -158 50 -64 -201 -122 192 -169
6897 -169 -110 -175 129 193 -3 101 188 -111 -142 213 -76 -60 21 83 -71 -286 64 369 -76 -15 -70 -136 204 -195
6921 -195 146 314 -131 -128 154 259 27 -93 -42 -175 289 43 98 149 87 -97 167 32 -48 4 86 112 -175
6944a75N0J63J11j34K7mj10oo3L78k56n6Q8K4J58l68Q0K54k43O3j42K19nl55L39
6969C7Q0p2n1j52J20K9k30K03J28o3j96k2K31r1P4k9R9p8k16K14M9o4Q7N1j33
6994EJ36k42J94j45K51m57K12J73n5p3j68L8K79N2k24K12l42k08L66o2j96J94
7016f0L3l8K4J33k25J10p8j13K67m6k7j63L27q1k1qk34J90o4N6l9K7j24j3P0j18
7042b15J59j6J49J6m35M00n3lO9k00P0K15m32L08L05l75o6J94k31K75k07j72L14
7065F9J08k44J11j21L6k23K26N4p7R6j55J76k55R4L8J50k12o6J76J36j21J55n
7088A46O5j66k59K20K02P3j89k17J02P3k33J88N5J93k97r6K40j32l4L7L6O1k18
7111a50R6K34m0j42K02L6j00o3o8L9j24k0R9J02k23L61k25m6j09j49J92K53o4
$$ plain form
6944 -175 -125 38 149 15 42 38 -72 -78 -141 237 -19 -75 13 37 195 -173 -93 161 -82 -19 -161 58 53 -302 37
6969 37 117 45 -6 -158 -38 -9 -239 -36 92 29 -167 -189 42 -49 25 -4 95 17 -199 15 64 0 87 138 5
6994 5 141 -101 93 -52 199 -258 -46 127 72 -1 -169 -131 148 200 -24 188 -154 -362 4 -58 -254 -60
7016 -60 -27 -65 -41 92 -133 -23 -101 -214 53 7 -20 -183 144 63 42 34 -200 -10 -74 -18 -57 -30 -154 -167 -97 -215
7042 -215 -56 -72 77 93 -342 58 5 2 71 -129 -59 156 -276 32 337 -38 -104 90 -141 134 -73 -245 69
7065 69 177 -67 44 -77 -41 -264 -38 16 -61 35 -120 56 -199 -105 -67 83 -129 -195 -19 117 -4 151 146
7088 146 211 45 -214 6 208 281 92 -125 -23 50 -183 5 60 253 -44 -140 100 -32 -66 -29 7 68 -150
7111 -150 -54 180 140 -2 200 236 136 73 5 44 -80 -100 -1 101 -122 239 14 -32 -141 -290 -98 155 91
7134I1j57J0K41m49L26j43K4J49k60K01J08Q3l43J66r9q3k1K38l4o7Q0l30K23
7157d6j68K14l7r6K54j21P7QQ6p3O2j09o1j31R1n5L2K72m75K42r2J6K03L1j3m6
7183F5M9q5n7m4K03l16M1J54J14j1j70L18m45k2j72M22R5L3l11J21J76k44K1N4
7207a1L05o8l92L03m3j90Oj06K58J01j60K10J18m22j29K65Nj10J28ON2k34qK06
7231I0k67j3R2l1L37l35k9K58l56P9M20j89k19K04k30K80j34j52q7L08l84J85
7253a73J78J12j52j01K97Q3k30k56L52m1n7j86l3J13nj56K65J63j94l8K20l8k88
7276a65j36K91J1p2M1jl5J14p8p4J84r7R5j04J60L3l11K08N1k2l3p8r6q9N0J90
7302C7Q0k42l4R1j8L1N0L1j28J07j52r2K18n9o6J95o1q4m7K05j27R3Lj57L91P5
$$ plain form
7134 91 -66 -56 185 -264 62 -81 -57 92 -168 33 141 224 -119 47 -52 -135 -156 82 48 -19 61 -269 -46
7157 -46 -214 0 -37 -133 121 0 77 85 171 98 160 51 -10 -141 -50 -105 -73 199 -276 -34 -126 -110 93 124 111 65
7183 65 114 29 -28 -72 131 -185 -144 10 124 113 -57 261 -184 -206 -378 44 139 172 -139 -18 158 -86 -65 -11
7207 -11 294 226 -166 137 94 -96 -90 -196 62 163 3 213 331 -91 -220 45 50 -60 68 74 126 -108 -116 90
7231 90 -177 -190 -98 -129 208 -127 -156 102 -254 -175 245 56 -163 41 -189 91 -43 -195 -282 26 -358 -173
7253 -173 5 117 -35 -136 161 244 14 -242 110 69 12 -174 -207 -94 -99 -255 10 173 -21 -59 161 123 -165
7276 -165 -301 -10 1 -71 -30 -31 -66 48 -30 -104 80 -17 78 -26 134 167 -144 64 115 93 60 -18 -114 -203 -153 37
7302 37 117 -125 -159 -68 -86 -55 -5 26 -102 5 -147 -239 -21 -80 -146 49 -12 -96 -143 62 -65 28 31 -126 265 340
7328C40n23K19j67J63N0M5K6r4MJ28k14j84K95j08R3j81K1J79k39ML9J94j04q3
7352i7Q0jM7j34K43l80K81J05k84K39k39m4L48m6pl50J11K77j6l46J97q4L45j57
7376H8k28M75k64k12L98j00k03J42n9k37K97j8n0pQ0k11j4J27K7j3nJ08n7K1k21
7401a36K95k07J2J25pm68L68p2M7l8J76j63J03j0q5M4o1j49J75J40k29m6J47L4
7425eK53k51J67j48N7k29K79m0J23l00j6J06J98j28j63K89m0l5j21K80m04J97
7447F9l3OJ50J63n39J14J62k1K3j44J02m4O6K36r3k57j0L20o04L11J99m9j30j56
7471a59J70j23N6l8m1J19L5r0K36j90J27k68L23k41N0j11R0j76K59j14l2K6j7
7494a09Q2l8O0M6n7N5O4j57j70J98R2q3j30n9L68nj61L55o76L80j05j7o4K3P0
$$ plain form
7328 340 -183 36 -131 32 82 127 153 59 63 191 -23 -207 88 -20 73 -108 -87 92 -147 -143 -104 90 -14 -97
7352 -97 -17 -18 29 -105 138 -242 39 144 -140 99 -140 -184 164 118 111 -239 -128 149 133 -213 -16 -100 245 88
7376 88 -140 335 71 -141 257 157 -46 96 37 -200 97 79 29 22 102 -109 -123 4 31 18 13 121 64 85 -136
7401 -136 159 -48 -36 89 82 -386 -18 -90 -43 -81 95 -68 35 25 -60 -16 -77 -226 -51 89 -140 -186 -39 -5
7425 -5 248 -3 164 16 73 -156 123 83 206 -94 -110 -4 194 66 -97 192 152 117 -4 276 -128 69
7447 69 36 42 192 355 -184 -70 92 71 94 -50 52 8 74 310 217 -40 -50 270 -334 -23 176 127 -3 -159
7471 -159 11 -112 -56 -94 -135 -16 19 -71 165 -25 102 -166 157 -84 -34 -145 -55 -231 28 -86 -118 -92 -109
7494 -109 -27 -65 -5 41 -16 39 103 -54 -224 -26 66 -17 -147 -206 162 157 -4 351 -325 55 -50 -67 -131 -108 -38
7519c8L14l87R7L0K42l84p7J76J58m48K00jK26j34k00K37J55o3k35M7J68M7k38
7542a08J11J21k52K17j62NL6Q9Nj15L0J29L7K9q6o7n3J60j43k49M53om20K79j34
7567i4K22n4j30m9O4O8j34L08j55k00J56N9l69K71n6pJ28k40J67P2J63k79K72
7590A83n16N19j54L1Q9j91k78K80O4k2j12Q6k28J79k4L9J10l8r7o0J78p4k10K19
7614b7J67m1n6q6O4O2l54L19K0q4J6K14j39j31J21j11J07j94K1L9J25k08L39j25
7638E8k17Q6M9o8J61j37J71j79J77j57j27K66K08k12n2j3Q1j13j10J60J3j58J04
7661im8k60J71M1R4j78J24O1J6J40J45k91n9J94n41O45l07N6m5j99J98K89l87
7684a50J43K05k38J20j34K78j6l15J78N5p8j21J24j83m5Q0n1L56j30j65J68l57
$$ plain form
7519 -38 276 -111 -14 16 258 -126 -203 -27 131 -317 -117 -118 108 -26 -226 11 166 103 -132 -85 83 130 -108
7542 -108 3 124 -128 89 -73 -68 -32 57 62 -53 -23 106 143 172 86 19 -34 126 -17 -266 187 181 -239 40 -94
7567 -94 128 74 -56 -105 -41 27 -107 201 46 -154 2 61 -308 -37 -93 -100 28 -212 -45 27 190 -89 183
7590 183 -333 186 32 63 152 -39 -317 -37 27 5 -107 -21 -249 -70 -94 -55 55 17 -80 -140 38 -36 -246 -27
7614 -27 140 99 43 -43 21 83 -271 48 68 -16 0 214 75 -56 65 -46 61 -133 -112 -73 52 -156 183 58
7638 58 -159 -73 -24 -92 69 -68 103 -76 101 -56 -183 83 291 79 27 14 95 -18 -128 32 45 -113 -9
7661 -9 -57 -317 -146 -105 -11 -189 -65 -4 12 152 297 6 -53 141 -400 245 -62 -6 -51 -250 -52 237 -150
7684 -150 -7 198 -40 80 -54 224 208 -107 71 126 48 -73 51 -132 -177 -97 -148 208 78 -87 81 -276
7706b76K01J35j63K86j58j72J18N8r7R6L9m6j68M7L52Jl65k45M33M2j39m0o5r1
7730b17K01M1Oj24L8K24k95K0K2J08J76k39O6m6K36k26pR6j65J8o9r4L53J32k29
7755B6n0M8l5J80K2k67J94j85j91L72j38j13J64Jm9q3K00l9n2j14j7P6J44n3j25
7780h4J69%j51J64q7j63J03J40J78r0K6k66L33l04Q4k8j28j20J16J27J66k93k43
7803c51L14p6J83k56K18K02P8k28QP1m4N5m9jj98j83K65J1k60K89j4J22j15j08
7827f7J17O7p1J3J99l23k5J76K3r5j73L50j31M5m6lr5K56k91J01r2J53M8j37Q9
7852H8k37JJ5J86j04l7J42K23l98K48l11J45J16q1q5m8J2J12j12J81K7K00l73
7875i0l2R7r6J74j4k53QL13M3q5q8k53K54K34j13k39Q3MJ01j9qk51K73j12Ql44
$$ plain form
7706 -276 -75 60 -103 183 25 -147 -29 29 -68 28 67 21 -147 -100 252 253 -112 -357 76 118 -21 -61 -126 -217
7730 -217 -16 25 31 -93 -55 169 -126 -106 -84 24 200 -39 27 -19 217 -9 -16 80 -85 -67 -136 -230 123 255 26
7755 26 -24 24 -11 169 191 -76 118 -67 -258 114 -24 -137 27 28 -21 -104 96 57 5 -109 -126 -50 94 41 -84
7780 -84 85 85 -66 98 11 -152 -49 91 269 179 205 -61 272 -32 52 24 -104 -224 -108 19 185 -108 -351
7803 -351 -37 -113 70 -186 32 234 312 84 92 163 119 174 125 124 -74 -257 8 19 -241 48 34 156 41 -67
7827 -67 50 117 46 59 258 -65 -90 86 109 14 -159 191 60 105 59 56 -39 217 -74 27 -65 88 136 -1 88
7852 88 -149 -148 -133 53 -51 -88 54 277 -121 127 -184 -39 77 -4 -89 -137 -125 -13 -125 56 83 283 -90
7875 -90 -122 -25 -121 53 39 -214 -206 107 150 65 -23 -276 -22 212 99 -140 -57 -53 48 29 21 -230 43 -69 -61 -405
7901d05J72L58j46j40M22l47j82J50R2j69L19l00K26nK7n3Rm%P2r5q3J22j13p6
7926a49K38L2J2l09J30L63l57J30o2oj65O0L28k61J6j68K00L4j42L00l86P6O4
7949b2Q7m4j3j43J60Kj16j08K67j2J33l14J83J99l30j05J52j1K13q9m4j6p2j10
7973a53L59j2k06o4J97j17j30M7J36j24J44J52k31O1q0O4q4P9j70O9K52k48lJ86
7997A24l9j67j8pq2K67k35K17r4N3j76J73M5n8j47J97p7O6r5Q2J98m75K13q2j3
8022a30J10j74N22k76j72m0J07K2l05N29j43n4k62M30n0l7R1n2j34J85k37N7j26
8045a39J04j61J90N7j15j0J17n0l5P6j21r9K78J99j96L4n9q4Q8k74J47j31N9L39
8069B14Jk98M0j0P3j17m9L22k18J09p8k04K24RK63k37m7j79J90l0k70K28K2J18
$$ plain form
7901 -405 -233 125 -21 -161 261 -86 -268 -118 -26 -195 124 -176 50 45 72 19 28 24 24 96 1 -82 40 -73 -149
7926 -149 89 121 133 -176 -46 317 -40 90 28 22 -143 -83 245 -16 0 -168 32 66 -76 224 -162 -86 -22
7949 -22 65 21 8 -135 25 27 -89 -197 70 58 191 -123 60 259 -71 -176 -24 -35 178 89 45 29 -43 -153
7973 -153 206 194 -12 -76 121 4 -126 -79 57 -67 77 229 -2 59 -21 43 -41 38 -132 -63 189 -59 -62 124
7997 124 85 -82 -100 -107 -189 78 -157 60 -34 19 -157 16 61 3 -144 53 -24 42 -53 29 227 -248 -35 -117 -130
8022 -130 -20 -194 328 52 -120 -160 -53 -31 -336 193 50 -4 -266 164 114 77 168 116 -18 167 -70 -13 -139
8045 -139 -35 -196 -6 51 -64 -74 43 -7 -42 34 -87 -186 92 291 95 129 70 -14 74 -200 -53 -184 -125 214
8069 214 215 -83 -43 -53 20 -97 -146 176 -42 67 -11 -215 9 18 281 44 -3 -182 8 -22 -292 -64 -42 76
8093G6l35J53M2J75o5O1j73K70p8l70J98J00N3q9n9J08k88J8kL26j21K54m36J52
8117c0K0J35r1m3RL16j66j42j16j59J32K7M8q4J66J98k01J15N5j18p2J5J61j06
8141F9j55J57qk7j01J38K36m24J52J34j61j16J79r4J2L12j18k20K23r4j3r1M6
8164C6j7k19J70J83R2l58K88l52K35q3j17L39j74l7l8J13j65Jk11J81J89q3K84
8187B57m6l24j8m0
$$ plain form
8093 76 -259 -106 -64 111 46 107 -66 204 126 -244 -46 54 107 18 -41 67 -221 -203 -205 121 0 254 -182 -30
8117 -30 -10 125 34 -9 0 316 150 8 -108 -267 -135 -108 -60 -144 22 220 19 134 189 71 -1 14 175 69
8141 69 -86 71 63 36 -65 73 309 -115 37 171 10 -106 73 -21 -9 303 185 -35 188 94 81 -10 36
8164 36 19 -200 -30 153 245 -113 175 -177 58 -25 -142 197 23 -14 -52 61 -104 -103 -314 -133 56 -27 257
8187 257 211 -113 -131 -171
8191a71
$$ Imaginary data points
##PAGE= N=2
##DATA TABLE= (X++(I..I)), XYDATA
0@%%%%%%%%%%%Qj6J6j6K4l2M0m8N6p2Q8j04J20j42J66j92K24k61L02l44L94m50
33b39N10n79O54p36Q27r26J034j153J283j423J579j751J936k138K359k600K863
50A500l154L476l831M223m658N148n703O334p058P901q898J0098j1574J3442j5897
65h651J9286k4305L2600m9618J48837k39080J5381L79608k63122r7270J63091
76G6757m0297r2043P9161k5082l3033k9963J7389N0834k8113o2778O7581j4202
88c3789n9906Q4831R970q1799O5428K7880n2002K5759J19k1977O9780k9049l3543
101b8298O9191m8074m7824J11247j5218j02051P0600M5154p2166j6147M6450J9475
113C2339m5705r543O2079j5935p0331M7308L2552m2522L2474o864n7451P6182
$$ plain form
0 0 0 0 0 0 0 0 0 0 0 0 0 8 -8 8 -8 16 -16 24 -24 32 -40 48 -56 64 -78 88 -104 120 -141 161 -183 211 -239
33 -239 271 -308 346 -390 437 -489 545 -608 675 -748 831 -920 1016 -1122 1237 -1363 1500
50 1500 -1654 1822 -2009 2214 -2444 2704 -2999 3335 -3723 4178 -4720 5378 -6196 7246 -8651
65 -8651 10635 -13670 18930 -30688 118149 -120931 -105550 274058 10936 -86334 76757
76 76757 36460 -55583 23578 -1504 -34537 -64500 -47111 3723 -24390 -87168 -19587 -33789
88 -33789 -93695 -8864 1106 -80693 -15265 12615 -39387 -13628 -13509 -35486 34294 5245 -28298
101 -28298 40893 -7181 -55005 56242 41024 -61027 9573 54727 -17439 -33586 12864 32339
113 32339 -13366 -22909 39170 23235 -47096 212 32764 -9758 22716 15852 -41599 34583
125C4583K4045j26538N9470R7561j22536k327J01760q4676l7893R7514l4575l8530
137c2142M7507l2595j3885M9431k0355l9611L7263L3586k5479l9413L0171N3479
149D7957n2009k4599P9203m896p2368L9113M1217m2108J0364P280k9311M1086
161D0929Q227p9530K4787O3395n7916k0858M3842k3164l5483L1713J5804m2290
173c0544p458L7671m924l7237J7262J2125j5108J9921l04k6672K7814J4919n0987
186d3522K9928N7355o5025k9521Q5364o1p5537K6874M0088j9084l401k557j4152
199a3251J8576J6212l1348o850L6422J081m6347J0360N1018l2690l5469M5573
211A3287J5861l8112O670R355j5881K7306O342m1120J2860L6943l4698j0442L9584
$$ plain form
125 34583 58628 -67910 -8440 89121 -33415 -35742 66018 -18658 -56551 40963 6388 -32142
137 -32142 15365 -17230 -31115 18316 -2039 -41650 -4387 29199 3720 -35693 -5522 47957
149 47957 -4052 -28651 50552 45656 -26712 12401 53618 11510 21874 29154 -157 40929
161 40929 49156 -30374 -5587 57808 -108 -20966 22876 -288 -35771 -4058 11746 -30544
173 -30544 -38002 -331 -5255 -42492 -25230 -13105 -28213 -8292 -8596 -35268 -7454 7465 -43522
186 -43522 -13594 43761 -21264 -50785 34579 34518 -41019 -14145 25943 6859 3458 901 -13251
199 -13251 5325 21537 -9811 -16661 19761 20842 -25505 -15145 35873 3183 -32286 13287
211 13287 29148 -8964 -2294 7061 -8820 18486 24828 -16292 -3432 33511 -1187 -11629 27955
224B7955k3443k4022M3403O415n2018O323L8960j0677k1530R695Q460j3881P478
237C118L813j4137J2728Q598k5381J2853K9202m4164j2707N7731m026n1436J7744
250f064L0325k6740m606J5507j0169k686R489j2584k14J2475k3389n679L5620
263A1285j671m8883P687N0236k3891l9227L5203K2349l8422L355K5041j4146k487
276a3571J0053n302J2251J3124l5873j803N3991r863m9737K4438M0527l0864j6499
289i128K3628k403r898J5085j406k1379J2492J0026k0282L233K1375k2435j2992
302a4084L4133j1774k9134K6415J2615l2802R876K7590k7292j5508K7476R423
314A6934j8313j492M58L296J8091j5715k5596K5644K8185l5838k0239L7957M243
$$ plain form
224 27955 4512 -19510 23893 30308 -21710 -15387 23573 12896 -8634 1061 9521 -4360 3118
237 3118 6931 -7206 5522 14120 -11261 1592 30794 -13370 -26077 31654 27628 -23808 -6064
250 -6064 24261 -2479 -7085 8422 -1747 -4433 5056 -7528 -7742 4733 -18656 -24335 11285
263 11285 9614 -39269 -31582 18654 -5237 -44464 -9261 13088 -25334 -21979 3062 -11084 -13571
276 -13571 -3518 -8820 3431 16555 -19318 -21121 32870 23007 -26730 -2292 38235 7371 -9128
289 -9128 14500 12097 2199 17284 15878 -5501 6991 17017 -3265 -32 21343 -1092 -14084
302 -14084 20049 8275 -20859 5556 18171 -14631 -4755 22835 -4457 -19965 7511 16934
314 16934 -1379 -2871 -2413 883 18974 3259 -22337 3307 31492 -4346 -24585 13372 17615
327A7615l6918P869L2299j9891j9477J3811O905J16n622j6941J1478L0962k5212
340c006l0763L1962K1802l3223m433L1650j5062j9405K3244Q158k3221K123J4788
353D614n146j273l027q269J0505J3739k1338r259L1041p052l2341K3307K8224
366B3725l5057j2356L6225J360k3993L427J3652j993N610l410j1664J3646R358
379A8530j8613K167K2699k0311j5266L1574K675l8177N981L3062j6547k0103J3104
392G75J764r372Q014m184j1621J8269j825k3048J5727K1255k8517j2711L8594
405A3120M023l3335J988K6132l044q763Q93k489R911N215j5951l846K2601p201
419I254k2529J8823J4992k9383q463L2447o029k4070J2245Q443j4529L437J0648
$$ plain form
327 17615 -19303 -11434 20865 974 -18503 -4692 2213 2329 -3293 -20234 -8756 22206 -3006
340 -3006 -33769 -1807 19995 -13228 -17661 13989 -1073 -20478 2766 10924 -12297 -10174 4614
353 4614 -532 -1805 -4832 -13101 -2596 11143 -10195 -19454 11587 4535 -27806 -4499 23725
366 23725 -11332 -23688 12537 13897 -10096 -6669 6983 4990 10600 7190 -4474 9172 18530
379 18530 -83 2084 24783 4472 -10794 20780 23455 -14722 -8741 24321 7774 -12329 775
392 775 2539 -6833 1181 -3003 -14624 3645 1820 -21228 -5501 15754 -12763 -25474 13120
405 13120 17143 -16192 -14204 11928 8884 121 1014 -1475 8436 13651 -2300 -6146 16455 9254
419 9254 -13275 5548 20540 -8843 -17306 15141 9112 -14958 -2713 5730 -8799 -5362 5286
432E286j3894r56J1266l670k068M658j4442K23L1601j3069l6012K4148L0293l1291
446g927j7717K9897K737j8473L034P486k995J808n734l662J9987q41k5926Q466
460i860L0172j3895k2500J9933J5651j5118n473J5331l620o224R301J181n637
473I242L409l270o709J6835k731k5119J0365K2663k2128j8402K5943n68k5765
486a6235J2389J5811k3194p898K0769l876r193M798l441j612J5034n307k0214
499b2169J6678J5644j8184l675J6780q314n860J4068l910p361P148r45n352J2389
513F937m496j8006J6833J6449k4328j1147L0525O07l0129J0884K9367j9776k4769
526b1049K8181J5826k6403p500J9729J643n386j675j0445J0055J3669j8606j0461
$$ plain form
432 5286 -8608 -9564 1702 -1968 -4036 622 -13820 -13597 18004 4935 -31077 -6929 23364 -7927
446 -7927 -25644 4253 6990 -11483 -8449 -963 -3958 -2150 -7884 -11546 8441 7600 -18326 -9860
460 -9860 20312 6417 -16083 3850 19501 4383 -1090 14241 10621 4397 13698 14879 9242
473 9242 12651 9381 2672 19507 16776 -8343 2022 24685 2557 -15845 10098 9530 -16235
486 -16235 -3846 11965 -11229 -19127 1642 -2234 -11427 -6629 -10070 -11682 3352 -1955 -22169
499 -22169 -5491 10153 -8031 -11706 5074 -3240 -9100 4968 1058 -6303 845 -100 -5452 6937
513 6937 2441 -15565 1268 17717 -6611 -17758 12767 13374 -16755 -5871 23496 3720 -21049
526 -21049 7132 22958 -3445 -10945 8784 10427 5041 3366 -7079 2976 16645 -1961 -12422
539a2422K2216k012k1292J1261J0475j4535l839J1175k088l044J143o944P156
552b750R989j1539p592J7643m3j6540J3374J1664k0916j987K8215q766k4477J6001
566B276J5000j5100m945R534m477K06L129q025O15J0721q140j4316J7486J0174
580A4138k4386p541K7800K466k5821K609J6225l079o661K210l072M747O377j2845
594f833M68J3635j0348j0175K1099K53k4009P590J8397j0099j1056Q540K204j528
608a862J476n286M34Q724k997r985J2018P113j8570l71K3565m736k2845J2471
622h51J5757j2877p076J0384m28m647L781k342J221J755q003O11J4041o231j8560
637a3465J3498J5726j7227j1899K0565L784j9536N436J3995r366r533J0487L812
$$ plain form
539 -12422 9794 7782 -13510 -2249 8226 -6309 -10148 1027 -1061 -4105 -2962 -9906 -2750
552 -2750 7239 -4300 -11892 5751 5708 -10832 2542 14206 -6710 -8697 19518 10752 -13725 2276
566 2276 17276 2176 -2769 6765 2288 2494 5623 -2402 -1787 8934 794 -13522 3964 14138
580 14138 -10248 -17789 10011 12477 -13344 -10735 5490 2411 -4250 -2040 -5112 -365 6012 -6833
594 -6833 -6365 7270 -3078 -13253 7846 8099 -15910 -8320 10077 -22 -11078 -2538 -334 -1862
608 -1862 -386 -5672 -5238 3486 489 -9496 2522 9635 -8935 -9306 14259 9523 -13322 -851
622 -851 14906 2029 -5047 5337 4909 262 4043 1701 2922 4677 -3326 -2715 11326 5095 -13465
637 -13465 33 15759 -1468 -13367 7198 10982 -8554 -3118 10877 1511 -8022 2465 6277
650F277l280k994o252O805J2961j2073j8728J9657J4772k2601p793J8201Q68j3041
664g221L371N061k161j732j552M61O303k40j2770N682J4512r347j2475J2288P111
679G291j2236K595Q119q493l788J2362j672r898M222K282k15K583m946o577J1676
694C305N432j5977N28J5473n743j3916J2645R372j4733m295J3553K913r315k631
708c389K010P964K899j4070l748J7675J538k0771N592J7519j2214j1844J4984
721D145N542j5922J7J0375P7n328k026P32N486J747j0108J871J1253n852j1014
736i005J2689O778j7467o92J6593k136j4388L848P240k154j183k751k373N558
750E57K970r387J352P789p102l133J0965j471j3449P796J1102r017o510R051J892
$$ plain form
650 6277 2997 3 -6249 556 13517 1444 -17284 2373 17145 -5456 -13249 4952 5820 -7221
664 -7221 -3850 1211 -950 -2682 -4234 -3773 2530 2290 -10480 -4798 9714 367 -12108 180 7291
679 7291 -4945 -2350 5769 -2724 -6512 5850 4178 -5720 -1498 784 569 3152 -1794 -8371 3305
694 3305 8737 -7240 -6712 8761 3018 -10898 1747 11119 -3614 -7909 5644 8557 -758 -3389
708 -3389 -1379 6585 9484 -4586 -8334 9341 10879 -9892 -4300 13219 1005 -10839 4145
721 4145 9687 -6235 -6218 4157 4234 -1094 -3120 -2388 3098 4845 -5263 -3392 7861 2009 -9005
736 -9005 3684 10462 -7005 -7697 8896 6760 -7628 -3780 3460 1306 123 -2628 -5001 557
750 557 3527 -5860 -4508 3281 -3821 -6954 4011 2540 -10909 -3113 7989 -1028 -7538 1513 3405
765C405n656K795P14j148K655k151k729P077J240j3391L667J6108p743j6399R913
780a643J2404j0161o761M882M173o78l156l851N279N945r892m314J3986K015j8047
795i819L089J7433o173j3318O295Q119n025j960J24j038L196Q68m460P99M064
810B194o229Q17R120n838r893J0787Q226j3536k431J2225m10r323M428O170m888
825A419k127J455K900K782m459p429R057Q552j4031o235J3550K997j4101J384
839d286R711o237n343N846K337n513j213Q65K810L007o333n487R613P170j3263
854f316l079J3199n63j0131M955O478o917r39N145N96j611j251k162M582O369
869H355r636o329J1977N694j3546j226J1404k612o507L973L551m939N12K269r44
$$ plain form
765 3405 -2251 544 1258 110 2765 614 -2115 4962 6202 -7189 -3522 12586 4843 -11556 -1643
780 -1643 10761 600 -6161 -1279 2894 2216 -940 -4791 488 6433 -3459 -7773 6213 8228 -9819
795 -9819 -6730 10703 4530 -8788 -2493 5626 601 -1359 -1235 -2273 923 1791 -2669 -1870 2194
810 2194 -4035 -3218 5902 64 -9829 958 9184 -4352 -6783 5442 5032 -4291 137 6307 1419
825 1419 -708 747 3647 6429 1970 -5459 3598 12150 -1881 -8116 5434 8431 -5670 -4286
839 -4286 5425 -812 -6155 -309 2028 -3485 -4698 -3833 -1023 1984 -4349 -9836 -223 6947 -6316
854 -6316 -9395 3804 3241 -6890 -1935 4543 -2374 -3313 1832 2428 817 -434 -2596 1986 8355
869 8355 -1281 -7610 4367 10061 -3485 -4711 6693 4081 -2426 1547 5098 159 671 2940 1996
884A996J681k350k678L866M343q271j289Q868m398p027P532M333j2755o92J2664
899E823j993j2413J236R683o44n687m006L587P759l523j0146O026J1404j0133
913c027p842J3320N359j3899j022J3507j303p730k05N090K650j000o547J193R295
928G839m148p673N293O355r901j256J0284l130r475N124O995o639k726L979j10
943H11j113P92j194k84K622l126j391O249j149r018M237R563p249p052O055N116
959C869m529k907J520P97K139j740k878K732L269o213n34J0152m515r445Q190
974i3R179j0424n326J0361K316o638q79M579l0o37l154J324O036l863q147N496
990A00J0028r186r729J0226O764r411n146P553R05l609q77J171J373m92l447J870
$$ plain form
884 1996 3677 1327 -1351 2515 6858 -1413 -2702 6166 1768 -5259 2273 6606 -6149 -6841 5823
899 5823 3830 -8583 -7347 2336 1692 -3995 -8001 -4414 3345 -178 -10324 -4298 7106 -3027
913 -3027 -10869 2451 7810 -6089 -7111 6396 5093 -2637 -2842 2248 4898 3898 -2649 -1456 7839
928 7839 3691 -3982 1311 7666 -2235 -3491 6793 3663 -5812 -688 6307 -332 -3058 921 811
943 811 -302 490 -704 -988 1634 -1492 -2883 3366 2217 -6801 -2564 6999 -250 -7302 -1247 3869
959 3869 -660 -3567 -2047 -1250 889 -851 -3729 -997 2272 -3941 -4475 5677 1162 -8283 -93
974 -93 9086 -1338 -6664 3697 6013 -625 -1504 3075 3045 2408 -746 578 6614 2751 -5396 100
990 100 10128 942 -8787 1439 8203 -1208 -6354 1199 2104 -1505 -2382 -1211 162 -330 -3777 -1907
1006a907N847m999n805P296N370r137k379Q962j094n344L366K946n777K20N477
1021C042j350m096j16K777K272m95n984p40J0303j267j1016L238J0950o509p456
1036f447P769M216o121k886M958J779m84m838o82O979J462q573j498R479j148
1051C965p332J447N443l533k939M149l95l143O02J504R5P60l304j442O672k13
1067B336p129J494P785m190m778O048K390o276j70O650j474m521oL094K065k566
1083G52l706J583O126l178o651N075N070p516k151Q962j887p466L444N636l204
1098H89l546J870J965R65k144k186L020K612n007j085O965j655p851L463Q698
1113F973n617q337N632O276l660n136J029L528K260l873l548M719L173n502j615
$$ plain form
1006 -1907 3940 -1059 -6864 432 5802 -3335 -5714 3248 2154 -3190 176 3122 -2655 -2435 3042
1021 3042 1692 -2404 -2520 257 2529 2034 -3950 -4690 5613 4346 -6670 -3432 7518 1009 -6447
1036 -6447 1322 5538 -583 -3469 1489 3268 2784 -2054 -2736 4243 5705 -2868 -4366 5113 3965
1051 3965 -3367 -1920 3523 -10 -2949 1200 805 -2338 -1736 -232 -137 623 -2681 -4123 2549 2336
1067 2336 -4793 -3299 4486 296 -4482 1566 3956 -2320 -2490 4160 2686 -1835 -1841 1253 3318 752
1083 752 -2954 -1371 4755 1577 -5074 1 5071 -2445 -4596 4366 2479 -4987 -1543 4093 889
1098 889 -2657 -787 1178 2143 -1 -2187 833 3445 -1562 -2647 4318 2663 -5188 -1725 6973
1113 6973 1356 -6981 -1349 4927 1267 -3869 -2840 688 2948 -925 -4473 246 3419 -2083 -3698
1128c698P471j500o589L595M605l098l446L578O85q79K35j479q4J902l4k777K268
1145G55l09k929J971L946n042l733O897J915o354p77N111k20k688k09J581J989
1161A904k254k302K698M987m831n910P320N841q314n143Q242L385o209k600L964
1176G78J478k112j212O79K252j283l288L109L327n026l397P622J387p142k51O629
1192C550j585m722K610K522k275k055J596K001n92l751o71N829K01p039l63P707
1208B963q97o735K390M319k799k594L449N71k353L59J508J244r73k154L84M861
1224C543j152m961J954M687k417m230M524J467m548j78M329o51l912q8K723K216
1240C306k935m227K774N620l386o449M869M930m900l877N322K175m482j420L119
$$ plain form
1128 -3698 3773 2273 -4316 -721 3884 786 -2660 918 1603 724 959 -520 -604 1298 1264 -1513 755
1145 755 446 -2483 -512 3434 -1608 -5341 1556 3471 -2883 -3660 1451 1231 -1457 -1666 -85 1904
1161 1904 -350 -2652 46 5033 202 -5708 1612 7453 -861 -6004 2238 5623 -586 -3186 778
1176 778 2256 144 -1068 -389 1863 580 -2708 401 3728 -1298 -4695 2927 4314 -2828 -3079 3550
1192 3550 1965 -2757 -147 2375 100 -1955 -359 1642 1050 -2701 -3372 2457 2658 -4381 -4744 2963
1208 2963 2066 -4669 -2279 2040 -759 -3353 96 667 -1686 -1327 181 1425 452 -1702 -1318 3543
1224 3543 2391 -2570 -616 4071 1654 -2576 1948 3415 -1133 -1311 3018 2367 -1545 -1633 1090 3306
1240 3306 371 -3856 -1082 4538 1152 -5297 -428 4502 -398 -4275 1047 3222 -1260 -2680 439
1255D39J763k818k253J349L893q85n271J701M418j872l857L179J347l737R52M047
1271B395k287l989L843K713k298k492J256K843K08k934q26M774n1n250J295N897
1287E097k886o346M643N496m909m920L680L758k702l121nL667J57l945p64M556
1303A456m43m815J982M425l213l993M414K376l405j590K560J343j362l59j0J158
1319E24N7j544Q37K170j989l080M196K082m518k047M835J883m253q66K405J152
1335A844j142j118J89J803J18k919J974K703l182k076L834J561m886o7L595l83
1351A848l344J260J115q20j268J97J401k70k338q81M805L1o166L62O560n79o431
1368d518J546N243j451l614J214L368r20k393n8L564K56m319k51N316N14o220
$$ plain form
1255 439 2202 -616 -2869 -1520 2373 1488 -3783 -2082 2336 464 -3393 -214 1133 -2604 -1652 2395
1271 2395 108 -3881 -38 2675 377 -2115 -859 1984 2192 -742 -1568 3206 3155 -2095 -800 5097
1287 5097 2211 -4135 508 6004 1095 -3825 -145 3613 911 -2210 -2215 1452 1609 -2336 -3100 1456
1303 1456 1013 -3802 -1820 2605 -608 -4601 -187 2189 -1216 -2806 -246 1097 -265 -624 -634 524
1319 524 581 -963 -126 2044 55 -3025 1171 3253 -1265 -3312 1523 3406 -847 -1713 692 1844
1335 1844 702 -416 -227 1576 1694 -1225 749 3452 270 -1806 2028 3589 -1297 -1364 2231 1848
1351 1848 -1496 -236 879 59 -1209 -1012 389 119 -2219 -3100 1705 1736 -4430 -4068 2492 1913 -4518
1368 -4518 -2972 2271 820 -2794 -1580 1788 868 -1525 -1583 1981 2237 -2082 -2333 2983 3497 -2723
1384b723P51N107p62m337J300K171j303o42R80n1q36L93N37L69p31j309J634J613
1402B161j708k707L426J376l427q54L974m05m089J175K876m04k662q94K509J787
1418B134k407l623L255L366l270l139L448K479l629q24K976L04k570R4K401M81
1434A476j593j490K306J795k030k515K809K223l064j323K866N94l736R69K996
1449B283j415l199J209K878o83k482q54K971J270l341j204L507J026m497J132
1464a399L639j678l142K321K796k522j622J214J826o50j744r4J957m5k173J227
1480h9J604k062j900L370J482m225j070M297J285m271o21L395J135k640j626K569
1496F33J674j997k307K944K259l298k292L444K419m330j412L322J151k106j621
$$ plain form
1384 -2723 -1972 3135 2373 -1964 -664 1507 204 -438 542 491 -345 48 585 954 223 -1086 548 2161
1402 2161 453 -2254 1172 2548 -879 -1733 2241 1836 -2253 -1078 1798 1394 -1268 -2162 347 2134
1418 2134 -273 -3896 -641 2725 -545 -3684 -236 2243 -1386 -2210 766 1070 -1500 -1406 995 1476
1434 1476 -117 -1607 699 2494 464 -2051 758 2981 -83 -1406 1460 2054 -1682 -713 2283
1449 2283 868 -2331 -1122 1756 1073 -1409 -2263 708 1978 -1363 -2567 940 1966 -2531 -1399
1464 -1399 2240 562 -2580 -259 2537 15 -1607 -393 1433 783 -961 -1055 902 857 -1316 -89
1480 -89 1515 -547 -2447 923 2405 -1820 -2890 1407 2692 -1579 -2200 1195 2330 -310 -1936 633
1496 633 2307 310 -1997 947 3206 -92 -2384 1060 3479 -851 -2263 1059 2210 104 -1517
1511a517J077J437J1k630N74J905j004j623J378J845k557p63K605M83k617O09
1527g87J873o14p63K38Q47o19n74K33J665p60k577J033L310p53m820J505M331
1544B768j782l869J391L558j685k269P89K083l36k419R30K502q18l014R79L649
1560B457j122l484J791L007k133j782J765J563k348o02J710L52j708j337K182
1575C11J777k039k902K804K661k878k090K528J863k474r14K169M29j373n89J920
1591A203N3j268q48J510J183j637j686J716J414j952o34J182K79j659N76J412
1607H44j528j023J014J398j053j528N66K102k14k597P11K758l15l043J153K781
1623B026j160k730J486L166j725k732J024K591L37l621k61L071O51l455l03K979
$$ plain form
1511 -1517 -440 997 1008 -1622 -1048 857 -147 -1770 -392 1453 -1104 -1867 738 1221 -1396 -787
1527 -787 1086 472 -291 -53 794 175 -399 -166 1499 739 -1838 -805 2505 1752 -3068 -1563 2768
1544 2768 986 -2883 -1492 2066 381 -1888 -1099 984 648 -1771 -841 1661 843 -2171 -1192 2457
1560 2457 1335 -2149 -358 2649 516 -1266 499 2062 -286 -888 822 1174 -534 -1871 311
1575 311 2088 49 -2853 -49 2612 -266 -2356 172 2035 -439 -1353 816 1245 -128 -717 1203
1591 1203 1256 -12 -860 650 1833 196 -1490 226 1640 -312 -946 236 515 -1144 -568 844
1607 844 -684 -1707 -693 705 -348 -1876 -1310 792 578 -2019 -1308 1450 1135 -1908 -755 2026
1623 2026 866 -1864 -378 2788 1063 -1669 -645 1946 2283 -1338 -1599 1472 2123 -1332 -1635 1344
1639A344j27k648O37K103j304j166J031J721j341j548J412J195l55j505K77J497
1655A223m73j436J130J083j996p49K213P79l154k70K614K04k561m11K036N37j590
1672h21j016J880P94j632r55K396P29k687q0K777M74k768j55K517Rj528P6R00
1690I10K19r78o09J168M05j654J65J917p67k633M50K871p71k439J69K557j41k063
1708a224o9J596M35j561j85J713M97j973k85K586j44k650L2K383k74j738K14O97
1726E0K35j066N28M81o33p67J145R11j334j032J484J655j803j245K057J285k065
1743a14o37K026M18j986n11K245M65k300p07J934J825l203j767K839J863l047
1759f57j816K474J005j989p63J534Q79j107j139J342J082j618m46J367J160k076
$$ plain form
1639 1344 1217 -1431 -794 1309 5 -1161 -130 1591 250 -1298 114 1309 954 -551 -274 1223
1655 1223 750 -686 444 1527 -469 -1218 995 1774 -1380 -1650 964 1168 -1393 -1804 232 769 -821
1672 -821 -1837 43 837 -795 -1750 646 1375 -1312 -1392 1385 1859 -909 -1064 1453 1462 -66 10 910
1690 910 1129 151 -458 710 1115 -539 -374 1543 776 -1857 -1407 1464 693 -1746 -1577 980 839 -1224
1708 -1224 -1293 303 738 -823 -1008 705 1202 -771 -1056 1530 1386 -1264 -1232 1151 877 -861 -647 50
1726 50 285 -781 -253 228 -405 -1172 -27 884 -450 -1482 2 1657 -146 -1391 666 1951 -114
1743 -114 -751 1275 1693 -293 -804 1441 1906 -394 -1101 833 2658 -545 -2312 527 2390 -657
1759 -657 -2473 1 1006 -983 -1746 -212 667 -440 -1579 -237 845 -773 -1219 148 1308 -768
1775g68k68J348P76j406k73J384p43p00O04Q74n97j507R32J029k19j555N3K161
1793A125j60j975j36K378l00j885P38J596q12j445J037J346r83j339O80J713l94
1810A184j808O0K068q17j590L61J686j313j337J217J232j586j278K198P32j482
1826d73j416J674J660j714j526J580J702j563j255J665J363j806j206K344O86
1841A715j666j336J719J096j409j437J224J474j277r76Q03P79j088l42J367m38
1857B08j054L22J529n07j449O03J258l56j063K95J100k35j243N53J431q21j963
1874a392Q27K209j470k136J178K169j045k029Q29J824m39j525J35J528n00r89
1890h26J65K003p29j686Q42J738q28j807R55J254j11j536N11J046n29p47L85N57
$$ plain form
1775 -768 -1036 312 1088 -318 -591 793 50 -650 -46 828 231 -1276 -344 685 466 -1089 -1036 1125
1793 1125 965 -1010 -1146 1232 932 -953 -215 1381 569 -876 161 1507 524 -815 -135 1578 1184
1810 1184 -624 -564 1504 687 -903 -542 1144 -169 -1506 -289 943 -643 -1921 277 1009 -473
1826 -473 -1889 -215 1445 -269 -1795 -215 1487 -76 -1331 334 1697 -109 -1315 1029 1715
1841 1715 49 -1287 432 1528 119 -1318 -94 1380 103 -873 -70 709 -379 -721 646 208
1857 208 -846 -524 1005 498 -951 -348 910 554 -509 -214 886 651 -592 -39 1392 571 -1392
1874 -1392 -565 1644 174 -1962 -784 1385 340 -1689 -860 964 525 -1000 -865 663 163 -826
1890 -826 -661 1342 613 -1073 -231 1507 679 -1128 -173 1081 970 -566 -55 991 462 -285 100 657
1908F57r23p59R97R30j009j459J498J276j858j114J678J431j694r69J368R66j446
1925d30l74J137R24j556o03J384O13j095j136J625O10j484o45J531R1j372K81
1942d99J082k15j373L42J562j52k095L19K232l01j901K51J620j97j497M44J320
1959I42k62j499N02J388m53j671L90J859p23j406l2J735l6j326l31J215M2j383
1977a049Q47M92j07n66M48L54m46m95M39Q05n04o01L82Q61l29j063O02N52j036
1996d14n58J291P19j603p45J603Q55j608q28J241J267j151j603J515J214j245
2012e0j269J290J244j460q02J449Q23j681m18J557K95j310o25J491M08j139m14
2029f11Q82J07j093rJ467q7j671N26J222j19j396J86J279p2q63j63J301l86r05
$$ plain form
1908 657 -266 -1025 -28 902 -107 -1566 -68 1208 -650 -1764 -86 1345 -349 -1318 50 1016 -430
1925 -430 -804 333 1257 -299 -902 482 1095 0 -1136 489 1099 -385 -1030 501 592 -780 -499
1942 -499 583 368 -1005 -663 899 747 -1348 -1029 1203 902 -999 -748 872 675 -822 -378 942
1959 942 680 -819 -317 1071 618 -1053 -663 1196 473 -933 -965 770 734 -592 -923 292 334 -1049
1977 -1049 -202 290 183 -383 65 419 -27 -522 -83 722 218 -383 -1 860 531 -532 70 622 -414
1996 -414 -972 319 1038 -565 -1310 293 1148 -460 -1288 -47 1220 69 -1534 -19 1195 -50
2012 -50 -1319 -29 1215 -245 -1047 402 1225 -456 -874 683 978 -332 -957 534 942 -197 -611
2029 -611 271 378 -715 -724 743 656 -1015 -489 733 614 -782 -596 683 611 -252 -415 886 500 -405
2048d05J23J093k26j365O88J249p15j176M40J180m17j310M98R12j71j153M32Q75
2066E52o86m64N62O00q45o18J048P76j267p40J119J030j167p14R01J118j295p21
2084h11R64O37q60j085J289J226j524j191J707Q59j180r73Q35Q47p42q24O71R30
2102G75q12n01O01P12j099k54J177L19j247kR16j4j020lJ097j50j311N68R22o02
2122G2j211M22J647r64j438O38J845n98j791P50J352j02j498M28J277m02j103
2139f76L90J578q49q96L88J074m29j121J44J222k80j009L53O30l17p50O72N16
2157F40p88p34Q22Q23j031p56J344N93r01r45Q53Q16o55o71Q85N40j130l03P88
2176A90M14j091m40J196N54j127n36J057N36r73m38O09L97r21K63N67p2o84J70
$$ plain form
2048 -405 -282 811 585 -780 -92 1157 442 -734 -294 886 469 -841 -343 569 398 -755 -323 552
2066 552 -134 -598 -36 564 -281 -899 149 925 -342 -1082 37 1067 -100 -814 87 1205 -90 -811
2084 -811 153 790 -70 -1155 134 1360 -164 -1355 352 1211 31 -942 -107 740 -2 -826 -155 775
2102 775 -37 -538 63 775 -324 -578 599 918 -329 -331 585 571 -449 -452 645 495 -816 -248 674 72
2122 72 -1139 -717 930 -34 -1472 -834 1011 413 -1378 -628 724 622 -876 -448 829 427 -676
2139 -676 -286 1292 443 -453 -65 1009 580 -541 -397 825 545 -464 -111 519 202 -548 124 640
2157 640 -148 -882 -60 763 -268 -1024 320 913 12 -933 -80 736 81 -590 295 835 -295 -598 190
2176 190 604 -487 -927 269 823 -304 -840 217 753 -220 -658 -49 348 -573 -310 257 185 -499 -329
2195c29J002k40q48O3J390l11j260J54J446n31r84L42J144m99j281N60J452j079
2213A91j082L12J589m98j583L64J706n14j204PJ152Q4j250L46P54k58q91P00P55
2232F80n95o53M81N36k73p35N05N74l80n94P51J08p67k84J148Q9j132k99J141
2251C01M73j093k62J011L69q52o96J317J92r91L9O58J95p67o43J188L97j186l58
2270g08J248J27r46n27J331k45o49m29J213kr03l2Q55Q8j236j4J315K02j460K46
2290e26J026Oj033N5J080Qj009lJ087p4j200N97O28o5j082J55J096l90p91k3O47
2311A89K23n86j09M96l33k86Q67n6n38n16J094L60p77l82Q19L21j001l81J002
2330D06J71j075l11J195L33j106l99J042K56j146l67J138N65q88p23J008O62j037
$$ plain form
2195 -329 673 433 -415 -352 1038 727 -533 -379 1067 536 -448 -106 1038 539 -742 -182 1270 191
2213 191 -891 -579 1010 512 -1071 -707 999 485 -719 -712 440 524 -726 -380 374 116 -775 -75 680
2232 680 85 -568 -87 449 176 -559 -54 520 140 -454 297 405 -362 -646 502 591 -541 -840 301
2251 301 774 -319 -581 430 799 -53 -749 568 760 -231 -192 466 661 -106 -749 439 836 -350 -708
2270 -708 540 667 -279 -806 525 280 -369 -798 415 413 -490 -522 333 421 -815 -829 486 688 -772 -526
2290 -526 500 506 -527 -472 608 616 -393 -396 691 617 -583 14 642 577 -505 -350 746 356 -435 -458 189
2311 189 412 -174 -283 213 -120 -406 461 405 -133 -649 445 805 28 -354 465 786 -215 -596 406
2330 406 577 -498 -809 386 719 -387 -786 256 512 -634 -1001 137 702 -186 -909 99 761 -276
2348b76n13R97M67q08j44O07L42q45j83N26M47o08m83N51M51p62j87R13k53n67
2368c28J67O36m85o85L28J000p32n25J03J180k31j001J77P65q5q31N49O06k52
2387C56p21J62J107o17q41M75R82o54q99O88N14n48n22L86P57p81m21Q13N49j146
2407c61l51P95N91q27m14O53N50o19o67Q02L49l85o17M99L89n39j93R46j85q00
2427c84l25P73M50p90k23O79J90m58o10O27L17m36K32r3L76n32J02L76L2m46l18
2448d61J111m26n73K68K63K42j065O77N67n62q82O40P78n54r90O11Q16k07j052
2467g99L22J244l83r45K95Q46m53q58N54P52k12p58K55Q62l70q05J91R12l91n84
2487c25K14O55l60o40M30K08m16k76O37J48n34l88R00J95p87N3L50M58n88j51
$$ plain form
2348 -276 -789 208 675 -133 -277 330 672 -173 -356 170 617 9 -474 77 528 -234 -421 492 239 -328
2368 -328 -161 475 -10 -695 -367 633 -99 -624 -521 659 428 -573 -396 369 284 -547 2 608 356
2387 356 -365 -203 904 287 -554 -79 903 249 -650 38 552 4 -518 -132 625 -156 -577 236 785 -361
2407 -361 -712 83 674 -153 -567 86 636 17 -650 152 501 116 -501 -2 387 -152 -345 601 416 -384
2427 -384 -709 64 514 -276 -499 180 370 -88 -698 -71 246 -190 42 -51 325 -207 -105 271 303 -143 -461
2448 -461 650 224 -349 -81 182 424 -641 36 603 41 -841 -201 577 23 -967 -356 460 253 -799
2467 -799 -477 767 384 -561 -266 580 127 -731 -177 575 363 -395 -140 722 352 -453 -262 650 259 -325
2487 -325 -111 544 184 -456 -26 182 -234 -510 127 275 -259 -647 253 448 -339 -286 64 522 -66 -217
2507b17L72L74o24m55J152L50j105j95Q71l1q55k42P54m5n51J1M77M71q88K9N25
2528A78j21m72K52N08p9n47j98J095k52p83K52M08M26r19pQ41l12p10O6P63k57
2549A32l74r0P15j75r18L47R08l10n84J70O66j57o14R8P28l03m54K35M77k38p77
2570e18M93L51j84p88O83K67k78l44N26L7n37K78M22Op44m64J023K86r71k79R13
2591A78J18o31k56P46K59o70j20N42L68q32j32O88K36n58k72O08K57o48l30N27
2611G8L32n74L6J66J75q03M11K95J05n57J37N13l65k48n1P99o5o27Q1M52j50l45
2633b05J38P21o47m99M81K25k39l54J38P31m91n04M07M03j00o66L41N66m88m66
2653e08N60K92n61k12O14M62o24m30N37L91q10pP96l03k84k38N80L14q18j41O17
$$ plain form
2507 -217 155 529 -95 -550 602 952 -153 -348 523 492 -363 -605 149 104 -447 -436 41 512 -376 -347 178
2528 178 57 -415 -163 345 266 -281 -479 616 364 -419 -167 241 667 -252 -259 582 270 -440 -374 389 132
2549 132 -242 -332 383 208 -710 -363 545 235 -349 -179 487 330 -284 -186 542 239 -215 20 497 259 -518
2570 -518 -25 326 142 -646 37 304 26 -318 208 245 -292 -14 408 414 -330 -794 229 515 -456 -735 178
2591 178 296 -335 -591 155 414 -256 -376 166 534 -298 -430 258 494 -64 -336 272 529 -119 -449 78
2611 78 410 -164 -128 38 213 -590 -179 116 221 -336 -199 314 -51 -299 -350 449 384 -243 -162 290 140 -205
2633 -205 -67 654 7 -492 -11 214 -25 -379 -241 490 -1 -505 -98 305 205 -461 -120 446 -42 -508
2653 -508 52 344 -217 -429 185 647 23 -407 130 521 -289 -296 500 197 -87 -325 255 569 -249 -390 227
2674B27L20r87j56P13L16p29k40N95K39k55p80P84L23n84J16K79L78p92K11M81
2694D59R4p68j04N24l1k10k18N76j79n82K92L21P5o35L22N42m85l87N05L68l11
2715A68m12K82N86j79p24J40P23l27o66M52J75K5n44J88M40k45m13J91P31n24
2735F7n01K18L30n13j33O52K6m58j31M19J75rm03K25M90m74r7K56M32n61k13M72
2757B69l54k57J73L80J00n34j61M43K60o67j63P77K16o92p1K32L37o48j5N42q
2778A59l89P9M19P1k55m7L42k16o86N62K32j75m03J92M22k27m46J76M21k18m93
2799d80K95M99k86p31L46Q05l94l34r3R54j74n14p9O12n40M8L29L1k29l51K60
2820b6K44L9m17l1L82l55k19M82R4j84m24M63K06n64k8M20J10m37L0N06l03j93
$$ plain form
2674 227 547 -440 -596 117 433 -296 -536 59 298 43 -737 47 370 -214 -98 181 559 -233 -22 459
2694 459 553 -215 -319 205 174 -36 -254 322 143 -439 -147 174 249 -386 -64 478 -7 -394 111 479 168
2715 168 -244 38 624 445 -279 -139 584 257 -409 43 218 243 -301 -113 327 82 -331 -140 591 67
2735 67 -434 -216 114 -399 -532 120 146 -312 -443 -24 151 142 -261 -36 454 -20 -117 139 571 10 -203 269
2757 269 -85 -342 -169 211 311 -223 -384 59 319 -348 -511 266 482 -210 -281 -49 288 -360 -375 167 159
2778 159 -230 -151 268 339 84 37 379 163 -523 39 271 96 -307 -115 307 80 -366 -190 231 13 -480
2799 -480 -185 314 28 -703 -357 448 54 -280 -373 581 407 -107 -186 426 -114 -66 263 294 65 -286 -26
2820 -26 218 257 -160 -191 191 -164 -383 99 193 9 -415 48 254 -310 -338 82 192 -245 -215 291 -12 -205
2842b05k20P24K25p45M1N02N4q84P5N94L19o58j65O83j94n12k1N03J92l77m1Q4
2864b6L90m17k49K38J32n25K80O69n13j76J83M56k37n81K20M14l32l66J97N12
2884B69l15m81L44K41r0m64L73M32l66m24N09nk7l6K41J36k97l55L18K85j87k80
2906a79L79K19m33k88L81K14l88l13M26J8l16o6L98N00o93k62M54J05l65m05N84
2927c0M14o82K55L37m5l83l50P67O5n06J15J63Q4l34k94N67J17l07j38M14j36
2948I3l34N6J75J31j68j68K71m8l48K36N57n12k42L45N18n68j98K67K66j88l37
2969a96L74L76n80l22O44p9Q8p89N49K82l56n69M38L49j42l47q4Q44n91m06O50
2990A33n9L1l83J88O43o39k01M08K75o01k15M05J89m06K52O9m6k37L7J54K96m37
$$ plain form
2842 -205 -425 299 524 -221 -180 322 376 -508 -433 161 480 -178 -343 340 146 -366 -387 116 308 -69 -110 -26
2864 -26 364 -53 -302 -64 68 -457 -177 492 -21 -197 -14 442 205 -376 -156 258 -74 -440 -243 269
2884 269 -46 -527 -183 58 -32 -496 -123 309 -57 -481 28 23 -4 -40 201 337 40 -315 3 288 101 -179
2906 -179 200 419 -14 -302 79 293 -95 -408 18 36 -280 -346 52 552 -141 -403 51 156 -209 -614 -30
2927 -30 384 -298 -43 294 249 -134 -484 283 348 -158 -43 120 204 -130 -424 143 260 -47 -185 229 93
2948 93 -241 -185 -10 121 -47 -215 56 8 -340 -104 453 -59 -301 44 562 -6 -204 63 329 141 -196
2969 -196 178 554 -26 -348 296 217 305 -484 65 347 -9 -578 -140 209 67 -280 -364 480 -111 -517 133
2990 133 74 105 -278 -90 553 -86 -287 121 396 -205 -420 -15 174 -232 20 89 43 -194 -157 -3 293 -144
3012a44q7L83Q6m36j34M53K20n57R8K24J30l39o3N34m7k56j25L44j00k95K23K37
3034C49m56l3PJ59K61n33j13O03j46o16N25K05j60m43K29P93n11n49K18N11k99
3055Al03J61N26k48m04K70M45k99m39L95J38k52m88M67J03K5k66O3J50j59j0K99
3077A75k31k6o2J49J85m76L00J40P9m88J21M41J48n20R5J21n2l94J74N52n28j34
3099b31M3K63J38m95J95L29m8l01j82M46o0k38j98M54K93o56P1O35k60n39J11
3120b30N70j47j61k53N42k18l46N06j62m8n17K63K08n0j55J09J39O1m72K59N50
3141D48l38k52O1L06j56l67M81K25n12r5K95J33k82jJ30K41m00P5oR6R9m96L72
3164E7K7l88R9K23N5l15K6M17j01l26K09J08L2J5l38O72m51l4l12P40r6o26P5
$$ plain form
3012 -144 -231 152 238 -198 -332 121 341 -216 -118 106 236 -103 -166 368 321 65 -60 284 184 -111 112 349
3034 349 -107 -140 -133 26 287 -246 -359 244 98 -518 7 212 52 -391 -162 631 120 -429 -211 300 1
3055 1 -302 -141 385 137 -267 3 448 149 -290 105 243 -9 -497 -30 73 98 -168 -105 45 -114 -124 175
3077 175 -56 -82 -144 5 190 -286 14 154 233 -255 -134 307 455 -65 30 151 99 -295 -121 431 -97 -231
3099 -231 -188 75 213 -282 -87 242 194 -107 -289 157 97 -141 -339 115 408 -248 -177 458 198 -341 -230
3120 -230 340 193 32 -221 321 103 -243 263 101 53 -464 -201 7 -43 -198 -89 50 111 -361 -102 448
3141 448 110 -142 -81 225 69 -298 183 408 -104 -199 96 229 -53 -54 76 317 -83 -8 -14 82 181 -315 57
3164 57 84 -304 -205 18 73 -242 -216 201 100 -226 -17 91 123 138 -200 472 21 -13 -325 415 319 -307 -232
3187b32O31k14k77k26N50o7n14l1O63L3n54j7M22k09J5k14K41J1j94L4L77j44
3209H4q7k07M14j71k60P1L80k65k23K92J17j33R0k76L14k85j22K11J64j60j8j14
3231a84K70O6n26M58rj01k74L82L0R9n06K65L12l79K8j15K05J0k36J87K40l79
3253a57J08O5n1J16l13K08K4q4j57N60j50l94k4K50M46m92k63K92K14k24q7J66
3275E3J70k84j89M31k06N6j11J84O2k01r2K2K38l00P4M28k62j37P3K41k54l71
3297c75O30q3l2l34K81K62l48j67K62k1l02j3J61K59l23K65l64O93l26n20M80
3318H5L2%m9k0M1M6l32J18K53l04J02L12k7l71J05J76n2j19Ln2J25j50k82L32
3342b8L42k17j55K08P4m27R5K62K55n04j16L11L11n46p1L25n3j88J06J47L9k57
$$ plain form
3187 -232 399 185 -92 -318 232 165 -349 -380 283 316 -238 -255 167 -42 -27 -241 0 11 -183 -149 228 84
3209 84 -3 -210 204 33 -227 -156 224 -41 -264 28 145 12 102 -174 140 -145 -267 -56 108 -52 -70 -184
3231 -184 86 152 -374 84 75 -26 -300 82 112 211 -295 -30 282 -97 -69 -184 21 31 -205 -18 222 -157
3253 -157 -49 16 -35 81 -232 -24 0 -84 -241 319 169 -225 -249 1 447 -45 -308 -16 198 -26 -113 53
3275 53 223 -61 -250 181 -25 31 -80 104 166 -35 -127 -105 133 -167 -93 335 73 -64 9 250 -4 -375
3297 -375 255 172 140 -194 87 349 1 -166 96 75 -227 -240 -79 180 -143 122 -242 451 125 -395 85
3318 85 117 117 68 48 89 135 -197 -79 174 -130 -28 284 257 -114 -9 167 115 -4 -1 -53 72 -78 -360 -28
3342 -28 314 97 -58 150 224 -203 -108 154 409 -95 -211 100 411 -135 -206 119 66 -122 -16 131 170 -87
3364h7Q6L02k14j20q3M24m00j3P8K37j79k60K01L21m65r7L04L24m18L5J26J86
3386B88k51k8L11J8k21k6o1K04j71k17O1K67l91j3K68J36m25J0J62L81k24k81
3408b03K53J73k61j75J34J11K0j64J56J1j87j58J20K82j58m9L02r3k63j8M46l28
3430d9K1P0k43M04k85j62O65k25n30o9M47Kj83MK73km35J35L77j36j14j23L84
3453B26j12j21J07P6j28k06o0M71k57k79K38K24l59l7J03L45k09k55K68J54k20
3474c1j20N96l28j28M9j27L53l50o0K2L48l05j7J41J42j65j20J28j09O5j74M57
3496B67n9j94nj12K8j01k7K02L16k40k43M76l13j9N2j46L59m67K1L39N6l39PL40
3520A98j7l28k34O26j40Jn4J05J05l77o6M38j81j47L7J46j93oj13J25R0j49N3
$$ plain form
3364 -87 -1 301 87 -33 -116 308 -92 -105 -27 210 31 -229 -28 293 -172 -269 35 359 -59 -24 102 288
3386 288 37 9 320 338 117 91 30 234 63 -154 -93 174 -217 -230 38 174 -251 -241 -79 302 78 -203
3408 -203 50 223 -38 -213 -79 32 52 -112 44 55 -132 -290 -170 112 -46 -95 207 114 -149 -167 279 -49
3430 -49 -28 42 -201 203 -82 -244 421 196 -334 -403 44 46 -137 -133 140 138 -297 -162 215 79 -35 -158 226
3453 226 114 -7 100 176 48 -158 -218 253 -4 -283 -45 179 -180 -217 -114 231 22 -233 35 189 -31
3474 -31 -151 445 117 -11 38 -89 264 -86 -146 -124 224 -81 -98 43 185 20 -100 28 -81 -16 -190 267
3496 267 208 14 9 -103 -75 -176 -203 -1 315 75 -168 308 -5 -24 28 -118 241 -226 -205 134 190 -149 -142 198
3520 198 181 -147 -381 245 105 106 52 157 262 -115 -181 257 76 -71 -34 112 -81 -87 -200 -75 15 -134 -81
3543h1K47k87m5K93m1k53l2M25j05o3j11Qp7j7j09M95k00j30J33mk03L01l51N12
3567C05k12R6l21J98J42j23o3J51J3K35o28K3M5J51o7K86q2k77K14P3L4l85q6
3590b78L65O2k49j06K53j82p5J66K35o1j41k80M19K94n60m9M07p6k25j12L59r6
3612G0j27J51rj54q6kK82R0r0m69O75p2m01%M01j39k41K82J76l56m4j62M75l32
3636h2n6Q8K62j62j36J42L6Q9m62L17k41J57j74K53J72j54l66K50K21j25L6k18
3658a53L28J1l51L22L1j31k9N7O3o1k50L51M0k87M8K70L3o49M41J1k2k87J80M1
3682GJ18j88K14j00J51k08LJ48L2k04n6K55l1j51k72M71k05l22K30M35p6l62K3
3705h8J96p3l63L23Q6N2k74K3M34l90k79L40N0K4k34K91j66J88m36M84o2j80J35
$$ plain form
3543 -81 166 -121 -166 127 86 -167 -199 226 121 58 -53 -45 -122 -139 -248 247 47 -83 50 46 -157 144 -207 305
3567 305 93 189 -132 66 208 85 22 173 186 421 -207 -184 -139 12 -55 231 149 -128 86 159 193 -192 -278
3590 -278 87 149 -100 -206 47 -135 -210 -44 191 130 -11 -291 128 422 -138 -187 220 144 -81 -193 166 70
3612 70 -57 94 85 -69 -155 -157 125 215 125 -344 331 259 -142 -142 259 120 -121 161 337 -19 -63 -225 250 -82
3636 -82 -138 -50 212 50 -86 56 92 181 -281 36 -205 -48 -222 31 203 49 -317 -67 154 29 65 -153
3658 -153 175 186 -165 157 188 57 28 85 148 87 -163 188 228 -59 -11 259 292 -357 84 95 73 -214 -34 7
3682 7 125 -63 151 51 202 -6 -3 145 177 -27 -83 172 141 -10 -282 189 -16 -338 -108 327 251 -111 -88
3705 -88 108 35 -328 -5 81 133 -141 -118 316 -74 -353 -13 37 61 -173 118 -48 140 -296 188 126 -54 81
3728H1j48Q0k37K79p1Q3j96j63L62K03m21k8j03N09k06j86J75L5K8l44L60n2l16
3751b76k1M09p0k95K71M0J01k57k4L27j58k96L28k29J53j23r3N09k51P5k15L70
3773B75j80l57k1M02q2k86J07m2L79k02j03L12k21J49l14K79J05k27k06L49O1
3794A77l06L95l98J64o3K55r2l56m0L23p1j29J52j16K59j58k23J10K95j62j08
3815i2JK33j13q3oR0O7j90K41n9o7J1O1l2L8l12L58K19j71j10j90J95j6n6K4o8
3841b7j01O1J97k82P1j56L23J97k50j13J71j87%J81K2K0k17R3l0J1n9j03J18l3
3865i3Q4m2L40k35R0k06j3rl4o0K60l2j27J21N8k56l0K33j33J60k26K60N4j40
3889B4p1r0K46m2j90p8M12k24k91J27L97l70p8N90k35P7k56J70K41l91j92J79
$$ plain form
3728 81 -67 13 -224 55 -16 67 -129 -292 70 273 -148 -176 -279 230 24 -162 13 48 76 -268 92 40 -276
3751 -276 -297 112 42 -253 18 58 159 -98 -122 205 47 -249 79 -150 3 -120 -213 296 45 120 -95 275
3773 275 95 -262 -283 119 37 -249 -142 -184 195 -7 -110 202 -19 130 -184 95 200 -27 -233 116 177
3794 177 -129 266 -132 32 -31 224 132 -224 -264 59 -12 -141 11 -105 154 -4 -227 -117 178 16 -92
3815 -92 -91 142 29 -54 -60 30 97 -93 148 89 22 33 94 62 100 -212 146 365 194 84 -106 89 73 17 41 -27
3841 -27 -128 -67 130 -152 -81 -237 86 283 33 -80 91 -96 -96 85 107 127 -90 3 -27 -16 -75 -178 -60 -93
3865 -93 -9 -51 289 54 144 -62 -75 -84 -118 -178 82 50 -77 44 102 -154 -184 49 -84 76 -150 110 164 24
3889 24 -47 -137 109 67 -123 -201 211 -13 -304 -177 220 -150 -228 362 127 204 -52 118 359 -32 -224 -45
3911d5K64p5k05K83j05l27J33J52q5r2j13J63K90m86K70l7O9j26j71J85J12k96
3933b42L03j39L67k62j35M01l8j47j05j99r1J93Q4L9M2n5l41J67O2n2j92M46j3
3956I3m07L10n2k0O9K5o7j75K18n9M6l7m1J70N9M2k75R9o6J2J8j14L80j40Kk02
3982a12L17l31K49Q0j43J68l89oK73K99n11J69J1k70K43k09J59k15J16M1K41j30
4004E0j31Q2M0p7J43j24LJ89m07L24k77L10n8j14J33N2j9l81J86j71j64O05j06
4027H8j55N3K7P3l09K07J42j48l3l3J85j06J30o8j3m0P3o2j51J67R5k55L23k39
4051d9j09J25K31q9r3j43J38n5Q2p7NO9j49PK49k00r1L95p6j63l68L62J14O7l41
4076a59N9N8K04k29K00Q1j81l46K52l6L8j5J70j61J69j09RP8k78K68M6r4m9k7
$$ plain form
3911 -45 219 144 -61 222 117 -210 -77 75 -10 -102 -215 -52 238 -248 22 -15 54 -72 -243 -58 54 -242
3933 -242 61 -78 289 27 -108 293 255 108 3 -196 -287 -94 -10 29 71 16 -325 -158 -96 -148 -340 106 93
3956 93 -314 -4 -56 -76 -7 18 -49 -224 -6 -65 -19 -56 -97 73 132 174 -101 -2 -68 -56 -38 -152 228 88 90 -112
3982 -112 205 -126 123 203 60 228 -161 -167 106 405 -106 63 74 -196 47 -162 -3 -218 -102 -61 180 50
4004 50 -81 1 41 -36 107 -17 -14 175 -232 92 -185 125 67 -47 86 138 119 -262 -76 -247 -411 194 88
4027 88 -67 -14 13 86 -223 -16 126 -22 -55 -88 97 -9 121 53 40 0 73 11 -140 27 122 -133 190 -49
4051 -49 -158 -33 198 109 16 -127 11 -44 38 -39 -34 35 -114 -107 142 -58 -149 246 170 7 -361 1 115 182 -159
4076 -159 -100 -42 162 -67 133 214 33 -313 -61 -97 -59 -74 96 -65 104 -5 4 82 -196 72 118 24 -25 -52
4100e2M0J69j58j13J29J21l70K9L10Q4j25JJ43j12m17M87l92L75k80J99r8q6j1
4123a27Q4K67j40q2M1n9K49k78m6M15k18k82K95l00K52j65O9K17L9k08K26j90
4145E9l3j94n5L09j66j73j0K49J15j63k37J45L59j09j59J07n9k00K06Q3k77o7
4167b70J59K89k83J95q1J71k24j68M02k20kJ91j10j2j8j14K51%j54m4L76k98j7
4190A9p4%J77j53p4J60n6K9p2nL48k27k00K56p7O6m8j33Q1qK0J37j49k21J82K46
4216B24m3m12J90J88j12K62k74j31K18k0n0j89O2K63k05J36J99j52j24LL1k19
4238a55K84o5Rr5q1K35n00M27j19L9N3L3Q8q1j00j94J66p0L0oj7J13O3j92N7k9
4264a07J70k15K37q1p2o0J80lK41m77K83q7K1n0K11j72j37K7Q3J03j67j13J68
$$ plain form
4100 -52 -12 157 -1 -114 15 136 -234 -205 105 189 64 65 208 96 -321 166 -226 149 -131 68 -30 -116 -127
4123 -127 -43 224 84 2 43 -16 233 -45 -91 324 106 -176 119 -181 71 -94 -25 192 231 23 249 59
4145 59 26 -168 -223 86 -80 -253 -263 -14 101 -62 -299 -154 205 96 -63 44 -15 -215 -9 74 -203 -270
4167 -270 -111 178 -105 90 9 180 -44 -212 190 -30 -32 159 49 37 19 -95 156 156 2 -42 334 36 19
4190 19 -55 -55 122 -31 -105 55 -1 28 -44 -49 299 72 -128 128 51 117 69 -64 17 9 29 166 17 -204 -22 224
4216 224 181 -231 -41 147 35 297 23 -108 110 90 40 -149 -87 176 -29 107 306 154 30 33 64 -155
4238 -155 129 64 73 -22 -103 132 -368 59 -60 -21 32 65 153 72 -28 -222 -56 -126 -96 -102 -119 -6 57 -135 -78 -107
4264 -107 63 -152 85 4 -68 -128 52 49 290 -187 96 9 30 -20 191 19 -118 -91 -8 95 -72 -185 -17
4287a7Q9J09k21K18l92J79J05r8J20O5j38n5QO3K21l41L46j05l14K55j08J17k47
4310a41M7L2j25PM37k74J4q2J90N5l14K08j96J57j8N2j79j15L33o5J5M4n4j08
4334h0q3J56P1p5O8LP4j95p8R9r9K75j94q6N3J28L09k54j29J57k57r7O4P4K52
4359A56n80O7K19J43k21J27J92q4R8k37mQ6kk2o6J22j44O7L11k54M6J58l02J86
4383F2Nm2j52j00K20Q2j05K27k89P4J56j11jL8j43j9r7L11R1k68L37k09k3Q1j49
4408b4J50l58K80Pp8R7L2J7k44L22o0O3l02k31L56j66J55p9k3j12K04P6l81M1
4432b58J29j3J78J29j68j64j42M32k27n1J41Nk9J35J29k44J08j11O7J77k77P2
4454A8J8j89J60Jj00m2P8J55J27o9j71M2Q2l05N8J14k01R8K10k17K28L4j59J4
$$ plain form
4287 -17 72 181 -40 178 -214 -35 70 -28 92 157 19 -36 -28 35 256 -85 261 156 -158 97 -11 106 -141
4310 -141 -94 -62 -187 -180 257 -17 -3 -85 105 160 -154 54 -142 15 -3 49 -130 -245 88 23 38 82 28 -80
4334 -80 -163 -7 64 -11 57 60 134 -61 -139 -40 -139 136 -58 -144 -91 37 346 92 -37 120 -137 -234 -170 -96 156
4359 156 -424 -357 -138 5 -216 -89 103 19 117 -120 -124 -38 -40 -62 -128 -6 -150 -83 228 -26 20 178 -124 62
4383 62 67 25 -127 -227 -7 75 -30 197 -92 -18 138 27 26 64 -79 -98 -195 116 207 -61 276 67 44 125 -24
4408 -24 126 -232 48 55 -23 74 106 123 -121 201 141 204 -98 -329 27 -139 16 -63 -86 -198 6 82 -299 -258
4432 -258 -129 -142 36 165 -3 -167 -309 123 -104 -155 -14 -9 -38 97 226 -18 90 -21 46 223 -54 18
4454 18 36 -153 7 8 -92 -134 -56 99 226 157 -14 28 110 -195 -137 -23 -224 -126 84 -133 95 129 -30 -16
4478a6K03j89O8K68k97J82k03o9Q0J54k94k2L6m9K20Kj86J09j37O0q8RJ24K03
4502A68j75pJ5k84K09k14L84k23J08j27K1L30l22p7J2K99l14J90n4L56n3l91O8
4525h1J82k95J8J38J10q9o0O7kJ17l52L15j88l2Q3n4R9m3j1M6M4j63J13P7L06
4550C45l83O4j05R9j50J08J47M1k47L1J33o7J38J40k92k09K47L4L9n6j79J85j43
4573h0K01k67M26k49j51n5K88j02K20k81mK11r0K79l32M4R2j53L2n9K10j64k3
4596gJ64qj67J37m2o5P9j53Oj29K58K19j23n9k09J10J20n8j77K33ok51K34k5j63
4621h2J52k24J52K9k39P4J38J15l4n8jK24k14Q4J92m93K42m8J9n3j17J57k38K75
4645E2l86Q0N40l38K22k38J12J45j68j38q1J96k9k5q0J16q3M63l46J21k2k27K80
$$ plain form
4478 -16 187 -2 66 334 37 219 16 -53 27 181 -113 -135 -99 -148 72 74 -112 -3 -140 -80 -168 -159 -35 168
4502 168 -7 -14 1 -283 -74 -288 96 -127 -19 -146 -125 205 -117 -194 -182 117 -197 -7 -61 295 242 -149 -81
4525 -81 101 -194 -176 -38 72 -17 -77 -10 -12 105 -247 68 -120 -152 -69 -123 -24 -67 -78 -32 12 -151 -38 39 345
4550 345 -38 26 -79 20 -130 -22 125 166 -81 -50 83 16 154 294 2 -207 40 74 113 57 -122 63 -80
4573 -80 121 -146 280 31 -120 -175 113 11 231 -50 -54 157 67 346 14 58 150 -3 29 -30 180 16 -7
4596 -7 157 149 -18 119 77 12 91 -62 -56 -185 73 292 169 110 -99 11 131 73 -104 129 123 -128 106 81 -82
4621 -82 70 -154 -2 27 -212 -138 0 115 81 23 22 246 32 116 308 -185 57 9 28 -25 -142 15 -223 52
4645 52 -334 -254 286 -52 170 -68 44 189 21 -117 -198 -2 -31 -56 -136 -20 -103 360 14 135 113 -114 166
4668A66J20m20M2QJ18k1j32J35K33j14R4m5l61L18l38L18o3J01J25k47j62M51
4690C26m05K36k30J75j74K27p3O1Mk51L7m3r0K60l01K93j51K46p2n8j14N2J12
4713F7J41q8m9J92j63l42J42j13M80l18m3K80m0r0K42j16m27L91j41j27Q3L22
4735B83k32Lj27Q3l7kj12J61j18L6J34N5Mk19J46L4j97J75o4MK8n6k34L94P3l3
4761A82k78R8p8j99j2L16L67l33j73j17L22j01q4K8K02j24K83n26J81L3O5j36
4783h4k2J44J90q5j59oJ12n7L3n6k31J61L4N6%J75l05K55j31N2j16j51L97l57
4807a51J20o3KK05j98N2Qnj04K30k79J95J8l5K3M4J07J1j89j00J09j06J44J7K0
4832G5J82l59K5M0k1J89j7p1Q9j02K31k29l2K36l60J66O1l0rj19K09j92L41l25
$$ plain form
4668 166 286 -134 -92 -84 34 13 -119 16 249 135 229 184 -177 141 -197 121 58 159 284 37 -125 326
4690 326 -79 157 -73 102 -72 155 82 143 147 -104 -67 -110 -200 60 -241 52 -99 147 75 17 -97 -45 67
4713 67 208 120 71 263 100 -242 -100 -213 267 -51 -94 186 146 56 298 182 -245 146 5 -122 -39 283
4735 283 51 54 -73 10 -27 -29 -141 20 -98 -62 72 127 131 -88 58 92 -105 70 6 10 38 -18 -252 142 215 182
4761 182 -96 2 -76 -275 -287 29 396 63 -110 -227 95 -6 -90 -62 140 16 299 -227 -46 -13 52 -84
4783 -84 -106 38 228 143 -16 -22 90 33 66 10 -221 -60 -26 30 30 205 -100 155 24 76 -40 -191 206 -151
4807 -151 -31 -94 -92 113 -85 -33 -25 -30 -134 96 -183 12 30 -5 18 62 169 180 -9 -109 0 -106 38 55 75
4832 75 257 -102 -77 -37 -58 131 114 43 132 30 261 32 0 236 -124 42 103 73 64 -55 154 -38 303 -22
4856b2J56j33p1j1j1Q5O2j66J27j14M3J19r7L60k48k44K27p5J39j60k80L62O5
4879A13j37K9N9k5j59J81Qj78L7N5Q8NM7p7J17k15N8Q4j95K83l32J66n8J16lj6
4905E1N7rm66M23J74k65O1M4K49j99J2q4L8R6k58L29k64K6o9L3J68k75K2j23M03
4930A74o9k49L17Ok70J10P9j97J79k45L41q7j79K0K03P7j24l57K85J31l12O8J72
4953G3J3j62J34o6j41K43j18k4k3M7J13J80k49j40J31R5k6k59R9K13k98K79J64
4976B78l22r5M3J0N7L7l3J78o7k2Q8q0J00j46J53j30L5J95m33J66J9j22N9K23
5000A91j78m4p8N5M1M9j06Q8K84k33j71Q5P1P1k56K44j4j10k57K58J64k23L5J38
5024A04L3j48k83L59k8mr8K33j75q4J69j5J75k88J95r6L9O2j94L4q8pN1Q1Oj75
$$ plain form
4856 -22 134 1 -70 -81 -92 -7 55 -111 16 -98 -55 64 -33 327 79 -165 62 -13 126 -34 -314 48 113
4879 113 -24 5 64 39 -120 61 69 -109 -72 -17 71 76 123 46 163 -52 6 90 -105 178 -154 12 -46 70 67 51
4905 51 108 99 -367 56 230 -35 26 70 319 120 132 48 86 182 -76 253 -11 15 -54 -21 147 -128 -106 -229 174
4930 174 105 -144 173 179 -91 19 98 -99 80 -165 176 89 -90 -70 133 210 86 -271 14 145 -167 -99 73
4953 73 86 -76 58 -8 -149 94 -24 -48 -71 -24 89 269 20 -120 11 106 80 -179 -80 133 -165 114 278
4976 278 -44 -139 -96 -86 -29 8 -25 153 86 64 152 72 172 26 179 49 84 279 -154 12 31 -91 -32 191
5000 191 13 -31 -109 -54 -13 36 -70 18 302 69 -102 -17 54 125 -131 113 99 -11 -268 -10 154 -69 -34 104
5024 104 137 -11 -294 65 37 33 -65 168 -7 -91 78 63 238 -50 145 49 88 150 -44 -10 -98 -105 -54 27 33 -142
5050a42M22l18m3J21k87M49p6k14K04l29K99k36J10J48k18J8K6J48l4K1j05J16
5072H0Q3l01l4J98j93J95mJ52k24J28M3K6j39m6L45k1k32k42R4J35j86j9L04p7
5096F5k41M9Q2NLqK56j2l18k04N55j01n6l10P3J45j3j10K02Q3P8k33L76l74j00
5121a08L85j15p8k99Q3K06Q0j94o1J59p3n4Q3J9n0j80J33R0p0Q8oJ75k28j27L03
5146A61k44M9K2P4L02k90k8J13N8j84l0k22K61m9j41J13P6q6J5J65l49j11J88
5169a37J62P1J12k93R1J40j60m0o3K57k00j66L10p0l09L19J23j96K36k32R8O1
5191A14o4J3k3O7k52K91Q1k74Lj34K92l7j17k18L85J41l25Oq6k3J72k45J95M84
5215D46m79m3L21j57k03Q8P7j10j18L6K4J70k19j28M99j24j16j04M01m33N0J9
$$ plain form
5050 -142 280 -38 -81 40 -247 202 126 -88 116 -213 86 -150 -40 108 -110 -92 -66 82 48 69 -36 80
5072 80 163 -138 -172 26 -167 28 24 176 -48 80 123 149 10 -36 309 288 56 -186 -92 43 -143 -162 142 65
5096 65 -176 -127 -45 -40 -37 -45 211 199 -119 -323 232 131 75 -235 -162 -17 -30 -140 62 145 223 -10 366 -8 -108
5121 -108 277 162 84 -215 -132 74 154 -40 -101 58 -15 -69 14 33 -17 -197 -64 26 -44 44 38 213 -15 -142 161
5146 161 -83 -34 -12 62 364 74 46 159 217 33 3 -219 42 -7 -148 -35 41 -45 -30 135 -214 -325 -137
5169 -137 25 96 208 -85 6 146 -14 -54 -117 140 -60 -226 84 14 -295 24 147 -49 187 -45 53 114
5191 114 50 63 40 107 -145 146 227 -47 -44 -178 114 77 -40 -258 127 268 -57 -51 -137 -160 12 -233 -38 446
5215 446 -33 -76 245 88 -115 -27 50 -60 -178 -142 -118 52 -167 -295 204 80 -36 -140 261 -172 -122 -103
5237a03j14Q0o4N9J53J2l14K87N7j6j97O9K70j94p7J26rRl34K83J16J08j95J33
5261A45j57l6J4K29k54O1%k85M02k77P5RJ86j95P5j51J36k13J22J48R6j29j50
5284a49J31l7n%O0K5n7n9L52k37LM3M9k61o7M9J80Q6m41K46O1o3j74L34pR3j46
5311Ij5N6j06q6J31K04l84K78o9j24j47O7J26P3QJ23j34j2J00j54l4K15R1l38
5335a22j38L00k02k25K98p5o4L55J12j68M5j83L1r9K70j90K00k8j24k95L06J25
5357A29m18L17J28j7l96J07K21j27%k40L42p4q4J59j69OO3j41K09q0M2Q1M5Oj33
5382b4q3L30j26j52m2R6J92j73l91M22r9J41j66J00K23l49o8K20j93k2K23K0m4
5405C5k56l1K82j65R0KN9j22j03K27nR4k08k22L38o2J28j71K03J36m11L53Q8l20
$$ plain form
5237 -103 -217 -137 -201 -142 11 23 -291 -4 53 37 -160 -91 179 -15 -92 34 25 34 -300 -17 99 207 12 145
5261 145 -12 -48 -34 195 -59 2 2 -283 119 -158 -83 -74 112 -83 -8 -159 -23 -236 -114 34 130 1 -149
5284 -149 -18 -55 -60 -60 0 25 -32 -91 261 24 27 70 119 -142 -209 -160 20 106 -335 -89 -28 -91 -265 69 62 155 9
5311 9 -6 50 -56 -142 -11 193 -191 87 18 -106 -253 -186 -60 13 21 144 10 -2 98 -56 -90 125 216 -122
5335 -122 -260 40 -162 -387 -89 -164 -228 127 239 71 116 -67 -36 -135 135 -55 145 117 -7 -302 4 129
5357 129 -289 28 156 139 -257 -150 71 -56 -56 -296 46 -28 -112 47 -122 -116 -53 -194 15 -65 -23 58 103 109 -24
5382 -24 -107 223 97 -55 -97 -1 191 18 -373 49 -50 91 -75 25 248 -101 -169 51 -142 -164 59 79 35
5405 35 -221 -252 30 -135 -45 -43 16 -106 -209 18 13 107 -101 -323 15 -47 81 -90 113 249 -162 191 279 -41
5429d1J49k11J24%j74L54k4k17m1l9J67N7k86J27J00M9j66L26j10k10R2J88l6
5452A78j71j21L96J5k01k50J20J74m73K51L9p0L7j94K35J60j62j54L93j78l44
5473c20J08L12q9l8rK6Q5j56N5Q4l9n4qJ38m11J67L1J76k8p3O8J05p9j67k30N67
$$ plain form
5429 -41 108 -103 21 21 -153 201 177 -40 -81 -120 47 104 -182 -55 45 94 -72 254 144 -66 26 214 178
5452 178 7 -114 282 297 96 -154 -34 140 -333 -82 -43 -113 -76 -270 -35 125 -37 -191 202 24 -320
5473 -320 -212 100 11 -27 -36 -10 75 -81 -26 58 19 -35 -43 95 -316 -149 -118 58 30 -43 25 130 51 -116 -346 221
$$ [...]
8191A
##END NTUPLES=NMR FID
##END=
