##TITLE=1H_Pr Am-Kol
 CDCl3, 40 sc, 
 13.3.2019
##JCAMPDX= 6.0         $$ Bruker NMR JCAMP-DX V2.0
##DATA TYPE= NMR FID
##DATA CLASS= NTUPLES
##ORIGIN= UXNMR, Bruker Analytische Messtechnik GmbH
##OWNER= root
$$ XWIN-NMR		Version 3.5
$$ Wed Mar 13 18:09:34 2019 Russian Standard Time (UT+4h)  she@DPX200
##.OBSERVE FREQUENCY= 200.1315
##.OBSERVE NUCLEUS= ^1H
##.DELAY= (6, 6)
##.ACQUISITION MODE= SIMULTANEOUS
##.ACQUISITION SCHEME= undefined
##.AVERAGES= 40
##.DIGITISER RES= 18
##SPECTROMETER/DATA SYSTEM= spect
##.PULSE SEQUENCE= zg30
##.SOLVENT NAME= CDCl3
##.SHIFT REFERENCE= (INTERNAL, CDCl3, 0, 15.7039)
##AUDIT TRAIL= $$ (NUMBER, WHEN, WHO, WHERE, WHAT)
$$ ##TITLE= Audit trail, XWIN-NMR		Version 3.5
$$ ##JCAMPDX= 5.01
$$ ##ORIGIN= Bruker BioSpin GmbH
$$ ##OWNER= she
$$ F:/spectra/data/she/nmr/H-F/1/audita.txt
$$ ##AUDIT TRAIL=  $$ (NUMBER, WHEN, WHO, WHERE, WHAT)
(   1,<2019-03-13 18:07:00.85 +0400>,<she>,<DPX200>,
      <continue with go, POWCHK disabled, PULCHK disabled
       configuration hash MD5:
       00 E9 B6 7A A2 85 ED C7 34 08 36 98 17 FE 4E 26
       data hash MD5: 16K
       C1 EC 2A A7 B4 AC 15 6C DB EA AA 72 BD 40 1F D3>)
$$ ##END=
$$ 
$$ hash MD5
$$ 00 D9 82 D3 00 DC B7 CE AA E9 3F 52 11 1A 80 41
##$RELAX= 
##$RELAX= 
##$RELAX= 
##$RELAX= 
##$RELAX= 
##$RELAX= 
$$ Bruker specific parameters
$$ --------------------------
##$DU= <F:/spectra>
##$EXPNO= 1
##$NAME= <H-F>
##$PROCNO= 1
##$TYPE= <nmr>
##$USER= <she>
##$AMP= (0..31)
100 100 100 100 100 100 100 100 100 100 100 100 100 100 100 100 100 100 
100 100 100 100 100 100 100 100 100 100 100 100 100 100 
##$AQSEQ= 0
##$AQ_mod= 1
##$AUNM= <au_zg>
##$AUTOPOS= <>
##$BF1= 200.13
##$BF2= 200.13
##$BF3= 200.13
##$BF4= 200.13
##$BF5= 200.13
##$BF6= 200.13
##$BF7= 200.13
##$BF8= 200.13
##$BYTORDA= 1
##$CFDGTYP= 0
##$CFRGTYP= 5
##$CHEMSTR= <none>
##$CNST= (0..31)
1 1 145 1 1 1 1 1 1 1 1 1 1 1 1 1 1 1 1 1 1 1 1 1 1 1 1 1 1 1 1 1 
##$CPDPRG= <>
##$CPDPRG1= <>
##$CPDPRG2= <>
##$CPDPRG3= <>
##$CPDPRG4= <mlev>
##$CPDPRG5= <mlev>
##$CPDPRG6= <mlev>
##$CPDPRG7= <mlev>
##$CPDPRG8= <mlev>
##$CPDPRGB= <>
##$CPDPRGT= <>
##$D= (0..31)
0 1.2 0 0 0 0 0 0 0 0 0 0.03 0 0 0 0 0 0 0 0 0 0 0 0 0 0 0 0 0 0 0 0 
##$DATE= 1552485859
##$DBL= (0..7)
120 120 120 120 120 120 120 120 
##$DBP= (0..7)
150 150 150 150 150 150 150 150 
##$DBP07= 0
##$DBPNAM0= <>
##$DBPNAM1= <>
##$DBPNAM2= <>
##$DBPNAM3= <>
##$DBPNAM4= <>
##$DBPNAM5= <>
##$DBPNAM6= <>
##$DBPNAM7= <>
##$DBPOAL= (0..7)
0.5 0.5 0.5 0.5 0.5 0.5 0.5 0.5 
##$DBPOFFS= (0..7)
0 0 0 0 0 0 0 0 
##$DE= 6
##$DECBNUC= <off>
##$DECIM= 24
##$DECNUC= <off>
##$DECSTAT= 4
##$DIGMOD= 1
##$DIGTYP= 9
##$DL= (0..7)
0 120 120 120 120 120 120 120 
##$DP= (0..7)
150 150 150 150 150 150 150 150 
##$DP07= 0
##$DPNAME0= <>
##$DPNAME1= <>
##$DPNAME2= <>
##$DPNAME3= <>
##$DPNAME4= <>
##$DPNAME5= <>
##$DPNAME6= <>
##$DPNAME7= <>
##$DPOAL= (0..7)
0.5 0.5 0.5 0.5 0.5 0.5 0.5 0.5 
##$DPOFFS= (0..7)
0 0 0 0 0 0 0 0 
##$DQDMODE= 0
##$DR= 18
##$DS= 0
##$DSLIST= <SSSSSSSSSSSSSSS>
$$ [...]
##$SUBNAM2= <"">
##$SUBNAM3= <"">
##$SUBNAM4= <"">
##$SUBNAM5= <"">
##$SUBNAM6= <"">
##$SUBNAM7= <"">
##$SUBNAM8= <"">
##$SUBNAM9= <"">
##$SW= 24.9337058887773
##$SWIBOX= (0..15)
0 0 2 0 0 0 0 0 0 0 0 0 0 0 0 0 
##$SW_h= 4990.01996007984
##$TD= 16384
##$TD0= 1
##$TE= 0
##$TE2= 300
##$TE3= 300
##$TEG= 300
##$TL= (0..7)
0 120 120 120 120 120 120 120 
##$TP= (0..7)
150 150 150 150 150 150 150 150 
##$TP07= 0
##$TPNAME0= <>
##$TPNAME1= <>
##$TPNAME2= <>
##$TPNAME3= <>
##$TPNAME4= <>
##$TPNAME5= <>
##$TPNAME6= <>
##$TPNAME7= <>
##$TPOAL= (0..7)
0.5 0.5 0.5 0.5 0.5 0.5 0.5 0.5 
##$TPOFFS= (0..7)
0 0 0 0 0 0 0 0 
##$TUNHIN= 0
##$TUNHOUT= 0
##$TUNXOUT= 0
##$USERA1= <user>
##$USERA2= <user>
##$USERA3= <user>
##$USERA4= <user>
##$USERA5= <user>
##$V9= 5
##$VALIST= <valist>
##$VCLIST= <CCCCCCCCCCCCCCC>
##$VD= 0
##$VDLIST= <DDDDDDDDDDDDDDD>
##$VPLIST= <PPPPPPPPPPPPPPP>
##$VTLIST= <TTTTTTTTTTTTTTT>
##$WBST= 1024
##$WBSW= 4
##$XGAIN= (0..3)
0 0 0 0 
##$XL= 0
##$YL= 0
##$YMAX_a= 664731
##$YMIN_a= -860640
##$ZGOPTNS= <>
##$ZL1= 120
##$ZL2= 120
##$ZL3= 120
##$ZL4= 120
##$ABSF1= 10
##$ABSF2= 0
##$ABSG= 5
##$ABSL= 3
##$ALPHA= 0
##$AQORDER= 0
##$ASSFAC= 0
##$ASSFACI= 0
##$ASSFACX= 0
##$ASSWID= 0
##$AUNMP= <proc_1d>
##$AZFE= 0.1
##$AZFW= 0.1
##$BCFW= 1
##$BC_mod= 2
##$BYTORDP= 1
##$COROFFS= 0
##$CY= 11.3945322036743
##$DATMOD= 1
##$DC= 2
##$DFILT= <>
##$DTYPP= 0
##$F1P= 18.9103706918063
##$F2P= -1.10871071338519
##$FCOR= 0.5
##$FTSIZE= 0
##$FT_mod= 4
##$GAMMA= 1
##$GB= 0.15
##$INTBC= 1
##$INTSCL= 1
##$ISEN= 128
##$LB= 0.24
##$LEV0= 0
##$LPBIN= 0
##$MAXI= 10000
##$MC2= 0
##$MEAN= 0
##$ME_mod= 0
##$MI= 1.114404
##$NCOEF= 0
##$NC_proc= 0
##$NLEV= 6
##$NOISF1= 3.799351
##$NOISF2= 2.8
##$NSP= 1
##$NTH_PI= 0
##$NZP= 0
##$OFFSET= 15.70392
##$PC= 1
##$PHC0= -9213.903
##$PHC1= 9.000262
##$PH_mod= 1
##$PKNL= yes
##$PPARMOD= 0
##$PSCAL= 0
##$PSIGN= 0
##$REVERSE= no
##$SF= 200.130013532006
##$SI= 16384
##$SIGF1= 3
##$SIGF2= 2
##$SINO= 400
##$SIOLD= 16384
##$SREGLST= <1H.CDCl3>
##$SSB= 0
##$STSI= 0
##$STSR= 0
##$SW_p= 3612.71676300578
##$SYMM= 0
##$S_DEV= 0
##$TDeff= 0
##$TDoff= 0
##$TI= <>
##$TILT= no
##$TM1= 0
##$TM2= 0
##$TOPLEV= 0
##$USERP1= <user>
##$USERP2= <user>
##$USERP3= <user>
##$USERP4= <user>
##$USERP5= <user>
##$WDW= 1
##$XDIM= 8192
##$YMAX_p= 0
##$YMIN_p= 0
$$ End of Bruker specific parameters
$$ ---------------------------------
##NTUPLES= NMR FID
##VAR_NAME=  TIME,          FID/REAL,        FID/IMAG
##SYMBOL=    X,             R,               I
##VAR_TYPE=  INDEPENDENT,   DEPENDENT,       DEPENDENT
##VAR_FORM=  AFFN,          ASDF,            ASDF
##VAR_DIM=   8192,          8192,            8192
##UNITS=     SECONDS,       ARBITRARY UNITS, ARBITRARY UNITS
##FACTOR=    0.0002004,     1,               1
##FIRST=     0,             0,               0
##LAST=      1.6414764,     0,               0
##MIN=       0,             -860640,         0
##MAX=       1.6414764,     664731,          0
$$ Real data points
##PAGE= N=1
##DATA TABLE= (X++(R..R)), XYDATA
0@%%%%%%%m0Q0q0Q2j22J60j95K37k82L59m07M67n80O83p87R08j047J218j408J609
27H55j825K069k352K666k996L352l754M204m694N224n802O443p154P933q780R712
43E101j0755J1925j3213J4651j6288J8154k0312K2837k5811K9394l3835L9498
55B1346m6985N7396p3005R9320j54834M75305o58173m05527J255886m62575n26871
66d18717P89045n3471r82883P09632N86838j000252k4235J047620o36455o60302
76f43180J007507J10105j066132N02507O87498q66876p9612R23340o20966o49183
86f94992J069200J75249j132726L69482P58813p72971j30489R14390n11448o90603
96f46095R28396J75178j016979M35292P42933r11543k39429J052878l27121q03622
$$ plain form
0 0 0 0 0 0 0 0 0 -40 40 -40 42 -80 80 -115 122 -160 199 -208 259 -321 362 -425 483 -564 654 -754 855
27 855 -970 1099 -1253 1413 -1583 1769 -1985 2219 -2475 2749 -3053 3390 -3764 4169 -4611 5101
43 5101 -5654 6271 -6942 7709 -8579 9575 -10737 12100 -13711 15683 -18152 21346
55 21346 -25639 31757 -41248 58072 -96762 378543 -279630 -685157 570729 108154 -418717
66 -418717 370328 316857 -666026 43606 630444 -369808 -394043 653577 17122 -643180
76 -643180 364327 474432 -591700 -89193 598305 -268571 -348183 575157 -45809 -694992
86 -694992 374208 549457 -583269 -213787 545026 -227945 -358434 555956 44508 -646095
96 -646095 282301 457479 -559500 -124208 618725 -292818 -532247 520631 193510 -610112
106f10112P51021K60812q85661L89890O99375q82376k58782J027408k99241p83018
116e90684P76278K56056j002934L27917Q58723p63829l78699R26776k42219p56287
126e88902P70210L19465r96416K42524Q56842p17669m15803R10045j81178p56141
136e57023P19642L31456r94580K12488Q91508o72798m32341R27191j76048q73894
146f24399O79804N13133q95043M9306P63708o10170l63556R39423j57444q94314
156e99552O43804N20554r11078L0303Q62233n40730m90030Q40938o5853q36297
166e45708N80191N19924q68591o29Q42087n24535n16337Q51266K2004q43882M86652
177B442N21619q23235j4157Q54918m98845n77215Q25940R1583q57570M15367N78699
$$ plain form
106 -610112 140909 401721 -483940 -94050 605325 -277051 -535833 491575 192334 -590684
116 -590684 185594 441650 -561284 -233367 625356 -138473 -517172 409604 167385 -588902
126 -588902 181308 500773 -495643 -253119 603723 -113946 -529749 380296 199118 -557023
136 -557023 162619 494075 -500505 -288017 603491 -69307 -501648 425543 249495 -624399
146 -624399 55405 568538 -326505 -277199 486509 -123661 -487217 452206 294762 -599552
156 -599552 44252 564806 -346272 -315969 546264 5534 -484496 356442 290589 -545708
166 -545708 34483 554407 -314184 -314813 527274 2739 -513598 337668 359672 -484210 2442
177 2442 524061 -299174 -313331 541587 42742 -534473 291467 383050 -474520 -59153 519546
188E19546p55003r1021Q13838m19973n56406P69435P8871q45000M32915O11881
198E59083p87901j64444Q47513l53348o09092P42606J66595q46675L27675O22433
208E04445p03630j62648Q25938l48907o45815P17004K06736q35967L08601O59621
218E25378p00608k44640Q14484k72887o29801P06887K36669q74999K26370O99166
228D86019o13924k65964P83991k53083o68632O50705K85511q05743K22622O79868
238E01370o48263l15266Q30561j60916p08790N79890L36932p79753J38552O74200
248D48517n59195l12932P74757j60729p04459N71275L74936p66078J01038O90369
258D57499n34606l67848P64330q6245p07236N08371L89794p46238O0108P14657
$$ plain form
188 519546 -235457 -326478 487360 67387 -489019 280416 359287 -485713 -52798 559083
198 559083 -228818 -393262 454251 100903 -508189 234417 401012 -445663 -117988 504445
208 504445 -199185 -361833 464105 115198 -530617 186387 393123 -442844 -134243 525378
218 525378 -175230 -419870 394614 121727 -508074 198813 435482 -439517 -213147 486019
228 486019 -127905 -393869 390122 137039 -531593 119112 404623 -401120 -178498 501370
238 501370 -146893 -462159 368402 207486 -501304 78586 415518 -364235 -225683 448517
248 448517 -110678 -423610 351147 190418 -514041 57234 432170 -333908 -232870 457499
258 457499 -77107 -444955 319375 233130 -474106 34265 424059 -322179 -262071 452586
268D52586m74564m14648P09150l4780o73077M76749L93925p37203L1932P22376
278D52446m52484m37564P15274l510p26481M29432M77794o79391m4169O80620
288D11967m05154m31319P02673K7708p26884L96330M78318o85297o3457P25014
298D29899l69227m91536O69211P7508p28569L57648N22586o45054j12989O96695
308D06172l42907n04793O62287J34088p22960K90439N03234o22991j04918P33150
318D30801l20258n67187O24754J85434p07103K61608N42832n96792j90028O95312
328C59373k40833n36675N80678J81046p02864K37515N58765n74516k09692P06445
338C59242k09742n79968N43346K38343o79578J83781N67009n36125k52772O79138
$$ plain form
268 452586 -21978 -436626 272524 237744 -435333 41416 435341 -301862 -269930 452446
278 452446 -38 -437602 277672 274162 -452319 -22887 454907 -224484 -268653 411967
288 411967 6813 -424506 278167 305875 -421009 -24679 453639 -231658 -295115 429899
298 429899 60672 -430864 238347 315855 -412714 -55066 467520 -177534 -290523 406172
308 406172 63265 -441528 220759 354847 -368113 -77674 425560 -197431 -302349 430801
318 430801 110543 -456644 168110 353544 -353559 -91951 450881 -145911 -335939 359373
328 359373 118540 -418135 162543 343589 -359275 -121760 437005 -137511 -347203 359242
338 359242 149500 -430468 112878 351221 -328357 -144576 422433 -113692 -366464 312674
348C12674j55705n70311N04257K52184o69076J54997N85380n00055k79460O60139
358B95024j37541n89196N00839L08638o75752P9806N94501m42604k99975O44716
368B78456r4362n99702M46829L23036o37250P9851O01761m54187l46442O54821
378B52811m1956o17995M19172L62340o39101J9355O17605l90916l60609O24768
388B45474k1974o26337L87959L91420o08932j895O11883l89243l96572O31058
398B22841L5704o31544L47398M08709o05561m4560O40826l23256m30785N71750
408A91522O1329o11019L24948M24498n80883p6008O22259l05325m36852N80562
418A95031J01724o36681K68587M59929n39388j17655O14949k57537m62078N27727
$$ plain form
348 312674 156969 -413342 90915 343099 -325977 -170980 414400 -85655 -365115 295024
358 295024 157483 -431713 69126 377764 -297988 -218182 376319 -66285 -366260 278456
368 278456 184094 -415608 31221 354257 -282993 -203142 398619 -55568 -402010 252811
378 252811 210855 -407140 12032 374372 -264729 -245374 372231 -18685 -379294 245474
388 245474 223500 -402837 -14878 376542 -232390 -234285 377598 -11645 -408217 222841
398 222841 258545 -372999 -25601 383108 -222453 -267013 373813 50557 -380228 191522
408 191522 252851 -358168 -33220 391278 -189605 -265613 356646 51321 -385531 195031
418 195031 296755 -339926 -71339 388590 -150798 -268453 346496 88959 -373119 154608
428A54608J33499o02593K47559M60331n31143j49084O15155k18648m71168N14003
438A52519J59920o20842K01664M94846m88473j87494N97408j85059m93489M82386
448A13386K04965n92391J63546M83340m77183j98855O11052j55841n18167M56948
458I0800K29897o03187J35662N29217m44410k59962N83761j09810n12193M34787
468G4562K57008n92443R5144N22429m20732k62908N92772r1707n48493M07512
478C3144K96166n79413O4749N43634l96604l13425N74611l2952n38817L68047
488A9140L04414n64418L2190N44652l58763l20109N58799k3052n59428L51978
498a4597L53074n46977j3630N45686l27570l53751N40229L7129n44322K93935
$$ plain form
428 154608 288107 -314486 -66927 393404 -137739 -286823 328332 109684 -361484 152519
438 152519 312439 -308403 -106739 388107 -100366 -287860 309548 124489 -369000 113386
448 113386 318351 -274040 -110494 372846 -104337 -303192 307860 152019 -366148 90800
458 90800 320697 -282490 -146828 382389 -62021 -321983 261778 151968 -360225 74562
468 74562 331570 -260873 -165729 356700 -64032 -326940 265832 174125 -374368 33144
478 33144 329310 -250103 -185354 358280 -38324 -351749 222862 189910 -348907 19140
488 19140 323554 -240864 -208674 335978 -22785 -342894 215905 192853 -366575 -14597
498 -14597 338477 -208500 -222130 323556 -4014 -357765 182464 219593 -324729 -30794
508c0794L45903n20989k5623N54940k96949l76989N11436N5428n44593K87742
518d0488L87385n15573q8345N48727k44082l84175M89124Q8491n48326K36403
528g0859L98907m74046r7743N43785k34090m08670M78061J20473n47318K16890
538g4610M23455m71528j46486N50665j83999m26670M50729J51656n46478J73757
548i9509M36995m31779j56997N36040j81293m47095M50868J93850n50287J37132
558a12075M48531m23030j88733N51867j29687m71478M00054K13658n26257J21120
568a16030M61246m04500k23687N32247j01615m65591L92103K30712n37449Q4629
578a47935M85402l71800k56441N22572o0107m80732L44941K58984n01488N7586
$$ plain form
508 -30794 315109 -205880 -231503 323437 26488 -350501 160935 216363 -328230 -40488
518 -40488 346897 -168676 -257021 291706 47624 -336551 152573 241064 -307262 -70859
528 -70859 328048 -145998 -243741 300044 65954 -342716 135345 255818 -291500 -74610
538 -74610 348845 -122683 -269169 281496 97497 -329173 121556 273212 -273266 -99509
548 -99509 337486 -94293 -251290 284750 103457 -343638 107230 301080 -249207 -112075
558 -112075 336456 -86574 -275307 276560 146873 -324605 75449 289107 -237150 -116030
568 -116030 345216 -59284 -282971 249276 147661 -317930 74173 304885 -232564 -147935
578 -147935 337467 -34333 -290774 231798 171691 -309041 35900 294884 -206604 -149018
588a49018M74646l51837k77039N08297l0191m75146L28968K73152n10206K1356
598a87018M98067l07318l00763M83190l637m89289K94274L13079m71160j8323
608a88898M71076k86513l04470M82943K4889m96974K67224L25891m67387m1921
618b14140M99536k54417l45665M52861N9278m88116K45864L48073m55091q1476
628b33293M91034k18664l45093M42237P3016n00025K24780L70406m44031j03760
638b43393N06679j98640l85734M23896J22757m90086J86954L77490m22259j26567
648b48903M97988j71457l86404M12870J35320n03261J62103M05664l95554j53199
658b44833M89996j55991m11716M03961J90610m93294J04689L98739l61800j61826
$$ plain form
588 -149018 325628 -26209 -303248 205049 174858 -300288 28680 301832 -208374 -187018
598 -187018 311049 3731 -297032 186158 182521 -306768 -12494 300585 -170575 -188898
608 -188898 282178 -4335 -308805 174138 199027 -297947 -30723 295168 -172219 -214140
618 -214140 285396 30979 -314686 138175 197453 -290663 -44799 303274 -151817 -233293
628 -233293 257741 39077 -306016 136221 209237 -290788 -66008 304398 -139633 -243393
638 -243393 263286 64646 -321088 102808 225565 -264521 -77567 299923 -122336 -248903
648 -248903 249085 77628 -308776 104094 239414 -263847 -101744 303920 -91634 -244833
658 -244833 245163 89172 -322544 81417 272027 -221267 -116578 282161 -79639 -241465
668b41465M84350j23943m21134L66269J95380m77549J03847M21615l59168k12844
678b64642M80078p1948m22880L31925K15640m69087P0721M30436l26445k34893
688b61095M61158m2979m23930L02946K25875m53537O0746M42399l21561k72990
698b82968M60869O15m30484K76172K47545m49834J5905M48828k72005k73842M32073
709A72874o927m40966K81082K90709m46781l0667M45238k48688k83998M37265
719A69141K4073m65689K42306L16706m21351n5713M46917k22834l05140M13381
729A41797M4106m53665K32923L28930m24714q2962M58950k01111l29248M09289
739A24295Q5234m65164J85587L43597l91383r5252M54594j82550l52863L84769
$$ plain form
668 -241465 242885 118942 -302192 64077 259457 -218092 -114245 307370 -51798 -264642
678 -264642 215436 143488 -279392 52533 268173 -200914 -130193 300243 -26202 -261095
688 -261095 200063 157084 -266846 36100 261975 -191562 -130816 311583 -9978 -282968
698 -282968 177901 178516 -251968 24204 271749 -178085 -162180 286648 14643 -259199 172874
709 172874 165947 -275019 6063 296772 -150009 -180676 264562 15874 -268124 169141
719 169141 193214 -272475 -30169 286537 -134814 -190527 256390 33556 -271584 141797
729 141797 185903 -267762 -34839 294091 -130623 -213585 245365 44254 -284994 124295
739 124295 209529 -255635 -70048 273549 -117834 -213086 241508 58958 -293905 90864
749I0864J18436m42344J62662L38653l87390j15797M67055j49222l73052L61630
759G1495J43231m42907J30833L64061l51014j47522M38490j25258l66457L51288
769F6240J62716m45242J01585L73852l30690j67102M40711r6083l84927L23261
779D4321J86414m34641Q2245L93805l13347k09933M22549n3668l70950L02876
789D9671J85445m37643O6088M10512k97277k24804M26427l8029m02496K81118
799A9012K31459m18586L1121M05486k79271k44636M19339p075m00527K62860K39595
810B58777m22482O186M20363k46948k55987M05023m167m20566K57814K84405m10320
821a27902m1246M10635k19402k64093L98769K6583m25741K20800K89468l89134
$$ plain form
749 90864 209300 -233044 -70382 268271 -119119 -234916 232139 82917 -290135 71495
759 71495 214726 -228181 -97348 266713 -84301 -231823 206667 81409 -285048 66240
769 66240 228956 -216286 -114701 259151 -71539 -238641 202070 105987 -278940 44321
779 44321 230735 -203906 -121661 272144 -41203 -251136 171413 117745 -253205 49671
789 49671 235116 -202527 -136439 274073 -23204 -248008 178419 140390 -262106 19012
799 19012 250471 -168115 -136994 268492 -10779 -255415 163924 156849 -243678 19182 258777
810 258777 -163705 -157519 262844 15896 -240091 164932 160765 -259801 -1987 282418 -127902
821 -127902 -169148 241487 22085 -242008 156761 183344 -242397 -21597 267871 -121263
831a21263m6374M15687k11663k91560L89859O0032m26779J91631L08505l71642
841a03567p8545M13260j78044l05392L65821Q4062m16216J65748L10355l57136
851i9654r0233M18024j64891l29225L53007J20018m10024J35532L17342l45393
861i5497j17055M25529j22054l42873L14787J29611l99798J26956L39011l31484
871g2867j48784M08133j06018l39946L26298J51874m24549Q8538L61932k98856
881e4245j69484M02051q0478l53874K97476J68450m07178P9214L70472k94576
891d2172j96165M00664n8745l61055K94113J96583m15791L7696L78196k62436
901b9112k00972L97063m3094l83683K64517K25914l88115K2547L69968k60078
$$ plain form
831 -121263 -167637 248050 36387 -255173 134686 194718 -232061 -40430 268075 -103567
841 -103567 -182112 231148 53104 -252288 113533 197595 -218621 -52873 257482 -99654
851 -99654 -189887 228137 63246 -265979 87028 207046 -202978 -67446 249896 -95497
861 -95497 -212552 212977 90923 -251950 62837 192448 -207350 -80394 258617 -72867
871 -72867 -221651 186482 80464 -259482 66816 218690 -205859 -117321 244611 -54245
881 -54245 -223729 178322 97844 -256030 41446 209896 -197282 -118068 252404 -42172
891 -42172 -238337 162327 103582 -257473 36640 233223 -182568 -144872 233324 -29112
901 -29112 -230084 166979 123885 -259798 4719 230633 -157482 -134935 235033 -25045
911b5045k17221M00115j3968l91677K44011K41594l84864m999L87080k27925k47759
922b40658L76098J8897l81034K17322K45416l69833k0396L87297k11490k60180
932b38561L69353L8320l90984J95676K70949l57209m9162L89731j85607k80318
942b37812L47831O7575l79742J74089K76497l52336p4204L93766j54250k83440
952b22026L32121P0549l94953J63394L10694l31530j06491L82569j40946l00307
962b36926L29974J09118l89562J25222L03821l19681j09730L93453j22985l18584
972b35880L15767J23184l98962J11738L34709l01000j44102L81214j04520l27481
982b45333L07550J54328l91684P8982L27849k90049j46843L91941q3627l48191
$$ plain form
911 -25045 -242266 157849 143881 -247796 -3785 237809 -147055 -152054 235026 7101 -240658
922 -240658 135440 154337 -226697 -9375 236041 -133792 -154188 233109 21619 -238561
932 -238561 130792 169112 -221872 -26196 244753 -112456 -161618 228113 42506 -237812
942 -237812 110019 177594 -202148 -28059 248438 -103898 -178102 215664 61414 -222026
952 -222026 110095 180644 -214309 -50915 259779 -71751 -178242 204327 63381 -236926
962 -236926 93048 202166 -187396 -62174 241647 -78034 -187764 205689 82704 -235880
972 -235880 79887 203071 -195891 -84153 250556 -50444 -194546 186668 82148 -245333
982 -245333 62217 216545 -175139 -96157 231692 -58357 -205200 186741 103114 -245077
992b45077K83477J69857l83921O9411L44697k81016j82125L86717m7934l51611
1002b37525K57969J87316l71771M3719L46745k57710j94339L75135l2194l53909
1012b36564K47862K04267l73449J6766L60575k32348k16618L62726k976l56809
1022b26568K17992K18951l55284Q6L64888k15803k36009L46832J6577l55255K13092
1033a0501K40472l59449l7917L68584j84164k40153L44491L3634l76841J80143
1043d1701K64045l27587m8798L60724j80377k61761L39824O1832l72176J69278
1053c6697K72321l35513p6051L76165j49425k75773L25716Q0682l80520J39886
1063e9209K89687l07745q6868L68710j45751k94951L19202J11281l73759J21702
$$ plain form
992 -245077 38400 208257 -175664 -106253 238444 -42572 -224697 162020 114086 -237525
1002 -237525 20444 207760 -164011 -120292 226453 -31257 -225596 149539 117345 -236564
1012 -236564 11298 215565 -157884 -141118 219457 -12891 -229509 133217 130241 -226568
1022 -226568 -8576 210375 -144909 -144823 220065 4262 -231747 115085 131662 -223593 -10501
1033 -10501 229971 -129478 -167395 201189 17025 -223128 121363 154997 -221844 -41701
1043 -41701 222344 -105243 -154041 206683 26306 -235455 104369 166201 -205975 -36697
1053 -36697 235624 -99889 -175940 200225 50800 -224973 100743 181425 -199095 -59209
1063 -59209 230478 -77267 -164135 204575 58824 -236127 83075 194356 -179403 -57701
1073e7701K94677l11835j10383L83567j11715l12210K94407J27209l69403J01988
1083g1399L08785k90251j34925L71234q9559l13798K80529J40830l71287Q3321
1093h6520L25190k75670j59155L66611o4708l25837K61249J65632l59729N4205
1103i8732L24182k54178j72895L58026m2337l28066K44200J76487l61575L5585
1113a19303L44545k33262j97530L45065k5916l36696K33640K08869l50605k50
1123a31443L32889k14875j97754L49504n140l51028K07354K15893l40192m211
1133a39003L51714k05911k31526L37514K2327l51424J94295K38880l33994l6541
1143a53669L47511j85041k35345L38089L8769l61398J72689K46917l24480m2605
$$ plain form
1073 -57701 236976 -74859 -185242 198325 86610 -225600 68807 196016 -173387 -71399
1083 -71399 237386 -52865 -187790 183444 93885 -219913 60616 201446 -169841 -86520
1093 -86520 238670 -37000 -196155 170456 105748 -220089 41160 206792 -152937 -98732
1103 -98732 225450 -28728 -201623 156403 114066 -214000 30200 206687 -154888 -119303
1113 -119303 225242 -8020 -205550 139515 113599 -223097 10543 219412 -131193 -131443
1123 -131443 201446 -13429 -211183 138321 133181 -217847 -10493 205400 -134792 -139003
1133 -139003 212711 6800 -224726 112788 135115 -216309 -22014 216866 -117128 -153669
1143 -153669 193842 8801 -226544 111545 150314 -211084 -38395 208522 -115958 -158563
1153a58563L61498j73606k65399L23061O9129l54174J54984K58550l19110p0335
1163a73965L63049j43575k69235L06278P7622l56118J41829K76572l07413r4257
1173a79213L61822j22235k83563K96590J03173l59699J12493K90374k83819j13414
1183a77491L52794j03141k89574K79939J19290l52099R6783K99727k76957j36386
1193a87115L52487p7984k98308K68304J41292l58259O4781L11875k47339j46487
1203a76753L42469o8434l12832K52235J65323l40901M9454L08881k49892j66092
1213a96542L53989l6907l24523K30006J77873l42124L0660L25318k24896j86021
1223a93167L36977k3969l28411K23142J96949l37614J0651L28407k17630k02666
$$ plain form
1153 -158563 202935 29329 -236070 86991 156120 -198054 -43070 215480 -103630 -173965
1163 -173965 189084 45509 -223726 82552 160174 -195944 -54115 222457 -84956 -179213
1173 -179213 182609 60374 -223189 73401 176574 -183125 -70632 219742 -64077 -177491
1183 -177491 175303 72162 -217412 62527 181817 -170282 -73499 226228 -50729 -187115
1193 -187115 165372 87388 -210920 57384 198676 -159583 -94802 217073 -30266 -176753
1203 -176753 165716 97282 -215550 36685 202008 -138893 -89439 219442 -30450 -196542
1213 -196542 157447 120540 -203983 26023 203896 -138228 -107568 217750 -7146 -193167
1223 -193167 143810 119841 -208570 14572 211521 -126093 -115442 212965 -4665 -207331
1233b07331L42001L075l39159J99650K09835l31768q751L42146j94171k23767
1243b08240L22174J9899l33473J89577K22160l29710k9236L45217j76231k35528
1253b13391L17933M0471l45961J66129K44773l09788n4708L40262j56498k47927
1263b18705L06197O3890l40979J44666K48393l00624o7757L46552j37463k62526
1273b18356K91998Q1738l43942J27484K69944k84380r6675L34884j13138k65842
1283b16285K82863J00494l43682J02471K74923k70897j04583L41438r9249k84821
1293b17328K67067J20471l39340Q9144K92497k62376j37027L36228p0531k85027
1303b06222K54835J31474l41574O9974K99105k47540j43292L40451o3187l08373
$$ plain form
1233 -207331 134670 137745 -201414 -1764 208071 -123697 -132448 209698 15527 -208240
1243 -208240 113934 133833 -199640 -10063 212097 -117613 -146849 198368 22137 -213391
1253 -213391 104542 145013 -200948 -34819 209954 -99834 -154542 185720 29222 -218705
1263 -218705 87492 151382 -189597 -44931 203462 -97162 -164919 181633 44170 -218356
1273 -218356 73642 155380 -188562 -61078 208866 -75514 -172189 162695 49557 -216285
1283 -216285 66578 167072 -176610 -74139 200784 -70113 -174696 166742 67493 -217328
1293 -217328 49739 170210 -169130 -79986 212511 -49865 -186892 149336 78805 -206222
1303 -206222 48613 180087 -161487 -91513 207592 -39948 -183240 157211 94024 -214349
1313b14349K43939J62425l33545M7804L01857k38181j61632L40353l6690l13587
1323b01606K24181J71177l28413L2296L12787k22392j78341L31602k4667l19144
1333b02520K17328J93725l28916L695L20023j99408j95838L21593J937l20667
1343a89048J91958J99244l16819n461L26205j87944k15974L09803K4117l19062
1353a82981J77637K14518l13030l5302L30746j58033k27055K96119L9553l25652
1363a83480J56311K32090k93552n0807L22887j50598k37610K95154O4568l30622
1373a75659J33440K44312k85182p0744L29000j26410k53018K78468Q0086l29872
1383a75579J19443K58121k72940q9613L23470j15557k57892K78784R8300l39936
$$ plain form
1313 -214349 29590 192015 -141530 -93726 208131 -30050 -191682 148671 111981 -201606
1323 -201606 22575 193752 -134661 -102365 210422 -11970 -190311 141291 116624 -202520
1333 -202520 14808 208533 -120383 -116688 203335 3927 -191911 129682 131619 -189048
1343 -189048 2910 202154 -114665 -120126 206079 18135 -197839 111964 136081 -182981
1353 -182981 -5344 209174 -103856 -139158 191588 33555 -193500 102619 142172 -183480
1363 -183480 -27169 204921 -88631 -139438 183449 32851 -204759 90395 154963 -175659
1373 -175659 -42219 202093 -83089 -153833 175167 48757 -204261 74207 154293 -175579
1383 -175579 -56136 201985 -70955 -160568 162902 47345 -210547 68237 166537 -173399
1393a73399R8860K72394k61293j08048L29832r4201k75561K58335J15336l26357
1403a64102Q9084K76699k60025j26849L32551p1649k81221K45853J28525l29379
1413a60513O8917K90332k41226j41974L27427n5963k95807K30862J55981l17371
1423a39335M4319K86984k27894j52288L25727l5948l01892K15332J66935l16595
1433a34655K5780L04724k04677j76742L07116j5407k99298K01539J83113l08435
1443a16942J780L02564j87486j85976L06015K381l07789J81933J96246l00195
1453a07469j2099L11344j73339k08372K93391K8571l04961J63811K06143k93977
1463i6957l2733L13614j53177k15646K86475L7335l14951J52495K26829k84334
$$ plain form
1393 -173399 -74539 197855 -63438 -171486 158346 64145 -211416 46919 162255 -164102
1403 -164102 -75018 201681 -58344 -185193 147358 75709 -205512 40341 168866 -160513
1413 -160513 -91596 198736 -42490 -184464 142963 87000 -208807 22055 178036 -139335
1423 -139335 -95016 191968 -35926 -188214 137513 101565 -200327 15005 181940 -134655
1433 -134655 -108875 195849 -8828 -185570 121546 106139 -193159 8380 191493 -116942
1443 -116942 -115162 187402 -84 -186060 119955 122336 -185453 -3520 192726 -107469
1453 -107469 -119568 191776 18437 -189935 103456 132027 -172934 -9123 197020 -96957
1463 -96957 -129690 183924 30747 -184899 101576 138911 -176040 -23545 203284 -81050
1473h1050n3128L14580j41883k31688K83057O4368l17331J26195K33120k72381
1483g6141o3728L17551j28250k43588K71536P6649l19123J19122K49953k67265
1493f3284r0977L15642j05440k49537K61749R5173l21347R3566K57251k50042
1503e7246r9541L14656r0871k64385K45254J11097l10663Q3893K64603k47091
1513e0294j25268L16870o2617k69853K26404J26680l07473N8683K72770k22185
1523c6283j34720L03496n3675k75797K20592J46588l05240L7409K78714k10176
1533b9092j51344L02275k8404k83679J99631J59052k96669K1217K84703j92138
1543a4448j65740K91627j5281k82856J90613J72532k95721K688K91334j77923
$$ plain form
1473 -81050 -134178 180402 38519 -193169 89888 154256 -163075 -36880 196240 -76141
1483 -76141 -139869 177682 49432 -194156 77380 154029 -165094 -45972 203981 -63284
1493 -63284 -154261 161381 55941 -193596 68153 163326 -158021 -64455 192796 -57246
1503 -57246 -156787 157869 66998 -197387 47867 158964 -151699 -67806 196797 -50294
1513 -50294 -175562 141308 78691 -191162 35242 161922 -145551 -86868 185902 -36283
1523 -36283 -171003 132493 78818 -196979 23613 170201 -135039 -97630 181084 -29092
1533 -29092 -180436 121839 93435 -190244 9387 168439 -128230 -107013 177690 -14448
1543 -14448 -180188 111439 96158 -186698 3915 176447 -119274 -116586 174748 -3175
1553c175j78919K90412M184k95713J69633J91740k81293j2657K90674j69539j92652
1564a87305K86084K3737k94812J58885J96660k84169k8059L03753j47429k09851
1574a82506K73636L8779k98756J43686K14692k69627m7933K96581j36620k16129
1584a84197K70242N7098l00070J24203K20681k62501o2116L05043j16738k32732
1594a81087K52988P4131k98269J10510K35612k47832q7635K92810r5143k31867
1604a75782K43952Q6773l00366R0338K42046k34536r7226K95031q0780k49843
1614a80393K28304J10403k90389O8850K46557k22790j13743K91114o1364k52751
1624a76202K15155J19977k89789N2595K58327k07966j30075K86728m8490k61358
$$ plain form
1553 -3175 -182094 108318 112502 -183211 -13578 178162 -103131 -115788 174886 5347 -187305
1564 -187305 98779 122516 -172296 -13411 183249 -100920 -128979 174774 27345 -182506
1574 -182506 91130 129909 -168847 -25161 189531 -80096 -128029 168552 31932 -184197
1584 -184197 86045 143143 -156927 -32724 187957 -74544 -136660 168383 51645 -181087
1594 -181087 71901 146032 -152237 -41727 193885 -53947 -141582 151228 56085 -175782
1604 -175782 68170 154943 -145423 -55085 186961 -47575 -144801 150230 69450 -180393
1614 -180393 47911 158314 -132075 -63225 183332 -39458 -153201 137913 76549 -176202
1624 -176202 38953 158930 -130859 -78264 180063 -27903 -157978 128750 80260 -181098
1634a81098K05959J40006k86511L2274K61179j94797j42112K84504k9444k67265
1644a77305J89267J47877k81501K6032K71348j90249j61513K81886r674k71493
1654a75325J78012J63197k79424K860K74061j67614j67577K73275l94k78601J65673
1665a1857J78271k69525j0350K77133j61281j83359K69999K2276k78681J48639
1675a8735J88044k65400k9673K82713j36583j94403K53638L4988k77114J34442
1685b8083K00331k52591m6344K78423j25662k03002K51369N6833k82711J11338
1695d0099K09295k37988o1807K79656j06110k14674K33174P0989k75481J01498
1705d1547K17942k32664q0956K78944q7777k21266K25539Q5945k80204Q1513K28686
$$ plain form
1634 -181098 24861 164867 -121644 -89370 171809 -22988 -165100 119404 89960 -177305
1644 -177305 11962 159839 -121662 -95630 175718 -14531 -176044 105842 96168 -175325
1654 -175325 2687 165884 -113540 -110680 163381 -4233 -171810 101465 101071 -177530 -11857
1665 -11857 166414 -103111 -113461 163672 2391 -180968 89031 111307 -167374 -18735
1675 -18735 169309 -96091 -125764 156949 20366 -174037 79601 114589 -162525 -28083
1685 -28083 172248 -80343 -126687 151736 26074 -176928 74441 131274 -151437 -40099
1695 -40099 169196 -68792 -130599 149057 42947 -171727 61447 132436 -143045 -41547
1705 -41547 176395 -56269 -137225 141719 53942 -167324 58215 144160 -136044 -54531 174155
1716A74155k16372r3849K75225p5677k31791K14672J02777k72567O5917K32408
1726A74898k13506j04439K77879n9565k39494K04315J14460k76917N1231K46308
1736A75170j96110j23723K68182m4607k43498J95538J28563k72432L4930K47534
1746A69547j88536j33430K72231k8031k55385J77170J43151k63194K0890K53473
1756A67886j75740j51235K62608r065k53034J65273J52241k60828K271K56469
1766A56846j57236j57874K56220J883k62255J51492J70520k49507j7404K58328
1776A51013j42982j72977K45195K4778k56076J32896J72852k43880k8070K63766
1786A46515j26627j85337K35708L7907k61385J21427J91345k32717n1031K57878
$$ plain form
1716 174155 -42217 -136066 139159 63482 -168309 46363 149140 -123427 -57510 174898
1726 174898 -38608 -143047 134832 75267 -164227 40088 154548 -122369 -71138 175170
1736 175170 -20940 -144663 123519 78912 -164586 30952 159515 -112917 -77987 169547
1746 169547 -18989 -152419 119812 91781 -163604 13566 156717 -106477 -85587 167886
1756 167886 -7854 -159089 103519 94454 -158580 6693 158934 -101894 -99623 156846
1766 156846 -390 -158264 97956 99839 -162416 -10924 159596 -89911 -107315 151013
1776 151013 8031 -164946 80249 105027 -151049 -18153 154699 -89181 -117251 146515
1786 146515 19888 -165449 70259 108166 -153219 -31792 159553 -73164 -124195 133683
1796A33683j09115j90327K29248N4895k63012J02028J97090k22339n8458K61930
1806A35623r9227k03458K20690O7807k60765R2775K07910k17991p7543K62172
1816A27993q1495k08858K11276Q1105k61307P6018K14790k05415q7055K61227
1826A28279p2832k19296K04096R9013k59346N9812K21495j96975j02146K59799
1836A21899n0912k25962J86689J07576k53360M9117K29456j86367j17869K53759
1846A14026l8526k28156J80287J22235k54020K8294K33327j68232j27992K47838
1856A09081k0785k36225J59823J35655k40650J5493K34389j58097j43002K41161
1866I6843m934k34771J52575J45016k43073n124K40877j37167j51052K30975P943
$$ plain form
1796 133683 24568 -165759 63489 118384 -144628 -42600 154490 -67849 -126307 135623
1806 135623 36396 -167062 53628 121435 -139330 -46555 161355 -56636 -134179 127993
1816 127993 46498 -162360 48916 130021 -131286 -55268 159522 -45893 -132948 128279
1826 128279 55447 -163849 40247 139260 -120086 -60274 161221 -35754 -137900 121899
1836 121899 70987 -154975 31714 139290 -114070 -64953 164503 -21864 -139733 114026
1846 114026 75500 -152656 27631 149866 -104154 -75860 157467 -10765 -138757 109081
1856 109081 88296 -147929 11894 147549 -93101 -77608 156781 -1316 -144318 96843
1866 96843 91909 -142862 9713 154729 -88344 -93468 147409 10242 -140810 90165 98108
1877I8108k41393J34745J60055k27292j8475K37526j31372j61943K30369K5482
1887A05810k43445J21280J66086k24302l1203K44009j14453j74791K19416L8124
1897A06531k43392J08535J77828k15486m5933K41601j04427j80703K15875N1365
1907A11794k45936R5408J85801k09590n7675K45838q8965j94112K03389O8374
1917A14326k40756Q2489J90010k01922p2454K46590p3883j96677J92491P5549
1927A15763k42436P0476K04433j89773q8514K39412n9671k03209J84597R4933
1937A26011k38567M9285K04148j75727r6638K37473m4226k08587J69946J03741
1947A26859k36397L9772K15059j62655j14628K28066k9296k11097J61569J20384
$$ plain form
1877 98108 -143285 -8540 151515 -75777 -94252 143274 11902 -150041 80328 105810
1887 105810 -137635 -16355 149731 -74571 -105774 138235 23782 -151009 68407 106531
1897 106531 -136861 -28326 149502 -65984 -111917 129684 25257 -155446 60429 111794
1907 111794 -134142 -38734 147067 -62523 -120198 125640 36675 -157437 45952 114326
1917 114326 -126430 -43941 146069 -55853 -128307 118283 44400 -152277 40214 115763
1927 115763 -126673 -56197 148236 -41537 -130051 109361 49690 -153519 31078 126011
1937 126011 -112556 -63271 140877 -34850 -131488 105985 61759 -146828 23118 126859
1947 126859 -109538 -69766 145293 -17362 -131990 96076 66780 -144317 17252 137636
1957A37636k31064J6347K14221j48535j18417K27935j7361k20786J46382J29514
1967A35872k22316J0200K19810j43313j36489K22799K756k20456J32148J39553
1977A40564k18573m562K21450j30965j42094K18101J2311k25472J23000J49458
1987A43218k14090j7250K26204j20405j55582K12397K8794k26333J09152J56132
1997A42237k06868k9644K26365j05496j62910K01603L7157k24620J02812J66018
2007A46654k05565m8129K29004q7919j68456J93039M8305k28317Q6008J75733
2017A40357j87080n9029K22200q0357j76950J85962O5555k23769P1773J80290
2027A38952j84585p2452K26709o2739j83084J73322P6760k24031N4848J89240
$$ plain form
1957 137636 -93428 -77081 137140 -11395 -129812 98123 80762 -140024 6358 135872
1967 135872 -86444 -76244 143566 253 -136236 86563 89319 -131137 1011 140564
1977 140564 -78009 -82571 138879 7914 -134180 83921 96232 -129240 -6240 143218
1987 143218 -70872 -88122 138082 17677 -137905 74492 103286 -123047 -13895 142237
1997 142237 -64631 -94275 132090 26594 -136316 65287 102444 -122176 -19364 146654
2007 146654 -58911 -107040 121964 34045 -134411 58628 106933 -121384 -35376 140357
2017 140357 -46723 -105752 116448 36091 -140859 45103 110658 -113111 -41338 138952
2027 138952 -45633 -118085 108624 45885 -137199 36123 112883 -111148 -56300 132940
2037A32940j66226q1371K16167n5634j90162J68819R3428k18569M0596J88131
2047A28119j61127r2200K21408l6981j97397J52773J00508k14656L1402J97756
2057A29605j49641j06755K12438k3279j98815J47252J09831k13365J8903K01648
2067A27822j41160j16674K12201j0414k03639J34486J19436k07605P827K05814
2077A28094j30293j27351K05789K553k04775J24970J27465k05110l688K10309
2087A27963j20361j35651J99978J1734k07765J14954J43471j98175k2909K06169
2097A19408j05652j39739J96407K4895k12267R9651J49023j89335l0300K09863
2107A21954r4768j53805J85297L9748k08773Q9101J57440j82627m8868K07677
$$ plain form
2037 132940 -33286 -114657 101510 45876 -144286 24533 117961 -100608 -60012 128119
2047 128119 -33008 -125208 96200 59219 -138178 14595 115103 -99553 -68151 129605
2057 129605 -20036 -126791 85647 62368 -136447 10805 120636 -92729 -73826 127822
2067 127822 -13338 -130012 82189 71775 -131864 2622 122058 -85547 -77720 128094
2077 128094 -2199 -129550 76239 78792 -125983 -1013 126452 -78658 -82346 127963
2087 127963 7602 -128049 71929 83663 -124102 -9148 134323 -63852 -86761 119408
2097 119408 13756 -125983 70424 95319 -116948 -17297 131726 -57609 -87909 121954
2107 121954 27186 -126619 58678 98426 -110347 -21246 136194 -46433 -95301 112376
2117A12376p8302j56868J78142M9099k09789P3154J62873j71322n4593K08520
2127A13290p2611j68903J68789O7676k05704O1904J66897j66029p1071K08577
2137A02815n3844j72399J58594P2867k05146N0665J75152j57148p9829K05536
2147I7263m6413j78423J53990Q6494k05076L6057J80642j47230r0322K02688l3111
2158E6559j82964J43671R3480k02318K9577J86522j41210j03149K00335k0020
2168F0483j86827J36280J04709k01778J3898J91591j27085j11266J94706j0622
2178F4089j90915J25415J16724j92562K527J89871j22024j19440J95658M283j93660
2189a20034J11425J23959j87873j0482J95499j04963j29312J82806J4546j92991
$$ plain form
2117 112376 34074 -122794 55348 104447 -105342 -32188 130685 -40637 -95230 113290
2127 113290 40679 -128224 40565 108241 -97463 -35559 131338 -34691 -105762 102815
2137 102815 48971 -123428 35166 108033 -97113 -46448 128704 -28444 -108273 97263
2147 97263 50850 -127573 26417 112911 -92165 -56108 124534 -22696 -113018 89670 56559
2158 56559 -126405 17266 110746 -91572 -61995 124527 -16683 -119832 80503 60483
2168 60483 -126344 9936 114645 -87133 -73235 118356 -8729 -119995 74711 64089
2178 64089 -126826 -1411 115313 -77249 -74722 115149 -6875 -126315 69343 73626 -120034
2189 -120034 -8609 115350 -72523 -83005 112494 7531 -121781 61025 75571 -117420
2199a17420J02618J33873j80699k3273J92911r6853j34914J80911L0892j97353
2209a09307Q6863J40207j73096l3127J97331q3491j46879J68933M1163j92439
2219a03842P9885J46997j69472m6844J96757p2340j49954J66272N0642j97894
2229i9793O7757J56188j59924n7248J95592o3011j57927J57883O2654j93782N6508
2240c5103J60056j56565o5831J96879n1983j63887J50798P1490j95972M7197J68211
2251A25290j46392p9148J92141m0466j67275J44121Q2273j94052L3844J69500
2261A19836j37917q5004J92072k9741j75520J33294R1900j88488K4441J75982
2271A20855j31569r8698J86582j3940j76362J23380J00387j86292R920J78732
$$ plain form
2199 -117420 -14802 119071 -61628 -84901 108010 11157 -123757 57154 88046 -109307
2209 -109307 -22444 117763 -55333 -88460 108871 25380 -121499 47434 88597 -103842
2219 -103842 -23957 123040 -46432 -93276 103481 31141 -118813 47459 98101 -99793
2229 -99793 -32036 124152 -35772 -93020 102572 39561 -118366 39517 102171 -91611 -35103
2240 -35103 124953 -31612 -97443 99436 47453 -116434 34364 105854 -90118 -42921 125290
2251 125290 -21102 -100250 91891 51425 -115850 28271 110544 -83508 -49664 119836
2261 119836 -18081 -103085 88987 59246 -116274 17020 108920 -79568 -55127 120855
2271 120855 -10714 -109412 77170 63230 -113132 10248 110635 -75657 -65737 112995
2281A12995j16917j05781J81751n533j82086J13610J13795j80376k985J79876
2291A08349j08478j15866J78309R259j81232R9859J18106j74668j2396J83883
2301A05125r6844j24825J71880J7607j84193R4563J29704j70769k7143J84658
2311I9763q7142j31005J67970L0157j86206Q1396J34060j63450l1645J85857p9744
2322B0011j40552J62678M1599j86140P4636J42221j61547m6251J88053o6066j44781
2333a16139J55649M9225j87208O2880J49290j51271n3530J84162n8992j51463
2343a17397J51456O1726j85803N1505J54007j46034o6690J87369m4442j57421
2353a11724J39783P0863j83956M1762J60440j36716p6993J81293l5482j59403
$$ plain form
2281 112995 -3922 -109703 72048 66515 -115571 -1961 111834 -68542 -71527 108349
2291 108349 -129 -115995 62314 71573 -109659 -9800 108306 -66362 -78758 105125
2301 105125 8281 -116544 55336 72943 -111250 -16687 113017 -57752 -84895 99763
2311 99763 12621 -118384 49586 79743 -106463 -25067 108993 -54457 -86102 99755 20011
2322 20011 -120541 42137 83736 -102404 -27768 114453 -47094 -93345 94708 28642 -116139
2333 -116139 39510 88735 -98473 -35593 113697 -37574 -91104 93058 34066 -117397
2343 -117397 34059 95785 -90018 -38513 115494 -30540 -97230 90139 45697 -111724
2353 -111724 28059 98922 -85034 -43272 117168 -19548 -96541 84752 49270 -110133
2363a10133J33692Q1797j82766K7057J64373j25829q6098J80467k3293j66934
2373a07667J21630R2072j74925J5953J66408j19758r4694J76218j0357j68787
2383a03907J13574R9263j76236O518J71801j07764j06267J72641j237j73477J04881
2394b10J10336j68877o316J70659j00969j12405J70870J1111j75914R5556J13544
2405A07385j68006j2966J79276r1795j23253J62715K0743j76874Q8864J24615
2415A10704j63683k6719J76313q2347j25057J60509K8644j79501P7958J31319
2425A08140j58158l5285J80412p3000j36553J53150M1776j78136O8267J37543
2435A08156j51153m7203J78253o2077j38690J47536N0596j80499N6663J45954
$$ plain form
2363 -110133 23559 105356 -77410 -50353 114020 -11809 -97907 82560 59267 -107667
2373 -107667 13963 106035 -68890 -52937 113471 -6287 -100981 75237 64880 -103907
2383 -103907 9667 108930 -67306 -60788 111013 3249 -103018 69623 68386 -105091 -210
2394 -210 110126 -58751 -65067 105592 4623 -107782 63088 74199 -101715 -6159 107385
2405 107385 -60621 -73587 105689 13894 -109359 53356 74099 -102775 -13911 110704
2415 110704 -52979 -79698 96615 14268 -110789 49720 78364 -101137 -23179 108140
2425 108140 -50018 -85303 95109 22109 -114444 38706 80482 -97654 -29387 108156
2435 108156 -42997 -90200 88053 25976 -112714 34822 85418 -95081 -38418 107536
2445A07536j43844n6764J77196n1491j46783J41137O3387j77614M2996J49425
2455A05181j35452o4964J76848m0185j53114J31335P2273j74564L6800J54065
2465A08223j29737p8222J76352k8375j56287J23877Q2451j73616K2228J58373
2475A05267j18468q3631J73487k1097j62556J16748R0686j69128J5036J62561
2485A08905j15311r6060J72308p189j63019J08704R6381j70431M103J69469j02714
2496E146j03071J64754j055j67240J03140J07931j67057o255J69574r7594j11282
2507a03009J64556J3216j70801R0975J13918j61282j7193J71642q6017j17699
2517a01694J57581K0399j71835Q3504J21848j55917k8615J72016p8351j23711
$$ plain form
2445 107536 -36308 -93072 84124 32633 -114150 26987 90374 -87240 -44244 105181
2455 105181 -30271 -95235 81613 41428 -111686 19649 91922 -82642 -45842 108223
2465 108223 -21514 -99736 76616 48241 -108046 15831 98282 -75334 -53106 105267
2475 105267 -13201 -96832 76655 55558 -106998 9750 100436 -68692 -53656 108905
2485 108905 -6406 -102466 69842 62653 -100366 8338 104719 -65712 -61609 107860 5146
2496 5146 -97925 66829 65774 -101466 1674 109605 -57452 -63707 105867 8273 -103009
2507 -103009 61547 74763 -96038 -5063 108855 -52427 -69620 102022 16005 -101694
2517 -101694 55887 76286 -95549 -12045 109803 -46114 -74729 97287 18936 -104775
2527a04775J54590L1514j73594O9908J29420j48048l8141J71709o7565j32466
2537a07448J46971M4577j72139O0103J33838j44484m7512J74668n6707j40637
2547a08770J39886N3249j71982N0848J42470j36793n9525J70315m5842j42812
2557a08956J34102O2558j71370M0505J45262j31002o6447J73776l6591j50864
2567a09027J25207P1326j69304L3265J53375j23701p9478J67580k6116j50143
2577a07016J22105P8805j70566K0549J55888j14713q4128J69038j8563j59353
2587a07954J13711R0594j66510J1607J59727j08109r4689J65393o629j58838J04751
2598C054R6516j64443J993J63555r9794j01761J62631L687j66041R5852J08300
$$ plain form
2527 -104775 49815 81329 -92265 -22357 107063 -40985 -79126 92583 25018 -107448
2537 -107448 39523 84100 -88039 -27936 105902 -38582 -86094 88574 31867 -108770
2547 -108770 31116 84365 -87617 -36769 105701 -31092 -90617 79698 33856 -108956
2557 -108956 25146 87704 -83666 -43161 102101 -28901 -95348 78428 41837 -109027
2567 -109027 16180 87506 -81798 -48533 104842 -18859 -98337 69243 43127 -107016
2577 -107016 15089 93894 -76672 -56123 99765 -14948 -99076 69962 51399 -107954
2587 -107954 5757 96351 -70159 -58552 101175 -6934 -101623 63770 57141 -101697 3054
2598 3054 99570 -64873 -62880 100675 881 -100880 61751 65438 -100603 -4751 103549
2609A03549j59140j0088J64282r0684j08931J57878J5079j66582Q5098J13627
2619A04088j53337j8495J66276q1540j18670J51573K7356j66414P6560J20452
2629A07849j51255l1440J69861p0441j23469J45399L4031j67868O6846J28874
2639A08387j44654m0136J69436o4255j31851J41979M6601j67628N6806J32815
2649A07500j39374n1550J69959n0238j36298J33148N2547j69223M9466J41863
2659A07800j33721n8882J66250m5364j40522J32097O4148j69887L6174J44674
2669A02767j26136o7552J69010l4504j47808J22403P1199j66235K9203J49702
2679A02049j19852p7721J65970k4989j49843J15470Q2092j65811J8070J53541
$$ plain form
2609 103549 -55591 -65679 98603 7919 -101012 56866 71945 -94637 -9539 104088
2619 104088 -49249 -67744 98532 16992 -101678 49895 77251 -89163 -12603 107849
2629 107849 -43406 -74846 95015 24574 -98895 46504 80535 -87333 -20487 108387
2639 108387 -36267 -76403 93033 28778 -103073 38906 85507 -82121 -25315 107500
2649 107500 -31874 -83424 86535 36297 -100001 33147 85694 -83529 -34063 107800
2659 107800 -25921 -84803 81447 36083 -104439 27658 91806 -78081 -41907 102767
2669 102767 -23369 -90921 78089 43585 -104223 18180 89379 -76856 -47653 102049
2679 102049 -17803 -95524 70446 45457 -104386 11084 93176 -72635 -54565 98976
2689I8976j12058q5365J64274j3744j56100J06545R0224j60218Q928J55183j05178
2700h533r2631J61164k495j58870R7959R8631j58711j591J60743r4484j02743
2711a01561J54956O751j59301R1393J06167j54754j3086J60816q5009j08435J52868
2722E0805J7622j64124Q1293J14321j50006k1909J64911p7227j17957J46752K7842
2733G2323j62585P3482J19590j46554l2144J65450o8036j20908J43433L5055j67105
2744h7999O4610J27909j40397m0273J65605o1480j29552J39179M7114j64850N3832
2755b6302J30710j35480m8888J66818n1322j33927J31750N3038j65761M7352J39312
2766A07300j29886o0601J64880m0737j40448J26085O4767j64833L4804J42071
$$ plain form
2689 98976 -13082 -98447 65827 52083 -104017 2528 92752 -67466 -58538 96645 -8533
2700 -8533 -101164 60000 57505 -101365 -3406 95225 -63486 -65077 95666 1182 -101561
2711 -101561 53395 60146 -99155 -7762 98405 -56349 -69435 91381 6372 -102063 50805
2722 50805 68427 -95697 -14404 99917 -50089 -71998 92913 15686 -102271 44481 72323
2733 72323 -90262 -16780 102810 -43744 -75888 89562 21526 -99382 44051 79106 -87999
2744 -87999 -23389 104520 -35877 -76150 89455 27975 -101577 37602 84716 -80134 -26302
2755 -26302 104408 -31072 -79960 86858 35536 -98391 33359 86397 -79364 -32012 107300
2766 107300 -22586 -83187 81693 40956 -99492 26593 91360 -73473 -38669 103402
2776A03402j22238o6973J63348l1019j45252J18369P1771j62228K6871J47355
2786A03406j16191p8834J62060j9342j48091J08784Q1498j60186J4375J50483
2796I7962j05798q4845J57973j1786j53667J03815R1143j56201L562J52584r8487
2807c745r4167J56472K03j55171R2617R7423j53320m483J57345r0255j02291J50865
2819E1493Q596j56290Q7029J05580j51136j5075J58520q2404j07488J48389J8819
2830F6033j60320P7646J10880j44676k1105J59965p5807j16027J44305K7805j59603
2841i0904P1736J17985j44579l2968J63682o4983j21010J38858L6080j62340O2276
2852b6167J24830j36128l9812J60590n8626j26476J35040M6412j61075N1502J29642
$$ plain form
2776 103402 -18836 -85809 77539 46520 -98732 19637 91408 -70820 -43949 103406
2786 103406 -12785 -91619 70441 51099 -96992 11792 93290 -66896 -52521 97962
2796 97962 -7836 -92681 65292 53506 -100161 3654 94797 -61404 -57842 94742 -3745
2807 -3745 -97912 58560 58763 -96408 -3791 93632 -59688 -64171 93174 2919 -99372 51493
2819 51493 60089 -96201 -9172 96408 -54728 -69803 88717 6313 -101175 47214 66033
2830 66033 -94287 -16641 94239 -50437 -71542 88423 12616 -103411 40894 68699 -90904
2841 -90904 -19168 98817 -45762 -78730 84952 19969 -101041 37817 73897 -88443 -26167
2852 -26167 98663 -37465 -77277 83313 24687 -101789 33251 79663 -81412 -29910 99732
2863I9732j30775n0634J62205m6267j32048J25649N5752j61237M3358J35264j22911
2874b1912o0929J59175l7385j36496J22112O4283j59362L1309J39756j17101o7513
2885h4063J58118k6936j42926J13108P3706j55762K2653J41949j09779p7556J57068
2896F9580j7076j45303J05947P9634j55676J3790J48282j02687q5488J54555r742
2907E5816j49264R9309Q9938j53387L692J49575r5812r2062J51939R30j51776
2918i1102R1056R3951j50942k499J54220q9109j00533J47552Q618j52939Q4777
2929f950J03540j47802j5511J53551p7715j05489J44636J7389j57245P6131J09651
2940I4186j40809k2286J54520p1935j13742J39314K8990j55281O6275J15736j38484
$$ plain form
2863 99732 -31043 -81677 80528 34261 -97787 27862 83614 -77623 -34265 100999 -21912
2874 -21912 -82841 76334 38949 -97547 24565 88848 -70514 -39205 100551 -16550 -84063
2885 -84063 74055 47119 -95807 17301 91007 -64755 -42102 99847 -9932 -87488 69580
2896 69580 52504 -92799 13148 92782 -62894 -49104 99178 -3509 -88997 65558 55816
2907 55816 -93448 5861 95799 -57588 -53896 95679 -133 -92195 59744 60674 -91102
2918 -91102 -46 93905 -57037 -59536 94684 5575 -94958 52594 61212 -91727 -6950
2929 -6950 96590 -51212 -66723 86828 9113 -96376 48260 65649 -91596 -15465 94186
2940 94186 -46623 -68909 85611 13676 -100066 39248 68238 -87043 -20768 94968 -43516
2951d3516l2325J56661o1472j18816J33828L7447j57091N6844J23231j31488m1680
2962g8377J55507n3684j24789J29095M8127j55767M6992J26177j23863n1428J56383
2973G4373m3179j28796J19653N5990j54528M0003J31241j19194o0128J55526l3157
2984C7804j34333J16189O3385j54436K9498J36930j12035o7332J53452k6453j37211
2995i4542J09138P1701j51655K2385J38582j07169p5655J53411j6490j41287J03674
3006A2093P7899j52266J3475J43748r7737q2421J47815r147j43921R6524Q7220
3017I3282j47461L113J43554r2470q8423J48293R71j47649Q6624R3492j43923
3028e0597n119J48134q4286r7287J41585J0341j47838Q0261R9684j40527j5254
$$ plain form
2951 -43516 -75841 80820 19348 -99468 34360 71807 -85284 -28440 94791 -36697 -78377
2962 -78377 77130 23446 -101343 27752 75879 -79888 -32896 93281 -30582 -82010 74373
2973 74373 31194 -97602 22051 78041 -76487 -36484 94757 -24437 -84565 70961 37804
2984 37804 -96529 19660 83045 -71391 -41893 95037 -16998 -84330 69122 42669 -94542
2995 -94542 14596 86297 -65358 -42973 95609 -11560 -87215 66196 49706 -91581 12093
3006 12093 89992 -62274 -48799 94949 -2788 -85209 62606 53459 -90462 6062 93282
3017 93282 -54179 -51066 92488 18 -88405 59888 60859 -86790 -166 93326 -50597
3028 -50597 -55716 92418 8132 -89155 52430 62771 -85067 -4806 94878 -45649 -60903
3039f0903J48455p4814j03597J38670J9239j51135P0899J06045j34286k4375J49955
3050H4153o5925j11028J31500L0365j49699O2438J10417j31133l3174J52274n7720
3061B2468j16618J28793L5836j50844N4524J18488j25134m3587J49635m8527j20069
3072i5035J23862M4277j50446M4807J22846j20126m9319J51123m2271j25705J17230
3083B1243N3775j49368L7433J27642j14987n8621J48619l1973j28494J12701O0723
3094G8693j49558K7455J32084j07803o2982J47781k6645j34393J05947P0492j45805
3105f4734J9232J34288j02057p3140J46123j4437j35046R7961P4838j43897J1738
3116d9131J37456r3794p9942J42444o122j39214R0767Q5332j41409J331J39610
$$ plain form
3039 -60903 87552 12738 -90859 47811 67050 -84085 -13186 92859 -41427 -65802 84153
3050 84153 18228 -92800 38700 69065 -80634 -18196 92221 -38912 -72086 80188 22468
3061 22468 -94150 34643 70479 -80365 -25841 92647 -32487 -76074 73561 25034 -95035
3072 -95035 28827 73104 -77342 -32535 90311 -29815 -79134 71989 29718 -95987 21243
3083 21243 75018 -74350 -36917 90725 -24262 -82883 65736 33763 -94731 17970 78693
3094 78693 -70865 -43410 88674 -19129 -82111 65670 39025 -95368 10579 81071 -64734
3105 -64734 -45502 88786 -13271 -86411 59712 45275 -89771 8190 83028 -60869 -49131
3116 -49131 88325 -5469 -85411 57033 50911 -88303 2464 87796 -53613 -52282 87328
3127H7328q6663q7024J39939L518j41085Q1715R0431j36790n880J41199p8214
3138H474r4082J33796J3166j42275P5187R7174j34041j6929J44094p0341r9447
3149h5224J30486J9512j42990O6103J03581j28324k4187J43022o3318j05950J27505
3160D0216K9343j44536N8051J08412j25732l1420J44705n4648j10546J20802L6061
3171G0708j44327N1576J13764j20114m0747J43491m8418j14636J18063M4105j44260
3182g0795M1761J17338j14973m7537J45493l9773j21517J11063N3016j42931L6162
3193c2693J20687j09430n6020J41268k9899j23191J05297N9727j42185K5588J25730
3204H4879j00836o4141J39870k0814j28397R8461O7317j37918J6823J27543r4889
$$ plain form
3127 87328 665 -86359 53580 57098 -83987 -2272 88159 -48631 -54511 86688 8474
3138 8474 -85608 48188 61354 -80921 -5734 91440 -42601 -59530 84564 14223 -85224
3149 -85224 45262 64774 -78216 -12113 91468 -36856 -61043 81979 18661 -87289 40216
3160 40216 69559 -74977 -16926 91486 -34246 -65666 79039 24391 -86155 34647 70708
3171 70708 -73619 -22043 91721 -28393 -69140 74351 25933 -88703 29360 73465 -70795
3182 -70795 -29034 88304 -26669 -74206 71287 31514 -90003 21060 74076 -68855 -32693
3193 -32693 87994 -21436 -77456 63812 33913 -89278 16019 75746 -66439 -40851 84879
3204 84879 -15957 -80098 59772 38958 -89439 9022 76339 -61579 -44756 82787 -12102
3215a2102p1267J38279j2207j29875R1434P3616j36816Q607J32510q7459p9097
3226h4377J34554l460j31685Q3520Q2776j33235k040J32720p9750q3097J31674
3237D7600M338j34887P7026Q7406j29366p457J35186p3826r0931J27875J4143
3248E7107j36310P1079R2647j26731j6753J36221o5539r4804J25169J9043j37626
3259g6497O3798R9559j22744k3722J36563n9554j01354J21042K9386j37286N4590
3270a6219J02505j17219l1416J37067n0597j05803J14112L5985j37199M7790J08588
3281H7594j11975m1182J36272m2052j11005J09894M4742j36008L7763J11615j06045
3292b0387m7120J35239l4567j15492J02971N3082j34873K9996J16704j02136n5620
$$ plain form
3215 -12102 -83369 54910 42703 -87172 4262 77878 -58938 -50331 82179 -5280 -84377
3226 -84377 50177 46717 -84968 -1448 81328 -51907 -53947 78773 -977 -84074 47600
3237 47600 51938 -82949 -5923 81483 -47883 -55340 79846 6020 -84911 42964 57107
3248 57107 -79203 -8124 84523 -42208 -58961 77260 11721 -83083 42086 61129 -76497
3259 -76497 -12699 86860 -35884 -59606 76957 17403 -83951 37091 66477 -70809 -16219
3270 -16219 86286 -30933 -62349 74718 24121 -81682 32430 68415 -68784 -20994 87594
3281 87594 -24381 -65563 70709 28657 -82348 27546 72288 -63720 -25957 85658 -20387
3292 -20387 -67507 67732 33165 -82327 20644 73726 -61147 -31151 85553 -16583 -72203
3303g2203J34677k4724j18671R5954N9489j33613K0904J19576r2073o2955J31166
3314E7527j8406j21994R1809O6437j30780J3217J22507q8815o9816J30277r029
3325D2934j23276Q3312P2201j28750O266J25544q1799p5549J26866l774j24981
3336h1006Q0111P7450j25995k674J26226p4113q1277J24617N871j28706P1392
3347h104Q4525j22419q555J28177o9179q6445J20850J3366j27954O4274Q8746
3358G7282j18649j6559J29124o0600r2005J15830K2431j29930N6846R4903j12827
3369c4154k5501J27817n4063r5057J13041K8374j28507M9078R8020j08735l2724
3380f2411J29667m4164j02957J06477L6376j27548M2767J03338j04115m1294J27800
$$ plain form
3303 -72203 62474 37750 -80921 15033 74522 -59091 -38187 81389 -10684 -73639 57527
3314 57527 39121 -82873 8936 75373 -55407 -42190 80317 -8498 -78314 51963 42934
3325 42934 -80342 2970 75171 -53579 -47313 78231 -3568 -79117 47749 43975 -81006
3336 -81006 -895 76555 -49440 -52114 74112 -1 -81278 43339 49210 -79496 -8104
3347 -8104 76421 -45998 -54553 73624 4445 -82000 38850 52216 -75738 -11464 77282
3358 77282 -41367 -57926 71198 10598 -81407 34423 56854 -73076 -16230 78673 -34154
3369 -34154 -59655 68162 14099 -80958 32083 60457 -68050 -18972 79048 -29687 -62411
3380 -62411 67256 23092 -79865 26612 62988 -64560 -21793 81545 -22570 -63864 63936
3391F3936l6577j04580J02064M2447j27396L4095J05940r8020m6423J27891k9693
3402C3684j10561R5255N1346j26040K6454J11177r4566n3485J25533k1980j11023
3413g4206R0039N6132j25644J9786J12715q6503n9596J22928j6120j15021Q5237
3424I747O3765j23054J1331J15475q1902o5520J21664q824j16400P8908O7278
3435G2468j19357M041J17701p5788p2046J19859j187j18593P2770P4310j18115
3446d3937m667J19869o8850p6290J15425O221j20175O5113P9333j12869j0039
3457e0866J19844o3300q3132J12061J6162j20625N8449Q3703j10234j8726J22158
3468F5494n4561q7210J06969K0852j20939N1551R1238j05872k5644J20565m8453
$$ plain form
3391 63936 27359 -77221 24843 67290 -60106 -26011 79929 -18091 -64514 63377 33684
3402 33684 -76877 18378 69724 -56316 -29862 81315 -13251 -66736 58797 36817 -74206
3413 -74206 15833 71965 -53679 -33893 78822 -7681 -67277 55651 39531 -75490 9747
3424 9747 73512 -49542 -38211 77264 -4638 -70158 51506 42682 -73718 5190 72468
3435 72468 -46889 -42848 74853 -935 -72981 46878 45691 -72902 -132 74178 -43937
3446 -43937 -48604 71265 2415 -73875 41550 47771 -72404 -7291 72042 -40827 -50866
3457 -50866 68978 5678 -77454 34607 50769 -69856 -11407 72296 -37938 -56664 65494
3468 65494 10933 -76277 30692 51544 -69395 -17844 73394 -32478 -58122 62443 13990
3479A3990r1177J03959K9317j21696M4240R3669j01407l2524J20966l9396r5619
3490g5678R8237L4533j20121L7764R9207r6420m0589J19985l3928r8047R4710
3501A9653M2112j20952L0258J01275r0206m4813J19440k7974j02686Q9751M8294
3512F4152j17680K3738J03647q6848n1227J18569j9688j06058Q3921N4851j17350
3523d9973J6494J07499q1344n7325J15327j3128j06954P8115O0536j14133Q839
3534c6047J08711p5639o2462J14192n134j10974P1228O6784j12041J985J11915
3545G2518o9772o9845J10341J902j10697O6617P0367j09431o715J13454o2688
3556F051p3068J07339P651j14054O0294P6963j04681j3277J12597n5731q0095
$$ plain form
3479 13990 -77187 26772 56089 -65607 -21367 72302 -29105 -61629 59337 19941 -75678
3490 -75678 22559 57092 -63029 -25265 73942 -22478 -63067 56918 22990 -75057 19653
3501 19653 61765 -59187 -28929 72346 -17860 -62673 56767 28793 -73893 15858 64152
3512 64152 -53528 -29790 73857 -12991 -64218 54351 34663 -71395 12526 67377 -49973
3523 -49973 -33479 74020 -7324 -64649 50678 37550 -69404 8711 69247 -44886 -36047
3534 -36047 72664 -2975 -65437 48755 43621 -67353 3875 70659 -41382 -39397 72518
3545 72518 2746 -67099 43242 45144 -65553 1064 71431 -38000 -44715 68739 6051
3556 6051 -67017 40322 47973 -66081 -5787 71176 -33505 -46782 65815 10084 -70011
3567g0011J04063J5776j12280N2500Q0897j03843j8926J15104n0378q2914J00252
3578C0240K0981j14243M6672Q6100r7358k6533J13266m4239q7197R7179K8693
3589E3561j14391M0662Q8441r4882l0295J13776l7810r1502R2405L3848j12147
3600e8334L4021R2661r1053l7673J12495k9659r4270Q7842M0396j12121K7646
3611b8049R5091q4425m4287J11971k4087r8429Q3566M7655j11343K0790R8902
3622F7355q0904m9545J10700j6429r9302P6578N1824j08645J3355J02631p4697
3633g079n6162J07228r373j01727P2606N8847j07569N954J03674o9465o1020J06806
3645D2720k135j04530O5128O3950j03842o3J05209o3911o6422J04088L105j05390
$$ plain form
3567 -70011 34052 49828 -62452 -9952 70945 -32898 -51824 63280 12902 -70012 30240
3578 30240 51221 -63022 -16350 69750 -27608 -54141 59125 14886 -72311 24868 53561
3589 53561 -60830 -20168 68273 -26609 -56904 56872 19062 -72440 19965 53813 -58334
3600 -58334 -24313 68348 -22705 -60378 52117 22458 -71812 16030 56426 -55695 -28049
3611 -28049 67042 -17383 -61670 50301 26214 -72215 11351 59006 -52337 -31547 67355
3622 67355 -13549 -63094 47606 31177 -68125 8453 60277 -48368 -35013 67618 -7079
3633 -7079 -63241 43987 34614 -67113 5493 64340 -43229 -37275 66399 -3066 -64086 42720
3645 42720 40585 -63945 1183 65133 -38709 -38772 66437 2526 -63896 40192 43297 -62093
3657f2093O1872O8010j02833o552J05704n6410p1399J00689R614j06930N4980
3668e348P3969r8798j2533J06101n2898p6083R9130J5815j06880M8931P6447r5861
3680b8008j9303J08622m6314p9450R3450K1744j07671M4185Q0526r1923k5192
3691d9334J06968m0861q2607R1321K7641j08134L6153Q5309q8731l0325J07474
3702E4874l4320q7380Q6339L4260j06648L0789Q8328q4324l8621J06051k6395
3713B2953q9388Q0970M0328j06627K3762R2285p9093m4118J06488k1458r4081
3724f7979P7001M8647j05582J6863R3327p4388m9079J04516j4263r4743P1470
3735E790N1400j03574J1757R7200o9892n4545J01321p525r7342O7549N7238j01091
$$ plain form
3657 -62093 -221 67789 -35044 -41596 64108 7698 -63701 36988 46602 -60328 -5348
3668 -5348 68621 -30177 -42710 63391 10493 -65590 33540 49355 -57525 -8594 67853 -28008
3680 -28008 -47311 61311 14997 -64453 28997 50741 -56930 -12745 67781 -24142 -49334
3691 -49334 57634 16773 -65834 25487 53128 -55006 -18853 66456 -22275 -52600 54874
3702 54874 20554 -66826 19513 53773 -52875 -22086 66242 -18082 -56703 49348 22953
3713 22953 -66435 14535 54863 -51764 -28002 64283 -14810 -58928 47560 26102 -67979
3724 -67979 9022 57669 -47913 -31050 62277 -12111 -61190 43326 29063 -65680 5790
3735 5790 57190 -46384 -34627 62573 -7319 -61864 39457 31932 -65410 2139 59377 -41714
3747d1714L568R7805o3782n8621J01089j954r9230O1324O2328r9367j427J00996
3759F1015o0000o4077R7982N364j01041N7590O5552r6600q132J01548n3483o7759
3771f2041R5299R440j00955N1192P1210r3505j2733J01206m9381p2553R3503J6729
3783D7411j02072M5024P4128r0767j8123J01400m2251p5803Q8174K2498j02378
3794e2759M0901P7989q7621k6114J02844l6708p9908Q5697K8655j03185L3407
3805a6802Q2348q3043l1849J02417l0277q4272Q0554L4310j00611K6853Q5849
3816F5477q0634l8450J02495k3059q7257P7491L8814j02180K2171Q8439p4166
3827a0859m3163R9875j9068q8646P3190M4916j00712J5901Q9631p0565m8058J00458
$$ plain form
3747 -41714 -38146 59659 -4123 -62744 38345 36391 -62839 -1515 60813 -38554 -39981 61015
3759 61015 1015 -63062 34920 40284 -60757 -3167 62385 -34215 -42347 59201 5718 -62041
3771 -62041 33258 42698 -58257 -7065 64145 -29360 -42093 59113 9732 -62821 30682 47411
3783 47411 -54661 -9637 64491 -26276 -44399 57001 14750 -61053 27121 49619 -52759
3794 -52759 -11858 66131 -21490 -47604 55240 18532 -61376 24321 52976 -50209 -16802
3805 -16802 65546 -17497 -49346 53071 22794 -61478 19076 53386 -47225 -20372 65477
3816 65477 -15157 -53607 48888 25829 -61428 16063 54877 -47303 -25132 63307 -10859
3827 -10859 -54022 45853 26785 -61861 11329 56245 -44467 -28566 61065 -9500 -57558 42900
3839D2900j2805r2325O8101M9489r8722R869R2749o5220n2729R6814p050r3664
3851f2593O5260N4618r7044L689R3675o1761n6376R5851n61r5896N7698O0017
3863E6577r4264j352R5339n5962o2181R3564N595r6102N2764O4240r1988q017
3875d1787R7426n1410o5969R0846J1549r8103M7978O8822q9166j4706R8949m5686
3887H743p0081Q7253J8054r8145M2115P1876q6191j9621R8783l8910p4992Q3978
3899B2862K3792r8768L7783P6138q2861k6380R7451l1717p7684Q0845K8471r8718
3911d8786L0780Q0148p8211l1505R8783l0008q1488P7937L4739r7903K5701Q2390
3923F2577p5483l7201R7914k2418q3300P3660L8900r8460K0383Q6330p2327m1749
$$ plain form
3839 42900 30095 -62230 5871 55360 -43362 -33493 59256 -5964 -58693 38121 31071 -62593
3851 -62593 2667 57285 -39759 -36070 57605 -4156 -60532 35319 34758 -61138 -3440 56577
3863 56577 -37687 -39039 56300 338 -61843 31721 37316 -58786 -6022 58218 -33770 -41787
3875 -41787 55639 4229 -61740 29106 40655 -57448 -9470 59352 -29814 -44520 54429 8743
3887 8743 -61338 25915 43969 -54176 -12061 59815 -26376 -45997 52786 13876 -61116 22862
3899 22862 46654 -52114 -14331 61807 -21054 -47434 50017 18300 -59384 21461 49932 -48786
3911 -48786 -18006 62142 -16069 -47574 51209 21201 -60287 17650 52389 -45514 -19813 62577
3923 62577 -12906 -50107 47807 25389 -57911 15749 54649 -43811 -23428 62902 -9425 -51174
3935e1174R6989j7905q6928O9911M5657r6463J3401Q7628o8681m6099R6787j1542
3947C1581q8709O4168M8183r4413R510Q9664o3744n1526R3786m556r1529O0052
3959B467N4551r3366J328R2559n7721n7332R2369M07r2984N5795N9155r1572m074
3972c8418R4097n3972o1377R0386O895r4869N0616O4076q9700r727R5182m7983
3984E206o5118Q6600J1881r4575M6037O7690q6250j6178R5062m3010o8202Q5201
3996B4344J8014r6228L9322P1124q2773j9730R5984l7195p3701Q0966K3799r6247
4008e2321L6209P4824q1316k5932R6348l2396p6839Q0205K8900r6864K9740P8166
4020E8724p7227k9997R6175k7422q0177P5351L3488r4638K5052P9579p3007l6819
$$ plain form
3935 -51174 45815 27910 -59018 10893 56550 -39913 -26512 61116 -7565 -53664 43123 31581
3947 31581 -57128 7040 55223 -39190 -29680 59984 -3760 -55286 38500 33944 -57585 2467
3959 2467 57018 -36348 -35020 57539 -182 -57514 34855 35262 -57722 -1927 57228 -34344 -38418
3972 -38418 55679 1707 -59670 30716 37611 -57258 -6642 57434 -32266 -41993 53189 5206
3984 5206 -59912 26688 38569 -56006 -9969 57721 -28529 -44707 50355 7345 -60857 24344
3996 24344 42358 -53870 -14548 56576 -26197 -45927 50057 12862 -60839 20127 43926 -52321
4008 -52321 -16112 58712 -22604 -48536 47812 15416 -61423 18782 47682 -49182 -19442 58724
4020 58724 -18503 -48500 47675 20253 -59924 15427 48915 -45723 -20671 58908 -14099 -50918
4032e0918R6124k1386q1654P1849L8050r5368J9306Q4263p0064m1754R5035j5406
4044B8077q4896O7433M4110r3747J3458Q4788o4864m5609R2704r603q8594O4109
4056G366M9370r2819O023Q9201o0458n2284R1565l187q8527N7240N3993r0813
4068c3330j02R0205n5000n5426Q8988J031r1407N3532O0325q9333m488R0502n1605
4081C892o0472Q7694R200r3300M8032O2510q6632j0116R3242m7101o4276Q5845
4093B8518J1543r3700M4154O7017q3576j6249R3135m2279o7759Q2609J8861r3547
4105e1273L7948O9264q1510j9843R4198l6492p2212P9508K3763r4076L4036P4448
4117E7759p9602k6025R3680l0303p5996P6964K8980r4488K8710P6694p4591l1856
$$ plain form
4032 -50918 45206 23820 -57834 14015 52065 -43303 -23997 60266 -9798 -51552 43483 28077
4044 28077 -56819 10614 54724 -39023 -25565 59223 -5641 -51250 41454 31851 -56743 7366
4056 7366 56736 -36083 -30060 59141 -1317 -53601 37964 34777 -53750 3490 57483 -33330
4068 -33330 -33432 56773 1773 -53653 35335 36366 -55041 -1509 58816 -30517 -35005 55497 3892
4081 3892 -56580 31114 40314 -52986 -4954 57556 -29076 -39192 54050 6949 -57327 28518
4093 28518 40061 -53639 -9485 57532 -26044 -42293 50842 8563 -59196 23413 42274 -51273
4105 -51273 -13325 55939 -25571 -45414 48784 12292 -59920 19588 43351 -50725 -16689 57759
4117 57759 -21843 -47868 45812 15509 -60487 16477 45457 -49031 -20321 56373 -18218 -50074
4129e0074R3741k5242p8517P3766L4017r3870K2520Q0380p1706l6229R3660j9379
4141B3067q1430O8195L9992r3184J6980Q3259o6447m2476R2600j5343q2673O4917
4153G457M5115r2110J0916Q5177o3403m5788R1642q479q5864O0248M9040r0064
4165c6113O166Q7265n9296n2411R1527l090q7805N6861N3203q9358K31Q8431n3533
4178B078n5428Q8321J432q9438N2150N7754q6739l954Q9176m9938n9943Q6177
4190C1648P748r0102M7006O1683q5363j0248R1351m4843o3637Q2872J2361r0754
4202e0278M2906O6360q2763j6757R1227l9684o6317Q0277J8182r1920L7449O9201
4214E7883p9820k1107R2562l5652p1330P7674K4632r2619L1983P1842p5111k7293
$$ plain form
4129 -50074 43667 18425 -60092 13674 47691 -46179 -23659 56721 -14985 -51214 42446 23067
4141 23067 -58363 9832 49824 -43360 -26380 56879 -9568 -52044 40556 25213 -57460 7457
4153 7457 52572 -39538 -28622 56555 -6848 -52636 39006 30527 -55337 4911 53951 -36113
4165 -36113 -29947 57318 -1978 -54389 37138 34048 -53757 3104 56307 -33051 -32820 55611 2078
4178 2078 -53350 34971 36403 -53035 -885 56869 -29870 -33824 55352 5414 -54529 31648
4190 31648 39396 -50706 -3700 57983 -27380 -37628 53723 8880 -54757 28115 40476 -50278
4202 -50278 -7372 58988 -23775 -40532 50695 11011 -55306 24971 43153 -48767 -11318 57883
4214 57883 -21937 -43044 49518 13866 -57464 20210 44842 -47777 -15794 56048 -19063 -46356
4226d6356R2499k9298p4683P4820K9122r2899K6321P7207p3569l1370R1403k3746
4238A9451p8788P1359L5941r1805J9847P8591o9067l7275R2389j7972q1125O7788
4250I334L9018r1461J5774Q2976o5974m2661R0799j2720q3074O3553M4697r0170
4262c9909J0428Q3691o1562m6111R0040q835q4154N9254M8133q8336O135Q5356
4274E4130n7157n1145Q7661j867q6227N5366N2708q6995n35Q7601n2239n4802
4286e3501Q5968J766q7291N1156N7123q4635n945Q8541m8619n9270Q4891Q660
4298C8844q9132M5615O0475q2053j0751Q9313m2319o4049Q2285J2975r0737M2778
4310f756O4058q0149j7067R1225l8540o7591P9612J9075r0215L4954O9101p7618
$$ plain form
4226 -46356 46143 16845 -57838 16982 46104 -46795 -20474 56733 -16836 -48206 43197 19451
4238 19451 -59337 12022 47963 -43842 -23995 54596 -14471 -51746 40643 22671 -58454 9334
4250 9334 48352 -43109 -27335 55641 -10333 -52994 37805 25085 -57989 5564 50261 -39909
4262 -39909 -29481 54210 -7352 -53463 36577 27742 -56412 2842 50975 -37361 -31226 54130
4274 54130 -3027 -54172 33489 31622 -54605 761 53469 -33526 -34061 53540 1301 -53501
4286 -53501 32467 34233 -53058 -1902 55221 -29414 -35359 53182 4563 -54707 30184 38844
4298 38844 -50288 -4673 55802 -26251 -37002 52311 9992 -54057 28228 41203 -49534 -6756
4310 -6756 57302 -22847 -39914 51311 12771 -54820 24792 43867 -46348 -11394 57707 -19911
4322a9911k1044R0560l3793p0777P5946K4746r0228K9958P2236p4837k7698R1182
4334D6340k7470p2975P2332K8757r0765K4869P5305p0496l1935Q9446k2723p6407
4346e5722O9352L4548q9790J9945P6999o7801l5951Q9703j8351p8684O4609L9628
4358D8485q9319J5152Q0395o4202m1460Q8636j2832q0955O2477M2580q8166J0025
4370b9184Q2475o0524m4967Q7743p450q3564N7009M9141q7632N231Q3828n6102
4382c996n0091Q6027j821q5360N4418N1456q4953k11Q5364n0533n4296Q3966L522
4395C3492q6979M8569N7615q2663o927Q6708m6442n8437Q2280R785q8242M4153
4407g088O0458q0333j1975Q8632m1494o3048P9593J4819q7596L8856O4137p8333
$$ plain form
4322 -19911 -40955 49605 15812 -54965 20981 45727 -44501 -14543 57693 -17144 -44842 46340
4334 46340 18870 -54105 18227 46984 -43781 -18912 56393 -14103 -46038 43408 20685 -55722
4346 -55722 13630 48178 -41612 -21667 55332 -12469 -48420 41283 22932 -55752 8857 48485
4358 48485 -40834 -25682 54713 -9489 -50949 37687 24855 -56100 6377 48957 -39209 -29184
4370 -29184 53291 -7233 -52200 35543 28093 -55471 1538 50679 -36953 -31722 52106 -3996
4382 -3996 -54087 31940 30119 -55241 -823 50633 -34320 -34531 50833 300 -53996 29970 33492
4395 33492 -53487 -4918 52697 -29966 -36893 49815 3373 -55064 27216 37001 -51241 -7088
4407 -7088 53370 -26963 -38938 49694 8200 -54848 24745 39564 -48032 -9176 54961 -23372
4419b3372j6302Q7555l6429o5172P6936J8587q8475L4750O6788p4352k1219Q8476
4431D7771l2989o8695P4262K3843q7277K9403O9351p1822k6430Q7700k5917p1820
4443e2620P0083K8432q7452K4631P2835o8620l1579Q8141k2980p3877O7139L4265
4455D8398q7723K0130P3851o4989l5321Q6730j6017p7437O3049L7363q5810J4285
4467b3491P8401o1471m1951Q5985j1159p9525O0467M2252q6017Q528Q1132n7787
4479d636m4558Q4755p128q1396N5682M7265q3996L988Q1399n3783m9402Q3612
4491C1802j210q3102N0897N1631q2873j257Q3633m8865n3533Q1029L194q2938
4503e1592M7053N4923q0098n631Q2521m4534n6816P9438R502q4893M1479N8997
$$ plain form
4419 -23372 -39674 47881 11452 -53720 23216 41803 -46672 -11922 54866 -19486 -40705 47771
4431 47771 14782 -53913 20349 44192 -43085 -13682 55669 -16153 -42583 45117 19200 -52620
4443 -52620 17463 45895 -41557 -16926 55909 -12711 -44290 43851 20871 -53006 14133 48398
4455 48398 -39325 -19195 54656 -10333 -45654 41076 25059 -52378 10671 48034 -37776 -23491
4467 -23491 54910 -6561 -48512 37473 26314 -53211 7256 49508 -36509 -27981 53151 -4636
4479 -4636 -49194 35561 28433 -52963 2719 49984 -34012 -30024 51375 -2408 -51810 31802
4491 31802 30592 -52510 -1613 50018 -32855 -34112 49521 656 -52877 28152 31346 -51592
4503 -51592 -4539 50384 -29714 -35345 47176 2642 -54174 25264 34766 -50127 -8648 50349
4515E0349p6958j1391Q5008m1071n9482P6321J3041q4154L7850O1645p5195j6492
4527d0529Q5706l4831o3711P4708J7662q5777L3069O6163p1965k1408Q5623l1139
4539A3571o6781P0029K5664q6080K8622O7763o9296k5699Q5145k5840o9177O7957
4551A5878K8478q5418K3494P1584o6595l0468Q4650k1133p1616O4199L3527q3802
4563c7222J7287P3252o2447l5454Q3949j4902p4667O0644L7962q4134J3138P5571
4575E2977n8634m0462Q3047r929p6607N6207M2720q2272P269P7799n5189m3228
4587d6302Q1125n591p8474N2280M6649q0908K938P8705n1119m8182Q0593j93p9987
4600d8466M8541M9483p9192k156Q0600m6395n1932P8130M038q0993M5489N2601
$$ plain form
4515 50349 -26609 -38000 47008 5937 -53545 22776 35817 -48337 -10487 51158 -24037 -40529
4527 -40529 45177 10346 -53365 21343 39005 -46772 -13703 52460 -19505 -40913 44710 13571
4539 13571 -53210 16819 42483 -43597 -14975 52788 -16508 -42207 42938 17098 -52079 15878
4551 15878 44356 -41062 -17568 54016 -12579 -43047 41603 20470 -51146 13053 46580 -37222
4563 -37222 -19935 53317 -9130 -44584 39365 24463 -50204 10440 48402 -35732 -22594 52977
4575 52977 -5657 -46119 36928 26999 -49608 6599 49319 -32953 -25684 52115 -3074 -46302
4587 -46302 34823 29232 -49242 3038 49687 -31221 -28283 50422 -697 -48879 31714 31521 -48466
4600 -48466 75 49558 -29634 -31790 48810 2415 -49517 28613 32651 -48342 -2853 49748
4612D9748p7378p080Q1439m2083n5803P6082R684q2159L9305N7477p4669j1379
4624c6816Q1782l7605o0045P3540J4203q2558L6858N9999p2159j6637Q2090l2756
4636I896o1559P0345J8657q1954L0089O3414o7705k2357Q1925k8324o4661O7774
4648A5540K4026q1539K5146O5752o5818k5300Q1982k3731o6841O3884K7747q1244
4660d0396K0889O9892o2800l1297Q1344j9069o9417O1322L3338q1170J6351P0856
4672D9843n9901l4002Q1164j4072p2656N7629L7373p9283J0938P3420n6928l8484
4684d4959P9686q897p4142N4239M0359p8413O930P4450n2169m0969P7249n086
4696B8278p4846M9286M5199p5680J348P4927m8281m5301P6104j00p5850M5772
$$ plain form
4612 49748 -27630 -34710 46729 4646 -51157 24925 34609 -47550 -8245 49232 -25437 -36816
4624 -36816 44966 7361 -52684 20856 35059 -47499 -10641 49358 -22801 -39438 42652 9896
4636 9896 -51663 18682 37339 -44615 -14526 48888 -18817 -41174 40751 12427 -52234 15540
4648 15540 39566 -41973 -16827 48925 -16893 -42193 39789 16058 -50783 13101 40848 -40396
4660 -40396 -19507 50385 -12415 -43712 37632 18563 -50854 10468 43806 -37364 -21013 49843
4672 49843 -10058 -44060 37104 23032 -49624 8005 45378 -33905 -22967 50453 -6475 -44959
4684 -44959 34727 25830 -48312 5927 46286 -32127 -25197 49253 -2916 -43885 33364 28278
4696 28278 -46568 2718 47917 -27763 -26415 48512 231 -45070 31034 30934 -44916 856
4708H56M7780p5411k374P7181m4344m9674P3504N024p6664M1429N2344p3722p465
4721c1536P6743l9014n3198P1431J0086p8839L8098N4770p0167j1684P7150l5611
4733H229n6569O9661J4206p8011L3158N8532o9720j6383P8201l0262n9619O6544
4745A7967J8542p8572K8677O0422o4313k0833P7335k6144o3223O4457K3054p7314
4757c9945K3515O3272o2563k5319P7146k0712o4666O0321K7258p6943J9461O5395
4769D6220n8425k9981P7244j7760o6129N8323L0447p6051J4844O6746n5272l3652
4781d3446P6647j3043o8532N4487L5010p4706J0484O9065n2732l7099P4410p664
4793B2881o9212N0506L8694p4155O094P0610m8150m0235P2206l661p0367M6612
$$ plain form
4708 856 48636 -26775 -29149 48032 3688 -45986 27518 32542 -44122 -2693 49651 -24071 -31536
4721 -31536 45207 6193 -47005 24426 34512 -44327 -6229 48541 -21626 -33310 43840 8229
4733 8229 -48340 21321 35527 -42484 -9326 49206 -20514 -36897 41304 11042 -48577 17967
4745 17967 36509 -42063 -13386 47036 -17277 -38110 39225 13081 -50142 14315 37369 -39945
4757 -39945 -16430 46842 -15721 -41040 36106 15394 -49272 11049 38307 -38636 -19175 46220
4769 46220 -12205 -42186 35058 17298 -48831 9492 39939 -36112 -21268 45478 -9794 -43446
4781 -43446 33201 20158 -48374 6113 41123 -33583 -23099 45966 -6766 -43865 30545 22881
4793 22881 -46331 4175 42869 -31286 -25192 45418 -2732 -42967 29239 25578 -44789 1823
4805A823M2869p2663J511P0663m4303m3523P1291J441p2221M2326M6419p0722
4817b5089l053P2120l9659m7986O8959N785p2499L8648M9967o8930q443P2704
4829D2524l5897n0750O8063R591p3078L4251N1716o5135j2387P3141l2486n3676
4841d4123O4111J5103p3067L0259N4257o3242j6767P3856k8686n6178O2610J7689
4853C5822p3078K5747N7610o0849k0495P2895k4410n7814N9017K1894p2477K2704
4865a3434N8391n7941k3831P1779j9341o0071N5579K6061p2115J7404O1940n4832
4877a0411k9843P2375j4732o2017N3665K8769p0454J2051O3657n1670l1481P0516
4889C0425j1790o3672N0751L3483p0118P835O5330m8671l5437O9662o015o6275
$$ plain form
4805 1823 44692 -27971 -26460 44203 -100 -43623 27668 29109 -43112 -786 45633 -25089
4817 -25089 -28142 43978 4319 -43667 25292 31077 -41422 -2774 47193 -21737 -30180 42524
4829 42524 6627 -44123 23940 33531 -39547 -5296 46420 -18715 -31102 42039 9553 -44123
4841 -44123 19988 35091 -37976 -7717 46540 -16702 -33469 40387 11701 -44477 18133 35822
4853 35822 -37256 -11509 46101 -14748 -35243 37652 13242 -44572 14445 36339 -36138 -13434
4865 -13434 44957 -12984 -36815 34964 15623 -44448 11131 37192 -34923 -17519 44421 -10411
4877 -10411 -40254 32121 17389 -44628 9037 37806 -32648 -20597 43060 -8610 -40091 30425
4889 30425 18635 -45037 5714 39197 -30921 -23086 42244 -6427 -41864 27798 21783 -44492
4901d4492M6285L7544o8794M480O5906m4551l8562O7582k449o6902M3829M1338
4913D1214o7243n23O6715m0717m2564O7713K040o8115L8847M4419o5654l435O8337
4926D1034l7318m5734O4406O051o8176L5002M7355o4356p714O8261l2995m7258
4938d1442O2123J0071o8607L1724M9402o1651j1307O8461l0114n0238N9856J4905
4950C3183o9597K8833N1568n9476j6063O9074k5636n1977N6506J7846o8345K4196
4962i888N4371n7077j9732O7745k1854n4610N5580K1358o9119K0061N6245n3627
4974a0547k3363O8145j8755n6920N2798K5123o7701J5891N8201n0978k7501O7476
4986C1869j3991n9237N0400K8599o7930J1239O0284m8315k9593O5513r333o0850
$$ plain form
4901 -44492 1793 39337 -29457 -24977 40929 -3622 -42184 25398 22949 -43953 -124 41214
4913 41214 -26029 -26552 40163 -554 -43118 24595 26635 -41480 -2633 41786 -23868 -27303 41034
4926 41034 3716 -42018 22388 28439 -39737 -4735 42620 -21736 -29450 38811 5816 -41442
4938 -41442 20681 30752 -37855 -6131 43271 -18380 -29687 38774 8660 -41578 18278 33183
4950 33183 -36414 -7581 43987 -15489 -31552 37522 11886 -40091 16415 34261 -34084 -9888
4962 -9888 44483 -12594 -32326 35419 13565 -41045 14535 35893 -33226 -13165 43080 -10547
4974 -10547 -33910 34235 15480 -41440 11358 36481 -31220 -15329 42872 -8106 -35607 31869
4986 31869 17878 -41359 9041 37640 -30290 -19051 41233 -7082 -36675 28838 19505 -41345
4998d1345M6266L2828o5635P707O0309m5238l4284O5448m579o1743M2825L4955
5010C7514o5572N026O2311m1466l7437O4537k775o2530L9872L8181o2062r98O2997
5023C7598l7946l9911O2153K337o3650L6969M0705o1428m166O4110l4662m3987
5035d1878O1216O797o4836L3353M3961n9453p592O3860l0347m5073N7655R784
5047B7447o4464K9913M7389n8606j1142O3993k7789m7747N7204J4041o4398K4382
5059i777N0237n5740j4966O3950k3402n0417N4399J7087o4037K1721N1723n2654
5071a1876k0057O4673j9913n1600N0962K1862o4197J7760N2985n0431k2553O4339
5083C1954j5407n4514M8273K4743o3551J3997N5264m7300k6581O2843j2350n4816
$$ plain form
4998 -41345 4921 37749 -27886 -20179 40130 -5108 -39392 26056 21477 -40266 2559 37514
5010 37514 -28058 -23032 39279 -2187 -39624 24913 22138 -40392 -520 37661 -24401 -25399 37598
5023 37598 -348 -40259 21894 24231 -39419 -2450 38255 -23173 -27339 36771 2109 -41878
5035 -41878 19338 26135 -38701 -5348 38613 -20840 -28432 35428 5081 -39992 17663 27447
5047 27447 -37017 -7104 40285 -18321 -29463 34530 6741 -41006 16198 30239 -34159 -9777
5059 -9777 40460 -15280 -30246 33704 10302 -40115 14284 31371 -32666 -10945 40778 -11876
5071 -11876 -31933 32740 12827 -38773 12189 34051 -30146 -12386 40599 -9832 -32385 31954
5083 31954 16547 -37967 10306 35049 -28502 -14505 40759 -6541 -33122 29721 17371 -37445
5095c7445M5340K8012o2239R253N6708m4351k9254O2684r429n6647M2554L0716
5107C5902o0984O081N7668m2011l1849O1122m497n8109L9230L3977o1107L666
5119b0911N8476l8126l5479N9634j109n9255L6779L7116o0313m14N9453l5771
5131H0l7557N8825K627o0257L3033L9324n6758n497O1219l2681m1139N7427N774
5144B4420n9971K9739M2029n5968p943O0759k8525m2907N4235J0008o0325K6061
5156h388M4777n3168j1922O0697k5473m5844N1919J5327o0508K2271M6810n1999
5168a5501j5209O1175k0973m7834M9901J7150o0865K0441M8439m8249j9733O0753
5180B9495j7990m9393M7855K1197o1185J6888N0572m6889k2153O0304j3993n1704
$$ plain form
5095 -37445 7895 35907 -26332 -17079 39629 -4722 -33976 28708 19279 -37368 5186 35902
5107 35902 -25082 -19001 38667 -3344 -35193 25929 21432 -36677 2553 36530 -24577 -20911
5119 -20911 37565 -561 -36040 23594 22485 -36770 9 37125 -23188 -23602 35851 80
5131 80 -37477 21348 23975 -36282 -3249 36075 -20683 -26180 35039 2358 -38781 18646 24420
5144 24420 -35551 -5812 36217 -19751 -27694 33065 4540 -38367 15868 25876 -34449 -8388
5156 -8388 36389 -16779 -28701 31996 6523 -39321 12598 27925 -32583 -10312 36498 -15501
5168 -15501 -30710 30465 9492 -38342 11559 28709 -32156 -11715 36724 -11525 -31258 29495
5180 29495 11505 -37888 9967 31164 -30021 -13133 37439 -9450 -31603 28701 14708 -36996
5192c6996M5768K3740n9861J2863N1950m4138k4730N8460j0324n2821M3401K6417
5204C3729n8947Q785N4136m2026k7761N8355o952n4732M0461L0232n8380N406
5216a7694N4057l8279l1172N7447l730n4780L6674L2433n6328K203N4828l5064
5228E95l3978N5690j96n5989L4534L5316n5845k044N7126l2605l6804N4733L030
5241B3563n6522L0181L8782n4116n689N7604k9596l9546N3109O920n7429K7912
5253d827M1033n2327r399N6767k5560m0961N0893J0057n7844K3975M3745m9668
5265a4116j3002N7488k3309m3496M9928J3536n8022K1596M4549m9131j4644N7477
5277B8854j9908m5321M6987J6269n6501J7008M6893m6155j8536N7079j6218m6569
$$ plain form
5192 -36996 8772 32512 -27349 -14486 37464 -6674 -31404 27056 16732 -36089 7312 33729
5204 33729 -25218 -16433 37703 -4323 -32084 26271 19319 -35413 5048 35280 -23100 -17694
5216 -17694 36363 -1916 -33088 24359 20629 -34151 2523 34956 -21372 -19169 35659 595
5228 595 -33383 22307 22111 -33878 656 35972 -19873 -21917 35209 2604 -34200 20533 23563
5241 23563 -32959 -2778 36004 -18112 -23801 33803 4207 -35339 17770 24690 -32739 -4827
5253 -4827 36206 -16121 -25520 31247 5687 -35274 15619 25676 -32168 -8193 35552 -14116
5265 -14116 -27118 30370 7061 -36435 13493 27029 -30993 -9397 35152 -13979 -28623 28854
5277 28854 8946 -36375 10612 26881 -29620 -12612 34281 -11874 -30410 26669 10451 -36118
5289c6118M4607K0362n7077J4412M7480m3073k1546N6290j2365m9708M3497K3454
5301C0215n6811J1992M8903m1964k4079N6421r452m9924L9817K5100n5133Q106
5313a6809N1189l8375k7646N4844o007n1916L8346K9115n5247M361N1613l5213
5325a745l0526N4412k846n2814L5034L1228n3509J403N3871l4110l2814N3145
5337B0729J18n2783L2609L4034n2822k653N3773l0833l4377N2531K306n3501K8712
5350b157L7386n1424n880N4533k7339l8136N0431P031n4347K5938L8065m8770
5362a4669q657N4632k4808l9613M9468R426n4874K2460M1048m7927j1393N4868
5374B9961k1898m2346M7610J3606n4989J9524M2317m5687j4724N4727j8201m3491
$$ plain form
5289 -36118 8489 28851 -28226 -13814 33666 -9407 -30953 25337 12972 -36736 6761 30215
5301 30215 -26596 -14604 34299 -7665 -31744 24677 15225 -34699 5118 30218 -24915 -16809
5313 -16809 34380 -3995 -31641 23203 17196 -34720 3626 32741 -22506 -18145 33468 -1745
5325 -1745 -32271 22141 19295 -33519 1515 32743 -20766 -19363 34508 398 -32416 20729
5337 20729 20847 -31936 673 34707 -18115 -20768 33005 2172 -32205 20326 22632 -30869 -2157
5350 -2157 35229 -16195 -22075 32458 5119 -33017 17414 24445 -29902 -3964 34101 -14669
5362 -14669 -23326 31306 6498 -33115 16353 25779 -29095 -6635 34413 -13514 -24907 29961
5374 29961 8063 -34283 13327 26933 -28056 -8532 33785 -11902 -26626 28101 9900 -33591
5386c3591M4796J5871n5405J7299M5083m3989j8222N3845j4910m4900M2569J9199
5398B7645n4943J4278M6094m1733k0837N3837j2004m6705M0141K2910n4431R665
5410a6083M8738l9083k4628N3274p966m8237L8382K5100n3318P039M8473l6701
5422e010k6171N2846o489m9377L5997K8243n2451L607N0558l4988k9010N2395
5434B0150k321n0423L1900L1604n1825J297N1314l2211l1802N1200P96n0544K9946
5447i19L3024n0274k526N2183k9155l4389N0363L813n2394K7840L5430m9416n095
5460b1515N2219k6125l6785M8444Q163n3567K4746L8315m7675r243N3409k3709
5472F677l7957M5963J0299n3429K2447M0409m6108j2550N2559j9630m0345M5055
$$ plain form
5386 -33591 11205 27076 -28329 -11030 34053 -9936 -28158 25687 10777 -34123 8446 27645
5398 27645 -27298 -13020 33074 -8659 -29496 24341 12337 -34368 5773 28683 -25748 -16083
5410 -16083 32655 -6428 -31056 22218 14252 -33985 4397 29497 -23821 -16782 31691 -5010
5422 -5010 -31181 21665 15176 -34201 1796 30039 -22412 -18805 31753 -3235 -32245 20150
5434 20150 17829 -32594 -694 30910 -20915 -19618 31696 -515 -32317 18883 19679 -30865 -919
5447 -919 32105 -18169 -20695 31488 2333 -32056 18307 22120 -30274 -2434 32996 -16420 -21515
5460 -21515 30704 4579 -32206 16238 24401 -29166 -4420 33895 -13780 -23023 30386 6677
5472 6677 -31280 14683 24982 -28447 -6000 34409 -11699 -24249 28310 8680 -31665 13390
5484A3390J3210n3756J8916M2508m4451j5253N4190j8128m3283M2824J6974n3420
5496b6279J6734M3617m2692j7986N3295j4644m4061M1297J8995n3262J2647M5011
5508C2672l9810k0156N1181j0521m5891L8472K2882n3533J0211M6338l8020k3081
5520b9256N1797p925m7521L6855K5070n2838P228M8329l5338k6810N1699n271
5532A6019m8681L4659K6540n0232L549M8585l3318k8609N0661k420m8966L2170
5544d3K9562n0133L99M9826k9680l1330M8455J220m9132K8994L1844m8533k853
5557b1404N0045k7524l2399M7478M510n1057K6633L4674m7393n759N1540k5554
5569C790l5836M7571P094n1456K3721L6903m6548q253N1152k1961l8102M5304
$$ plain form
5484 13390 26600 -27156 -8240 34268 -10183 -25436 28754 10626 -32657 10167 27141 -26279
5496 -26279 -9545 34072 -8620 -26606 26689 12045 -32016 9281 28276 -24986 -12339 32672
5508 32672 -7138 -27294 23887 13366 -32525 5947 28829 -24704 -14493 31845 -6175 -29256
5520 -29256 22541 14616 -32905 3950 29020 -23818 -16590 31739 -3599 -30409 21290 16019
5532 16019 -32662 1997 28537 -21695 -18146 30439 -2879 -31488 19173 16753 -32213 -43
5544 -43 29519 -20614 -20215 29611 -69 -31399 17056 18276 -30856 -1862 29982 -18551 -21404
5557 -21404 28641 1117 -31282 16196 20706 -30351 -3718 30956 -16437 -22196 29344 3790
5569 3790 -32046 15525 22619 -28837 -5116 31787 -14761 -23014 28138 6177 -31925 13379
5581A3379J0884n1730K1255L8608m4819j1460N1534j9702l9869M5137J2309n1094
5593b5568J7949M0038m2575j4363N2419j7479m1513M1688J6423n1846J5916M1719
5605C2808m1152j6995N0820j3450m2849L9499J9256n1876J3089M3815l9554j9256
5617b5845M9918j1546m3462L8819K0650n1032J0030M4295l6853k2603N1067q641
5629A4797m5709L5442K3892m9481O360M5910l4319k4877M9429m850m7986L4800
5641C408K5898m9721L006M7688l2385k7860M9799l102m7227L0776K8871m8433
5653a9282M20M8749l0120l0938M8233R58m8530K8943L1464m8114k812M9341k7341
5666I71l2594M7631L238m9373K6030L4267m7054n215M9630k4821l4126M5451P157
$$ plain form
5581 13379 24263 -27467 -6212 32396 -12423 -23883 27651 7949 -31920 13217 25526 -25568
5593 -25568 -7619 32419 -10156 -24519 27900 10421 -31092 10596 27019 -24827 -8911 32808
5605 32808 -8344 -25339 25481 12031 -30818 8681 27937 -23939 -10850 32965 -6589 -25845
5617 -25845 24073 12527 -30935 7884 28534 -22498 -12468 31827 -5026 -27629 23438 14797
5629 14797 -30912 4530 28422 -21059 -14699 31211 -3108 -27985 21444 16594 -31392 3408
5641 3408 29306 -20415 -17409 30279 -2106 -29966 19833 16731 -30496 280 29151 -19282
5653 -19282 -18862 29887 -233 -31171 17062 18020 -30510 -1567 29897 -18217 -21029 28312 971
5666 971 -31623 16008 19246 -30127 -4097 30170 -16884 -22099 27531 2710 -31416 14035 21192
5679B1192n0393K3834L5325m5164q144N0162k2193l6359M4804Q581m9651K1332
5691f674L7847m4184j1549N1040j9220l9173M3357J2165n0865J8072L9970m1542
5703a0756j4043N0572j6695m0580M1516J5433n0626J5444M0989m0140j6804N1091
5715B5401j4309m1652L9169J8908n0522J2103M3174l8400j9236N0380j2639m2785
5727c0408L7950K0847n0216R238M4322l6242k2415M9428p577m4786L5295K3643
5739B9079m9949P215M5627l4828k3903M7879m212m5656L2337K5798m8538K834
5751a6317M7818l2951k7149M8506j914m7173K9658K9044m7857Q76M7746k9747
5763E40l0437M8015J38m7495K8572L0954m7027l716M9000k6057l2755M6046L963
$$ plain form
5679 21192 -29201 -5367 29958 -15206 -23350 26812 4619 -31740 13064 21645 -28006 -6674
5691 -6674 31173 -13011 -24560 26480 7260 -31913 11444 23609 -27256 -9184 30786 -10756
5703 -10756 -24799 25773 9078 -31502 10014 25447 -25179 -9735 31254 -8886 -25690 25401
5715 25401 11092 -30560 8609 27517 -23005 -10902 32272 -6128 -25364 25016 12377 -30408
5727 -30408 7542 28389 -21827 -12589 31733 -4509 -26924 22504 14927 -29859 5436 29079
5739 29079 -20870 -13655 31972 -2856 -26759 21120 16908 -28748 3589 29387 -19151 -16317
5751 -16317 31501 -1450 -28599 19907 17993 -29180 478 29522 -18335 -17459 30287 540
5763 540 -29897 18118 18256 -29239 -667 30287 -16740 -20456 28544 2487 -30268 15778 19741
5776A9741m8602K6124L2461m5015o497M9145k3796l4654M5849O183m9485K3050
5788e496L5258m4401q585M9733k1006l7041M3798R681m9184K0677L6374m2426
5800a2618j2158M9592j8319l8100M2441J1774m9215J7163L9530m1128j4036M9531
5812B4457j6659l9628M0557J5796m9777J5020M0393l9331j6996M9833j3541m1072
5824c0948L8304J8191m9649J2429M1635l7429j8976M8408r987m2281L6150K0409
5836B6256m8197R465M3104l5776k1939M8945p696m3679L4095K2869m8150O480
5848a4223M5276l3896k3397M6957m415m5005L2933K4712m8060L650M6485l1610
5860e93k6507M6784j829m5377L0031K7384m7147N82M6306k8491k8894M6151Q61
$$ plain form
5776 19741 -28861 -2737 29724 -15291 -21788 27357 3561 -31093 14756 20939 -28546 -5496
5788 -5496 29762 -14639 -23224 26509 5503 -31538 12260 21941 -27243 -6566 29808 -12618
5800 -12618 -24776 24816 6497 -31603 10838 22612 -26603 -9440 30090 -11038 -25074 24457
5812 24457 7798 -31830 8727 24523 -25254 -10234 30159 -9172 -26168 23665 10124 -30948
5824 -30948 7356 25547 -24102 -11673 29962 -7467 -26443 21965 11978 -30303 5847 26256
5836 26256 -21941 -12476 30628 -5148 -27087 21858 14162 -29517 4578 27447 -20703 -14223
5848 -14223 31053 -2843 -26240 20717 16302 -28703 4230 28942 -19118 -15468 31017 -593
5860 -593 -27100 19684 17855 -27522 2509 29893 -17254 -16672 29634 1143 -27751 18400 19261
5873A9261m7066K7350L0193m6014k112M6979k6120l1044M5204L434m7691K5457
5885b169L1660m3818n307M7400k3400l4225M4375P206m7627K1434L4175m2634
5897a2930q646M8623k1387l5654M3026Q897m7802J8573L7309m1892j1324M8456
5909B5249j8957l6496M0419J2786m8611J6148L8866m0034j3961M8571j6027l9014
5921c1061L9263J5841m8379J3982L9308l8300j6353M8033j2341m0207L6863J7527
5933B4176m7728J0903M0988l5862j9290M8222j0406m1697L5928K0189m7531Q695
5945a3413M1459l3926k1202M7463p413m2710L2830K3283m7009O225M2391l1371
5957c393k4484M7266n318m2857L1053K4859m6606L030M4730k9827k5646M5499
$$ plain form
5873 19261 -27805 -455 29738 -16276 -18388 28591 2471 -28573 16631 20065 -27626 -2169
5885 -2169 29491 -14327 -19634 27766 4366 -29859 14516 21722 -25905 -4471 29704 -12930
5897 -12930 -21576 27047 5660 -29994 13032 21929 -25873 -7300 30009 -11883 -23207 25249
5909 25249 6292 -30204 10215 23001 -25610 -9462 29404 -10630 -24591 23980 7953 -31061
5921 -31061 8202 24043 -24336 -10354 28954 -9346 -25699 22334 9993 -30214 6649 24176
5933 24176 -23552 -12649 28339 -7523 -26813 21409 11003 -30694 5234 25423 -22108 -13413
5945 -13413 28046 -5880 -27082 20381 12968 -29742 3088 26371 -20638 -14413 27978 -3393
5957 -3393 -27877 19389 14071 -28786 2267 27126 -19480 -16450 28280 -1547 -27193 18306
5969A8306j310m4938K9169K6913m5351J035M4445k8269k7366M4811J270m5733
5981b7018K6509K9443m4678j652M5153k4350l1137M3852L580m5630K3537L1844
5993B9453m2726n651M6707k3325l2183M2872O034m6061K1803L3213m2441p820
6005b0125M6626k0497l4267M0866J0132m7447J8994L5032m0277j0799M6714j7087
6017G865l5791L8235J2797m6981J6201L6987l8315j3989M6329j5177l7254L8775
6029I682J3563m6347J4048L7519l7301j4870M6450j2867l8732L5430J7280m6430
6041b2575J1300L9949l5868j8012M5710j0210l9887L4072J9843m5179P226M0752
6053B7121l2976j9957M4739n676m2032L1856K1836m5191N159M2466l1030k4143
$$ plain form
5969 18306 16996 -27942 1227 28140 -17211 -16176 28269 0 -27366 17445 18715 -27018
5981 -27018 -509 28934 -15744 -17396 27757 3407 -27730 16122 19702 -25928 -2391 29453
5993 29453 -13273 -18924 27783 4458 -27725 15147 21181 -24880 -3077 30136 -12305 -20125
6005 -20125 26501 6004 -28263 12603 22735 -24712 -5718 29314 -10963 -21762 24952 7865
6017 7865 -27926 10309 23106 -23875 -7674 29313 -9002 -22991 23338 8161 -29093 9682
6029 9682 23245 -23102 -9054 28465 -8836 -23706 22744 9877 -28855 6575 23855 -22575
6041 -22575 -11275 28674 -7194 -25206 20504 10294 -29593 4479 24322 -20857 -13631 27121
6053 27121 -5855 -25812 18927 13251 -28781 3075 24911 -20280 -15121 27345 -3685 -27828
6065b7828M5101l397m1855K9430K4405m4911L493M2100k9017k4656M4042j922
6077A4985m2683K7233K6664m3575L70M3396k6436k7332M2626J807m3502K4896
6089a551K9052m2824l169M4427k4143k9006M1597L911m3402K2146L1515m1959
6101a3406n142M4103k1752l0966M0563P024m4817K0558L2087l9702p739M4260
6113B5071j9379l2083L8446Q963m3746J7656L3188l7907j0693M4826j6515l3700
6125b5873L6917J0985m4120J5318L5289l6816j2832M4199j4308l5855L6209J4540
6137B3653m5072J4062L5309l5112j5023M3788j0789l7308L3238J6507m4676J1466
6149i957L7343l3033j7989M3994r216l7967L2373J8754m3983P594L8828l1345
$$ plain form
6065 -27828 17273 13876 -27979 1451 25856 -19055 -15562 26538 -2479 -27135 16907 14985
6077 14985 -27698 -465 26199 -17376 -17006 26390 -46 -27378 15248 17055 -26447 -1551
6089 -1551 27501 -15323 -18492 25935 1792 -27214 14383 18294 -25108 -2962 28553 -13406
6101 -13406 -18548 25555 3803 -27163 13400 20424 -24393 -3835 28252 -11450 -19189 25071
6113 25071 5692 -26391 12055 21018 -22728 -5072 28116 -9791 -20484 24342 7827 -25873
6125 -25873 11044 22029 -22091 -6773 28516 -8300 -21132 23067 8759 -27096 9113 23653
6137 23653 -21419 -7357 27952 -7160 -22183 21605 10816 -26492 6746 23253 -21423 -9957
6149 -9957 27386 -5647 -23636 20358 11142 -26825 5548 24302 -19681 -12087 26741 -4604
6161d604j9658M4139p140m0071L1219K0681m3499N335L9954k9054k2204M2230
6173A7328l550m0460K8281K3370m3315K914M0910k7102k4229M1742j673m0947
6185b6731K6574K4801m0862k01M0900k5268k5482M0494J287m0692K3663K6014
6197B4497l9918k803M2558k2908k7873L9877L557m2590K3071K7553l8597m883
6209a8459M2188k0206k9921L8213O884m2679J8924L0585l7429o741M2243j9732
6221C870l0169L7537Q398m1796J6441L2017l6079j0012M2206j5757l2464L5553
6233I745J0831m1769J4306L3649l5459j2157M2466j3630l3146L3679J3394m1420
6245a9511J1102L5418l3017j5134M2538j0959l5409L2164J5553m2135R985L6776
$$ plain form
6161 -4604 -24262 19877 12737 -27334 3885 24566 -18933 -13598 26356 -2698 -24902 17328
6173 17328 13778 -26682 1599 24969 -18346 -15432 25478 -1624 -25853 15889 14216 -26731
6185 -26731 -157 24644 -16218 -16419 24481 -787 -26269 14225 15512 -25180 -1517 24497
6197 24497 -15421 -18224 24334 1426 -26447 13430 16987 -25603 -2532 25021 -13576 -18459
6209 -18459 23729 3523 -26398 11815 18699 -23980 -5056 25529 -11900 -18641 23602 3870
6221 3870 -26299 11238 19636 -22160 -5719 26298 -9781 -19793 22413 6656 -25808 9745
6233 9745 20576 -21193 -6887 26762 -8697 -20854 21612 7982 -25164 8515 21909 -19511
6245 -19511 -8409 27009 -6008 -21142 21396 10437 -24972 7192 22745 -19390 -9405 27371
6257B7371l2285j6955M1458q022l6323K9994J8944m2264P594L6532k9360j8803
6269b2119M0497o128l6538K8536J8765m0063M622L8284k7637k1432M0185l184
6281A3788l7753K6563K0830l9924K235L8591k5326k2875M0034j413l9130K4427
6293D7K4323l9440k63L8854k3517k4327L8277R36l8975K2095K5942l7699l201
6306a6948M0291k1614k6973L7679L484l9206K0016K7085l6957m973M0171j9907
6318B148k7266L6011N751l9920J8334K9163l5726p197L9748j6426k9776L4477
6330I321R075l9661J5769K9655l4227r541M0034j4293l0466L3130R543l8815J3707
6343f769L1370l3021j1375L9232j2532l1599L2294J2279l8880J1049L2757l1295
$$ plain form
6257 27371 -4914 -21869 19589 11567 -24756 5238 24182 -18082 -10488 26044 -3316 -22119
6269 -22119 18378 12250 -24288 4248 23013 -17050 -12428 25856 -1781 -23213 16972 13788
6281 13788 -23965 2598 23428 -16496 -14261 24330 -996 -23871 16163 14750 -24380 47
6293 47 24370 -15070 -15333 23521 4 -24323 13954 14890 -24085 -1990 23952 -13747 -16948
6306 -16948 23343 1729 -25244 12435 15919 -23287 -3271 23814 -13143 -18116 22055 2148
6318 2148 -25118 10893 16644 -23276 -4942 24221 -11505 -18702 21046 4620 -25156 9321
6330 9321 18396 -21265 -5496 24159 -10068 -19609 20425 6132 -24334 8796 18339 -20476 -6769
6343 -6769 24601 -8420 -19795 19437 6905 -24694 7600 19879 -19001 -7952 24805 -6490
6355f490j3703L9316j0669l2177L0534J4329l9047Q796L4079k9748j5868L8761
6367A8113p873l3663K8317J6526l8308O484L4243k7166j7696L7917m872l4312
6379b2290K5724J8301l7118L941L5481k5388j9985L8017l653l5229K4495K0981
6391B3277l7899K843L5507k4020k1329L6785r89l6825K2982K2136l5690l58L5945
6404B2365k0990k4750L7039P75l6356K1205K3803l5152k531L6314j9687k4949
6416b2914L4377L865l6997J9364K5258l5308m412L7493j8127k5553L3895N434
6428A6375l8144J6546K7840l3256o767L6264j5067k8002L2943P577l6524J4436
6440e779K8078l1288r121L7167j3903k9324L1500R807l6908J2058L0592l0904
$$ plain form
6355 -6490 -20193 19123 8454 -23723 6811 21140 -17907 -9111 24968 -4780 -20648 18113
6367 18113 10240 -23423 4894 21420 -16888 -10404 23839 -3327 -21023 16894 12022 -22290
6379 -22290 3434 21735 -15383 -11442 24039 -1349 -21334 16683 13030 -22199 2296 23277
6391 23277 -14622 -11779 23728 -292 -21621 15164 14175 -22650 332 22468 -13222 -13580 22365
6404 22365 1375 -23375 13664 14439 -21917 -712 23091 -12061 -14592 21722 2035 -22914
6416 -22914 11463 15328 -21669 -2305 22953 -12355 -16767 20726 2599 -22954 10941 16375
6428 16375 -21769 -5223 22617 -10639 -17406 18858 3791 -24211 8732 16309 -20215 -5779
6440 -5779 22299 -8989 -18110 19057 5154 -24170 7330 17137 -19771 -7713 22879 -8025
6452h025j2018L8075j1650l0392L0147J2224l7090J0332L0602k9659j2521L7410
6464A7435q934l1643K7875J4015l6331P929L1258k6955j4036L5423o467l1894
6476b2325K6277J5616l5837O637L1554k5143j7259L5896m766l2420K4239J8322
6488B0791l5584L650L3703k4661j7586L5134l822l2790K2970J8633l3961J769
6500a1754L3749k2242j9723L4246l61l4568K1383K1230l3846j055L3713j9477
6512A295k1875L3615J696l4573J9680K1649l2282k063L3602j8061k3713L2707
6524A1677L897l4472J6781K4409l2381m427L4929j7013k4674L2139M706l4295
6536a8724J5516K4657l0752o421L5236j4835k5446K9226P610l4580J4145K5325
$$ plain form
6452 -8025 -20043 18032 6382 -24010 6137 18361 -18729 -8397 22205 -7454 -19975 17435
6464 17435 8501 -23142 4733 18748 -17583 -9654 21604 -5351 -19387 16036 9569 -22325
6476 -22325 3952 19568 -16269 -9632 21922 -3221 -20480 15416 10650 -21770 2469 20791
6488 20791 -14793 -11143 22560 -2101 -19687 15447 11625 -21165 1805 20438 -13523 -11754
6500 -11754 21995 -247 -19970 14276 13915 -20653 730 21960 -11886 -12941 20772 1295
6512 1295 -20580 13035 14731 -19842 -162 21487 -10795 -12858 20744 2683 -21030 11677
6524 11677 15574 -18898 -2117 22292 -10089 -14516 20413 3400 -21274 10865 15571 -18724
6536 -18724 -3208 21449 -9303 -15724 19512 4677 -20769 8457 16067 -18513 -4368 20957
6548B0957k8614r329L4162j1591k7950K9152R802l3954J0751K7587k8602j0300
6560a7929L5346j0946k8636K7877J0970l4500R668K8552k6853j1838L4082q226
6572G567k9438K6217J3345l4258O873L0018k5056j4508L4366p592k9478K4941
6584B997J5321l4175N434L0858k3684j6208L3228m090l1021K3203J7043l3556
6596a4650M096L0779k2642j7371L3174k841l1361K2199J8138l3056K300L1968
6608B0733k1641j8631L1938n45l1273J9365J9578l0899p04L2191j9171k0669L1432
6621A1704J623l2145J7908K1485l1111j759L2069j7869k1106L0594L127l2631
6633a8111J6586K2859l0556m827L3324j5488k3914K9952M715l1957J4282K3717
$$ plain form
6548 20957 -7657 -16986 17176 5585 -22365 6787 16589 -17365 -6614 20973 -7629 -17929
6560 -17929 17417 6471 -22165 5712 16682 -17818 -8150 20402 -6451 -18289 15793 7567
6572 7567 -21871 4346 17691 -16567 -9694 20324 -4732 -19240 15126 7534 -21944 2997
6584 2997 18318 -15857 -10423 20435 -3249 -19457 13771 9681 -21340 1863 18906 -14650
6596 -14650 -10554 20225 -2417 -19788 13386 10545 -20816 1383 19521 -13535 -11235 20733
6608 20733 -908 -19539 12399 11854 -19419 -54 19524 -11375 -12079 20112 941 -19728 11704
6621 11704 13327 -18818 -910 20575 -10536 -12295 19774 1905 -19201 11393 14520 -18111
6633 -18111 -1525 21334 -9222 -14049 19275 3787 -20127 9825 14540 -17417 -3135 20582
6645B0582k8829o218L2798j3790k4317K8878P296l2949J2239K4475k6538q602
6657a4975L2242j1041k6062K7771Q358l2373J0650K6297k7442r387L2274r771
6669F541k6787K5611J1480l2355Q708K6412k4801j1881L2604q561k6916K3997
6681D052J3110l2095O175K8693k4532j3217L2061o581k7993K3346J3531l1396
6693a4846N256K8338k2487j4945L1692l407k9845K2262J5071l0982L715K9326
6705A9148k1536j6575L0852j728k9394J9761J7201l0694J627K9830j9256j8928
6717a9692L0846Kl0358J9039J8413l0177n76L0778j8337j8985K8654L068l1110
6730a8435J6705K0223k9112l166L1686j6502k0924K9862K344l0056J4597K1858
$$ plain form
6645 20582 -8247 -14465 18333 4543 -19774 9104 16400 -16549 -4310 20165 -6373 -14975
6657 -14975 17267 6226 -19836 7935 16293 -16080 -5430 20867 -6575 -15962 16312 6541
6669 6541 -20246 5365 16845 -15510 -6802 19610 -5191 -17072 15532 6971 -19945 4052
6681 4052 17162 -14933 -8758 19935 -4597 -17814 14247 7666 -20327 3019 16550 -14846
6693 -14846 -9590 18748 -3739 -18684 13008 9601 -20244 2018 17089 -13893 -10178 19148
6705 19148 -2388 -18963 11889 10161 -19233 528 17729 -12965 -11338 18492 -764 -19692
6717 -19692 11154 11156 -19202 -163 18250 -11927 -12503 18275 -62 -19047 9607 12675 -18435
6730 -18435 -1730 18493 -10619 -13785 17901 1399 -19525 10337 12681 -17375 -2778 19080
6742A9080k7887m361L1239j5223k1639K7542N453l1207J4187K2870k8039n687
6754a3672L1066j3677k3037K7923O352l0646J1706K3652k6040p750L1152j1295
6766E734k3981K5728Q253l0770J0362K4749k5136r956L0808r184k5466K4558J0641
6779A6340l1883R512K5794k3939j1226L0803q531k5388K4131J0987l0499O764
$$ plain form
6742 19080 -8807 -13168 18071 2848 -18791 8751 14204 -17003 -2816 20054 -7985 -13672
6754 -13672 17394 3717 -19320 8603 14955 -15691 -3985 19667 -6373 -14123 17029 5734
6766 5734 -18247 7481 15734 -15036 -4674 20075 -5061 -15017 15791 6607 -18859 5699 16340
6779 16340 -15543 -6031 19763 -4176 -15402 15401 6870 -18518 5613 16600 -13899 -7135
$$ [...]
##END NTUPLES=NMR FID
##END=
