##TITLE=1H_Pr Am-C8
 CDCl3, 8 sc, 
 23.12.2020
##JCAMPDX= 6.0         $$ Bruker NMR JCAMP-DX V2.0
##DATA TYPE= NMR FID
##DATA CLASS= NTUPLES
##ORIGIN= UXNMR, Bruker Analytische Messtechnik GmbH
##OWNER= root
$$ XWIN-NMR		Version 3.5
$$ Wed Dec 23 11:15:05 2020 Russian Standard Time (UT+4h)  she@DPX200
##.OBSERVE FREQUENCY= 200.1315066352
##.OBSERVE NUCLEUS= ^1H
##.DELAY= (6, 6)
##.ACQUISITION MODE= SIMULTANEOUS
##.ACQUISITION SCHEME= undefined
##.AVERAGES= 8
##.DIGITISER RES= 18
##SPECTROMETER/DATA SYSTEM= spect
##.PULSE SEQUENCE= zg30
##.SOLVENT NAME= CDCl3
##.SHIFT REFERENCE= (INTERNAL, CDCl3, 0, 15.7039)
##AUDIT TRAIL= $$ (NUMBER, WHEN, WHO, WHERE, WHAT)
$$ ##TITLE= Audit trail, XWIN-NMR		Version 3.5
$$ ##JCAMPDX= 5.01
$$ ##ORIGIN= Bruker BioSpin GmbH
$$ ##OWNER= she
$$ F:/spectra/data/she/nmr/H-F/1/audita.txt
$$ ##AUDIT TRAIL=  $$ (NUMBER, WHEN, WHO, WHERE, WHAT)
(   1,<2020-12-23 11:13:15.56 +0400>,<she>,<DPX200>,
      <created by zg, POWCHK disabled, PULCHK disabled
       configuration hash MD5:
       00 E9 B6 7A A2 85 ED C7 34 08 36 98 17 FE 4E 26
       data hash MD5: 16K
       02 83 4A 17 22 CC 67 F9 C1 DD 4C BB 64 F9 A7 B5>)
$$ ##END=
$$ 
$$ hash MD5
$$ 2D 9E 5A 3A BE FD E4 3A 3B F7 1F D5 EF 55 52 98
##$RELAX= 
##$RELAX= 
##$RELAX= 
##$RELAX= 
##$RELAX= 
##$RELAX= 
$$ Bruker specific parameters
$$ --------------------------
##$DU= <F:/spectra>
##$EXPNO= 1
##$NAME= <H-F>
##$PROCNO= 1
##$TYPE= <nmr>
##$USER= <she>
##$AMP= (0..31)
100 100 100 100 100 100 100 100 100 100 100 100 100 100 100 100 100 100 
100 100 100 100 100 100 100 100 100 100 100 100 100 100 
##$AQSEQ= 0
##$AQ_mod= 1
##$AUNM= <au_zg>
##$AUTOPOS= <>
##$BF1= 200.13
##$BF2= 200.13
##$BF3= 200.13
##$BF4= 200.13
##$BF5= 200.13
##$BF6= 200.13
##$BF7= 200.13
##$BF8= 200.13
##$BYTORDA= 1
##$CFDGTYP= 0
##$CFRGTYP= 5
##$CHEMSTR= <none>
##$CNST= (0..31)
1 1 145 1 1 1 1 1 1 1 1 1 1 1 1 1 1 1 1 1 1 1 1 1 1 1 1 1 1 1 1 1 
##$CPDPRG= <>
##$CPDPRG1= <>
##$CPDPRG2= <>
##$CPDPRG3= <>
##$CPDPRG4= <mlev>
##$CPDPRG5= <mlev>
##$CPDPRG6= <mlev>
##$CPDPRG7= <mlev>
##$CPDPRG8= <mlev>
##$CPDPRGB= <>
##$CPDPRGT= <>
##$D= (0..31)
0 1.2 0 0 0 0 0 0 0 0.06 0 0.03 0 0 0 0 0.0002 0 0 0 0 0 0 0 0 0 0 0 0 
0 0 0 
##$DATE= 1608707595
##$DBL= (0..7)
120 120 120 120 120 120 120 120 
##$DBP= (0..7)
150 150 150 150 150 150 150 150 
##$DBP07= 0
##$DBPNAM0= <>
##$DBPNAM1= <>
##$DBPNAM2= <>
##$DBPNAM3= <>
##$DBPNAM4= <>
##$DBPNAM5= <>
##$DBPNAM6= <>
##$DBPNAM7= <>
##$DBPOAL= (0..7)
0.5 0.5 0.5 0.5 0.5 0.5 0.5 0.5 
##$DBPOFFS= (0..7)
0 0 0 0 0 0 0 0 
##$DE= 6
##$DECBNUC= <off>
##$DECIM= 32
##$DECNUC= <off>
##$DECSTAT= 4
##$DIGMOD= 1
##$DIGTYP= 9
##$DL= (0..7)
0 120 120 120 120 120 120 120 
##$DP= (0..7)
150 150 150 150 150 150 150 150 
##$DP07= 0
##$DPNAME0= <>
##$DPNAME1= <>
##$DPNAME2= <>
##$DPNAME3= <>
##$DPNAME4= <>
##$DPNAME5= <>
##$DPNAME6= <>
##$DPNAME7= <>
##$DPOAL= (0..7)
0.5 0.5 0.5 0.5 0.5 0.5 0.5 0.5 
##$DPOFFS= (0..7)
0 0 0 0 0 0 0 0 
##$DQDMODE= 0
##$DR= 18
##$DS= 0
##$DSLIST= <SSSSSSSSSSSSSSS>
$$ [...]
##$SUBNAM2= <"">
##$SUBNAM3= <"">
##$SUBNAM4= <"">
##$SUBNAM5= <"">
##$SUBNAM6= <"">
##$SUBNAM7= <"">
##$SUBNAM8= <"">
##$SUBNAM9= <"">
##$SW= 16.9725356469052
##$SWIBOX= (0..15)
0 0 2 0 0 0 0 0 0 0 0 0 0 0 0 0 
##$SW_h= 3396.73913043478
##$TD= 16384
##$TD0= 1
##$TE= 0
##$TE2= 300
##$TE3= 300
##$TEG= 300
##$TL= (0..7)
0 120 120 120 120 120 120 120 
##$TP= (0..7)
150 150 150 150 150 150 150 150 
##$TP07= 0
##$TPNAME0= <>
##$TPNAME1= <>
##$TPNAME2= <>
##$TPNAME3= <>
##$TPNAME4= <>
##$TPNAME5= <>
##$TPNAME6= <>
##$TPNAME7= <>
##$TPOAL= (0..7)
0.5 0.5 0.5 0.5 0.5 0.5 0.5 0.5 
##$TPOFFS= (0..7)
0 0 0 0 0 0 0 0 
##$TUNHIN= 0
##$TUNHOUT= 0
##$TUNXOUT= 0
##$USERA1= <user>
##$USERA2= <user>
##$USERA3= <user>
##$USERA4= <user>
##$USERA5= <user>
##$V9= 5
##$VALIST= <valist>
##$VCLIST= <CCCCCCCCCCCCCCC>
##$VD= 0
##$VDLIST= <DDDDDDDDDDDDDDD>
##$VPLIST= <PPPPPPPPPPPPPPP>
##$VTLIST= <TTTTTTTTTTTTTTT>
##$WBST= 1024
##$WBSW= 4
##$XGAIN= (0..3)
0 0 0 0 
##$XL= 0
##$YL= 0
##$YMAX_a= 178174
##$YMIN_a= -213511
##$ZGOPTNS= <>
##$ZL1= 120
##$ZL2= 120
##$ZL3= 120
##$ZL4= 120
##$ABSF1= 10
##$ABSF2= 0
##$ABSG= 5
##$ABSL= 3
##$ALPHA= 0
##$AQORDER= 0
##$ASSFAC= 0
##$ASSFACI= 0
##$ASSFACX= 0
##$ASSWID= 0
##$AUNMP= <proc_1d>
##$AZFE= 0.1
##$AZFW= 0.1
##$BCFW= 1
##$BC_mod= 2
##$BYTORDP= 1
##$COROFFS= 0
##$CY= 11.3945322036743
##$DATMOD= 1
##$DC= 2
##$DFILT= <>
##$DTYPP= 0
##$F1P= 15.9154993809931
##$F2P= -4.1035820241983
##$FCOR= 0.5
##$FTSIZE= 0
##$FT_mod= 4
##$GAMMA= 1
##$GB= 0.15
##$INTBC= 1
##$INTSCL= 1
##$ISEN= 128
##$LB= 0.24
##$LEV0= 0
##$LPBIN= 0
##$MAXI= 10000
##$MC2= 0
##$MEAN= 0
##$ME_mod= 0
##$MI= 1.114404
##$NCOEF= 0
##$NC_proc= 0
##$NLEV= 6
##$NOISF1= 3.799351
##$NOISF2= 2.8
##$NSP= 1
##$NTH_PI= 0
##$NZP= 0
##$OFFSET= 15.70392
##$PC= 1
##$PHC0= -10765.15
##$PHC1= 11.20095
##$PH_mod= 1
##$PKNL= yes
##$PPARMOD= 0
##$PSCAL= 0
##$PSIGN= 0
##$REVERSE= no
##$SF= 200.130013532006
##$SI= 16384
##$SIGF1= 3
##$SIGF2= 2
##$SINO= 400
##$SIOLD= 16384
##$SREGLST= <1H.CDCl3>
##$SSB= 0
##$STSI= 0
##$STSR= 0
##$SW_p= 3612.71676300578
##$SYMM= 0
##$S_DEV= 0
##$TDeff= 0
##$TDoff= 0
##$TI= <>
##$TILT= no
##$TM1= 0
##$TM2= 0
##$TOPLEV= 0
##$USERP1= <user>
##$USERP2= <user>
##$USERP3= <user>
##$USERP4= <user>
##$USERP5= <user>
##$WDW= 1
##$XDIM= 8192
##$YMAX_p= 0
##$YMIN_p= 0
$$ End of Bruker specific parameters
$$ ---------------------------------
##NTUPLES= NMR FID
##VAR_NAME=  TIME,          FID/REAL,        FID/IMAG
##SYMBOL=    X,             R,               I
##VAR_TYPE=  INDEPENDENT,   DEPENDENT,       DEPENDENT
##VAR_FORM=  AFFN,          ASDF,            ASDF
##VAR_DIM=   8192,          8192,            8192
##UNITS=     SECONDS,       ARBITRARY UNITS, ARBITRARY UNITS
##FACTOR=    0.0002944,     1,               1
##FIRST=     0,             0,               0
##LAST=      2.4114304,     0,               0
##MIN=       0,             -213511,         0
##MAX=       2.4114304,     178174,          0
$$ Real data points
##PAGE= N=1
##DATA TABLE= (X++(R..R)), XYDATA
$$ [...]
2056a47k13O35j078J432j396J309j213Q78l09j68N42r95J241j380Q94o15N46p8
2074a15p21J375j280J396j656J354o23l6K77n66J134j206J215j239J313o94p9
2091a51M44q67J461j650J123m07N61n33N0M23n95Q87j361J621j365J049o51j16
2109g7Q66j227J322j503J420q54L99k09l96J262j540J355j281J122p41Q9L68q03
2127d28R89j236J165j000R38q52L07N82r91J081j293J338j295P47k97j29N57r37
2145g54J126j240J454j196O16N3k82M45r19J326j589J118q12P08K72o52O43j022
2163g05J321r78Q87p99M31N2n19Q21r20J219j308Q38l03Q5K71o61J045j026J103
2182H54j118P30k59m3K28p85J239j280J247j292Q63j06p76R86r04J239j266J153
$$ plain form
2056 -147 -360 275 -803 629 -767 542 -671 207 -102 -270 272 -723 518 -862 32 -583 -37 -115
2074 -115 -836 539 -741 655 -1001 353 -270 -306 -29 -595 539 -667 548 -691 622 -72 -151
2091 -151 293 -574 887 -763 360 -47 514 -19 31 454 -141 746 -615 1006 -359 690 39 -77
2109 -77 789 -438 884 -619 801 -53 346 137 -259 1003 -537 818 -463 659 -82 7 375 -428
2127 -428 561 -675 490 -510 428 -424 -117 465 -526 555 -738 600 -695 52 -245 -374 183 -754
2145 -754 372 -868 586 -610 6 59 -223 222 -697 629 -960 158 -654 54 326 -326 317 -705
2163 -705 616 -362 525 -274 157 209 -310 511 -409 810 -498 340 37 122 393 -268 777 -249 854
2182 854 -264 466 207 164 392 -393 846 -434 813 -479 384 278 -498 488 -416 823 -443 710
2200G10q44M44p43P9J035j975K126k045R10M39m61K01P6N44j249R12j196J262
2218B25m37p1K47k56P67j105J128o50O03n46q7P9r32J205q85J151p26M98l4k48
2238g4J59j020J538j231J163n50k00K16p02J130r31R26q52J095o85L76r1k20Q18
2257H65j177J427j575N95n03J98R94j134J185j690J151r01O71o43L20M56n01J008
2275G46r02J097j896P68k93O02Q81j926O91p48J014n04J235r43j51N52j175J356
2293D04j765J546q10J219o99q10Q64M40K11j404J051n65l17P06m78M37p33J010
2311C07j241J045R3k66j18r07J896p93J326k252J671l25j96K54q44J054j864K014
2329H54j132N25Q6o76Q07j069J497j067Q46r52k44r5O53O75j084J064j340J417
$$ plain form
2200 710 -134 310 -433 -354 681 -1294 832 -1213 -303 136 -325 -124 -48 496 -753 159 -1037 225
2218 225 -212 -283 -36 -292 475 -630 498 -152 451 -95 -182 -103 -1035 170 -715 436 -290 208 174 -74
2238 -74 85 -935 603 -628 535 -15 -215 1 -701 429 -502 424 -428 667 -18 358 267 47 865
2257 865 -312 1115 -460 135 -368 -170 824 -310 875 -815 336 -565 106 -537 -217 239 -262 746
2275 746 -156 941 -955 -187 -480 122 1003 -923 -232 -980 34 -470 765 -178 -329 223 -952 404
2293 404 -1361 185 -625 594 -105 -915 -51 389 600 -804 247 -318 -635 71 -407 30 -703 307
2311 307 -934 111 204 -62 -180 -1087 809 16 1342 -910 761 436 240 494 -350 704 -1160 854
2329 854 -278 247 333 -343 464 -605 892 -175 671 -281 -525 -620 33 708 -376 688 -652 765
2347G65q55j83P74j38L43n89M30j048J247p71n45J014j519K112j116m00n34Q18
2365a95l07J69On51R86m78l24J29Q91q89R12m95m73J284j124Q69p00M56Q5o07
2385c56Q02j145P89l89L71p29O70L1n68J212j069R46j071M19L3J59L65p45N74
2404B99j230O61L17O97q19m00J094r87J577k039R42n4L42O18q46M61j277J160
2422E16j055Q04q96Q09L36o36P94k60Pj522J927p64l6K80n21M41q89Q79r62J69
2442e79Q33o04O54j535J898j401J543q42n0O5j144J253j205J180r86J355r36P41
2460B40o26m5J144j346Q27j43M72r05J008m03m05R29j850J723j818J388J24m86
2478a72Q25m74L13p45J036j003N56k10n14P79j42k59J3K17O33l63l03o23N38j77
$$ plain form
2347 765 -90 -273 501 363 706 117 547 -501 746 -25 -570 444 -1075 1037 -79 -479 -1013 -195
2365 -195 -502 -333 -327 -878 108 -370 -694 -565 326 -563 349 -146 -619 665 -459 410 -290 166 251 -356
2385 -356 446 -699 90 -299 72 -657 13 44 -524 688 -381 565 -506 -87 -54 105 470 -275 299
2404 299 -931 -270 47 744 -75 -475 619 -368 1209 -830 112 58 400 1018 172 633 -644 516
2422 516 -539 265 -631 178 514 -122 672 412 419 -1103 824 60 24 304 -217 224 -665 214 -748 -579
2442 -579 254 -350 304 -1231 667 -734 809 -33 -83 -18 -1162 91 -1114 66 -920 435 -501 240
2460 240 -386 -431 713 -633 194 51 523 -382 626 223 -182 747 -1103 620 -1198 190 314 -172
2478 -172 653 179 492 -253 783 -220 336 126 -388 391 249 -10 3 220 853 490 187 -436 102 -75
2498g5q1o00R58r56R40l12m55J097j217R45j180J451m60m02K73P4n11j04N57J60
2518A02K26o64J63Q80j179R24j176J684j380K91k13m4J018p30m18L25R12j416
2536f95J121k48p3P09o64M10j395R81O3m01Q08m0J01j358Q82p29P86J7l10M16
2556C81p87J548k081J780n11k35Q35r64N82l38N96j066J041j032J42K52M0P7p37
2575d77P93p57Q08o70N84p4k85L98r97J181j076O41j43L37n58m61J086q80R34
2594C84j041O28n19K77P00j367J421p61M51r73R52l30l8O00l18N95j130P31m20
2613a58M99j04j87j29j21P23r19J039q34N79m63r9M05n17J098q74N88l70Q6j32
2633A10l06M20m07Q00p27P74o93J5K48n92Q27r03J004o38M34l46j49M50n87O36
$$ plain form
2498 -75 -156 -756 202 -754 186 -126 -581 516 -701 244 -936 515 55 -347 -74 0 -511 -615 -58 102
2518 102 328 -336 -173 707 -472 452 -724 960 -420 -129 -342 -386 632 -98 -516 -191 721 -695
2536 -695 426 178 105 814 150 560 -835 146 209 -192 616 576 677 -681 201 -528 258 275 -35 381
2556 381 -406 1142 -939 841 330 95 930 -34 548 210 806 -260 781 -251 -109 143 183 260 -477
2575 -477 316 -441 367 -303 281 207 -78 320 -677 504 -572 69 -74 263 -295 -756 330 -550 384
2594 384 -657 -29 -548 -271 429 -938 483 -278 173 -800 152 -178 -216 384 66 661 -469 262 -158
2613 -158 341 237 50 -79 -200 523 -396 643 -191 388 -75 -174 231 -286 812 -62 526 156 242 110
2633 110 -196 224 -183 617 -110 664 -29 -14 234 -358 469 -434 570 -68 366 20 -129 321 -266 370
2653C70o93O01p95L49K23j78N85p60O53r42P72m27O2N2k15O95j034O61l70O59
2673B68q63O13Km08P66p78P96j006O30l53J76M09o79Q28p50P17p33N91l32K82
2693A76K08o75O31l35P49j281P48o2j19L27q16J109j038Q53o46L67o4O4L07q29
2713c26R85r13N46m60K81k8J15K21m84L24n04N83k78k71M95n64O10p73P32l98
2733a07J84k13j53L88m07N04m86L14j14K7p4PK9m58O50n56P38p89O00j42j96O88
2755D34q49P30p01O72m08j12R6j74M98o16Q74o50M34m70K57J32m38O56p56Q03
2775D12o25N41n84M41M22r86Q20q33J066o38K79l76L46K8o98R70r54Q27l85J84
2795B57k3l71L15m43P33p32L23j47M4L61m67M05p96O62k70J75k28j04K73n48Q02
$$ plain form
2653 370 -323 278 -517 -168 55 -123 462 -298 355 -587 185 -242 -180 -128 -343 352 -682 -21 -391 268
2673 268 -595 18 20 -388 378 -400 396 -610 20 -333 -157 252 -427 401 -349 368 -365 226 -106 176
2693 176 384 -291 340 5 754 -527 221 159 40 367 -449 660 -378 475 -171 196 132 196 503 -326
2713 -326 659 -254 292 -168 113 85 200 421 -63 261 -243 340 62 -209 286 -278 332 -441 291 -107
2733 -107 77 -136 -289 99 -308 196 -290 24 -90 -63 -137 -130 -101 -559 91 -465 273 -516 84 -58 -254 434
2755 434 -415 315 -386 286 -122 -234 -138 -312 186 -430 444 -206 228 -242 15 147 -291 365 -391 412
2775 412 -213 328 -256 185 607 -379 441 -392 674 36 315 -61 285 313 -385 585 -369 458 73 257
2795 257 234 -137 178 -265 468 -264 59 -88 -44 317 -150 255 -541 121 -149 26 -202 -306 -33 -581 221
2816B21p74R21q06M20K88m52L26m93J026j135M69m69L09j69o3J281m52J21m69
2835A00K08J58l92J90j060O44J1N31j62K01p60O61n54M1K14j40L70R2o66P98m92
2856gj0QM08r12J459j337J124j416J66Q42q57M14R1J60j00k09pj41J228j584R50
2877B70j44j21m1K76m92K61J53l35Q6p21J367p24J00Q6l02j0m47P51p68J74O29
2898D8m0o56Q74O69j303M38J26M44j071J352r6j090N5j94Q70p31O80m98m86J226
2918F17j191P72j446P22M2P73o8l07K48l99P72n05N47n21m5m9j87P87j194J387
2938G55r93N51p61K23N95m74M44r05O74p1m58N23l30R75r78K34j48R20r40N2L73
2959B61K9p3q62L74k12Q25r31R27o26k48P41j018J281p40O94o24J31K93o73J58
$$ plain form
2816 221 -553 368 -438 -18 270 -182 144 -349 677 -458 11 -458 -149 -318 -381 900 448 569 100
2835 100 308 466 74 264 -796 -152 -141 390 228 429 -331 330 -224 -183 31 -109 261 353 -313 485 -7
2856 -7 -17 -9 399 -513 946 -391 733 -683 -517 325 -532 -118 -27 133 33 -176 -183 -324 904 -680 270
2877 270 126 5 -36 240 -252 9 162 -173 -87 -808 559 -165 -65 21 -281 -291 -738 13 -755 -581 48
2898 48 8 -648 226 895 -408 30 156 600 -471 881 785 -305 -250 -444 426 -305 375 -123 -609 617
2918 617 -574 198 -1248 -526 -484 289 221 -86 162 -237 535 30 577 56 11 -38 -225 562 -632 755
2938 755 -238 313 -448 -225 370 -104 340 -565 109 38 -420 103 -227 748 -230 4 -144 776 -164 -112 261
2959 261 290 217 -645 -271 -483 342 -589 338 -288 -536 205 -813 468 -272 422 -202 -71 222 -451 -293
2979b93l13J113r32N06k34K50m5j44J84l43N57p27M51J30J88J03p41Q61r97P04
2999B78n77L23L49o69J026p82q8R7Q98r67K66M56o83N01j22l78k3N39q1l11K59
3020C11o15Q49j183J108r06P09m74K92L36j076P41n85M04J95M6m19K77k06m02
3039e98J467j422N15j06L65k82L1L99n20K49k01M65n97k38K99j34O01r55O93o68
3059f37J432r70P5k80k55N86n32J676j302N22p20N39o15L63J31l90P79o83J014
3078G33o20m47Q80p44P31j296J976j285L45J40p91P18n17P57j100J222q13j05
3096b16KK28K55o28Q84p38Q24j179O26K68m36P30o43O58K0q87r26Q62q5J17N92
3117C28n03r07P77O75J99j094L87l80M45j048J314q43P82o7J68j19l80K32j77
$$ plain form
2979 -293 -606 507 -425 81 -153 97 52 -92 92 -251 306 -421 30 160 348 451 -290 571 -426 278
2999 278 -299 24 373 -296 730 -52 -140 -43 855 -112 154 610 -73 428 306 -72 -95 444 363 52 311
3020 311 -304 545 -638 470 -436 273 -201 91 427 -649 92 -493 -89 106 152 -267 10 -196 -598
3039 -598 869 -553 -38 -144 221 -61 -30 369 -151 98 -103 362 -235 -473 -174 -308 293 -662 31 -637
3059 -637 795 -175 -100 -380 -635 -49 -581 1095 -207 315 -405 134 -481 -118 13 -377 402 -281 733
3078 733 113 -334 546 -198 533 -763 1213 -72 273 413 -378 340 -177 580 -520 702 -111 -216
3096 -216 -214 14 269 -359 525 -213 611 -568 58 326 -110 620 -23 635 655 -232 -1158 -296 -381 -264 328
3117 328 -175 -1082 -305 370 569 -525 -138 -518 -73 -1121 193 -650 132 65 233 114 -266 -34 -211
3136b11k12P71r7o2j27n81N99J23k54j76K31N53k93n92O85r85Q65r92P16R7L42
3157D00m68l74J265r87P97j330O98K13j41k7k39L25o53J113j83k23l34M20N80
3176H52j871R22N0l5k07o0M71j83R24j603J408j108M51o11O85J03n45N93m02M67
3196C01j098O78k17M49l16l60L48M47m1n33K66q4k11O59n27p50O39M66N49j086
3216d21l11M26M09j96Q77j557N3J87P67J56p60N73k5N82j002J23o51Q15L11k67
3236H9k82L34j12k58J268j100l83J432j175R23j482Q09O74p67n95M21l28k83Q05
3255a0p60R84r65N89k02N71O8p92Q98n12M23m22l8J50m64N16m54N47m99N88p23
3276e07M98K8j03M39o02O90o10K37r35J141P8p01M02o57M58J60K44j09Q8m54J9
$$ plain form
3136 -211 -423 348 251 189 62 -519 80 203 -51 -227 4 557 264 -328 357 -628 237 -755 -39 58 400
3157 400 -68 -442 823 -164 633 -697 1 214 73 46 -193 132 -521 592 409 186 -148 272 852
3176 852 -1019 -97 -47 -82 -289 -349 122 -61 863 -740 668 -440 11 -600 85 188 -357 236 -166 301
3196 301 -797 -119 -336 113 -203 -563 -215 232 191 -342 -76 -160 -371 288 -239 -989 -350 116 665 -421
3216 -421 -732 -306 103 -93 784 -773 -720 -533 234 390 -370 203 178 760 -242 -119 -770 45 356 89
3236 89 -193 141 29 -229 1039 -61 -444 988 -187 736 -746 63 737 -30 -625 -204 -532 -815 -10
3255 -10 -770 214 -751 -162 -364 207 275 -517 381 -131 292 -130 -168 -18 -482 34 -420 127 -372 216 -507
3276 -507 -9 19 -84 355 -247 443 -167 70 -865 276 354 -347 55 -602 -144 16 260 151 239 -215 -196
3297a96K28j48N29o76L24j36j15N13r33N52J58N37j091J48L99l01P87p00N38m07
3317A0k87m8O1L31r2K14o78P12p35O97m48K56L40l77J3l1K09q46J075m39K7J97
3339A61m04L57k21L5j7rJ12k57K42l37N20l99L86l06J33K03k75K62n35N45k53
3360e7J85n15L54N4j41L91n26N41l99K96l42K41j32o4L53l97N13n12M24j72K13
3381C08J0m64L57j40P3l1o7J08j64O0k30N64m35J85o7L02l95k61L42j2Q3n24M48
3404E0k78M08j96j8J60k27L23n03M51l63K15m7o0K26n31P14n20PLJ40L9k96N53
3427B50n06M71l84K08J41l26L41l65M58o19N56k50m1K32k84L68k73J93l76K07
3447Ak01M50J2n22O05o14O61m89L38l6o5j58k45N15l05L74n49M26l3j25K55k72
$$ plain form
3297 -196 32 -116 413 -263 61 -75 -190 323 -610 -58 100 637 -454 -306 93 -208 579 -121 417 10
3317 10 -277 -325 -264 67 -25 189 -489 223 -512 185 -263 -7 333 -44 -31 -62 147 -699 376 -63 -36 161
3339 161 -243 114 -107 -72 -89 -98 14 -243 -1 -338 182 -217 169 -137 -4 199 -76 186 -349 196 -57
3360 -57 128 -387 -33 21 -120 271 -255 286 -113 183 -159 82 -50 -114 239 -158 355 -157 267 95 308
3381 308 318 -146 211 71 144 113 46 154 -10 50 -180 384 -51 134 67 369 -26 -287 55 43 126 -398 50
3404 50 -228 180 -16 -34 126 -101 222 -281 170 -193 22 -25 -85 141 -390 324 -196 -189 -186 -46 -7 -303 250
3427 250 -256 215 -169 39 180 -146 195 -170 288 -331 225 -25 -66 166 -118 250 -23 170 -206 1
3447 1 -200 250 262 -260 345 -269 392 -97 241 205 140 -18 -263 252 -53 321 -228 198 165 40 295 23
3469B3L45k12J00m06L42j42j21L62n42M49m61O24n06j58J71O8n9p9L64m80M14
3490I6l77n3J72JK38l61L97j40P1j72N7P9m18N61l08L53p62K58L04j19M90o13
3512b46K59o1O0j14J08L0k36J50j02M39m19l0K16R2q0k39M52m35N01o22L41j30
3534f6Q4K52k88J33l40L58j01k7M9k43M54m36J81j05K61j76P6j94Q8J9m02N34
3556A11k94N75m71K13o6q1Q7k56M22n01J27j02jL98l42Q3j07M62m85L38j69J24
3578F5J4l91O50p09N16o57Q82k95j48J05j04M41l72J10l06L76l74P5K5J9M87l80
3600B9j38J35L0l2J45J35m40K21j49J51m2J3K0L4K06m36N09n14J72P3K38l59j31
3623a30L40m00M58n63L52l5p7K18j27J20m35N58l69O2J38m38L48l89M40m22L42
$$ plain form
3469 23 368 156 256 -150 192 50 -71 291 -251 198 -263 361 -145 -303 -132 -64 -123 -202 162 -318 96
3490 96 -281 -334 -162 -161 77 -284 113 -27 44 -128 -71 8 -410 151 -157 196 -566 -308 -4 -123 367 -246
3512 -246 13 -48 12 -102 6 36 -200 -50 -152 287 -132 -162 54 146 66 -173 279 -156 345 -277 64 -66
3534 -66 18 270 -18 115 -225 133 32 5 54 -189 265 -171 10 -95 166 -10 66 -128 -40 -21 -423 111
3556 111 -183 392 -79 134 68 -13 74 -182 240 -261 -134 -236 -237 161 -181 -98 -205 257 -228 110 -59 65
3578 65 79 -312 338 -371 145 -512 370 75 -73 32 -72 369 -3 107 -199 177 -197 -122 -97 -78 409 29
3600 29 -109 26 56 24 169 304 -136 85 -64 87 45 58 78 112 318 -118 391 -123 49 122 360 1 -130
3623 -130 210 -190 268 -295 57 22 -55 163 36 156 -279 279 -90 -28 110 -328 20 -369 71 -351 -9
3644im30M60M4k69K62k46K95l06L80l01P6R0k89L49j53R9j61J91j86K79n1j28
3666dJ32n14O02l25K12l22K71J96l87L59m35L05j55K0j21O5N9k7M36k86P7k02
3688d4L95l13q5J36j50K87m33L76k43J77Mk19L46k81L33j94K1K5k48O9q0L02o21
3711d40O93m94L26p1p1Q3l20N65o62M39j13J25N5l99M11l95J14j94M22j35j20
3732a81K19j05m5k61M22k01M36m97JL04k69K72n5J47l27L68q6j89K12k37J92j51
3754c1K99l25M10n18K38J38k23L66n37L68o6j2l62R7K82k43M30n36K83o3J46L9
3776A80k01J55l47M97p15O22k50j98J01N3M84p68M53j98L27k05o1J18o6J66k51
3797a04K43m93N02k53J2J98k27K90m42M13k54j4j71QM90l91K41j76L74j93j89
$$ plain form
3644 -9 -439 21 65 -204 58 -188 107 -199 181 -120 -44 46 -243 106 -47 52 -109 82 -104 175 124 -4
3666 -4 128 -386 216 -109 103 -219 52 248 -139 220 -215 90 -65 -45 -166 -101 -42 -69 367 81 158 -44
3688 -44 351 38 -47 89 -61 226 -207 169 -74 103 107 -112 234 -47 286 92 113 138 -110 -41 -121 181 -440
3711 -440 253 -241 85 14 -57 26 -294 271 -391 48 -65 60 115 -284 127 -268 -154 -348 74 -61 -181
3732 -181 38 -67 -112 -373 49 -152 284 -213 -212 92 -177 95 40 187 -140 228 142 -47 165 -72 120 -31
3754 -31 268 -57 353 -165 73 211 -12 354 -183 185 119 107 -255 -158 124 -119 311 -225 58 -5 141 180
3776 180 -21 134 -213 284 -431 191 -59 -257 -156 -103 381 -387 66 -132 195 -10 -71 47 -19 147 -104
3797 -104 139 -354 148 -105 -93 105 -122 168 -274 139 -115 -129 -300 -292 198 -193 48 -128 246 53 -136
3818a36J00k04M45l98M00l49N2L35j93J70j42M8l5K49l70L49k37q0M2O9j17j8
3840b0K86k06N6j29n9L52j68O5k86J08j35J47mj61L42m50K27q6j6mQ3k28L46K34
3864B94k51o2m26M24m63N76k26k7K63m93N16m25M40O2l02l8j40M77j6J03l79j79
3886b72N7L29j50K1L91o39K48k4j50M15m24l0N24n9k93O24p72K53j62R1N70q68
3908c20N79l30N08j92l43K68K50J18o51l0j6K78l04J15N0l08L32k19M16m06L12
3929A07m08O45j56j20J58n59M44N4j92L99p15N39l43O1j78L66l47j61q1J60L64
3950C7J24m34m91P14j45J49K50l55k5K57j21k34K56J13j25L05l17j10K35n9j32
3971a08K56j44l5R1j47L06k12J60K0J61k99N2K92m33K50l81N64n55K19j55J69
$$ plain form
3818 -136 -36 -240 205 -193 207 -142 -90 245 52 222 80 128 93 342 -28 321 84 4 46 115 -2 -20
3840 -20 266 60 116 -13 -72 280 112 177 -109 -1 -136 11 7 -154 188 -262 -35 -121 -137 -141 -58 -286 60 294
3864 294 43 -19 -445 -21 -484 92 -134 -161 102 -391 125 -300 140 202 -100 -138 -278 199 183 286 -93 -272
3886 -272 -215 114 -36 -15 376 -263 -15 -39 -189 226 -198 -228 296 237 -56 568 -204 49 -113 -22 548 -320
3908 -320 259 -71 437 245 -98 170 420 538 -113 -143 -159 119 -185 -70 -20 -328 4 -215 201 -205 107
3929 107 -301 344 188 68 226 -333 111 165 -27 372 -343 196 -147 -86 -264 102 -245 -406 -487 -327 37
3950 37 161 -273 -764 -50 -195 -46 204 -151 -176 81 -40 -274 -18 95 -30 275 -42 -152 83 24 -108
3971 -108 148 4 -31 60 -87 219 7 167 187 348 49 101 393 -40 210 -171 393 -162 57 -98 71
3992G1J84l43K25J14q0j69n3L5k62M48n44O19m33K74K96l57k50L1L27k08K89o55
4014d41L17r8K83K24l15M2l96J54o35J118k86J0j77K94J96r40Q43m52K2k88P96
4035B71p41k81R21j87L73l21r6K9j64o08O5N99M34m3n55K05m6M65k95L7K36j70
4057A28p1l0p2m4M16o5l02L46o19K92J24j56M03m99K03k61L21j88J55Q9k83M66
4079C53o08N52m08J27j66L06l1j78K87l81L29m68L29jk72K57o5J35n79L57L5J36
4101D6p8ql7K31o99O36o52J013j403J171n96k51n9N38M47J24k43k70o40K37P18
4122B25p48N60L1p5j39L93j84j8K04l71j86j73N32J50o15K73K67q4n16O07o37
4143e04O59m9k3J51m63L56p9O2j50oQ0j3l19L29P25j002L59p53j25N1M51L10l25
$$ plain form
3992 71 255 -88 137 251 171 2 -51 -16 -278 170 -374 245 -188 86 382 25 -225 -194 133 -75 214 -441
4014 -441 -124 -222 61 285 -30 12 -384 -230 -865 253 -33 -23 -200 94 290 -650 193 -259 -237 -525 271
4035 271 -470 -751 170 -17 356 35 -61 -32 -196 -804 -739 -140 294 251 -304 -99 -145 320 25 62 298 128
4057 128 57 27 -45 -89 327 262 -40 306 -313 -21 103 -53 350 -149 54 -207 114 -74 81 170 -113 353
4079 353 -255 297 -111 16 -150 156 125 -53 234 -147 182 -286 43 42 -230 27 -38 97 -482 -125 -90 46
4101 46 -32 -40 -77 154 -545 91 -561 452 -951 220 -376 -627 -686 -148 299 423 180 -90 -730 -493 225
4122 225 -523 37 68 -7 -146 247 63 45 249 -122 -308 -481 51 201 -414 -141 126 42 -474 133 -504
4143 -504 155 106 83 234 -229 127 48 110 -40 -46 34 21 -298 31 756 -246 113 -640 -765 -714 -263 47 -278
4166b78M31n03K69l60K14N95m00J93j33o6j12K92k22j3J60l65O40o24O13l12M72
4187D91r48O99m92J40j0r6J12j91J57M89o69M94m34K23l8J37O9N5k58j81N7K24
4209C0j1j31K87k56j52K15j07K10j18M87m59O5K28l97P0p8J55q2K31j66J95l70
4231a54L5J44j84J81j79K36l19K35j9O6L6l09L27k83O4PO8J42k49L9k09M01k94
4254b18K82j04Q9j58p7L81l64L01l77M84n35J61K43k35L28k46J84l9k9K9l12M03
4276A91l09N19m86K9J56r7J7j04J28p5K32m14K04l7J18J00j63J41l44L85l32K20
4298G9l3L4k17J56J71m25N59l38J32Q7L2k31n9J55l18L08r8p2nj03L39j88J71
4321A36j93K73k57O5p9j34N41n44L08k27R4J01k06J53k61L90l08L04j11J45l20
$$ plain form
4166 -278 153 -350 -81 -441 -227 368 -32 161 28 -38 -150 142 -80 -93 67 -298 342 -282 331 19 491
4187 491 -457 242 -250 -110 -120 -216 -104 -295 -138 351 -318 176 -258 -35 -73 64 133 188 -70 -251 -194 30
4209 30 19 -112 175 -81 -233 -18 -125 85 -33 454 -5 60 288 -109 -39 -117 38 -44 187 21 216 -154
4231 -154 -119 25 -159 22 -157 79 -240 -5 -24 42 78 -231 96 -187 -123 -116 -48 94 -155 -116 -325 76 -218
4254 -218 64 -40 49 -109 -186 195 -169 132 -245 239 -296 -135 108 -127 201 -45 139 100 71 100 -212 191
4276 191 -118 401 -85 -56 100 3 20 -84 44 -31 201 -213 -9 -46 72 172 9 150 -194 191 -141 79
4298 79 46 80 -137 19 190 -235 324 -14 118 205 237 6 -53 102 -216 92 -6 -78 -83 -186 153 -35 136
4321 136 -57 216 -41 24 -55 -189 352 -192 116 -111 -17 84 -122 31 -230 160 -148 156 45 190 -130
4342a30J62p0J3M63p50N74m07K98l17L08J82o11O45m08K99l85J49nj32M17m96
4363b01N88n08J41l6j89K86N7p4k76N61o26K95K8N7Q4l12J45k1J12j10Q0k26J43
4386bK06l49K45j71Q9j46M00m06QJ40k37K47k32L79l22K93p0k65J98j85L4q4M14
4409A84k35J42J1P4j56j17L56n13O91m13L6Ll2N4r3Lk96K59N5n6K25j25K77o20
4433b86M48k43J93j48J65J46m48K57k60M97k97M4q1p4K88k64M04n89K53O4M1j50
4455d0L3J34j56n4K0K35k83J19K31l05J64k91K77k33K5K05j59R0k48M93m95K98
4477F0%L88l82R0K5l93Q4N7K9N1n3M6o3J21j59J44j33l5L08j52J1J03p1k67K18
4502B7k70M53k29K84k86j58M10k84L85m73K13k11J65N3o7Q2j60J23m8K0N1j91
$$ plain form
4342 -130 32 -38 -25 438 -312 262 -145 153 -164 144 326 -285 360 -48 251 -134 15 10 -122 295 -201
4363 -201 387 -121 20 -16 -205 81 138 64 -212 349 -277 18 46 103 187 -125 20 -1 111 1 81 -145 -2
4386 -2 204 -145 100 -71 18 -128 272 -134 -126 14 -223 24 -208 171 -151 142 72 -193 5 -180 -146 -230 184
4409 184 -51 91 102 176 20 -97 259 -254 437 24 60 63 31 85 -8 -5 -301 -42 13 -43 182 57 334 -286
4433 -286 162 -81 112 -36 129 275 -173 84 -176 321 24 68 -13 -87 201 -63 341 -248 5 69 110 -40
4455 -40 -7 127 -29 -83 -63 172 -111 8 239 -66 98 -193 84 -149 -124 81 -78 12 -236 257 -238 60
4477 60 60 448 66 156 181 -212 -128 -71 -42 9 -44 2 -61 60 -99 45 -88 -123 185 33 44 147 76 -191 27
4502 27 -243 210 -19 265 -21 -179 231 -53 332 -141 72 -139 26 79 12 94 -66 57 9 29 80 -111
4524a11J77j4J44o37N04j42M8j96Q3J85j51L62k87R8k66K67l2m00N16j50J87r2
4546I3k36J84j3J15j71J87l8R2n09K76P2l88N60m07L43j61L93l34j4M6k07M06
4568B89m66M99l94K86j78N0l7M4j07l29N71k47L71l95K40j87P9P2n4J26k15l3
4590a5J58j16J15j10K53o4J26j72r4j34J29j77k2L45k97K2L7J39l98N5O9p9L67
4613A37j19O9j30N5n6M2K48n69M52k57L08j08j74K37l65K11j53L87n66M27J37
4634B13l5l94K9J65k54M06k49J14p3KJ27k53L63l33L13k74L26j11j41J17R1K03
4656C52m88K26k74L46r1k1j0L9k1l07L74k95K03r6o3K68j4Q1l02nl1L1J82j06
4680b2K60m01L59j98K69l26K61l57M7J13j47Q8jK68m77Q4K72j00k9k73M93j23
$$ plain form
4524 -111 66 52 196 -441 63 -79 -31 -227 -144 41 -110 252 -35 63 -203 64 32 -368 148 -2 185 93
4546 93 -143 41 28 143 -28 159 121 213 -296 -20 52 -336 224 -183 160 -1 392 58 44 90 -117 289
4568 289 -177 322 -72 214 36 86 49 93 -14 -343 228 -19 352 -43 197 10 89 161 107 233 18 -15
4590 -15 143 27 142 32 285 221 347 175 81 -53 76 -101 -123 222 -75 -53 -16 123 -275 -220 -151 -230 137
4613 137 18 87 -43 12 -44 -2 246 -323 129 -128 180 72 -102 135 -230 -19 -172 215 -351 76 213
4634 213 178 -216 -187 -22 -276 130 -119 -5 -78 -76 51 -202 161 -172 141 -133 193 82 -59 58 149 352
4656 352 -136 90 -184 162 71 50 40 79 58 -249 125 -170 33 -63 -126 142 128 209 -93 -98 -129 -98 84 -22
4680 -22 238 -163 196 -2 267 -59 202 -155 -108 5 -142 -54 -55 213 -264 -180 92 -8 -37 -310 183 60
4702F0J4k6j60M58p62M19o0N4q1m2M37k09R2n34M37j46n4K15j35p1N3K00k22K3
4726d0mP6M9l6K56n02M29l89Q3J9R2o6J15J78l49J56J30k41J95j57J27j42K71
4749B50l09j75K6L98j37l4j3j55K60m14K29J49m6j23K63j53k44N2l7J88j18L71
4771B28l89kJ44j4Q0P8j5l16L32L6l40K13k10K38m11M48ol4K4l07L39l84L38M0
4795A10j42l30K43J39j06J60j48J39J43j63K1j12J45k9K5j81N6p9K27j9l59J01
4817a59Q9J41K37l26Q4k5J22o8q5NK21m51K32j09M7mp5O7L7J81j90J84k12o4J14
4842gk9J85l96L72j61O5j05j19M51l42j8MK40l8j40K6o0Q6j88J07KL27j24r6J91
4867B33k51J85k48M06l05r1K11k39PJ24O4j34R9j34J34J7p5l1r8L07m03K68j86
$$ plain form
4702 60 74 48 -112 346 -416 3 -57 -3 -84 -126 311 102 194 -340 97 -49 -103 112 -23 -94 -41 159 -63 -40
4726 -40 -44 32 81 45 301 -201 228 -161 -78 -59 33 -33 82 260 -89 67 197 -44 151 -6 121 -21 250
4749 250 -59 -234 -208 190 53 19 6 -149 111 -303 -74 75 29 -94 169 16 -228 -176 -213 -25 -143 228
4771 228 -161 -163 -19 -33 47 125 110 -206 126 162 -178 35 -175 63 -348 100 94 60 84 -223 116 -268 70 110
4795 110 -32 -362 -119 20 -86 74 -74 65 208 45 66 -46 99 70 95 -86 -30 -109 118 99 -260 -159
4817 -159 -70 71 308 -18 66 41 163 95 10 15 236 -215 17 -92 -45 -49 -124 -57 -20 161 -29 155 -57 -121 -7
4842 -7 -36 149 -247 125 -36 29 -76 -195 256 -86 -104 -100 140 102 -38 -12 -72 14 -174 -67 -65 262 138 42 233
4867 233 -18 167 -81 325 20 -71 140 -99 -92 32 96 -38 61 -73 61 78 3 -28 -126 181 -222 46 -140
4890a40K42M4j88J80j87K36j69J49m89N08j80k76L36l38L73l13L21k50r7L73j30
4911EM0l96M38j43J10o7J37j42n9J55k63K54l76N4K04l08P17n55l3n6M38j68K72
4934B58k87n4r3L00L9o02P64n80K26m07N43k83j69N18o12P54l34l01J70m16K68
4955b98M29j5j045P26K81r9k90m64J906j280O31j235Q46n42O95o21J11L79k51
4974a36N9l50p7N78m90M80p23L93L65N2n59Q26L4o27j52j23P07o6J8M46k33o21
4996a99J55j03J7M77j29r5R5k84m6J35K84k12J15l54j05M44o46K6M34m1j09K57
5018A16j5J31j51M4K58m43J30J6p8j2k33M23Mm4r9K53j98o4o9Nj22J87kJ26j16
5043D7o3K45m21L11N8r3P9l23J49j39M2j11L97n94N19J34j18j19K17j6j50j68
$$ plain form
4890 -140 102 146 -42 138 -49 187 18 167 -322 186 6 -270 66 -272 101 -212 109 -141 -238 135 5
4911 5 45 -351 87 -56 54 -13 124 -18 -77 78 -185 69 -307 -253 -49 -357 360 -195 -228 -284 154 -14 258
4934 258 -29 -83 -176 124 163 -439 325 -255 -29 -436 107 -176 -345 173 -439 315 -19 -320 -150 -566 -298
4955 -298 131 116 -929 -203 78 -21 -311 -775 1131 -149 482 -753 93 -449 246 -375 -264 115 -136
4974 -136 -77 -427 -504 74 -416 64 -659 -266 99 151 -408 418 452 -175 -327 -450 257 191 209 655 422 -199
4996 -199 -44 -147 -130 347 218 123 218 -66 -112 23 307 95 210 -144 -249 195 -451 -425 9 -32 -141 116
5018 116 101 232 81 125 383 -60 70 86 8 -4 -237 186 190 146 47 300 102 38 -31 -26 -148 39 37 163 47
5043 47 -16 229 -192 119 177 84 163 -160 -11 -150 -108 -219 178 -416 103 237 119 0 217 201 51 -117
5065a17r9P95o21k6J42j46m31M52l41M27m75K42m2M23n26r9M49k86J052p43l4
5086dp57J195o11m92M63l43P91n78J94j26M15q16R75o2l34o34J70Q18m24M58R1
5107C89l36k8p7K24m23J64PP4J31k85K20k80L76k35K27k15J37Nj97J39N0n1q2
5130f6pJ01p9J12j32J71r3K55j56J8J3k51J86M3j38j84L86l63L69k93R6p1j2m0
5154a35M8n9R2J67n0o0n4%K35l14K32j40O3r4o0J80k04M45k88J73j79J57k10r8
5178a53K18l04O91m44o2N9j14J05P9J40k36L1p7K50j91o0K22o6K09l58L02k56
5200a5n9K33k30N1k3n1J30P3l65K4K34k81M35j37K10k00K68m49Q4L40l90J83j11
5223d6J01r3n8J00Q6j32J73k2j15J98j99Q6k03J70j59K07J65k27j0p3J28j09l9
$$ plain form
5065 -117 -216 579 -42 -68 74 -72 -503 -51 -392 35 -440 -198 -240 183 -343 -442 7 -279 773 30 -4
5086 -4 -761 434 -177 -669 -206 -549 242 -336 -142 -268 147 -669 306 244 -90 -724 -554 264 -160 298 389
5107 389 53 25 -52 172 -251 -87 -80 -6 125 -160 60 -220 156 -79 148 -67 70 75 -122 17 67 16 -66
5130 -66 -73 28 -51 61 -71 100 7 262 106 124 137 -114 72 115 -23 -207 179 -184 185 -108 -12 -83 -95 -135
5154 -135 -87 -146 -54 113 63 3 -51 -51 184 -130 102 -38 25 -69 -129 51 -153 292 4 177 -2 155 -55 -153
5178 -153 65 -239 452 8 -54 5 -109 -4 75 215 -21 10 -67 183 -8 -68 154 88 297 -61 241 -15
5200 -15 -74 159 -71 -20 -43 -94 36 109 -256 -232 2 -279 156 19 229 29 297 -152 -68 272 -118 65 -46
5223 -46 55 -38 -96 4 90 -42 131 109 -6 192 -7 79 -124 46 -113 94 259 32 22 -51 77 -32 -71
5246g1J30k35L07l75K26J48l93K91j41J68l4M5l60M76l9n4L6l85M26k84K37j80
5268f1l6JQ1j72P2K70k53K79k17L5k52J38K4K23kl03K97l00L4J66rM6j14K31m00
5293b22K41J68k38o4J51L6k63O6R5J77L3n99M70j08J95J05l53Jn3Q2J1K80j59
5316E2k07q4L70j87J42k55J09J38j18M51n87JM19n2p3k70J71M0R7m55L09J09J76
5339B96k65k13O17l15Q6j79o5p3k5L86k07rJ95k51o1J6j45N08l28p8J33p3J7P
5363b6P8k11J63M6K09Kn13L64l68K74J17m25K27j51K24n3n2K24k43J04n7j03J22
5386d8Q7O1l6j84j2J38k01L55m10K83k08J91M0J35L1j12K11k65J34k46K0M8QL0
5410E0l0K52l71K51p9J75k45n7l8m8K16l75K56p4K48N4j13j23N8J0k00J38r0N2
$$ plain form
5246 -71 59 -176 131 -244 -18 130 -263 28 -113 55 21 66 -294 182 143 89 125 -260 166 -118 119 -61
5268 -61 -97 -96 -15 -187 -115 155 -98 181 -36 -1 -253 -115 -91 132 130 -173 124 -176 -142 24 15 61 -53 178 -222
5293 -222 19 187 -51 -115 36 72 -191 -125 -30 147 180 -419 51 -57 138 243 -110 -109 -162 -80 -69 211 52
5316 52 -155 -239 131 -56 86 -169 -60 78 -40 411 -176 -175 244 192 119 -151 20 60 157 -298 11 120 296
5339 296 31 -182 435 120 206 27 -38 -111 -136 250 43 34 229 -22 -83 -67 -212 296 -32 -110 23 -50 -33 -26
5363 -26 52 -159 4 50 259 261 -252 112 -256 18 135 -290 -63 -214 10 -43 -95 129 -114 -10 -67 -170 -48
5386 -48 39 100 64 -120 -132 6 -195 160 -250 33 -175 16 56 191 222 110 321 56 190 -56 -36 12 20 50
5410 50 20 272 -99 152 73 248 3 -54 -92 -140 76 -299 -43 -117 131 185 72 -51 7 17 -183 -45 -135 -83
5434h3N6L21l31n7L26k81M9j58K4R3j02J26q5M2J11r1r9K67m0l04K13R1j56J07
5458C9K24k37n8J87j26P0k47L59k94n3J46Q4J25m12L16k86K67l01K44J15n2J68
5480B78k46J57k5o5J2m9M8n2k03J99KO0j68k14K02J65j73J17J79j34Q9l25K90
5503A44l05M9j31M22j65j12K08J66j09k67J15M0p2k75M63j88L99j81J78m89l32
5524d42O22l3o58O03k43M28l95K78k40K61m35J63P1j44J44p3M01k02K60k81M4
5545A29j44QN2J7R7j51P4j52J28j47K40j38L7q1j07K35j73OJ84l68O78k73j34
5568A7J1j48k2J60N9k10L54j03j78Q8j11R7R2k79J13K1n3J14o1j24K07j69L45
5591B20n13K47J13k5k93L74j68m25M26r5J01J23K84m94J09J47l36M3K33mM2j66
$$ plain form
5434 -83 -27 294 -37 -94 232 -49 0 -158 -134 -41 -143 -17 -102 -60 51 -40 -139 128 88 -216 -3 88 -68 39
5458 39 263 26 -32 155 29 99 -148 211 -83 -136 10 94 219 -193 123 -163 104 -197 47 162 110 278
5480 278 32 189 164 99 111 62 110 58 -145 54 56 116 -52 -266 -64 101 -72 45 224 90 179 -146 144
5503 144 -161 -112 -243 179 14 -98 110 276 167 -100 15 55 -17 -292 171 -17 382 201 379 -110 -442
5524 -442 180 147 -511 92 -151 277 -118 160 -80 181 -254 -91 -20 -164 -20 -93 308 106 366 85 129
5545 129 -15 -7 45 62 159 8 82 -70 58 -89 151 13 50 -31 -138 97 -76 -70 114 -254 424 151 17
5568 17 28 -120 -142 18 77 -133 221 118 -60 28 -83 14 106 -173 -60 -39 -92 22 -39 -163 44 -125 220
5591 220 -293 -46 67 42 -251 123 -45 -470 -44 -139 -38 85 369 -125 -16 131 -205 -162 71 67 109 -57
5613e7r4J80O4k60J02oK05k17N0J18n21M01j25J24k1J26k3l75N86k68l1j45J47
5636d0K08j2p9o9N2j47J26rj04J66J26m58K08j37P2J06o9K30j55j06q4M2J68J37
5660A72j01j53J20K7J7k16L2R4l6K71m82R1K35q2j18j75N7J54K71m35K61R5J1
5683A10kj11n8J60l5j69J7J45k91L25r5m7K8j60K52P5J50k43J33l29M13k43K36
5706B61k69KJj40L11k86K25J4M8k28N8J42k69L79k34J6j28K66k91k6J72J2R4k20
5730i0J54q7P3M0j44j47R9J81k91K87j11K61k67j6J64k06L87j01j51k21K63k71
5752a94J09M4n7j13K05Nm4Q1j16o9L47k24R3j04K43k46k88K55J07P4k88M03k23
5775@NMl6PjJ25k01K11j30%L5k58L88j5M6J54l11m2K90l26M9K17l39NJ08Q4M3
$$ plain form
5613 -57 -151 29 93 -167 -65 -71 134 -83 -33 85 -436 -35 -160 -36 -57 69 46 -329 257 -11 -42 -187 -40
5636 -40 168 156 77 8 60 -87 39 30 -74 92 218 -240 -32 -169 -97 9 -60 170 15 -91 -175 -133 35 172
5660 172 71 -82 38 65 82 -134 -102 -8 -44 227 -255 -164 71 -11 -129 -304 -247 -93 178 -257 4 99 110
5683 110 108 -3 -61 99 64 -105 -88 57 -234 91 -4 -51 -23 -183 69 144 294 51 184 -145 268 25 261
5706 261 -8 -6 -5 -145 166 -120 105 119 167 -61 -3 139 -130 249 15 31 -97 169 -122 -148 24 36 130 -90
5730 -90 64 -23 50 90 -54 -201 -102 79 -212 75 -36 225 -42 -58 106 -100 287 186 35 -186 77 -194
5752 -194 -85 -41 -98 -211 -6 -1 -45 36 -80 -149 198 -26 67 -37 206 -40 -328 -73 34 108 -180 223 0
5775 0 5 9 -27 -20 -21 104 -97 114 -16 -16 19 -239 149 134 180 334 23 -19 271 -55 -6 211 -128 -123 -15 69 112
5802A12J05L0j13j18J82O7l96L05k80J0K7NJ95m5k3k34J69j40N6N4J06m4M2j25
5826e3j08K40j18M9r8n5J80M4K3k02J90o2l1K57k92r0OJ27Q8L8j24j7J5j06pK95
5852A89q1j3j13j01J60m22M41k6m9K02q3j26m3j49K32j02L18k33p7M36N77r98
5874f1L13k28L19m36J34m92p0L24P37p99O4N86m04J58q2j25M9j2L6J4j0k22J65
5897d2j00N4J61q7J18O8j74N3N5j72Nj06K61k17M11j71j19Rj37K98k22j50M05
5920B01k33O2Q2%l94N99j43N2k60j32J56O0Q8l73M51l53L06j28K27l11l3J62m86
5943d00P54m14N3k6mN4j57M83m42K06j24J21j44J47o7k04K31r5J16k43J19M9o2
5966d9j15K03r1j83K39J12J7q3l3M2j59J54j00Pm0K8K51k93J68o7J13j53p4q1
$$ plain form
5802 112 217 247 134 16 198 265 -131 174 -106 -96 -69 -64 131 86 63 -171 -2 -142 -86 -32 74 30 72 -53
5826 -53 -161 79 -39 10 -88 -143 37 81 104 -98 92 30 -1 256 -36 -126 -120 7 95 133 9 -8 7 -99 -106 189
5852 189 108 95 -18 -119 41 -381 60 34 -15 187 104 -22 -65 -214 18 -84 234 1 -76 360 937 -61
5874 -61 252 24 343 -93 41 -451 -521 -197 540 -259 -195 391 -13 145 63 -62 -13 -25 11 25 15 -207 -42
5897 -42 -142 -88 73 -14 104 172 -2 51 106 -66 -61 -167 94 -123 288 117 -2 7 -130 168 -54 -204 201
5920 201 -32 30 112 112 -282 317 174 226 -34 -166 -10 50 138 -235 216 -137 169 41 268 -43 -76 86 -400
5943 -400 354 -60 -7 -33 -37 17 -140 343 -99 107 -17 104 -40 107 40 -164 67 -28 88 -155 -36 13 -49
5966 -49 -164 39 -52 -235 4 116 133 50 17 59 -100 54 -46 -39 -79 -51 200 -93 75 8 121 -32 -106 -187
5990a87K70o1k65J08K17k2N8k7q5j59K26l39l4LM80l06J31r4K67j51L2R9k39L77
6014B99M4l92J3k7lL8L60j99J8j53j11j4J70M2k25Q5k24M25m25K94j68O7J04M9
6038F7nj42l5j64q9L85k11R5J78o1r5J07j31K27J2l10J87j66K15k24Jm3L12N4
6062A64l96M85l66J06j48L49j39k15J62Q1M4k70K02k02J06N4oJ42l59L41m36O26
6084C25m20K97p3j44p7j17N10m79K44j49PO6M0n7k7K73j26R3l28n1J19r4J70K0
6108B2Q2k29J74M6m1J97k69K34j99J55k61J74l4k09L63j82J04l00K39k29J1J06
6130d6p7K62m01J56k9RJ75j16k4J16O1r4Q8j34L3J67k89L10m2Q4Jj26k89J74l
6155c4J62j48k10J86r9l8K45j02K42k99J15l6J99k36j97J68Q3K5j55K93k25J32
$$ plain form
5990 -187 83 22 -243 -135 82 60 118 91 6 -153 73 -266 -300 -297 183 -123 8 -86 181 30 62 161 -78 299
6014 299 343 -49 -36 -63 -66 -28 332 133 151 -2 -113 -127 43 85 -140 -55 -279 146 -279 15 -153 -86 18 67
6038 67 62 -80 -115 -279 -368 17 -194 -99 79 18 -77 30 -101 126 138 -172 15 -151 64 -160 -159 -202 110 164
6062 164 -232 253 -113 -7 -155 194 55 -160 2 83 127 -143 59 -143 -37 17 11 153 -206 135 -301 325
6084 325 -95 202 129 -15 -92 -209 301 -178 66 -83 -76 -10 30 -27 -54 219 93 186 -142 -193 -74 -168 2 22
6108 22 104 -125 49 95 54 251 -18 216 17 172 -89 85 51 -158 205 23 127 -173 66 -163 -152 -46
6130 -46 -123 139 -262 -106 -135 -126 49 -67 -91 25 86 -8 80 -54 -21 146 -143 167 125 209 210 84 -205 -31 -34
6155 -34 128 -20 -230 -44 -143 -181 64 -38 204 -95 20 -16 183 -53 -250 -82 1 26 -129 164 -61 71
6177G1r3Q8m6J99Rl70k15K72K3P1k01K65j33L00l21Q1n3j09N6K82k4l66K6K76
6201H8m13K82J23l87M32M0j77m2lJ70P2j44O8jj72n1K62l94N04k03LJ1J07j30
6225D5k04K15j56K15j22O0k22K71j29J12Q3l79J11l6L27k30m7J73M2r2l6K40k08
6248C3r8J17j57J04j12J15j54K01J0L1J6k09J25j83L25j90l6O1k7L6k31O21n00
6271a02K4J88k5j43K17Pk25J59k03M48m35K1K9J09j10p0J05m7J95k32k26J31J48
6294c7m9r1K35k71K66j05J56k24K38O3l26J75M1rq6j30J6J26L23l91J64n5l9P3
6318F3K8j20L8N6n9j52K55j03N0j42L9J63r3l4K4pj41mr0L57j3J13j92J8k99K64
6344A9l2k38N23k15J67m39L39q4j05N0j72L23j39J02j06o1j92L40k77J79P9l14
$$ plain form
6177 71 -22 66 20 219 228 -142 -357 -85 -62 9 -192 73 -60 240 -81 0 -53 -162 -106 176 152 -214 -188 88
6201 88 -325 -43 80 -307 125 165 -12 -54 -57 113 185 41 109 108 -64 -115 147 -247 257 54 57 68 175 45
6225 45 -159 56 -100 115 -7 53 -169 102 -27 85 168 -211 -100 -136 191 -39 -86 87 129 37 1 241 33
6248 33 -65 52 -105 -1 -113 2 -152 49 59 90 106 -103 22 -161 164 -26 -62 -1 -28 8 -223 398 -102
6271 -102 -78 110 85 -58 159 166 -59 100 -103 345 -90 -69 -40 69 -41 -111 -6 -53 142 -90 -316 -185 -37
6294 -37 -86 -177 58 -213 53 -52 104 -120 118 181 -145 30 71 62 -24 -154 -138 -12 311 -80 84 29 -10 63
6318 63 91 -29 9 65 6 -146 109 6 56 -86 -47 116 23 -11 13 6 -135 -139 -229 128 115 228 36 54 -245 19
6344 19 -13 -251 272 57 224 -215 124 40 -65 -15 -187 136 -3 99 -7 -68 -260 80 -197 -18 61 -253
6366b53K02k33L17j45K8L17l67L15l67M54o72M14n7l6J64k35J05k84L72k43L15
6387A11m0j36J42j43L34l22p8K18j10O6j13J95j81n4j47K66p6J32j74j26K54J44
6409A62M0k33K69j81j49%K16P0k51J40l04K81k5k38K14j23J82j78K58j79j45J73
6431aJ41l00nK25k44J49N1k88L17jO4j2k45J65J56j45j79O6k42L70j95K33p5Q4
6455H9k40J09O5j80j3L7K46L4L0k82M07j40k02j29J13K78j93j25K26k53M4R2j2
6478Ak7m4J40L5k48j13K60n0Q7R8l41K46Rp8M8O3j35nm4J25j85K72m2O5k35P0
6504b8j35j8O9N9k4J88k64J09r4J41j0J1J5k1l9k66N38n71M45j30J15r2j17M32
6528C13k51k7j57J63Q8Jj73J08Q2l3k31o8J00qj22L77j89P2J15j45o9O0m98L05
$$ plain form
6366 -253 -51 -284 33 -112 -84 233 -134 181 -186 268 -404 10 -47 -83 81 -154 -49 -333 39 -204 111
6387 111 71 -65 77 -66 268 -54 -132 86 -24 42 -71 124 -57 -111 -258 8 -68 64 -110 -236 18 162
6409 162 202 -31 238 57 -92 -92 124 194 -57 83 -221 60 35 -203 11 -112 70 -108 150 -29 -174 -1
6431 -1 140 -160 -165 60 -184 -35 16 -272 45 44 108 96 -149 16 172 27 -152 -86 -328 42 -153 80 5 89
6455 89 -151 -42 23 -157 -170 -133 113 147 177 -105 302 162 -40 -169 -56 222 29 -96 130 -123 -79 13 1
6478 1 -26 -70 70 105 -143 -256 4 -46 41 139 -202 44 53 -25 23 86 -49 -54 -98 27 -158 114 72 137 -98 -28
6504 -28 -163 -181 -112 -53 -77 111 -153 -44 -138 3 -7 4 19 -2 -41 -307 231 -340 105 -25 90 -2 -119 313
6528 313 62 35 -122 41 129 130 -43 65 147 114 -117 -185 -85 -93 -215 162 -27 45 160 15 -54 6 -492 -187
6552a87P9n79J045j168R62k65j26J91l46Q44m82m07R02l83K94m22K80n8j02j22
6572e0j01P5j40J55M71p18pQ5R8O1P87p18k35K97P5p23O30k65L39k30M4j54M08
6595A84l54L78r2l66l01M18o02N15L01M6k29j78j16K87L0O33q70L89k74N82o44
6616b63N28l78L74o23N02k54L02k64l02O16k77N11l10l86K34n8J86k89L95l21
6636g7J22m6k05j56Q21l81k63K14L7J04l32K54k28K82k72L87j95l4j27J61J20
6657A86j74n3k58J97Q3Q1J42n19O25l71R4J59k12j06L08j26r4L3j25J04J41j28
6679a3k2J52j89J4J24j4K02m44R8L45l31k7O2J35k97l7M61j37l9J0nn7j40j0J09
6704e0p7JJ21N4j26M8O8l45M94r2k32L20k93N5k8O10m87o9J65j52K72l12R4j08
$$ plain form
6552 -187 -108 -687 358 -810 152 -113 -239 -48 -394 450 -32 -439 463 80 374 -48 232 174 72 -50
6572 -50 -151 -76 -216 -61 410 -308 -315 -230 -132 -71 716 -2 -237 60 135 -588 42 -223 116 -114 -70 -224 184
6595 184 -170 208 116 -250 -551 -133 -735 -220 81 127 -102 -280 -396 -109 -79 554 -316 73 -201 381 -263
6616 -263 265 -113 261 -362 140 -114 188 -76 -378 238 -39 472 162 -224 10 -48 138 -151 244 -77
6636 -77 45 -1 -206 -362 459 78 -185 29 66 170 -162 92 -136 146 -126 261 66 32 -95 66 186
6657 186 12 -41 -299 -102 -19 62 204 -315 310 -61 33 192 -20 -126 182 56 -38 -5 -130 -26 115 -13
6679 -13 -35 117 -72 -58 66 52 254 -190 -92 253 -78 -105 -43 92 -205 -242 219 82 43 53 48 -9 -149 -159 -50
6704 -50 -127 -126 -5 49 -77 -29 39 -306 188 96 -136 184 -109 -54 -82 528 41 -28 137 -15 257 -55 39 -69
6728f9J16J66q7k63K3K67j19J76o01N90l17K5J68j55K1j24K64l2J39k28J09J47
6750B16j95K48m08N2j52N55k58j44l5j00L79k04K58m04K87k05O0R9j84K87j55
6771cN6J69j55lm9Q7J3k19J84J40k27k19M89j38l50K80R2m05O97j27N3n38R2L39
6795B58m33K28k71K86j16J52L4k97j31j30N09N9k84j15M20j15j36K7M92m24K71
6816B84q90L27L56j35M54m09P0j19m6K44l71N36j30k68J02J43l23L18l70L94k30
6837f3L88k38m8M20m16o34O29pQk16M46r46N51N59J16j102L24R6k3N24n83N7j23
6860b81N55p41L91N32j85m73J05l6N21J71m02K66n84J68l71N51k89k69M22Q72
6880I23o07M3M6l36J76K68k91N06m04k61l04Q2M18L47j054j29J078k21n83M35
$$ plain form
6728 -69 47 213 126 -137 -114 153 34 210 -391 199 -118 -93 75 -80 -59 -183 81 49 188 -40 69 216
6750 216 21 269 -139 -87 -239 316 58 -86 -121 -221 158 -46 212 -192 95 -110 -50 49 -135 152 -3
6771 -3 53 222 67 64 15 102 115 -104 80 220 -7 -226 263 125 -225 55 147 -258 439 312 365 -173 -81 258
6795 258 -175 53 -218 68 -48 104 138 -159 -290 -420 89 148 -136 -251 169 54 -82 -55 437 13 284
6816 284 -606 -279 77 -58 396 -13 57 -62 -108 136 -235 301 171 -97 5 148 -175 143 -227 167 -63
6837 -63 325 87 39 459 43 -591 38 31 39 -177 269 -677 -126 433 549 -553 -229 -133 -156 368 -215 -158 -281
6860 -281 274 -467 -76 456 271 -202 -97 -133 388 559 157 423 -161 7 -364 187 -102 -371 51 923
6880 923 316 359 405 69 245 513 222 728 324 63 -241 -159 259 606 -448 -577 501 280 -303 132
6900A32j13K30j73M88o20m68Q22m08J56p6R3L7k67K77Qk73J14RJ43k36K35j75
6922f5O1K03n69L72j0J15k2k21L15j99o1j63L45k04l3J1j21J26J14r1k62K06L4
6945a19J69m2l9m6J70K6p3Q4q7k57K53O0m5j4r3J2J83j87J94j69l8M8jQ5j93N2
6971f7K23k68Q0O5J46j88K18jQ9q0k98J50j55P7j20K92j2l27J48j02M5r0k16K30
6995a61OoJ09L5M9N1l72K63Q2P9k18N4j54K85k7r9K00k43K15n7Q0q3k40K22j28
7020e8j48O5J2L4l8J00k0M1RL6j83O9K0q2J41LN7j14K99j41J69k35o7J99l23L35
7046A80m37N67l18K03l97J36K03j67J46l15K47j64J87j01P4J58j29J9k96L47o7
7067G6m5J43l74K22m3N4L2r7K77l20N6l6k7O2O1j7j41K5L3kk47K98p7J98l3Q0
$$ plain form
6900 132 19 249 76 564 -56 -524 298 -110 46 -30 63 100 -167 110 118 -155 -41 -32 111 -125 110 -65
6922 -65 -4 199 -370 2 -8 107 85 -136 179 -20 -81 -244 101 -103 -136 -125 -246 -120 -6 -97 -359 -153 -119
6945 -119 50 8 -31 -77 93 119 46 130 43 -214 39 99 54 40 -53 -41 142 -45 149 -20 -58 -10 -11 74 -119 -67
6971 -67 156 -112 -32 33 179 -9 209 208 297 217 -81 69 -86 -9 -129 163 151 -176 -28 -130 -85 -175 -391 -161
6995 -161 -155 -161 -52 -17 32 83 -289 -26 56 135 -83 -29 -183 102 75 -24 176 -67 148 91 171 88 -152 70 -58
7020 -58 -206 -141 -129 -95 -133 -33 -53 -12 -3 33 -150 -81 -61 -143 -2 1 58 -56 243 102 271 36 -31 168 -155 180
7046 180 -257 310 -8 195 -202 -66 137 -30 116 -199 48 -116 71 -30 44 202 73 92 -204 143 76
7067 76 31 174 -200 22 -21 33 65 -32 245 -75 -19 -55 -82 -20 41 24 -117 -92 -59 -61 -308 -10 -87 111 78 158
7093A58j11k10J42k38K05K95l54Q3K15n9j37J94k23l3j9K02j14J40q6k31L05j30
7115fk72L03qJ54o3m5j73L34j95p3J48k81K81j38O9J8J00n7P0j31kj02J83N7j03
7140F8r0k8O4o5j30K27k36N9J38p9K51k15k9K8Q1j21K27l54K06k43K76O5p2j45
7164a17J49M8j03P2K0j59q6J98N3o0J3rp1l1r9J04K2P2O2l88K90o8K59l91N4K04
7190C8J5M7J21j80k28K19J08j16O9o8p1K04m5j76N5L3P8l14K77N5J4j5k47J16
7214a1k3O0K00k49L1j09K29j52P9N5j32J6k34P5K53j02j09K40k00O6o3J01j34
7237a13J19j0j18k9J5J17j58M93m43J7L11k73k3l9K41r5J18m00K62Q8j59J37j80
7260a22K41k89K45K0j07k9n1M0m8J69Rj49r3K41p4m9J32k1k6j20K51j25r9J38
$$ plain form
7093 158 47 -163 -21 -259 -54 241 -113 -30 185 126 -11 183 -40 -73 -92 110 -4 136 50 -181 124 -6
7115 -6 -278 25 17 171 108 63 -110 224 29 -44 104 -177 104 -34 35 53 153 96 166 35 33 -69 114 171 68
7140 68 -22 -50 14 -51 -181 46 -190 -131 7 -72 179 -36 -65 -37 44 -77 150 -204 2 -241 35 100 28 -117
7164 -117 32 80 -23 49 69 -90 -176 22 75 15 28 19 -52 -83 -182 -78 -56 16 78 -310 -20 -88 171 -220 -166 38
7190 38 53 100 221 41 -187 32 140 24 93 25 -46 158 113 -63 -8 25 103 -211 66 121 135 120 -127 -11
7214 -11 -34 26 226 -23 8 -101 128 -24 55 110 -22 -6 -240 -165 88 -14 -123 117 -83 -17 -80 21 -113
7237 -113 6 -4 -122 -151 -136 -19 -177 316 -127 -110 201 -72 -95 -134 107 12 130 -270 -8 80 -79 58 -122
7260 -122 119 -170 75 95 -12 -41 -92 -52 -100 69 78 -71 -164 77 3 -46 86 65 39 -81 170 45 -54 84
7284H4p2N3l1JR8j14J66k64rN0J38o2K86l63j07J28j43K27k01J33j35m1O07o77
7308b48L55K3p6j3j36J98j18J22J25j32j39J30j82K08j26k99L77k28K85m3P3j66
7330a0J45q9n7P0j36K04k76P9j23K48q8n9L24k89L8N7j48J11k66K99N9j13J6j2
7354a6O8P5k84N7RJ36j13J48K85k51P4l22L66R8p2l54M42mq98O03J3m1J9n8j5
7379c5P1K02k44O0j62N1K4m6k2K99l12n3L22l01K08p1j44P2j14R7n9R8J32k05
7403a32M12k48j52q2K43pj44nL8K6P8jl2j52mL95n10J06L07k40J24N0k61K72J26
7428B07j05j64M6j0N2k2L2j45R2K52r2k81J94k27K04k24K85j27l8J79j98K09j52
7451c3j32J06m6J33p1j05J59j78n9K05j26P1J85k1l04J38r9J11J24r2o2O8M1j67
$$ plain form
7284 84 12 65 34 35 133 19 185 -79 -88 -38 100 38 324 -39 -146 -18 -161 66 -135 -2 -137 -178 429 -248
7308 -248 107 130 54 41 -95 103 -15 107 232 100 -39 91 -91 117 -9 -308 69 -159 126 83 156 -10
7330 -10 135 46 -11 59 -77 127 -149 -70 -193 55 -33 -92 232 -57 -19 38 -110 1 -265 34 93 -20 -4 -16
7354 -16 52 127 -157 -100 -91 45 -68 80 365 114 188 -134 232 330 258 -96 346 342 -556 47 60 19 38 -20 -35
7379 -35 36 238 -6 54 -108 -57 -33 -79 -101 198 -114 -167 155 -146 62 -9 -153 -81 -195 -98 -157 -59 73 -132
7403 -132 280 32 -120 -202 41 34 -110 -115 -77 -51 27 26 -6 -158 -162 233 -277 -171 136 -104 20 70 -191 81 207
7428 207 102 -62 -16 -26 26 4 36 -109 -17 235 143 -138 56 -171 33 -191 94 -33 -71 108 -90 119 -33
7451 -33 -165 -59 -105 28 -43 -148 11 -167 -226 -21 -147 -76 109 88 -216 -78 -177 -66 58 -34 -96 -28 13 -154
7475a54n5j0K30K5J60l04j7J0N1K38O3l08K36r8j48K3K69j49K4j51rK59m1j15
7499B9R9j98p1K21j34J49l0J96l5k78P4lQ4p1j60R1m0J73l53P9K19P4K5l23p5
7524b58K8K73r2N9K23k08J55O9l73J93J53j72j4K6J02n9k98J01k13M25m8k68J93
7547cJ30p9k97J61O6K52j44J8J86l29J62P0j44o7M4p1J1J18j05r1k5J19P8p4j24
7572a38n6J07P0J58j99J23j29K54p7j20J71l94L87k42K05p8k40L9k12K93Kk6K43
7595A41j02j01m9J28j42L2K03m3Oj00lN3j1rL5m1k42K7J88J12k27J57p2o3K71
7620A48j7l68M59m71L51r3j98J49J39l05J26j99J78J30k19K54k28J14J93j63r2
7641a12J4j05J87R8n1R8q1j03R7j12p1K09R2K6k12P8K9J88l06R6L26l75J55k53
$$ plain form
7475 -154 -209 -219 11 36 196 -108 -125 -115 -64 174 237 -71 165 67 -81 -58 211 62 86 -65 -74 185 144 29
7499 29 128 -70 -141 80 -54 95 65 261 226 -52 22 19 103 32 -128 -37 -77 96 -257 -178 41 115 140 -183 -258
7524 -258 -230 43 -49 10 233 25 180 249 -124 69 222 50 36 62 164 105 -193 -92 -305 120 72 -196 -3
7547 -3 127 48 -249 -88 -22 230 86 104 290 -39 123 193 49 -18 26 -45 -34 84 -21 -112 -137 -18 60 -14 -138
7572 -138 -194 -87 -17 141 -58 65 -64 190 113 -7 164 -230 157 -85 120 42 -198 -159 -371 -78 -76 -102 141
7595 141 39 -62 -111 17 -125 -93 110 67 73 -27 -30 23 12 3 38 -3 -245 -218 -30 82 -145 12 -60 -123 148
7620 148 131 -237 222 -249 102 9 -189 -40 99 -206 -80 -279 -101 29 -190 64 -164 -50 143 -20 -112
7641 -112 -98 -203 -16 82 31 129 48 -55 42 -70 -141 68 160 186 -26 52 81 269 -37 59 385 10 165 -88
7665h8L3M8l9J17r4L04n2o7l82K64j33Q1M9k6m5N8N9j02K3N3l3m5J16j61K1J72
7691A31q3J64r1j63k6j09J95J02q9r1J24L4J00k01r6O0m2o9O4J28J00j02j42J10
7715Hk7J29J4j29J35j01J21j58k39L10j29p8J98j30Q9j30K02l1j08j71J46pm9
7738a35J38k65J69J00j32K83l50K71p2J1K18j26n6n9K43l15o5J31r4K47l74K31
7760ak6K8m3J71j93m8L1k5j7K17m8k08J84K5Pj00K42p4j12J00j86K20j01q5J35
7785I3q5k61K09J24j07J40j59p0K17j94K83k14M9n5q6K50r1%j32J94j66p1K17
7808H5o4R5Rj36j18K11L3J45l58R9pK14j10j36J5J02J57n10M41j84k94L38o8r5
7832a36J18K46l10Q0n4L1R6r4j54J32K6p7O0K51k80K46l20J09k07J45K90l59K25
$$ plain form
7665 -88 -55 -7 -46 71 -23 281 229 162 -220 44 -89 -8 41 15 -30 28 87 -15 8 61 28 -17 99 -62 -41 131
7691 131 48 212 121 -42 -68 -177 18 120 31 -60 64 98 198 -3 -99 -39 -81 -150 -86 42 142 40 -102 8
7715 8 -19 110 124 -5 130 29 150 -8 -247 63 -66 -144 54 -76 13 -117 85 54 -54 -225 -79 -86 -135
7738 -135 3 -262 -93 7 -125 158 -192 79 7 18 236 110 54 -5 238 -77 -142 -11 -105 142 -232 -1
7760 -1 -27 1 -42 129 -64 -112 -81 -106 -123 94 46 -162 22 47 54 -46 196 122 10 110 -76 144 43 -42 93
7785 93 8 -253 -44 80 -27 113 -46 -116 101 -93 190 -24 25 -30 -116 134 43 43 -89 105 -61 -132 85
7808 85 21 116 125 -11 -129 82 115 260 -98 1 -6 208 98 -38 -23 79 236 -274 167 -17 -311 27 -41 -136
7832 -136 -18 228 -82 -2 -56 -25 71 -23 -177 -45 -19 -96 -36 215 -65 181 -139 -30 -237 -92 198 -161 64
7855F4j51L1M7n4M5N9q2J36J5j80k74M29J8j96L30k37J70q5r1P9l16M04j08M5
7879I8k01J80K30k90k4R4J05k46K26k50J30J89Q9O8m13J91L2k56P2o9k3l5j31
7902b34J82Oj45M55l04K81j12k22K2j30K61o0J49k4k05J26J7L36l23l59K12k4
7924i5j39K17j43J45J75j30P4l8J86j48J58l14L7J34q7m0K16m33L16j85K55l52
7946a91K67J32j27j01r7P0K5o4J42j74lL68j66jj50j01L57j99J02l66J42K81n7
7969H9j65r5L46k77R2k56K21j05K33j82K35k02q3R4K63Jl38L41j78j26j9P2j4
7992e3P4M5j11J19k01J01J92l04L15k09J0rQ3p7M1JN2k81k2K10j8J02K22k86k9
8017c3Q3k05J40OK51l00J21k52K40k8K38j77j08j8o4lJ62J08j27l3K07j62J70
$$ plain form
7855 64 -87 -56 -9 -63 -18 41 -41 95 110 -70 -344 85 103 -93 237 0 170 85 -6 73 -243 161 53 98
7879 98 -103 77 307 17 -7 87 192 -54 172 -78 52 241 330 398 -15 176 208 -48 24 -45 -68 -103 -234
7902 -234 -52 -46 -191 264 -40 241 129 -93 -71 -201 60 0 149 125 -80 46 63 399 76 -283 -71 -95
7924 -95 -234 -17 -160 -15 160 30 104 66 252 104 262 -52 -15 119 32 -8 208 -225 91 -94 161 -191
7946 -191 76 208 81 -20 -117 -47 -22 -86 56 -118 -121 247 81 80 -70 -171 186 -13 89 -277 -135 146 89
7969 89 -76 -171 175 -102 -10 -266 -45 -150 83 -99 136 -66 -149 -55 208 209 -129 212 34 -92 -111 -39 -53
7992 -53 21 66 -45 74 -127 -26 166 -138 177 -32 -22 -31 52 -25 16 17 69 -212 -234 -24 -42 60 282 -4 -33
8017 -33 50 -155 -15 -9 242 -58 63 -189 51 23 261 84 -24 -42 -106 -109 53 161 34 1 208 46 216
8040B16m02L51k5p0p3K99j98j53Q3l3j75K36j14j61K07k02L19j19P0M7k76J21
8062e2k8J15j73K3R1j51J72j56K35M9k59K27j67J75l75K32Nr6J88j44p6J79j34
8085a20J93j58j03O0K50j50K21k38K40k55k18L30K55j81k0J20o6k07J22k46L87
8106B16J43l09p4L2Mk1n1J07j08K15j56L7L75l94l1j41L31j51p2K6M1j08Q3p1
8130g7K34q5Nj33j2j82K95l77L08K8J58j96J8J35k46jJ42j0p7J26k16j60L04k8
8154d7k57L91M7k51J4K08j04K51k69n3J90q0Q5k57J13q7O6l3m4m0L08R3l29J94
8178A09j03K11k69N7Q1q9%K1L52m19p0K52k8
$$ plain form
8040 216 -186 165 140 70 -3 296 98 -55 28 -5 -180 56 -58 -219 -12 -214 105 -14 56 103 -173 -52
8062 -52 -80 35 -138 -115 -24 -175 -3 -159 76 125 -134 93 -74 101 -274 -42 -37 -133 55 -89 -165 14 -120
8085 -120 73 -85 -188 -128 122 -28 193 -45 195 -60 -278 52 307 126 106 226 160 -47 75 -171 216
8106 216 359 50 -24 8 12 -9 -60 47 -61 154 -2 35 410 16 -15 -156 175 24 -48 -22 19 -89 -6 -77
8130 -77 157 72 77 -56 -68 -250 45 -332 -24 4 162 -34 -16 119 -127 -128 14 4 -73 53 -163 -323 -19 -47
8154 -47 -304 87 134 -117 -103 105 1 252 -17 -70 120 40 125 -132 -19 -106 -40 -73 -117 -157 151 244 -85 109
8178 109 6 217 -52 5 86 -3 -3 18 370 -49 -119 133 105
8191A05
$$ Imaginary data points
##PAGE= N=2
##DATA TABLE= (X++(I..I)), XYDATA
0@%%%%%%%%%%%%qJ6j6J6k4L2l2M0m8N6p2Q8j04J20j37J61j88K16k49K85l25L69
34A96m20M76n36O01o73P52q40R37j042J158j282J418j569J731j908K104k318K552
52A337k810L097l414L770m172M625n143N743o447P282q300R573j1212J3413j6557
67i215K1482l0689P9062k27338J33354K11518k52330L4539P3964m3271K1444l2199
79a9679j9945J26570j26940Q355Q3712n3610l9166M3699L5044p8049P435Q4474
91E1900l8640q7034J06197O259r5756P2194l6105K4718K1932o8421L6245N4990
103D8479p1074j612M6253m0937L8814n1383J2100O6795o7987J243M2590j1860
115A1421l1498K9744j7221O150k19l348J5778k5572L5252k1196M428j775j3965
$$ plain form
0 0 0 0 0 0 0 0 0 0 0 0 0 0 -8 8 -8 8 -16 16 -16 24 -24 32 -40 48 -56 64 -73 88 -100 116 -133 152 -173 196
34 196 -224 252 -284 317 -356 396 -444 493 -549 609 -673 745 -824 907 -1001 1103 -1215 1337
52 1337 -1473 1624 -1790 1980 -2192 2433 -2710 3033 -3414 3868 -4432 5141 -6071 7342 -9215
67 -9215 12267 -18422 60640 -166698 -33344 178174 -74156 -39617 34347 -8924 12520 -19679
79 -19679 -39624 86946 -39994 -31639 52073 -1537 -40703 2996 38040 -40009 -32574 51900
91 51900 13260 -73774 32423 38682 -57074 15120 -20985 3733 25665 -42756 -6511 48479
103 48479 -22595 -24207 22046 -18891 19923 -31460 -19360 47435 -20552 -19309 23281 11421
115 11421 -20077 9667 -7554 -1404 -1623 -4971 10807 -14765 20487 -709 3719 1944 -12021
128a2021L5240k2973l2517N3591J7711r0195P4375O055n9553N3210l0077m994
140a2148L7235k8065k3457O1993l2961j4308K6936k8018L2517k8282m884K1569
152H127l019r225L850M409l007P558k7187K9437j9772K332J7104l3463L0402M666
166A2212k2905l98K8335k5576M470j399o667L2240m0421J7633J2823j6977L493
179c137R442j9334P048K5176m2311K1499J0032k987j3863J57K4583k0377k568
192f640j985J9271j2038j908J988Q241L091k3149K7531k0076L759J1456j4170
205d629l256K0399j278k6459K8202j1222M290p573n003J5435q555J290o418J4984
219A0207j1056P038r238N70J1801j3577N331j1365K5172j2774j3124J2960P812
$$ plain form
128 -12021 23219 246 -32271 21320 39031 -51164 23211 29266 -30287 22923 -7154 -12148
140 -12148 25087 -2978 -26435 35558 2597 -11711 15225 -12793 19724 -8558 -13442 8127
152 8127 5108 -4117 -267 4142 1135 8693 -18494 10943 -8829 -6497 10607 -22856 7546 12212
166 12212 -10693 -11091 17244 -8332 -3862 -5261 -11928 20312 -20109 -2476 10347 -6630 -3137
179 -3137 6305 -13029 -5981 19195 -23116 -1617 8415 5428 -8435 -8278 16305 -4072 -6640
192 -6640 -8625 10646 -1392 -3300 -1312 6929 10020 -13129 14402 -5674 -1915 9541 -4629
205 -4629 -7885 12514 11236 -15223 12979 1757 6047 -1526 -6529 8906 351 1641 -4777 10207
219 10207 -849 6189 -3049 -2479 9322 -4255 1076 -10289 14883 2109 -11015 1945 9757
232I757j1188j1615K0789j4208J1116j2129N337R637j4359R405m618J236o232
245g072J4755k0045P619J3435j5661O766o607J5373j2548j399J345O823k827r445
259i488J4047q431J0812j4613Q701K541p618N770p244J0552o444M059q555J4699
273H788o866p596J3447j3543J1492p401L489k218O271l022m059O547q501J3768
287A0596j8605R048L579k961j808l059J3810j1878L033n694J1863r529j093O153
301C455p577J3105j4836P665j142J954m787o28L365l169R194j8053J5574k857
315A263k203q19l147Q228o912L230q326J4120p280q57J68l38J0317j6693Q381
330h68k127O528p612n15O377o08J623j1960J5920r429L631k763j683Q470o243
$$ plain form
232 9757 -1431 -13046 7743 -6465 4651 -7478 -2141 7496 -6863 2542 -2076 -840 -7072
245 -7072 7683 -12362 -4743 8692 -6969 -203 -6810 8563 -3985 -5384 -4039 2784 -43 -9488
259 -9488 4559 -3872 6940 -7673 1028 3569 -4049 1721 -5523 5029 -1415 2644 -5911 8788
273 8788 1922 -5674 7773 -5770 5722 -1679 1810 -408 5863 2841 -1218 5329 -3172 10596
287 10596 -8009 1039 4618 1657 -151 -3210 10600 -1278 1755 -3939 7924 -1605 -2698 3455
301 3455 -4122 8983 -5853 1812 670 2624 -2163 -2791 574 -2595 6599 -11454 4120 1263
315 1263 -940 -1759 -4906 3322 -3590 -360 -8686 5434 -1846 -2703 -2535 -2873 7444 -9249 -868
330 -868 -2995 3533 -4079 -4594 1783 1175 2798 -9162 6758 -2671 960 -1803 -3486 4984 -1259
345a259L082o286J2007q719K582l471J527Q327j3307Q475l857Q173q625J271K772
360B692j017J858r107J1805q005P544p428J328O092n852K777p564J0912p264L597
375B368o187N419M462j1073P244m478Q033j0712L442J693P37j658n917J2102r104
390c629N385o471M841l22l257M153o031Q273p164O997p243L790J653m550L696
405A21n979J1868j0516K390P99N216m364o296J1133n968M548r828Q997R90l621
420e10j062N79Q489j2238O684l335N889m786j757O093n189O264p931O302m668
435a176N498l475l195O273n004P049j0172O577J44P66n178q63R702q250K154n468
451d618J1611p101k722L800j796N028r504N609k434O333q135J364N338n191N006
$$ plain form
345 -1259 1823 -4463 7544 -1175 1407 -2064 -537 7790 -5517 2958 -899 7274 -1351 -80 2692
360 2692 1675 3533 -5574 6231 -1774 5770 -1658 -330 5762 -90 2687 -4877 6035 -1229 2368
375 2368 -3819 1600 6062 -5011 2233 -2245 5788 -4924 -1482 211 948 -710 -6627 5475 -3629
390 -3629 1756 -4715 126 -196 -3453 700 -5331 2942 -4222 2775 -4468 -678 975 -3575 121
405 121 -5858 6010 -4506 -2116 -1317 3899 -465 -6761 4372 -1596 2952 -6876 2121 3111 -510
420 -510 -1572 -993 7496 -4742 1942 -1393 4496 -290 -2047 4046 -1143 5121 -2810 3492 -1176
435 -1176 4322 847 -2348 3925 -1079 5970 -4202 2375 2519 3285 -1893 -2756 6946 -1304 850 -4618
451 -4618 6993 -108 -2830 970 -826 4202 -5302 307 -2127 4206 -3929 -2565 2773 -2418 2588
466B588r226Q329k383J558n186J711O399p206L189m587R685r516L609J153m534
481d417O804m630K513n313R988o581q46J003K811L027j2401J0362p65K398q998
496e045L823Q474p953k275J916R843j4337O698K134l285K028k563M163o002P448
511E067o393K978j822J456L362q131O762m180O572q715K397M838l755j394j412
526b370Q627r518N422m805L385K637o629L120j856P464j0491M105J513R70m310
541b736j048Q642r878O077l893K987j365O07O08m422P176n940M806o995N963J9
557F08k728Q10j729Q814j0942L521K670J307o423L021N235p953P820p270M160
572I21o3J030k417j215O413n715L478o037P721k142k186k70J122N935j1297O298
$$ plain form
466 2588 -6638 1691 -692 866 -4320 -2609 3790 -3416 -227 -4814 4871 -4645 -1036 117 -4417
481 -4417 2387 -2243 270 -5043 4945 -1636 -2482 -1479 1332 4359 -8042 2320 1555 3953 -5045
496 -5045 -1222 7252 -701 -2976 -1060 8783 -5554 1144 3278 -7 2021 -542 3621 -2381 5067
511 5067 -1326 1652 -170 1286 4648 -3483 3279 -901 5671 -3044 -647 4191 436 -958 -2370
526 -2370 6257 -3261 2161 -2644 741 3378 -3251 -131 -1987 5477 -5014 -909 604 1574 -2736
541 -2736 -3784 4858 -5020 1057 -2836 151 -1214 -607 1 -4421 2755 -3185 1621 -5374 589 608
557 608 -2120 -1310 -3039 5775 -5167 -1646 1024 2331 -4092 -1071 4164 -3789 4031 -3239 921
572 921 858 1888 -529 -1744 4669 -1046 2432 -3605 4116 1974 -212 -482 640 6575 -4722 1576
588A576j84K339n993K292L617m617M432o827O711m203K681j815j329L741k872
603d51K779o674P700l209j42k447J329O012q817K951o10O316q944J363M844l042
619a042L85l970P521n899L688l172J566J951l823L982n246N528l213L512n602
634c834K419N559p637L145j352N825p932L873J033j044J381m081N604m406M530
649C083n350L193O09j345J987n466P436l738J065l478M794m14m304M213l414N220
665D091o152L937j739J382K50l859M957m218M816n758K905J69M97j207l292P607
681D386o697K930k892L899j404j914J706k624N981p383M420k236K542j428k671
696c385M400k842M078p010N510q99m35j273j54M714o139N069m399M209j694j009
$$ plain form
588 1576 1392 3731 -2262 30 3647 -970 3462 -3365 3346 -857 1824 9 -1320 2421 -451
603 -451 2328 -4346 3354 145 3 -2444 -1115 4897 -3920 -969 -1579 4737 -4207 -2844 2000 -1042
619 -1042 -657 -4627 2894 -3005 683 -2489 -923 1028 -2795 1187 -4059 1469 -1744 1768 -3834
634 -3834 -1415 4144 -3493 -348 -1700 4125 -3807 66 1099 55 1436 -2645 2959 -1447 3083
649 3083 -2267 926 1535 190 2177 -3289 4147 409 1474 -2004 2790 2376 -1928 2285 -1129 4091
665 4091 -2061 1876 137 1519 1769 -2090 2867 -1351 3465 -2293 612 781 1278 71 -3221 4386
681 4386 -2311 619 -2273 1626 222 -1692 14 -2610 3371 -4012 408 -1828 714 -714 -3385
696 -3385 1015 -1827 2251 -4759 751 -148 -583 -1856 -2010 2704 -3435 1634 -2765 1444 -250 -1259
712a259Q45j312M545n551M240l658M882k549k277L652j883K860n810O138l105
727b42K166k232l76M073m221L233n014O308l115l0l85P5L398n403L952l216M569
744C540m585J091J934k745L535n169M556l220L593l775K41K803k702K440n432
759c895O634l850J109j651J061K345m863M037l541M972n273K134K57l28J840m509
775c521M934l395L472m226K387N08j513K016l995N792m457K562k399J915Q89k706
791a737L109l430N469n250K646j252J170P18l695M595l394L503m270L213j97q12
807C86Q44k783N563n055L058l060K971m97j906K174k780M723n676L934k439J865
823A322m02k124L294l587M084m685L674j911R13l46k291M503m004K842m257M201
$$ plain form
712 -1259 -414 -1726 2819 -2732 1508 -2150 2732 183 -2094 1558 -325 2535 -3275 2863 -242
727 -242 1924 -308 -684 3389 -832 2401 -2613 3695 580 550 165 240 3638 -1765 2187 -1029 3540
744 3540 -1045 46 1980 -765 2770 -2399 2157 -1063 2530 -1245 -1004 1799 -903 1537 -3895
759 -3895 2739 -1111 -2 -1653 -592 1753 -3110 927 -2614 2358 -2915 -781 -524 -852 988 -3521
775 -3521 1413 -1982 1490 -2736 -349 159 -1354 662 -3333 2459 -1998 564 -1835 80 969 -1737
791 -1737 1372 -2058 3411 -1839 807 -445 725 1443 -2252 2343 -1051 2452 -1818 1395 1198 386
807 386 1230 -1553 4010 -1045 2013 -1047 1924 1427 -479 1695 -1085 3638 -2038 1896 -543 1322
823 1322 920 -1204 2090 -1497 2587 -2098 1576 -335 578 232 -2059 2444 -1560 1282 -2975 1226
839A226j406r82O62j176L966n640M034k501K951k304r94K965k383K785m705M765
855A263k703J539r69o14K793l628L782m183M318k127K50j51n10L266m487L980
871A819l661M399k610q30K017o12J814m882N442l280K395k767J273J853l121K952
887B201l859N009l924J393n33K88J357l409M056m730M806l546R71N60p00J927
903A867m033M146l740L303l296J547R07j501K566m819M914k872J208k093J953
918E7Q26l569L277k882M749n482K478O3K1M92k491M853m756K764k587K588j106
935g05l38J861m083N429l281K540l246K293N3n55J515l482M682l502K031j475
951b63J610m33k767M257l006K581l294K366q37N77p1j841M435m562K797k292K665
$$ plain form
839 1226 -180 -1162 -500 -1676 2290 -3350 684 -1817 1134 -1170 -2164 801 -1582 1203 -3502 1263
855 1263 -1440 99 -870 -1484 1309 -2319 1463 -2720 1598 -529 -279 -430 -940 2326 -2161 1819
871 1819 -1842 2557 -53 -883 1134 522 2336 -2546 2896 -384 2011 -756 517 2370 -751 2201
887 2201 -1658 3351 -573 820 287 575 1932 -1477 2579 -2151 2655 -891 80 640 -60 1867
903 1867 -2166 1980 -1760 1543 -1753 -206 701 -800 1766 -3053 1861 -1011 197 -1896 57
918 57 883 -2686 591 -2291 2458 -3024 -546 -483 -462 30 -2461 2392 -2364 400 -2187 401 -705
935 -705 -1043 818 -3265 2164 -1117 1423 -1823 470 523 -32 1483 -1999 2683 -819 1212 -263
951 -263 1347 914 -1853 2404 -602 1979 -1315 1051 214 791 720 -1121 3314 -1248 1549 -743 1922
968A922k092j98J683k225K953l627L561l318L086j267j782K448j846K537m110
983b275L692k199J779j758j056L636l346K025l109M685l110j29R72p44J886l285
999b336L864m199L892k227j1J321j490J666k651L508k995K813j574p32K758k437
1015h30J902l340M610l422J211M7n89J826k729L183l475M120l226J243Q3n06J973
1032B081l827L721k496K856l438J730J321k134J342k541M064l545J729j033R11
1047G41L13j977K674l058L382k782J050j187P58J029k765L270l090L176l451K337
1063D20M0j244R87k203M076l776J909j611J714n79j292K268k813L765l951K605
1079C15r98P71m1k150L322k604K585l019K626p93m92P09j808L371l072K783l221
$$ plain form
968 1922 -170 -368 1315 -910 2043 -1584 1977 -1341 1745 478 -1304 1144 -702 1835 -2275
983 -2275 1417 -782 997 -761 -1817 1819 -1527 498 -2611 2074 -1036 -1165 -193 -937 949 -2336
999 -2336 1528 -2671 1221 -1006 -1017 304 -1186 480 -2171 1337 -1658 1155 -419 -1151 1607 -830
1015 -830 1072 -2268 2342 -1080 131 178 -411 1415 -1314 1869 -1606 2514 -712 531 614 108 2081
1032 2081 -1746 1975 -521 2335 -1103 627 1948 -186 1156 -1385 2679 -866 863 -170 741
1047 741 1054 -923 1751 -1307 2075 -707 343 -844 -86 943 -1822 1448 -1642 1534 -1917 420
1063 420 460 -784 203 -2000 2076 -1700 209 -1402 312 -267 -1559 709 -2104 1661 -2290 315
1079 315 -683 88 47 -2103 1219 -1385 1200 -1819 807 14 -478 231 -1577 1794 -1278 1505 -1716
1096a716K937q89o42Q91j727L620l881K517j740K368j517q30K371k293K345l492
1112a678L674k382N84M86j256K578k799K511l249L262j825M94q8j119K944l426
1128a289J957j832K846k121o09J662j212J772l506L374k184J621j604K30J793
1143H98k837K525k396K899k460J257p74j4J764l181L172k917L197k403P93R4l51
1160g34J579k956L093k298K541k447R96R85j461J648k650L495k580J454j122J112
1176F55O10k486K892k798K973k644J444l55J82O82k052K797k834K825k621J222
1192D92R6n98J284k611L354k556J620j852J558Nj537J352j808L151l644K144j101
1209f51R68r8j576K214k168K337k862K283q58j28N13j641K599k345K053k416K102
$$ plain form
1096 -1716 1221 332 -310 581 -1146 2474 -1407 1110 -630 1738 221 -609 1762 -531 1814 -1678
1112 -1678 1996 -386 198 684 -572 2006 -793 1718 -1531 1731 -94 400 312 -807 2137 -1289
1128 -1289 668 -1164 1682 -439 -1048 614 -598 1174 -2332 1042 -1142 479 -1125 -895 898
1143 898 -1939 586 -1810 1089 -1371 -114 -888 -902 862 -2319 853 -2064 1133 -1270 -477 -383 -734
1160 -734 845 -2111 982 -1316 1225 -1222 -226 759 -702 946 -1704 1791 -789 665 -457 655
1176 655 1265 -1221 1671 -1127 1846 -798 646 291 473 1155 -897 1900 -934 1891 -730 492
1192 492 588 -10 1274 -1337 2017 -539 1081 -771 787 792 -745 607 -1201 1950 -1694 450 -651
1209 -651 317 219 -1357 857 -1311 1026 -1836 447 -411 -539 -26 -1667 932 -1413 640 -1776 326
1226C26o22o74Q52j546K878k952K333j965J723n98j010K028k043K451k914K673
1242I40j411R79l38p85J922k439K553k763K486j232J68L73j023K435l159K821
1258A527k276J949r59j33O83j147J824k600K687j852J619j253j87J429j952K117
1274A476k694K557j849R00o03j79J853k874K461k302K563k200M66O31p95J420
1290H31k789L201k425J774j620N45M12r38J741k599K640k053J715j503P21N74
1306B27j698K010k192K607k184J107l01N6Q88j851K277j812K182k467J496P2r29
1323e12J390j851K684k457J948j467R64J50j421J818j930K429k510J928j285P11
1339E89K35j450J980k009K367k693J604k45j9L50j747K332k077J866k070J840
$$ plain form
1226 326 -296 -970 -118 -1664 1214 -1738 595 -1370 353 -245 -1255 773 -1270 1181 -1733 940
1242 940 -471 508 170 -615 1307 -1132 1421 -1342 1144 -88 80 453 -570 1865 -1294 1527
1258 1527 -749 1200 241 108 791 -356 1468 -1132 1555 -297 1322 69 -118 1311 -641 1476
1274 1476 -1218 1339 -510 390 -213 -392 1461 -1413 1048 -1254 1309 -891 -425 206 -589 831
1290 831 -1958 1243 -1182 592 -1028 -483 -71 -1009 732 -1867 773 -1280 435 -1068 -347 227
1306 227 -1471 539 -1653 954 -1230 -123 -424 -368 520 -1331 946 -866 1316 -1151 345 417 -512
1323 -512 878 -973 1711 -746 1202 -265 699 849 -572 1246 -684 1745 -765 1163 -122 589
1339 589 824 -626 1354 -655 1712 -981 623 378 359 709 -1038 1294 -783 1083 -987 853
1355H53n85j076J387j815K480k697K016j245Q08n73m00J255j721K122k791K558
1371E76j342L05M26j141J964k405K494k382J995p93j76L12p61K078k570K050j561
1388i31J585r77l52R00p19J374k338K720j754J110p04l49J597j981K167k186K180
1405A342j289P19n39l01J465k219K389k156K217j419n7J38k28J084k173K505j712
1422b34J241j325L10O10r89J489k139K073j497P79r08M34Q05j833K229k205K109
1439I49k051R15j09J02N17j789K298k217J982j706J026k24p30J464k087K663k087
1456a084J370j310J005L56j471J685j658K341k483J620p15N04M2j046J970j589
1472d63J437j904J422l52l2N85j623K320j983J627j556J384l89o20Q63j189J732
$$ plain form
1355 853 268 -808 579 -1236 1244 -1453 563 -682 126 -447 -847 408 -1313 809 -1982 576
1371 576 -766 -461 -35 -1176 788 -1617 877 -1505 490 -303 -479 -167 -928 1150 -1420 630 -931
1388 -931 654 -323 -675 225 -494 880 -1458 1262 -492 618 -86 -435 1162 -819 1348 -838 1342
1405 1342 53 772 233 -68 1397 -822 1567 -589 1628 209 152 290 62 1146 -1027 1478 -234
1422 -234 1007 -318 -8 602 -387 1102 -1037 1036 -461 318 -590 -156 649 -1184 1045 -1160 949
1439 949 -1102 -187 -296 -194 323 -1466 832 -1385 597 -1109 -83 -307 -1037 427 -1660 1003 -1084
1456 -1084 286 -1024 -19 337 -1134 551 -1107 1234 -1249 371 -344 160 202 -844 1126 -463
1472 -463 974 -930 492 140 108 693 -930 1390 -593 1034 -522 862 473 -147 716 -473 1259
1489A259k197J645j027Q51K06r77Q96r83J709k133J612j136P13M6r09J699j929
1506f55K085k636K119r69n02P88q67J348j860J979j867J225r57k46R87j040J621
1523E53j865J734j363J352l04j156J303j056J197j605J482m11Q2Oq53J428j111
1540e87J367j761K017j394N15j24m87J611k417K603j333P99r17M21O14n91P49
1557A085j447J059j899J882o58R88O87j917J001j288J817j819J875j477K55R51
1573A095j683J716j497R68j678K300p17j352J432q32J780k039J391j499R02N1
1589C38j144J702k563K306j692J617j673R60L34j169J433j545J970k242J363L7
1605C2n96N89j185J795j377J320j364J016k60n89J707k028J868j586J279j066
$$ plain form
1489 1259 -938 707 -320 531 737 -240 656 -327 1382 -751 861 -275 438 484 -425 1274 -655
1506 -655 1430 -1206 913 -56 -558 230 -637 711 -1149 830 -1037 188 -769 -1015 -28 -1068 553
1523 553 -1312 422 -941 411 107 -1049 254 -802 395 -1210 272 -139 -57 -51 -904 524 -587
1540 -587 780 -981 1036 -358 157 33 -454 1157 -1260 1343 10 809 -108 313 927 336 1085
1557 1085 -362 697 -1202 680 22 1010 1697 -220 781 -507 1310 -509 1366 -111 144 1095
1573 1095 -588 1128 -369 599 -1079 1221 504 -848 584 -248 1532 -507 884 -615 287 338
1589 338 -806 896 -1667 639 -1053 564 -1109 -149 185 -984 449 -1096 874 -1368 -5 32
1605 32 -564 25 -1160 635 -742 578 -786 230 -30 -619 1088 -940 928 -658 621 -445
1621d45J98J15l14J554j852K029j526J651j605O87l22n02J532j522J925k319J220
1638E04n40j75Q58j475K177j821J432j638J605j368K71Q05j080J705k336K094
1654A018j571Q48n53j93J183j631J454j652J618q13K41k21m49J562j933J417j515
1671a190J632r48j4M68n78J124j870J937j401J251j013jR02j044J077j793K183
1688G22j307O17m67K27O81j354J545j364J566j437J055l39k14R90j459J520j512
1705e30J444j112M18J56o83J218j556J857j490J033j013O27M64j033R84j330J840
1722A294j551R37o01J59L39j467J655j136J357j576J230n06m69N21j111J667j777
1739a035J604j240R11k4m65J67j159J909j844J445j045P61Q4q50R53j141J693
$$ plain form
1621 -445 -247 -132 -446 1108 -744 1285 -241 1410 -195 492 170 -332 1200 -322 1603 -716 504
1638 504 -36 -211 647 -828 1349 -472 960 -678 927 -441 -170 635 -445 1260 -1076 1018
1654 1018 -553 295 -258 -451 732 -899 555 -1097 521 -292 -51 -272 -721 841 -1092 325 -1190
1671 -1190 442 -506 -520 -52 -630 494 -1376 561 -840 411 -602 -603 299 -745 332 -1461 722
1688 722 -585 32 -435 -208 473 -881 664 -700 866 -571 484 145 -69 921 -538 982 -530
1705 -530 914 -198 220 376 -307 911 -645 1212 -278 755 -258 369 833 -200 784 -546 1294
1722 1294 -257 680 79 238 577 -890 765 -371 986 -590 640 134 -335 186 -925 742 -1035
1739 -1035 569 -671 240 216 -249 -82 -1241 668 -1176 269 -776 -15 69 -781 172 -969 724
1756G24j854J124k82K72Jp73J712j747J394j033Q74n63mL98n05J233j640J406
1774G37j279P23P4l83P47j047J636j950J432q23P26l34l99R35j056J267j645J511
1792H72o09J15k85l04J064j431J058q37J454j364L88K54o60J284k035J905j489
1809f20J050n60q3L96o35R11j732J966j415J072p86N1O62j224J381j337J374j147
1827f76N23j42k37R50j558J645j346J322j391O51M14p65R05j336K060j752R94
1844B61o63M16K98q50J463j439J558j486R51n56L76K78j123J308j206J527j544
1861d31Q09J78l60N59j325J776j660J235j243R24k3r02J119j194J541j507J181
1878F77q75L24J99r48J199j355J544j600J199o34J17J41r43J210j037J388j638
$$ plain form
1756 724 -1130 -6 -288 -16 -15 -788 924 -823 571 -462 412 -151 -155 243 -262 971 -669 737
1774 737 -542 181 255 -128 619 -428 1208 -742 690 -133 593 259 -140 795 -261 1006 -639 872
1792 872 263 378 93 -211 853 -578 480 -357 1097 -267 121 375 -285 999 -1036 869 -620
1809 -620 430 -130 -213 183 -452 459 -1273 693 -722 350 -436 -385 277 -947 434 -903 471 -676
1827 -676 -153 -295 -532 418 -1140 505 -841 481 -910 -259 155 -610 295 -1041 1019 -733 261
1844 261 -402 14 312 -538 925 -514 1044 -442 509 -47 329 607 -516 792 -414 1113 -431
1861 -431 378 556 196 755 -570 1206 -454 781 -462 462 439 -463 656 -538 1003 -504 677
1878 677 -198 126 325 -623 576 -779 765 -835 364 -270 -153 -12 -955 255 -782 606 -1032
1895a032J064l08j8K41q03J420j384J186j207R90l75j51N91j264J501j528J535
1912D58r16L89Q0o18J272j330J388j599J495r86M36K29p12J139j367J380j307
1929e69J333r87J73L65n67J147j330J215r63P04n52j41O86q04J390j656J386p77
1947E3L01l89J50Q12j531J275j273J451j209L50K54o96J020j449J461j094J129
1964F15j161L26K67n61J214j775J552j248J199j036K34O64j125R54j020J522j294
1981f73N96j17rL27r49J399j202J106j103O34O9k54N57j247J511j351J253j116
1999e69P83J68o31P90j354K023j456R63j012M87K48p11J046j015J377j704J197
2016F30o93J53M52j248J820j604J268j359P97k4k43N48j090J461j584J507j230
$$ plain form
1895 -1032 32 -276 -294 -53 -856 564 -820 366 -841 149 -226 -377 214 -1050 451 -1077 458
1912 458 -458 -69 11 -607 665 -665 723 -876 619 -367 69 298 -414 725 -642 738 -569
1929 -569 764 -223 -50 315 -252 895 -435 780 -183 521 -31 -172 514 -290 1100 -556 830 53
1947 53 354 -35 115 927 -604 671 -602 849 -360 -10 244 -452 568 -881 580 -514 615
1964 615 -546 -220 47 -514 700 -1075 477 -771 428 -608 -374 290 -835 119 -901 621 -673
1981 -673 -77 -194 -203 124 -825 574 -628 478 -625 9 78 -176 381 -866 645 -706 547 -569
1999 -569 214 382 -249 541 -813 1210 -246 717 -295 192 440 -271 775 -240 1137 -567 630
2016 630 -63 90 542 -706 1114 -490 778 -581 216 192 -51 497 -593 868 -716 791 -439
2033d39P75q2o49P98j119J706j870J193p04J26P2n44J076j234J372j354J208p36
2051d05j2J38n17J194j308J287j133J032o14j37O31q41J233j341J497j153P89
2068C40n01j87R37j046J189j940J877p50L89k25p3Q65j334J244j424J330q67M28
2086B52P4m25J159j400J351j359J211j074L42L69r24J117j267J415j080O09n77
2103b07R2O64j134J089j314J671j377Q23n16J49M83j439J602j296J465j353M20
2120a78r0J05N23j406J519j301J259j239N51K73p21R82j249J266j062J021o38
2137c85M10K0m76R76j282J373j382J074k02kK87r40J228j362J526j388J093n59
2155Il1M65r86J320j185Q97r86R08n21K8O70j054J315j204R42n50J10N0p75J362
$$ plain form
2033 -439 336 254 -395 403 -716 990 -880 313 -391 -265 -193 -737 339 -895 477 -877 331 -405
2051 -405 -417 -279 -796 398 -910 377 -756 276 -338 -475 156 -685 548 -793 704 -449 340
2068 340 -161 -348 589 -457 732 -1208 669 -81 308 83 10 875 -459 785 -639 691 -176 252
2086 252 326 -99 1060 -340 1011 -348 863 -211 131 500 -424 693 -574 841 -239 370 -207
2103 -207 -115 549 -585 504 -810 861 -516 307 -209 -60 423 -1016 586 -710 755 -598 -178
2120 -178 -268 -163 360 -1046 473 -828 431 -808 -257 16 -705 277 -972 294 -768 253 -385
2137 -385 25 45 -431 545 -737 636 -746 328 126 124 411 -529 699 -663 863 -525 568 9
2155 9 -22 443 -543 777 -408 489 -497 411 -110 -82 588 -466 849 -355 587 37 147 197 -578 784
2175G84j277J006j115J064o92L57j69m28J016r84J048j120P15j37j73K97n89O50
2193B53j335J414j191J091m68j67M41o37J021j289J492j222N29j33m27O44p54
2210g38O34p53J127r82O64l60K84R26j318R66r48J209r71J19O34r54J515j729
2228f75J724j038Q12j018K0N70q74J287j026J033j187M96J29p46J253j181P13
2245B92j011J454r01M00q06M2J091r61P64j220J383n62L23M2q98L40r92J608p78
2264c90K91j99j55Q51j079N65o29J478j250O53o51l55J339r50L02j076J472n03
2282b86M68m43K7o2j07J426j766J353j283J204o52L26k73n14J009j418R49J60
2300A18j40L55o17R31j524J876j138M30o84N95J10o98R86k033K506j397R78o28
$$ plain form
2175 784 -493 513 -602 462 -230 127 -42 -470 546 -438 610 -510 205 68 -105 192 -397 253
2193 253 -1082 332 -859 232 -236 -403 38 -599 422 -867 625 -597 -68 -201 -628 16 -738
2210 -738 -104 -857 270 -712 -48 -408 -124 802 -516 450 -498 711 -260 -141 493 -461 1054 -675
2228 -675 1049 11 823 -195 -175 395 -479 808 -218 815 -372 124 253 -493 760 -421 292
2245 292 -719 735 -166 234 -572 -530 561 -400 364 -856 527 -35 288 330 -568 -228 -1220 388 -390
2264 -390 -99 -298 -453 398 -681 -116 -745 733 -517 136 -515 -870 469 -481 -179 -1255 217 -286
2282 -286 182 -261 -234 -296 -403 1023 -743 610 -673 531 -121 205 -68 -582 427 -991 -42 118
2300 118 -22 333 -284 647 -877 999 -139 291 -393 202 312 -386 600 -1433 1073 -324 654 26
2318B6m33P32o37J688k114J372j248J280p17L3N62j611J695n74Q69j643L88N13
2336A81m62P68j013R41q67J035j374K72O66n9N68r92R91r27J053j077l27P83j28
2355C2K79j010P10l20J58J19j050J265n12K04q53K277r57m58o67J87R36n2j99
2374H9N12n20n91Q94o30M30M0o67P70m97M16l46R4N12m61O16o49O31j427J014
2394B30j05L26J2r83P13l56Q14j258J011l78m77J351j233O76m79Q94j104R89q3
2413E60j307P85q32J043r86J144j140R44j33q55P67p83K056j754L1K17J82n62
2431f23O47N03r20O80p60M51O7n76l38M30Q57r96J314r63Q66n05k98Q0q95J067
2451H8o15N43j05N10q41M38J96o0m26J06Q54j634J893r88r78J909j496J033r38
$$ plain form
2318 26 -407 325 -312 1376 -738 634 -614 666 -51 -18 544 -1067 628 54 923 -720 -332 181
2336 181 -281 487 -526 415 -452 583 -791 -519 147 88 656 -336 655 -272 781 -296 -623 160 32
2355 32 311 -699 11 -309 -151 -32 -1082 183 -329 -125 -978 1299 342 -116 -783 -596 340 288 89
2374 89 601 81 -510 384 -246 184 224 -443 327 -170 246 -100 -6 506 45 661 12 643 -784 230
2394 230 125 451 463 -520 193 -163 651 -607 404 26 -451 900 -333 343 -136 758 -346 643 560
2413 560 -747 38 -794 249 -737 407 -733 211 78 -777 -10 -793 1263 -491 -460 -243 -61 -623
2431 -623 24 527 -393 287 -473 -22 45 -531 -869 -439 418 -578 736 -227 639 134 -164 -84 -979 88
2451 88 -527 16 -89 421 -420 18 214 154 -272 -166 688 -946 947 -41 -1019 890 -606 427 -511
2470e11J336j201n36J156Q20n98j339J603j326O36o83R20m5l26M99j393J215m27
2488b00N45r67K31R82j233P75p23J192j242N54j91j47N61k14K19r52J192p9o24
2507c21N98j409O53N23Nl86L73j89k06Q1OP81j476J614o56l76j12J99J81K28K32
2528C43q55K99L00n6k46k69K41m32L43M2P78p46J56j41j22O68m88R94j701J647
2548G55j93k63m56l38J818k128J400j357J069j091P92j83q36J659q50J024j328
2565e06O35k52n65L69k34J131j565J414r20M24p1K5J8j60R1o38J125r76Q23o73
2585e05K05L27o70J170j317J686o90o7l91K02j16o85J335j079R21n46o2L37l86
2604c31P44q10N89q9L77l89O9J89p56J181r87J223j336Q19m73L0M73p42O47o93
$$ plain form
2470 -511 825 -376 -912 244 1064 466 -873 730 -596 40 -643 277 232 -94 405 -988 227 -200
2488 -200 345 -622 -391 591 -642 133 -590 602 -640 -86 -277 -424 137 -77 142 -810 382 303 -321
2507 -321 277 -1132 -479 44 49 -337 36 -153 -359 -278 -272 509 -967 647 -9 -385 -497 -298 -117 111 343
2528 343 -512 -213 87 31 -215 -484 -243 -675 -332 -290 488 -258 -102 -243 -365 303 -185 809 -892 755
2548 755 562 299 -157 -495 1323 -805 595 -762 307 -784 8 -175 -1011 648 -202 822 -506
2565 -506 129 -123 -688 -319 -553 578 -987 427 -493 -69 -140 -115 -97 -257 -166 -804 321 -655 168 -505
2585 -505 -300 27 -643 527 -790 896 206 139 -252 -50 -166 -851 484 -595 326 -220 -282 55 -331
2604 -331 413 -397 192 103 480 91 160 349 -407 774 -213 1010 -326 493 20 50 523 -219 428 -265
2624b65P04m35J74m23rN25m59M26m76Q42o07r4P1j58N52j199J172p03M55m12P
2645c12K25l71N58n44P21p74M83l32J0J97m52Q18n80N79p22O87m58MK76k72N01
2666B42p33Q97o10L46k48J93K96q07J027j056P35k57o7J46l16N71p63J090r92
2685c06O65n64M12J53k66M74p40N38o67Q35o54L03O4m40N69n39N03m91O05l16
2705A38l32M66o63R28p41N07o90M30n0k61Q12r79R04r08P73m02K00j66j98P51
2725E19j112P83q64P36j98K11k67j81M77m74Q14n26J53k36LL40n27O56p76P14
2745B45n34M74k24k31N93q53R93q96R04p85L31pJ37J68o46P16n26O74o46M15j59
2766A43k55N83p89P14l59M05n07L10N1n02O17q00J093j047M33j59j7J99m32O32
$$ plain form
2624 -265 439 4 178 -245 -254 271 -188 238 -238 604 -3 -97 -26 -184 368 -831 341 -362 93 -319 -312
2645 -312 -87 -458 100 -444 277 -497 -14 -346 -336 -139 -591 227 -353 226 -496 191 -267 -263 13 -259 242
2666 242 -491 406 -204 142 -106 87 383 -424 603 -453 282 25 -42 104 -212 359 -404 686 -306
2685 -306 359 -205 207 360 94 568 -172 366 -301 534 -120 183 247 -193 376 -163 340 -151 454 138
2705 138 -194 272 -391 537 -204 303 -387 43 -7 -268 544 -435 469 -439 334 -68 132 -34 -232 519
2725 519 -593 190 -674 62 -136 75 -192 -373 104 -370 444 -82 71 -165 -162 178 -349 307 -469 245
2745 245 -289 185 -39 -270 323 -530 463 -433 471 -314 17 10 147 315 -331 385 -141 533 -113 302 143
2766 143 -112 471 -318 396 37 442 -65 245 296 -206 411 -389 704 -343 90 -69 -86 113 -319 313
2786C13o39Q49q91O07k27l75Q38q96O57p36P96p30N58j23k01N15o75P38r73Q32
2806B37n76J11j07K02K5l00O09p78Q11k79o6j9j46Q16j251R46l93O33p29M66k11
2827AN15K65n36pl82q1L58j94K10j02J421j503O85p90L21N95o15J33j298J307
2847C03r74J78O22M64o86l70O94m57N82j440J192K42j85K08n54Q47p50J57j70
2866i7j56R3k16J119j029M06p57P27k09qj52L49l69j69Q03o40L63J02k90N24j035
2887f41o6O41R37j546K42j58N37q2M86kj501J321j42P28o29l11M50k36P65j364
2907e71O83p55J291p95O1N82n05J5r14K367q44l07m05N63k28r91J180j168J048
2926C07k91m78K42J82Q48p22K8m58N97l71J91k33o25P98k69O27p23N01k38N63
$$ plain form
2786 313 -326 523 -368 239 12 -363 475 -421 236 -500 296 -434 124 1 -200 315 -360 378 -595 237
2806 237 -339 -228 -335 -133 -108 -408 201 -577 234 -45 -111 -130 -276 540 -711 235 -158 475 -254 212 1
2827 1 516 781 245 238 -144 -225 133 -61 149 47 1468 -35 650 -140 181 776 161 294 -1004 303
2847 303 -671 -493 129 593 -93 -463 231 -226 356 -1084 108 350 165 373 -181 666 -84 73 -97
2866 -97 -253 -160 -376 743 -286 120 -637 90 -119 -127 -279 70 -299 -468 335 -305 58 160 -130 394 -641
2887 -641 -707 -66 871 -675 -433 -591 -54 -136 350 348 -1153 168 26 754 125 -186 264 28 793 -571
2907 -571 112 -643 648 -147 -86 496 -9 6 -908 1459 615 308 -97 466 238 -753 427 -741 307
2926 307 16 -462 -220 -38 810 88 116 -342 255 -116 75 -158 -783 15 -254 373 -350 151 -87 476
2946D76l36p05R48j185R19q17Q45M77q47j66j49M00j25P20n45K44k06Q7j11k27
2966c03L93m90J239j284O73J26q40O65p57R85l19M15l94k1m08N2Q10q77L92n26
2986d69R24n12J22o8j94N80p58J292j638J155m29K58M15j160P22Rl85K81J60n55
3006b50j62M27q7L59j191J114l41m99M31l9N63o10R09j164O15n14J72pj69Q91
3026D48p88M79q91Q05k99m2O24m31K07m62R84l23m76l34O25R8q70R65o41P83m47
3047A4j94K31m24L33j98O55k87K74j203J656j063j89O94k50Q4L45q95K67N52o56
3067b54K23J06K48k07o6k23N41o66R86p26K45m21L38o61R69l95n06R86r02O97
3087C12p56J140o45l93k04Q60p03k40M43J6L00m94L62kj173R21n49J502j287N81
$$ plain form
2946 476 140 -565 383 -802 117 -700 145 622 -225 -391 -540 -140 -265 455 -90 154 -52 35 -76 -303
2966 -303 90 -400 839 -445 228 354 -486 179 -578 407 88 503 109 88 -320 -268 542 -335 57 -469
2986 -469 455 -57 65 -3 -197 383 -375 917 -721 434 5 263 678 -482 240 249 -136 145 305 -250
3006 -250 -412 15 -72 287 -904 210 -131 -630 -199 -238 325 -285 624 -540 75 -439 -267 -274 -443 448
3026 448 -340 139 -752 53 -246 -288 336 -95 112 -350 634 311 -165 -499 126 224 -646 319 -322 461 14
3047 14 -180 51 -373 -40 -238 417 130 404 -799 857 -206 -395 299 49 133 478 -417 -150 402 -254
3067 -254 -31 75 323 116 50 -173 368 -298 688 -38 207 -214 124 -537 432 37 -469 517 -385 312
3087 312 -444 696 51 -342 -546 314 -389 -629 -186 -170 130 -364 -2 -4 -1177 -256 -805 697 -590 -9
3107io06M44l76M63j68j28P51o98N86l88K87l09N28o84K88J033j889J216n54r1
3127c04K11j41K23L75m7o1k34J86j028Q40J20j67j18R29j136N96n86j28N42k91
3147b19N09p12N88l51N35p0l42M30p36j22K41M76k69k63P79l73R45j137J88l74
3167b77O26j403J391J90q24M48r27J224p80k8Q31o82M6j81O34n31K21n80K78J36
3187a88K42J1n01J464j805Q51l85J14L91k49L15n30Q37l71q4P4k67k97K67M54
3207C43q96P73m79P4L38l44P8j093J533o86K41n29N65Q00j096M17k20J438k104
3226h47R63P7L00m75n06N38k51J072r19M73r93Q50o46K24J71R0j54j52N14l68
3246c9O91j430j0Q53n79Q2o07J332l24j77J15K01K70o48L43K7L5k43L01j80k00
$$ plain form
3107 -9 -615 -171 -547 -84 -252 -380 371 -327 259 -129 158 -151 377 -307 -19 1014 -875 341 -213 -304
3127 -304 -93 -234 -11 364 317 256 22 208 -820 20 140 -27 -145 784 -352 244 -342 -470 72 -219
3147 -219 290 -422 166 -185 350 280 -62 368 -368 -490 -249 227 -42 -305 474 101 1046 -91 97 -277
3167 -277 349 -1054 337 527 -297 151 -776 448 -332 -360 471 -211 -165 -346 288 -243 -22 -602 -324 -188
3187 -188 54 65 -436 1028 -777 74 -311 -197 194 -55 260 -270 567 196 112 186 -81 -378 -111 343
3207 343 -553 220 -259 -185 153 -191 -113 -1206 327 -359 -118 -647 -82 718 -378 39 -181 1257 -847
3226 -847 116 193 493 18 -488 50 -201 871 -48 425 -568 282 -364 -140 31 121 -33 -185 329 -39
3246 -39 652 -778 -788 65 -514 -432 -1039 293 -31 -208 -93 108 378 -270 73 100 135 -108 193 13 -187
3267a87M06n87J017q34J41O6l45N65n70K64m6N10q62M37L65k91L47l69N8r09J049
3288B25k41k50N92k07L56n45Q32r23N03p74j64O42p23J072l59K48r60N62J44K2
3308E2N6k12J39J68o0l07K16k65k88O98m72N69l10O1o4M8m4m2K10k67K47p51O90
3331G2l31J57J30o51O08k11L93o02Q69m72lJ03l98O47o26M19m22O77l71P5K01
3352B64n07N59n80O48n66L51j67N2L20k45M35p90K61r1J30Q8k51K65l56K14r5
3373f1j50J56K51j09l35M37k83L41n69N15k55J98j07j21K38k29M05m43nL8Q7q0
3395h1k88M97o95O14l07N4J72j83L68m61L44l23L63r2j02R0j67J40j80L78l10
3416a69M74m37KJ92j50N12p62O05m77O09k32j05K83m70K38l01M12k90K33J70m07
$$ plain form
3267 -187 219 -368 649 -185 -44 22 -323 242 -328 -64 -110 400 -462 -25 340 49 396 27 85 -824 225
3288 225 -16 -266 326 119 475 -70 762 -161 342 -432 -596 46 -677 395 36 284 -676 -114 30 52
3308 52 108 -104 35 203 143 -164 52 -213 -501 197 -275 294 -16 45 -19 29 -15 -57 153 -114 133 -618 72
3331 72 -259 -102 28 -623 -15 -226 167 -435 434 -38 -41 62 -336 311 -315 104 -318 359 -12 63 264
3352 264 -243 316 -264 384 -182 169 2 54 374 129 564 -226 35 -56 74 162 -89 176 -180 34 -61
3373 -61 -211 -55 196 87 -248 189 -94 247 -322 193 -62 136 29 -92 146 -83 322 -121 -126 -88 -1 -81
3395 -81 -369 128 -567 47 -260 -206 -34 -217 151 -310 34 -289 74 -18 -120 -30 -197 -57 -237 141 -169
3416 -169 305 -132 -130 62 -88 424 -338 267 -210 399 167 62 345 -125 113 -188 224 -66 167 337 -70
3437g0M30n67P32p03L72j51Q7J1k18N73l69kn79N46k10J33M2m36N32k05K37k26
3459d1J31J88l73J41n29N03o9K61m81L26j64j34K16k05N89p77N21k09o3L25k98
3480a42Q1r9J99m29M43Ljp9k15K71l43N94n17L85k53K07r8j43M17m10L75m94M25
3503A77j76o5L42k70J28j25K70l20K18n0k24M11l55N37n70K36k85K76k44r5N25
3524C41m69L17m43L16k92K58N6m08M79m42N55m75M06l35ML07l30L60k56J44j51
3545e8j32m1J85lP3J83m64M89m55J49j25K49J21n08M55k57Q7j70K84K68n08K21
3567D3n71P81p04N48j85P8N1j36M2j43M02o27O44k96Q5K53k34N9j44K94n27N01
3589B14l65L94j31m91M68k25M19m73K51n0O4O8j30M16m68L75k92L6o5P2P7l51
$$ plain form
3437 -70 360 -207 525 -178 194 43 130 141 -77 496 127 125 -454 92 -118 15 57 -379 153 -52 185 -41
3459 -41 90 278 -95 46 -483 20 -49 212 -269 57 -107 -241 -25 -230 359 -418 103 -106 -169 156 -142
3480 -142 -61 -160 39 -390 53 56 55 -24 -239 32 -311 283 -234 151 -102 105 7 -136 281 -129 246 -248 177
3503 177 1 -64 278 8 136 11 281 -39 179 129 -95 316 -39 498 -72 164 -121 155 -89 -184 341
3524 341 -128 189 -254 62 -230 28 84 -324 155 -287 268 -207 199 -136 -132 175 -155 205 -51 93 -58
3545 -58 -190 -231 -46 -49 24 207 -257 232 -223 -74 -199 50 171 -337 118 -139 -52 -222 62 330 -178 43
3567 43 -528 253 -451 97 -88 -10 41 -95 -53 -196 206 -421 223 -73 12 265 31 90 -54 240 -287 214
3589 214 -151 243 112 -379 89 -136 283 -190 61 11 75 143 13 429 -39 336 44 80 15 87 164 -187
3611a87L43m02K95j47jk9p2J56rO2m33N87m12K47k20k16O14l88L25j41PO9k0J13
3635A41k77M17n51M98k20j69o0Q3L21o1J36n95M81k18K73k04P5N48n41K96m88
3656a15N47o06M81k53k8Q7l93L85l42K47n5j66J19oL40k95K27l31N48m15j06J32
3678Bp9M48n57M18m25M00k80J6P9l51M72k81N31m20K46k90j02J78l40L96k46P6
3700a09J33k74L85m63N90k82K93l59K26j54J25J62m20M21n51M64n30L75m4n6o5
3721a33j6O15n02J92j36K06m0l05R4nL98o03M62l33K62J89k34K72o65L55q1L32
3743C24l63kJ72j60K67j44R2j19P4j15n5q6j13K99j84M40m16J29j56q4M34n51
3765c17M35j06J26k10Q3l03K73K41o40N51k60J84l21L41j38J55j17J2J15n16O00
$$ plain form
3611 -187 156 -246 49 -98 -99 -128 -200 -44 -53 9 -424 163 -249 -2 -222 -438 176 -212 113 -28 -21 48 28 141
3635 141 -136 281 -270 228 8 -161 -221 -138 183 122 258 -337 144 -74 199 -5 70 618 77 373 -115
3656 -115 432 -174 307 54 26 113 -280 105 -237 10 -45 -211 -92 -98 242 -53 174 -157 391 -24 -130 2
3678 2 -77 371 -186 232 -193 207 -73 -57 22 -329 143 -138 393 -27 219 -71 -173 5 -335 61 -185 -109
3700 -109 24 -250 135 -328 262 -20 273 -86 140 -14 111 273 -147 274 -277 187 -343 32 -12 -68 -133
3721 -133 -149 466 -36 156 20 226 186 -119 -25 -30 368 -235 227 -106 156 345 111 383 -282 73 -8 324
3743 324 -39 -41 131 -29 238 94 186 67 141 26 -29 -115 -228 71 -113 327 -89 40 -116 -200 234 -317
3765 -317 118 12 138 -72 11 -292 -19 222 -418 133 -127 57 -264 77 -61 94 -23 -11 104 -412 188
3786A88k60J29j0o5j1j78M97k69M3r4J9K82k24K75m68M12l88J71M1l5J5j47L16
3809B39m04L40l5J26j34l58M99j88P7o5M3l10K29j26J03M08n83L65j97J35k39
3830g5L03l62R9J49n17O54n79L65j08o2K86j11O6l04L33l82P3N7L73l1l59N33
3852D01p98L04J0k5P6j31N0l11N70l05J68R8j22J20%Nj84L10k88K28m22O5o6J
3876b46K81l17N91j32K09m1l14J24j95J6k16M33n71P82k39J26l9q0L35r43N39
3897A03j85M62n86K23K08k67L42j61m52M24J6p8l3r7J02l46J37L67k33m7m9j90
3919c40N11j40J19k94J23K7K06J98p19O64l10L34l18n8M7j28O66q63J95m76J016
3940D60k04%m85M51j78j57L78o42N84n88L17L04o0N4l58J89j76J30M6j36k08L26
$$ plain form
3786 188 -72 57 47 -18 -29 -207 290 21 64 -30 -11 271 47 322 -146 266 -122 49 90 55 70 -77 239
3809 239 -165 175 140 266 132 -226 273 85 162 97 140 -170 59 -67 36 444 -139 226 29 164 -75
3830 -75 228 -134 -35 114 -403 251 -328 37 -71 -133 153 42 108 -196 137 -245 -172 -115 258 227 -132 401
3852 401 -397 -93 -83 -108 -32 -163 -113 -424 146 -159 9 107 -15 105 105 110 -74 236 -52 176 -246 -181 -247 -246
3876 -246 35 -282 309 177 386 345 31 155 -40 -24 -240 193 -378 404 165 291 252 172 507 -436 103
3897 103 -82 380 -206 17 225 -42 300 139 -313 111 127 49 16 -81 21 -325 -188 179 -54 -101 -150 -340
3919 -340 171 31 150 -144 -21 6 212 410 -309 355 45 379 61 3 50 -78 588 -275 -80 -556 460
3940 460 256 256 -229 222 44 -113 265 -377 207 -381 -64 240 180 234 -124 65 -111 19 65 -71 -279 47
3962D7r1O8J60p6Pj76K32RN8k6l00K97m99M40J57q34M27O2K37m70L01k4j27j5
3986a36j4N20m33K76l56M93p11P92l59k54M93q82J391q30p3j36L45l60K3K01m2
4007e2K21o36N15J10m72P27o63L55m53j81J83O99j7n27j52m7R2OL61q3m8J50j54
4030f6k93N45k76L17k1l08J77M1j071R04o79Q70P0J059j440k18j27M07K27k83
4050a65k2k33N86j15lK41l31J93k46J18k39J35J8j22M61l19M9k37L02j21R8k69
4072b21Q7L3j8K20j56N6O7k30N5L8K50m93M98l53M32l22J79m7j15J98l49K28n7
4095b0M58m52o3n3M24j62m23N11l41M49m60J09R1q5o3j42J209q57j198N19N91
4116D2K62p50O33r09J342j228J299K91p24K36l73O1k85N8J4J40m26L41m99L92
$$ plain form
3962 47 -44 24 184 108 115 -61 171 180 238 212 -88 209 -290 150 307 -527 -100 -38 199 -271 30 6 -121 -136
3986 -136 -150 370 -63 213 -143 350 -361 431 72 -182 311 -571 820 -10 -83 -219 126 -234 -211 -10 -52
4007 -52 169 -467 48 158 -314 413 -250 105 -348 -529 -346 353 336 -191 -343 -390 -298 -292 69 -14 -62 88 -66
4030 -66 -359 186 -90 227 206 -102 75 116 -955 -51 -730 140 210 1269 -171 -389 -516 -109 118 -165
4050 -165 -187 -420 166 51 48 289 -42 151 -95 23 -216 -81 -63 -185 276 -43 6 -231 71 -50 48 -221
4072 -221 -134 -101 -119 101 -55 1 68 -162 -107 -69 181 -312 186 -167 265 -57 122 75 -40 158 -191 37 -20
4095 -20 438 -14 -77 -130 294 132 -291 220 -121 328 -132 -23 68 -17 -80 -222 987 130 -1068 -549 42
4116 42 304 -446 187 -722 620 -608 691 982 258 494 121 182 -103 -45 -31 109 -317 24 -475 -83
4136h3l21P26j8m79j07L50n31N80l18J86j85K33n86K36M68k67j34l64P39N0l67
4157a92N09m33K13j38M92j029O20J73o38M9K25K29l7R0k24K30m82L53j8K9K25
4178B46j0M1o56K31J57n63Q37m84J6N00m1k03K31k82L3J09k57K26m69K11L7Q8
4200bj78JK60n12M94l68N35m2j8o29M60j74J25J52l11J66J06o0J43l13K16j16
4222f5J5l0P5K95l70K73k31J45j5j02j49L16k42R7p9k15M44l95M11k11m5K02k63
4245a39K27l37K14J02M1j5L1L0j77J73k78K56j40QO9j39K31j67J31k70L64l30
4267a15K95k37o6J34j87K00l37N52k18J73q2j04m3m7K10m11L42k02J64m4mL48
4289C21m30P4k2K10k10j7K60m51O00m98J77J39j76N1j04r5j29L16r9K57j69M4
$$ plain form
4136 -83 -404 322 304 -175 -282 68 -463 117 -201 -15 -200 33 -553 -317 151 -116 -250 -614 125 175 -192
4157 -192 317 -116 97 -41 451 -578 42 215 -423 -374 -149 80 43 133 -91 139 -343 10 -8 21 246
4178 246 236 277 -379 -148 9 -554 283 -201 -185 315 274 71 302 20 53 162 -95 131 -338 -127 -90 -2
4200 -2 -180 -179 81 -431 63 -305 230 188 170 -459 1 -173 -48 104 -207 -41 65 5 148 -165 51 -65
4222 -65 -50 -80 -5 290 -80 193 -38 107 92 -10 -159 157 -85 12 -67 -282 162 -233 178 -33 -78 124 -139
4245 -139 88 -249 -35 67 108 93 124 154 -23 150 -128 128 -12 -4 65 -74 157 -10 121 -149 215 -115
4267 -115 180 -57 -123 11 -176 24 -313 239 21 194 112 8 -35 -82 128 -283 59 -143 21 -23 -27 321
4289 321 -109 -35 -57 153 -57 -74 186 -265 335 -163 14 153 -23 28 -76 -171 -300 16 -83 174 5 49
4311D9P7j92J23j55K30M5n5j01J25j84jK97l68M18n22L44j0j04K1q6J75j95J43
4334G4k62M85k92m4j9Q5J31l41M50k24j10J43j14L70l39K78l19J96k08J06m5L9
4356D0J18lq8j96M04k72J13j29p2J73j26K62l97jM17m36J30j01L13n02N88m12
4378a77K03j17J01M7j70K55j80M5k17L58j36N3K3p2L5o7J00j44j09L3Q1J55J16
4401B16q5k28L64m53L58j59P6J80n05N47l50J86j95K7J30M2nk60K73k30K2J66
4423A17j30m7O9J42m31M87k05j74L16o7r5n0J52k64L64j16k10Q5j66K67j4m2j76
4446a88n1J2J42J34m4m9j97M95l50R7J21k39r4Q3Or2L18j66L92m05K18j67j33
4469a57K33p2nr6J76k1K4J84j26n7k89L97m07N15k78l07L62l86L01j48M01k07
$$ plain form
4311 49 126 -66 57 -98 132 177 122 21 146 -38 -39 258 -110 308 -214 130 120 16 37 -49 126 -69 74
4334 74 -188 297 5 -39 -58 27 158 -183 267 43 -67 76 -38 332 -7 271 -48 148 -60 46 1 40
4356 40 158 155 67 -129 275 3 116 -13 -85 88 -38 224 -173 -174 243 -193 -63 -164 149 -353 235 -177
4378 -177 26 -91 10 57 -113 142 -38 7 -210 148 12 65 88 16 51 -16 84 -60 -169 -136 -55 100 216
4401 216 131 -97 267 -186 172 13 89 269 -236 311 -39 147 -48 -21 109 151 146 -114 159 -71 -49 117
4423 117 -13 -60 9 151 -280 207 2 -172 144 77 -18 -68 84 -180 184 68 -142 -57 -223 44 30 -12 -188
4446 -188 -239 -227 -85 49 5 -44 -241 254 -96 1 122 -117 -211 -128 -122 -214 104 -62 330 -75 143 -24 -157
4469 -157 76 4 -1 -97 79 58 82 266 140 83 -206 191 -216 299 21 -286 76 -310 -9 -157 244 37
4491C7J11q5O5J44m24L12J03r2l5j17k01L38q4k27K65p0K13l43lk19K20L21m34
4514b05J81k03L07q0PO9m27J61J76R3l10K18j85j29K54q1J52k89r8K85J23P5j13
4537a9P7k52L41m19J63k3J68J46j04rk07K52k09J68j14p9P6K22j22k32M33k78
4559b1O3J2Q7K9l93M64l73K73o7m7p2o3M06k57K00n25L49N8j08l5K27j41j31J72
4583A07n45N86l57L31j73J01q5k21L26m54M40k95L47j40j96M26l33K64j32j54
4603a57L29J4k21l28L52k56K07K2L4o3k22K33j80K27j75K37j63J25l3n7J55l69
4625b89L12l24L63k27J13%k16O96l76K13k63J89j74j51J90j6J2k64L21j79J51
4646H1j46l4L53n58N57j75k2j33J17P4j92JK9M43n63L32k56NP9O4j99J03K34k58
$$ plain form
4491 37 148 63 128 272 -152 160 263 171 136 19 -182 156 72 -155 110 40 253 -90 -93 -312 -92 229 -205
4514 -205 -24 -227 80 0 7 76 -351 -190 -14 79 -231 -13 -198 -327 -73 -154 -2 -291 -389 -104 19 94 -19
4537 -19 58 -194 147 -272 -109 -132 36 182 78 69 -138 114 -95 73 -41 -120 -44 178 56 -176 257 -21
4559 -21 42 54 141 170 -223 241 -132 141 74 27 -45 -108 298 41 241 -284 65 123 15 -20 207 66 -65 107
4583 107 -438 148 -209 122 -51 50 -35 -256 70 -384 56 -239 108 -32 -228 198 -135 129 -3 -157
4603 -157 172 186 -35 -363 -11 -267 -60 -38 -4 -67 -289 -56 -236 -9 -184 53 -110 15 -18 -75 80 -289
4625 -289 23 -301 62 -165 -52 -52 -268 428 52 265 2 191 17 -134 56 40 52 -212 109 -70 81
4646 81 -65 -99 254 -304 253 78 56 -77 40 114 -78 -77 -48 395 -168 164 -92 -87 -8 56 -143 -40 194 -64
4670f4Q3j02kK3j32K53k19L46k83Q0o8n4K00l95O00k82K72m35j1P1l9R2L9P0k58
4695b15K38j46P9N0k46N9K29P3k36J19N6J07M5l05J14p6L02k50J81j69M6k8p9
4718e2J88j42K05l22J64l3J18j05j10K24r0j82L17l39R5j51R5r5M34k23N1n46
4740d99M95J7jM2j5O6k53K00j53K13p1m23J85KK99j32n9j05K77J04m26J72m21
4763d86O47l05L14l66K25pj40K95l28L94k14m6J83l33L19m3J26l64J90n6j53J83
4785C5k45L30k15j66L39r2m2J30l9n7J60j82K18l52K36m6J40j35j8J49k88J75
4807C5j4Qj22K4J43Qq0j93N60n96J31k19L07j96Q5J26p0j14J67j56j6K69j28n6
4831i7K78n63M61p1o2K84j70p8n7K20l40J2K01j6j12M0J66j28O6j18J37j45p4
$$ plain form
4670 -64 19 -83 -85 -62 -194 59 -160 186 -97 -17 -85 -139 61 -334 266 -16 256 -179 -190 -119 -158 -66 -27 43 -215
4695 -215 23 -123 -44 6 -240 -181 48 121 -115 4 60 167 212 -93 21 -55 247 -3 178 9 55 27 -52
4718 -52 136 -6 199 -123 41 8 126 21 -89 135 45 -137 180 -159 -64 -215 -120 -215 219 -4 47 -499
4740 -499 -4 13 12 54 39 105 -148 52 -101 112 41 -382 -197 -195 104 -28 -87 -192 85 189 -237 -65 -486
4763 -486 161 -144 170 -196 29 22 -118 177 -151 243 29 -17 166 -167 152 109 235 -129 61 5 -148 35
4785 35 -210 120 -95 -261 78 -14 -56 74 35 -22 138 -44 174 -178 58 12 152 17 -1 148 -140 35
4807 35 21 29 -93 -69 74 82 2 -191 369 -227 -96 -315 -8 -204 -119 7 -63 -177 -10 -166 -182 87 -41 -97
4831 -97 181 -382 79 8 -54 230 60 -18 -75 145 -195 -183 18 2 -110 -70 96 -32 34 -84 53 -92 -166
4854a66J8jK40l7j19m5j5K5K37l8k99M78l59K13q3j51L40N9m51J46M53l51P6k46
4878g6R5J29k48K56k90J46k41M6l7J03K02k29J56j54M04j55m8k17K4L17l72J48
4900d1k31N12j51Nj07R1j34J25J15m42L90J46j57j07L8j31L4l5K96j1m25J79J14
4923G3m55J66j56L72m83L92K39l66J92j47K04K19M2n61L73l40L4L0k58M40p28
4944g18R49N8n82P73p98J04r6L63L9L65q59L99J3L8j05K29o82j42L00Q33l84L32
4966D29q99M29p76K99P50J9n07kJ24L31j60j11k31j76O47o69O03p5n50N72j15
4987f8k66m87M47J61P05K83o22l29o7O94n70M4P9j14n3m72L38L64K73k83k90k9
5009b62N10j1j91K28l81K70m15K07J6k08O52p26N36l73L05j31R8m5j13J00k29
$$ plain form
4854 -166 -148 -149 91 54 -65 -110 -125 -100 137 99 -200 278 -81 132 49 -102 238 297 -154 -8 445 94 170 -76
4878 -76 19 148 -100 156 -134 12 -229 -183 -220 -117 85 -144 12 -142 262 107 59 -158 -134 183 -189 -41
4900 -41 -272 240 89 94 -13 78 -56 69 184 -258 132 278 121 14 52 -79 -45 -80 216 205 -220 -41 73
4923 73 -382 -216 -372 0 -483 -91 148 -218 -26 -173 31 250 292 -269 104 -236 -202 -172 -430 10 -718
4944 -718 231 289 -293 480 -318 -214 -310 53 92 457 -402 -3 10 48 -57 172 -510 -652 -352 481 97 429
4966 429 -470 -41 -817 -518 232 251 -256 -258 -134 197 37 -74 -305 -481 166 -503 100 25 -525 47 -68
4987 -68 -334 -821 -374 -213 492 775 153 -176 -243 451 -119 -75 4 -110 -163 -635 -297 67 340 57 -233 -262
5009 -262 248 237 46 274 -107 163 -252 -45 -29 -237 415 -311 225 -148 157 26 124 79 -34 66 -163
5030a63J84N9j55k18L06J12j69L28l34K26l42K30l76K51J23l2K21m63L11l34K99
5051F4M8j58J86k62J19k00K94k47K11m5j91J74j26p1l56L19k16K21K88l94O24
5072B82k43L13m97r3M19k42L21k76P42n30j22K83j00n54L58N17o80K45l06l59
5092e22J65K74p0M31j17m61M6k05M36k84o1j0L52N3j88lJ32J80k30J19o1j23L07
5115A60l11n5L97q4k34j1J51r0K9k52N18k08L4J17l20K40m6P6n3o8j77L5j39J54
5139a37J64k60K13m8K55k80P9j81J23L18q5k04k98K51K8Q6j93J95m9j29L67k35
5161b0K65m63M04o6q8J94k19K67l82j56M61j77J31l81L65k06J14l18O45m02pL41
5183C02k05N2r7K40l64J15j31L6J1Q3o8K38Mn47M87J13m26Q9k18L63l96L80l51
$$ plain form
5030 -163 21 80 -75 -293 13 125 -44 284 -50 176 -166 64 -312 -61 62 30 251 -212 99 -235 64
5051 64 112 -46 140 -122 -3 -203 91 -156 55 10 -181 -7 -133 -204 -560 -241 -457 -236 52 -342 282
5072 282 39 352 -145 -238 181 -61 260 -16 726 196 74 357 257 -297 61 578 -102 143 -163 -522
5092 -522 -357 -83 -153 278 161 -300 -254 -459 -23 -307 -368 -378 -26 27 -161 -164 -32 148 -82 37 -24 -147 160
5115 160 -151 -206 191 107 -127 -138 13 -77 -48 -300 218 10 44 161 -159 81 35 111 58 -10 -187 -152 -291 -137
5139 -137 27 -233 -20 -68 187 -93 -14 -195 -72 246 161 -43 -341 -90 -62 24 -169 26 -23 -152 215 -20
5161 -20 245 -218 186 120 32 226 7 274 -108 -264 197 20 151 -230 135 -71 43 -275 370 -32 -39 302
5183 302 97 149 52 292 -72 43 -88 -52 -41 42 -26 212 216 -331 156 269 -157 -68 -286 77 -319 61 -290
5206b90K68P0q1P5k26P9R4j04p5K68N9k56K52M3J15m51K0M14k85J91l02L66k80
5229c6J16m05L68J43j87L50l41K47k01L0J06j86q3p8L16j52Mj39K26J34k30L2
5251C4j91l1J53J56%k27J05l29N23k67O0k6J01j16j41M77k20kl92K52j89L53j12
5274b9o8J93n7j55K84j16k33K32k01R8O6j51M51o80K67q3K76O2k05j84K40J32
5296A39j94m7j25K89j4j6r2j54J32J87j09j52J40J30k29L32m83L48j16L5J16k47
5318a30K17k60K14j78L16l89J20J2N9J12j76L84k56n9m10O28o2k5j71j14R8j51
5340b21K35k12K65j73J94p7o5j86Q2Q5o6M7L5j58L75j52l2K47k24j02q7K29Q6
5363A25L19o55J64k8l7K04l26M64k28M6n0j82K11L0j68J04P9k93J33j31K59j6
$$ plain form
5206 -290 -22 48 -33 42 -184 -105 -11 -115 -190 78 137 -119 133 176 291 -160 -140 274 -11 180 -122 244 -36
5229 -36 80 -325 43 186 -1 349 8 255 54 84 190 4 -79 -157 159 7 11 -128 98 232 2 34
5251 34 -157 -188 -35 121 121 -106 -1 -330 193 -74 -14 -40 61 -55 -196 281 61 59 -333 -81 -270 83 -29
5274 -29 -97 96 39 -116 168 52 -181 51 -150 -52 14 -137 314 -366 -99 -182 94 156 -49 -233 7 139
5296 139 -55 -102 -227 62 48 32 -60 -214 -82 105 -4 -156 -16 114 -115 217 -266 82 -34 1 117 -130
5318 -130 87 -173 41 -137 179 -210 -90 -78 -19 93 -83 301 45 -14 -424 204 142 117 -54 -168 -70 -221
5340 -221 14 -198 67 -106 88 11 -54 -240 -158 -73 -139 -92 -57 -215 160 8 -24 223 -1 -103 -190 39 125
5363 125 444 -211 -47 -75 -112 92 -234 230 2 48 -2 -184 27 57 -111 -7 72 -221 -88 -219 40 24
5385B4J76k56j66L40k89L02j14l0K1R9k05k4J49j28J05jJ75J1m21O3P2J96j55
5408e6J68j41J98J05j38j0l60L14l4n0q2l0KP8P3o1P7l61M90j90j11J04K4r3j5
5433i9J06p1N5lk44K86k52L3k4J81q1J00N6p3K9L0J56m83N85k28o4j8J96l18L
5458a42J76l86L68n3rO1p5K55m61L54n4J26q5N7j24J21Lj94R6k51L27l64K39r8
5482a13K12mj59K56m97L70L7k98L63l40K79k35K16k79J65k50J64J01r5K96j33
5503E6j04k02M20q2m6k00k33N57l51r9m7P63j292O27K97O5j08J00l7K18m62j00
5525b60M23l83K30J96q0J1k47J10j47rL19l72L45J08l02k4O8j44M33j49j54K05
$$ plain form
5385 24 200 -56 -222 118 -171 131 17 -13 8 107 -98 -122 27 -101 4 3 178 189 -232 -169 -97 99 -56
5408 -56 112 -29 169 274 136 126 -234 80 46 -4 -86 -116 -114 -36 37 -24 53 -308 182 -8 -119 -15 9 -84 -99
5433 -99 7 -64 -9 -12 -256 30 -222 -189 -213 -32 -113 -13 43 -30 -1 29 185 -298 287 59 -5 -23 173 -145 -142
5458 -142 34 -352 16 -37 -46 15 -60 195 -266 88 34 160 75 132 8 129 132 -62 34 -217 110 -254 -15 -113
5482 -113 99 95 -64 192 -305 65 102 -196 167 -173 106 -129 87 -192 -27 -277 -113 -12 -107 189 56
5503 56 -48 -250 170 88 42 -158 -391 166 -185 -284 -331 432 -860 -233 64 129 21 121 84 302 -160 -260
5525 -260 163 -220 10 206 126 137 -110 0 -147 -156 163 -209 136 244 -58 -82 -14 -158 275 126 -28 177
$$ [...]
8191i2
##END NTUPLES=NMR FID
##END=
