##TITLE=1H_Pr AmC4
 200.13MHz,CDCl3 ,
 8 sc
 
 12.3.2025
##JCAMPDX= 6.0         $$ Bruker NMR JCAMP-DX V2.0
##DATA TYPE= NMR FID
##DATA CLASS= NTUPLES
##ORIGIN= UXNMR, Bruker Analytische Messtechnik GmbH
##OWNER= pz
$$ XWIN-NMR		Version 3.5
$$ Wed Mar 12 15:08:59 2025 Russian Standard Time (UT+4h)  she@DPX200
##.OBSERVE FREQUENCY= 200.1313
##.OBSERVE NUCLEUS= ^1H
##.DELAY= (6, 6)
##.ACQUISITION MODE= SIMULTANEOUS
##.ACQUISITION SCHEME= undefined
##.AVERAGES= 8
##.DIGITISER RES= 18
##SPECTROMETER/DATA SYSTEM= spect
##.PULSE SEQUENCE= zg30
##.SOLVENT NAME= CDCl3
##.SHIFT REFERENCE= (INTERNAL, CDCl3, 0, 14.3821)
##AUDIT TRAIL= $$ (NUMBER, WHEN, WHO, WHERE, WHAT)
$$ ##TITLE= Audit trail, XWIN-NMR		Version 3.5
$$ ##JCAMPDX= 5.01
$$ ##ORIGIN= Bruker BioSpin GmbH
$$ ##OWNER= she
$$ F:/spectra/data/she/nmr/H-C/1/audita.txt
$$ ##AUDIT TRAIL=  $$ (NUMBER, WHEN, WHO, WHERE, WHAT)
(   1,<2025-03-12 15:07:26.23 +0400>,<she>,<DPX200>,
      <created by zg, POWCHK disabled, PULCHK disabled
       configuration hash MD5:
       00 E9 B6 7A A2 85 ED C7 34 08 36 98 17 FE 4E 26
       data hash MD5: 16K
       D5 E3 57 11 7D 60 67 5E 45 26 4D 2B F7 36 DF 23>)
$$ ##END=
$$ 
$$ hash MD5
$$ DB D2 4B 58 51 A1 7C DF D5 65 9B 0D 05 7F 54 6C
##$RELAX= 
##$RELAX= 
##$RELAX= 
##$RELAX= 
##$RELAX= 
##$RELAX= 
$$ Bruker specific parameters
$$ --------------------------
##$DU= <F:/spectra>
##$EXPNO= 1
##$NAME= <H-C>
##$PROCNO= 1
##$TYPE= <nmr>
##$USER= <she>
##$AMP= (0..31)
100 100 100 100 100 100 100 100 100 100 100 100 100 100 100 100 100 100 
100 100 100 100 100 100 100 100 100 100 100 100 100 100 
##$AQSEQ= 0
##$AQ_mod= 1
##$AUNM= <au_zg>
##$AUTOPOS= <>
##$BF1= 200.13
##$BF2= 200.13
##$BF3= 200.13
##$BF4= 200.13
##$BF5= 200.13
##$BF6= 200.13
##$BF7= 200.13
##$BF8= 200.13
##$BYTORDA= 1
##$CFDGTYP= 0
##$CFRGTYP= 5
##$CHEMSTR= <none>
##$CNST= (0..31)
1 1 145 1 1 1 1 1 1 1 1 1 1 1 1 1 1 1 1 1 1 1 1 1 1 1 1 1 1 1 1 1 
##$CPDPRG= <>
##$CPDPRG1= <>
##$CPDPRG2= <>
##$CPDPRG3= <>
##$CPDPRG4= <mlev>
##$CPDPRG5= <mlev>
##$CPDPRG6= <mlev>
##$CPDPRG7= <mlev>
##$CPDPRG8= <mlev>
##$CPDPRGB= <>
##$CPDPRGT= <>
##$D= (0..31)
0 0.7 0 0 0 0 0 0 0 0 0 0.03 0 0 0 0 0 0 0 0 0 0 0 0 0 0 0 0 0 0 0 0 
##$DATE= 1741777645
##$DBL= (0..7)
120 120 120 120 120 120 120 120 
##$DBP= (0..7)
150 150 150 150 150 150 150 150 
##$DBP07= 0
##$DBPNAM0= <>
##$DBPNAM1= <>
##$DBPNAM2= <>
##$DBPNAM3= <>
##$DBPNAM4= <>
##$DBPNAM5= <>
##$DBPNAM6= <>
##$DBPNAM7= <>
##$DBPOAL= (0..7)
0.5 0.5 0.5 0.5 0.5 0.5 0.5 0.5 
##$DBPOFFS= (0..7)
0 0 0 0 0 0 0 0 
##$DE= 6
##$DECBNUC= <off>
##$DECIM= 32
##$DECNUC= <off>
##$DECSTAT= 4
##$DIGMOD= 1
##$DIGTYP= 9
##$DL= (0..7)
0 120 120 120 120 120 120 120 
##$DP= (0..7)
150 150 150 150 150 150 150 150 
##$DP07= 0
##$DPNAME0= <>
##$DPNAME1= <>
##$DPNAME2= <>
##$DPNAME3= <>
##$DPNAME4= <>
##$DPNAME5= <>
##$DPNAME6= <>
##$DPNAME7= <>
##$DPOAL= (0..7)
0.5 0.5 0.5 0.5 0.5 0.5 0.5 0.5 
##$DPOFFS= (0..7)
0 0 0 0 0 0 0 0 
##$DQDMODE= 0
##$DR= 18
##$DS= 0
##$DSLIST= <SSSSSSSSSSSSSSS>
$$ [...]
##$SUBNAM0= <"">
##$SUBNAM1= <"">
##$SUBNAM2= <"">
##$SUBNAM3= <"">
##$SUBNAM4= <"">
##$SUBNAM5= <"">
##$SUBNAM6= <"">
##$SUBNAM7= <"">
##$SUBNAM8= <"">
##$SUBNAM9= <"">
##$SW= 18.0517328524113
##$SWIBOX= (0..15)
0 0 2 0 0 0 0 0 0 0 0 0 0 0 0 0 
##$SW_h= 3612.71676300578
##$TD= 16384
##$TD0= 1
##$TE= 0
##$TE2= 300
##$TE3= 300
##$TEG= 300
##$TL= (0..7)
0 120 120 120 120 120 120 120 
##$TP= (0..7)
150 150 150 150 150 150 150 150 
##$TP07= 0
##$TPNAME0= <>
##$TPNAME1= <>
##$TPNAME2= <>
##$TPNAME3= <>
##$TPNAME4= <>
##$TPNAME5= <>
##$TPNAME6= <>
##$TPNAME7= <>
##$TPOAL= (0..7)
0.5 0.5 0.5 0.5 0.5 0.5 0.5 0.5 
##$TPOFFS= (0..7)
0 0 0 0 0 0 0 0 
##$TUNHIN= 0
##$TUNHOUT= 0
##$TUNXOUT= 0
##$USERA1= <user>
##$USERA2= <user>
##$USERA3= <user>
##$USERA4= <user>
##$USERA5= <user>
##$V9= 5
##$VALIST= <valist>
##$VCLIST= <CCCCCCCCCCCCCCC>
##$VD= 0
##$VDLIST= <DDDDDDDDDDDDDDD>
##$VPLIST= <PPPPPPPPPPPPPPP>
##$VTLIST= <TTTTTTTTTTTTTTT>
##$WBST= 1024
##$WBSW= 4
##$XGAIN= (0..3)
0 0 0 0 
##$XL= 0
##$YL= 0
##$YMAX_a= 128642
##$YMIN_a= -142447
##$ZGOPTNS= <>
##$ZL1= 120
##$ZL2= 120
##$ZL3= 120
##$ZL4= 120
##$ABSF1= 10
##$ABSF2= 0
##$ABSG= 5
##$ABSL= 3
##$ALPHA= 0
##$AQORDER= 0
##$ASSFAC= 0
##$ASSFACI= 0
##$ASSFACX= 0
##$ASSWID= 0
##$AUNMP= <proc_1d>
##$AZFE= 0.1
##$AZFW= 0.1
##$BCFW= 1
##$BC_mod= 2
##$BYTORDP= 1
##$COROFFS= 0
##$CY= -3
##$DATMOD= 1
##$DC= 2
##$DFILT= <>
##$DTYPP= 0
##$F1P= 0
##$F2P= 0
##$FCOR= 0.5
##$FTSIZE= 0
##$FT_mod= 4
##$GAMMA= 1
##$GB= 0.15
##$INTBC= 1
##$INTSCL= 1
##$ISEN= 128
##$LB= 0.25
##$LEV0= 0
##$LPBIN= 0
##$MAXI= 10000
##$MC2= 0
##$MEAN= 0
##$ME_mod= 0
##$MI= 1.114404
##$NCOEF= 0
##$NC_proc= 0
##$NLEV= 6
##$NOISF1= 3.799351
##$NOISF2= 2.8
##$NSP= 1
##$NTH_PI= 0
##$NZP= 0
##$OFFSET= 14.38212
##$PC= 1
##$PHC0= -462.0307
##$PHC1= 3.392214
##$PH_mod= 1
##$PKNL= yes
##$PPARMOD= 0
##$PSCAL= 0
##$PSIGN= 0
##$REVERSE= no
##$SF= 200.129724274929
##$SI= 16384
##$SIGF1= 3
##$SIGF2= 2
##$SINO= 400
##$SIOLD= 16384
##$SREGLST= <1H.CDCl3>
##$SSB= 0
##$STSI= 0
##$STSR= 0
##$SW_p= 3205.1282051282
##$SYMM= 0
##$S_DEV= 0
##$TDeff= 0
##$TDoff= 0
##$TI= <>
##$TILT= no
##$TM1= 0
##$TM2= 0
##$TOPLEV= 0
##$USERP1= <user>
##$USERP2= <user>
##$USERP3= <user>
##$USERP4= <user>
##$USERP5= <user>
##$WDW= 1
##$XDIM= 8192
##$YMAX_p= 0
##$YMIN_p= 0
$$ End of Bruker specific parameters
$$ ---------------------------------
##NTUPLES= NMR FID
##VAR_NAME=  TIME,          FID/REAL,        FID/IMAG
##SYMBOL=    X,             R,               I
##VAR_TYPE=  INDEPENDENT,   DEPENDENT,       DEPENDENT
##VAR_FORM=  AFFN,          ASDF,            ASDF
##VAR_DIM=   8192,          8192,            8192
##UNITS=     SECONDS,       ARBITRARY UNITS, ARBITRARY UNITS
##FACTOR=    0.0002768,     1,               1
##FIRST=     0,             0,               0
##LAST=      2.2672688,     0,               0
##MIN=       0,             -142447,         0
##MAX=       2.2672688,     128642,          0
$$ Real data points
##PAGE= N=1
##DATA TABLE= (X++(R..R)), XYDATA
$$ [...]
$$ plain form
1635 -116 -85 -204 131 -18 -262 6 398 -20 52 384 118 -43 -49 262 -10 -391 -46 -14 -72 133 -3 -320
1657 -320 -307 126 -223 -75 289 331 -221 262 291 207 -106 -15 279 -186 160 351 17 -96 -42 -181 -316 28
1679 28 187 -241 -152 241 39 -119 104 270 80 -114 398 198 -52 -20 21 -311 -217 29 -25 -71 33 -235
1701 -235 -107 88 99 36 -236 97 261 68 173 273 -55 -17 235 158 -104 24 -24 -192 -316 -112 -70 -160
1723 -160 113 -242 -107 39 227 -30 44 167 116 47 443 422 -76 15 83 -119 -232 -16 93 -47 -259 144
1745 144 -83 -193 25 89 -160 120 225 189 29 347 101 -46 211 151 17 -184 -42 43 7 -106 198 -41
1767 -41 -63 15 -145 -174 -27 198 52 263 -40 22 20 105 15 68 -92 -24 -12 60 -146 -24 -146 -81 -82 75 -10 -97
1793 -97 -78 -100 -91 7 74 223 192 -1 203 179 295 261 -176 176 -63 99 110 -208 -50 -23 -71 -138 -28 71 52
$$ packed form
1635a16L1j19L35j49k44K68L92m18P2L32k66j61oL11k72l81L45L2n8K05j36l17
1657c20J3M33l49J48L64M2n52M83K9q4l13R1K94m65L46J91l34j13N4j39j35L44
1679B8J59m28Q9L93k02j58K23J66j90j94N12k00k50L2M1l32R4K46n4m6J04k68
1701b35J28J95J1o3k72L33J64j93J05J00l28L8K52p7k62J28m8j68j24K04M2r0
1723a60K73l55J35J46J88k57P4J23n1o9L96k1m98R1O8k02j13K16J09j40k12M03
1745A44k27j10K18O4k49K80J05l6j60L18k46j47K57o0j34k01J42Q5l6j13L04k39
1767d1k2P8j60k9J47K25j46K11l03O2kQ5r0N3j60O8J2P2k06J22j22O5jJ57q5q7
1793i7J9k2RR8O7J49l1j93K04k4J16l4m37L52k39J62J1l18J58K7m8o7J10R9j9
$$ plain form
1818 52 -129 234 210 -106 116 15 125 -49 34 -64 22 -46 28 49 -66 -139 -99 76 75 -22 -154 63 206 102
1842 102 226 110 -44 78 45 395 59 184 -47 127 -115 -122 -178 -151 -274 -8 67 -169 -125 -160 -89 -69 59
1865 59 253 13 92 41 -11 119 94 95 -35 70 124 -130 -81 -320 -58 -128 -225 59 25 -91 241 55 -58 82
1889 82 42 173 20 -46 -170 90 -89 13 -15 166 -206 -213 -81 -15 -43 -133 -79 -5 -68 -17 25 35 237 98 -56
1914 -56 100 108 148 71 159 86 25 65 -43 -17 174 -254 -71 -55 -50 50 -142 140 -98 151 200 29 96 169 -154
1939 -154 147 53 -214 -52 -47 -20 25 -36 -44 -77 -77 188 -13 104 323 58 98 81 285 14 183 257 53 -23 -171
1964 -171 119 94 -84 -66 -108 -210 -88 166 -118 33 157 -82 -133 128 71 107 121 177 -296 -126 -6 60 -301
1987 -301 16 160 -250 -381 -89 -18 -320 -3 -80 -250 71 168 -16 52 190 314 56 30 141 124 141 -98
$$ packed form
1818E2j81L63k4l16K22j01J10j74Q3r8Q6o8P4K1j15p3M0J75jr7j32K17J43j04
1842A02J24j16j54J22l3L50l36J25k31J74k42pn6K7j23K66P5k36M4l5P1K0J28
1865E9J94k40P9n1n2J30k5Jj30J05N4k54M9k39K62p0r7K84l4j16L32j86j13J40
1889H2m0J31j53o6j24K60j79J02k8J81l72pJ32O6k8r0N4P4o3N1M2J0K02j39j54
1914e6J56QM0p7Q8p3o1M0j08K6J91m28J83J6NJ00j92K82k38K49M9j71O7P3l23
1939a54L01r4k67J62NK7M5o1ql3%K65k01J17K19k65M0j7K04k71J69P4k04p6j48
1964a71K90k5j78J8m2j02J22K54k84J51J24k39n1K61n7L6J4N6m73J70J20O6l61
1987c01L17J44m10j31K92P1l02L17p7j70L21R7j84O8J38J24k58k6J11j7J7k39
$$ plain form
2009 -98 181 -110 -335 -76 -25 -100 132 233 -162 -172 238 86 146 344 5 -31 16 -23 44 207 -13 104 -40
2032 -40 150 -308 -135 -223 -76 -246 19 242 97 -249 -28 240 63 60 137 -228 276 82 148 -75 73 -145
2054 -145 66 -120 -101 -93 -153 50 -232 53 44 192 127 17 -83 279 -100 69 151 -77 -210 28 17 -39 -368
2077 -368 -20 -176 -257 108 139 -85 -26 18 -81 96 11 132 -123 8 67 30 166 197 -164 -47 -40 58 -360 -30
2101 -30 242 -63 -116 174 73 -308 -299 19 -198 -24 159 -38 73 164 67 -178 38 160 144 -223 54 83 -135
2124 -135 -26 165 -95 -158 314 238 123 188 290 30 -214 380 268 -92 138 -43 204 -9 132 -178 -276
2145 -276 -103 257 -324 -413 57 -126 -280 268 288 81 -4 -45 -149 155 71 399 -16 -138 174 51 -39 189
2167 189 25 -98 -21 149 65 -118 -41 -24 -135 -12 140 59 38 -36 89 25 266 176 -47 15 266 -138 37
$$ packed form
2009i8K79k91k25K59N1p5K32J01l95j0M10j52O0J98l39l6M7l9O7J63k20J17j44
2032d0J90m58J73q8J47j70K65K23j45l46K21K68j77lP7l65N04j94O6k23J48k18
2054a45K11j86J9Qo0K03k82K85rJ48o5j10j00L62l79J69Q2k28j33K38j1n6l29
2077c68L48j56q1L65L1k24N9M4r9J77q5J21k55J31N9l7J36L1l61J17PR8m18L30
2101c0K72l05n3K90j01l81RL18k17J74J83j97J11R1r7k45K16J22j6l67K77K9k18
2124a35J09J91k60o3M72p6j15O5J02k60k44N94j12l60K30j81K47k13J41l10r8
2145b76J73L60n81q9M70j83j54N48K0k07q5m1j04L04q4L28m15j22L12j23r0K28
2167A89j64j23P7J70q4j83P7J7j11J23J52q1k1p4J25o4K41r0k23O2K51m04J75
$$ plain form
2190 37 -161 219 -227 -66 30 -82 -28 196 -122 -167 162 153 -34 -57 64 -69 41 358 -163 -438 -197 -176 -283
2213 -283 -24 71 -96 -51 -76 188 103 -4 119 -67 231 196 252 177 200 119 -132 117 -172 -145 -258 -121 -145 -120
2237 -120 -64 -14 66 -351 -95 84 109 133 -21 158 175 -94 234 83 85 170 208 -43 -131 -8 -122 69 -161 60
2261 60 -162 217 68 -49 -284 32 77 70 207 -257 -88 -114 -91 129 158 19 -102 75 -126 0 -82 -193 -192
2284 -192 126 93 106 -64 135 57 44 -32 160 111 18 -130 -38 -93 -79 -87 7 -80 98 174 1 -213 -64 -277 38
2309 38 -63 -14 -172 60 22 29 42 -154 173 -190 -33 -14 42 14 24 -14 192 -169 -29 -145 -231 -130 -12 -222
2333 -222 25 141 2 99 -11 79 -28 -64 85 -3 -15 -151 -79 2 -31 -226 -124 -26 148 30 69 121 199 -283
2357 -283 -150 122 -5 295 181 238 -177 60 -135 -53 -19 7 -58 -179 -77 39 151 138 -195 13 12 -8 -54
$$ packed form
2190C7j98L80m46J61R6j12N4K24l18m5L29rj87k3J21j33J10L17n21k75K41K1j07
2213b83K59R5j67M5k5K64q5j07J23j86K98l5N6p5K3q1k51K49k89K7j13J37k4K5
2237a20N6N0Q0m17K56J79K5K4j54J79J7k69L28j51KQ5L8k51q8J23j14J91k30K21
2261F0k22L79j49j17k35L16M5pJ37m64J69k6K3K20K9j39j21J77k01J26q2j11J
2284a92L18l3J3j70J99p8j3p6J92m9r3j48R2n5J4qR4q7J78P6j73k14J49k13L15
2309C8j01M9j58K32l8PJ3j96L27l63J57J9N6k8J0l8K06l61J40j16q6J01J18k10
2333b22K47J16j39R7j10R0j07l6J49q8j2j36P2Q1l3j95J02R8J74j18L9N2P8m82
2357b83J33K72j27L00j14N7m15K37j95Q2L4K6o5j21J02J16J12j3l33K08jk0m6
$$ plain form
2380 -54 -88 197 306 -99 169 238 50 -115 -61 -69 -79 -14 -120 -42 -8 170 -71 -14 -106 116 -7 6 -17 38 -15
2405 -15 165 300 -19 46 100 19 -64 -72 123 114 -74 -271 -129 -154 -324 -26 -77 88 39 104 -82 25 122 2 37
2430 37 108 60 -45 106 -76 46 -115 -112 109 -81 -77 -98 2 -44 189 17 10 -144 79 -65 -83 151 108 186 -47
2455 -47 161 -86 1 55 -76 -9 -78 -98 26 -37 173 46 -122 80 0 90 -168 64 -62 156 95 -165 -168 66
2479 66 32 120 -74 80 60 44 -64 49 -20 120 335 66 35 -40 -104 123 -43 118 176 -284 56 -243 63
2502 63 -75 75 117 46 49 -85 80 -170 71 -42 -13 140 47 -223 -73 202 -128 -75 -49 -4 -22 -80 188 105
2526 105 -272 70 -16 -57 -146 -12 -54 51 156 133 99 -139 99 -33 -41 160 56 -12 61 42 -136 41 -58 3
2550 3 -212 -55 -20 -95 -64 315 -189 25 23 -134 233 75 85 4 71 175 4 58 -100 59 -261 29 58 -179
$$ packed form
2380e4l4K85J09m05K68O9j88j65N4qj0O5j06P8L4J78k41N7r2K22j23J3k3N5n3
2405a5J80J35l19O5N4q1q3qJ95rj88j97J42k5j70K98n1J65m9O5j86J07R7j20L5
2430C7P1m8j05J51j82J22j61LK21j90Mk1J00m6K33j72pj54K23j44j8K34m3P8k33
2455d7K08k47Q7N4j31O7o9k0J24o3K10j27j68K02q0R0k58K32j26K18o1k60lK34
2479F6l4Q8j94J54k0j6j08J13o9J40K15k69l1p5o4K27j66J61N8m60L40k99L06
2502F3j38J50M2p1Lj34J65k50K41j13K9J53r3k70J50K75l30N3K6M5j8n8K68q3
2526A05l77L42q6m1q9J34m2J05J05k3l4k38K38j32qK01j04o8P3j9j78J77r9O1
2550Ck15J57L5p5L1L79n04K14kj57L67j58J0q1O7J04j71N4j58J59l20K90K9k37
$$ plain form
2574 -179 -103 117 -116 9 425 30 242 12 129 341 216 81 161 -6 167 3 -191 91 223 18 -77
2595 -77 -19 -34 -47 94 -86 -220 -108 34 94 143 53 -30 9 117 25 -63 -36 67 -54 76 29 156 -116 31
2619 31 -48 -231 -94 -14 93 -28 92 186 308 50 170 448 -27 -15 208 -7 -28 -75 -66 -21 -233 70 -113
2642 -113 -242 7 -52 -41 84 -92 -84 36 -128 143 -92 26 291 -52 91 -95 -70 -201 -232 -104 -214 25
2664 25 190 44 -184 107 251 35 -79 97 -42 -39 -9 117 16 14 55 -36 74 55 55 -122 36 -168 -252 -66
2688 -66 24 -66 57 -50 -43 -46 27 54 -64 21 -62 58 106 -47 102 -64 -144 108 128 -337 117 -41 -208 -66 107
2713 107 97 -64 -120 363 209 341 77 181 -93 -50 -319 202 -23 166 33 -157 -39 -13 87 -149 -65 72
2735 72 137 261 154 -123 6 -120 98 -36 318 -18 47 52 -25 9 82 62 -34 -167 -142 9 31 39 105 -6 225
$$ packed form
2574a79P6K20k33J25M16l95K12k30J17K12j25j35Q0j67J73j64j94K82J32k05r5
2595g7N8j5j3J41j80j34J12J42O0M9r0q3L9J08r2q8K7J03j21J30m7J27k72J47
2619C1p9j83J37Q0J07j21J20R4J22k58J20K78m75J2K23k15k1m7RM5k12L03j83
2642a13j29K49n9J1J25j76QJ20j64K71k35J18K65l43J43j86K5j31l1J28j10K39
2664B5J65j46k28K91J44k16j14J76j39LL0J26j01kM1r1J10j9%j77J58k04q4J86
2688f6R0r0J23j07PlP3K7j18Q5q3J20M8j53J49j66q0K52K0m65M54j58j67J42J73
2713A07j0j61n6M83j54J32k64J04k74M3k69N21k25J89j33j90J18K6J00k36Q4J37
2735G2O5J24j07k77J29j26K18j34L54l36O5Np7L4P3k0r6j33K5J51K2QO6j11K31
$$ plain form
2760 225 228 71 -64 58 73 10 192 36 -119 -21 38 -89 -29 -75 -19 -112 -102 -103 115 36 -58 -72 75 -1 131 62
2786 62 36 1 -58 101 -77 81 -49 -139 84 -142 48 101 0 -180 -135 14 -185 -24 25 -117 54 -47 77
2809 77 238 112 -159 -41 240 65 143 -16 36 -199 -118 120 -101 -43 -250 -36 -63 250 41 103 319 -18
2831 -18 -2 -41 276 137 -13 140 -95 219 -69 37 -130 -24 102 -108 -132 -155 27 -117 31 221 74 55
2853 55 112 -116 360 190 18 9 -104 -7 -285 -151 24 -41 -9 -112 136 61 -17 -45 44 154 24 205 193 -108
2877 -108 -26 21 143 63 50 -213 -62 -164 55 -24 154 -199 -60 91 -101 -43 -201 127 140 -94 -78 103 -1
2900 -1 42 -81 -36 -53 22 79 106 64 -74 -139 -111 -36 272 143 -98 113 -14 124 -249 44 194 -73 204 -95
2924 -95 69 -40 111 1 107 -182 49 -123 -200 -68 -134 1 186 -53 98 255 -49 -163 -69 -50 85 -7
$$ packed form
2760B25Lj57j35J22J5o3J82j56j55R8N9j27O0m6N6r3J0jK18p9r4j4J47p6J32o9
2786F2k6l5n9J59j78J58j30r0K23k26J90N3j01j80M5J49j99J61M9j42J71j01J24
2809G7J61j26k71J18K81j75P8j59N2k35Q1K38k21N8k07K14k7L13k09O2K16l37
2831a8J6l9L17j39j50J53k35L14k88J06j67J06J26k10k4k3J82j44J48J90j47j9
2853E5N7k28M76j70j72rj13R7k78J34J75o5L2j03K48p5p8k8Q9J10j30J81j2l01
2877a08Q2M7J22q0j3k63J51j02K19p9J78l53J39J51j92N8j58L28J3k34J6J81j04
2900aM3j23M5j7P5N7K7m2j38o5K8P5L08j29k41K11j27J38l73K93J50k67K77k99
2924i5J64j09J51j10J06k89K31j72p7J32o6J35J85k39J51J57l04j14R4J9J35r2
$$ plain form
2946 -7 83 -9 -36 144 -140 4 -205 -11 -123 34 -191 -137 -91 280 -92 -201 60 91 15 -2 -132 -43 -54 -225
2970 -225 -22 78 33 28 -159 115 56 -146 107 -129 -104 99 -156 185 47 -59 -33 82 23 126 47 -103 203
2993 203 -68 19 86 -190 30 -19 -64 -198 100 -132 93 174 7 -9 100 -86 -116 -2 177 -7 -47 47 70
3016 70 -89 -183 -146 -11 -156 -142 104 -82 -25 -118 7 119 -79 -63 -67 -186 210 -29 -67 -2 165 -61 -12 -68
3040 -68 -157 -10 -151 127 79 -169 -178 23 158 -60 135 -40 88 98 -75 58 -13 102 -242 -135 106 -234
3062 -234 -46 -189 -201 210 84 -104 -169 21 -6 37 25 18 -139 -208 -26 -43 200 -15 -47 -19 -59 66 -72 -133
3086 -133 -129 -40 -75 -57 62 -70 59 -221 -139 4 -60 290 84 -178 -110 -40 94 61 -198 -87 146 -63 79
3109 79 -153 28 78 -39 -84 59 -43 12 147 -112 -145 59 -14 62 -73 147 -10 73 -93 -15 -7 -37 79 109
$$ packed form
2946gR0r2k7J80k84J44k09J94j12J57k25N4M6L71l72j09K61L1p6j7j30Q9j1j71
2970b25K03J00m5nj87K74n9k02K53k36K5K03k55L41j38j06K6J15n9J03p9j50L06
2993B03k71Q7O7k76K20m9m5j34K98k32K25Q1j67j6J09j86l0J14J79j84m0R4K3
3016G0j59r4L7J35j45J4K46j86N7r3J25J12j98J6mj19L96k39l8O5J67k26M9n6
3040f8q9J47j41K78m8k48rK01J35k18J95j75J28J0j73J33p1J15l44J07K41l40
3062b34J88j43j2M11j26j88o5J90k7M3j2pj57o9J82j7K43k15l2K8m0J25j38o1
3086a33MQ9l5J8J19j32J29k80Q2J43o4L50k06k62O8P0J34l3k59J11K33k09J42
3109G9k32J81N0j17m5J43j02N5J35k59l3K04p3P6j35K20j57Q3j66P8Ql0J16L0
$$ plain form
3133 109 204 29 199 -10 22 61 115 29 126 59 -51 164 54 3 113 38 6 136 102 95 -52 -58 -81 -194 -122 -185
3159 -185 -125 11 -131 -121 57 -23 -121 -91 128 -158 17 -68 -123 39 26 -91 236 155 -81 -53 37 34 84 -190 147
3184 147 16 23 79 27 -50 62 149 -209 -21 -66 -35 65 -178 121 -4 -35 -125 65 -128 14 -126 -28 74 112
3208 112 105 21 88 237 53 102 152 50 -9 4 134 -79 -77 2 -148 8 -151 -110 267 132 -36 -82 -182 -42
3232 -42 -172 122 242 226 -111 -104 52 -55 -38 -12 105 -159 72 -57 -129 -53 -137 0 8 -59 130 -47 -62 139
3256 139 -35 136 0 -192 161 119 19 -126 -27 166 -96 -84 -199 68 -78 -54 152 -31 -34 127 -75 -132
3278 -132 206 -11 21 41 -271 68 99 -57 59 35 99 -79 93 -29 -116 -99 43 -30 112 -133 57 -38 327
3301 327 4 150 230 -149 -74 -74 153 25 160 -216 -231 -21 -184 29 77 44 194 26 -187 -59 -15 6 -45
$$ packed form
3133A09R5j75J70k09L2L9N4q6R7o7j10K15j10n1J10p5l2J30l4pj47ok3j13P2o3
3159a85O0J36j42J0J78q0r8L0K19k86J75q5n5J62j3j17L27q1k36K8R0lN0k74L37
3184A47j31PN6n2p7J12Q7l58J88m5L1J00k43K99j25l1r0J90j93J42j40R8J02L8
3208A12pq4O7J49j84M9N0j02n9J3J30k13KP9j50J56j59M1L77j35j68m6j00J40
3232d2j30K94J20j6l37PJ56j07J7K6J17k64K31j29p2P6q4J37Qo7J89j77j5K01
3256A39j74J71j36j92L53m2j00j45R9J93k62J2j15K67j46K4K06j83lJ61k02n7
3278a32L38k17L2K0l12L39L1j56J16k4O4j78J72j22q7J7J42p3J42k45J90r5L65
3301C27l23J46Q0l79P5%K27j28J35l76j5K10j63K13M8l3J50j68k13J28M4K1n1
$$ plain form
3324 -45 -104 -51 99 -18 0 155 -47 56 -99 -70 -78 -95 80 47 -8 -105 38 208 -33 -114 -10 -20 283 112
3348 112 111 -32 -15 147 -3 -11 1 -4 -134 81 91 -4 -11 -57 142 -37 -83 76 152 29 332 -19 3 21 1 12
3374 12 -48 -36 -127 85 16 70 -129 -85 -97 -2 81 -12 42 109 297 69 -126 -71 -42 -68 -85 -179 158 -117 -129 -104 -158
3401 -158 -201 -173 -104 65 -67 -18 -118 -26 280 -66 -1 -183 51 158 -191 103 -11 99 49 -156 -258 33
3423 33 -42 -89 -134 -33 78 -102 124 21 68 111 -174 -116 22 -99 -7 153 2 -46 -162 -185 78 -260 -40
3446 -40 77 -18 -81 -122 -23 160 112 155 112 48 174 -36 80 -52 123 -48 165 -52 -112 139 -12 110 -47
3469 -47 -69 57 -220 87 -50 -67 120 -32 -196 -212 -28 281 206 131 91 -110 167 36 -49 -19 12 -47 -67 -164
3493 -164 188 -155 -112 58 -133 45 83 -60 -36 178 108 -51 119 149 -3 -19 -57 -205 130 -42 -159 192
$$ packed form
3324d5n9N3J50j17J8J55k02J03j55K9qj7J75l3n5r7J43J70k41q1J04j0L03j71
3348A12jj43J7J62j50qJ2nj30K15J0r5pm6J99j79m6J59P6j23L03l51K2J8k0J1
3374A2o0J2r1K12o9N4j99M4j2R5Q3r3N4O7J88k28j95N5K9k6j7r4L37k75j2K5n4
3401a58m3K8O9J69j32M9j00R2L06l46O5j82K34J07l49K94j14J10n0k05j02K91
3423C3p5m7m5J01J11j80K26j03M7M3k85N8J38j21R2J60j51m8j16k3K63l38K20
3446d0J17r5o3m1R9J83m8M3m3o4J26k10J16j32J75j71K13k17o0K51j51J22j57
3469d7k2J26k77L07j37j7J87j52j64j6J84L09p5p5m0k01K77j31q5L0L1n9k0r7
3493a64L52l43M3J70j91J78L8j43K4K14p0j59J70L0j52j6l8j48L35j72j17L51
$$ plain form
3515 192 -30 140 28 -189 8 194 -22 -1 -133 59 -67 -8 -5 89 -65 235 -97 -50 -90 -123 5 -162 12
3538 12 114 30 -20 120 -15 20 14 36 36 105 176 -33 -133 127 -59 -97 -140 -149 -152 -114 32 76 -51 2 179 -97 120
3565 120 -77 44 114 -89 19 -38 48 -117 -90 44 3 -207 97 28 -39 360 -126 123 -142 92 -43 -103 -48
3588 -48 -81 131 97 224 -117 -1 0 -75 -108 -51 145 -20 -1 -59 115 38 -63 57 79 -87 93 87 103 98 107 32 -35
3615 -35 -126 -39 3 -28 96 16 -14 -108 -125 -188 -91 -76 -252 -74 79 -33 115 -110 42 168 -276 -260 -169 -54 -54
3640 -54 19 84 15 49 -148 -109 150 40 1 20 248 53 -61 -112 -130 -39 -79 232 -151 13 156 61 101 97 -85
3665 -85 -46 -108 -41 166 -49 -65 95 67 49 226 12 188 -6 222 42 -92 23 13 -15 3 -7 -55 91 96 -16
3690 -16 -87 -23 -321 -49 -151 -40 -96 -164 -117 -96 -105 41 65 -72 359 65 281 -85 81 80 -8 144 -81 -255
$$ packed form
3515A92k22J70j12k17J97J86k16K1j32J92j26N9LR4j54L00l32M7m0l3J28j67J74
3538A2J02q4n0J40j35L5oK2%O9P1k09j00K60j86l8m3rlL8J46M4j27N3J77k76K17
3565A20j97J21P0k03J08n7Q6j65K7J34m1k10L04o9o7L99m86K49k65K34j35o0N5
3588d8l3K12l4J27l41J16Jp5l3N7J96j65J9n8J74p7j01J20K2j66J80oJ6nRp5o7
3615c5r1Q7M2l1J24q0l0r4j7o3R7J5j76J78J53j12J48k25J52J26m44J6R1J15%
3640e4P3O5o9L4j97L9K59j10l9J9K28j95j14n1j8R1m0L11l83J64J43r5M0mj82
3665h5L9o2O7K07k15j6J60k8j8J77k14J76j94K28j80j34J15j0k8J8j0m8J46Nj12
3690a6p1O4k98K72j02J11n6o8M7K1rJ46K4j37M31k94K16l66J66jq8J52k25j74
$$ plain form
3714 -255 -43 222 -20 23 76 -45 -65 76 -19 -11 -171 -95 80 128 -170 72 -92 -16 -41 25 -160 -244 -83 -162
3738 -162 15 35 59 27 71 -166 -153 165 274 161 -15 -102 7 99 13 172 101 -70 -102 278 297 63 -110 -170
3762 -170 -65 28 -46 -78 27 -103 99 -40 137 -126 -53 29 -12 -114 -105 -17 11 111 25 -71 -61 -102 76 -18 -42
3787 -42 -120 -79 -104 -3 -84 -118 58 22 -18 -57 135 -268 -3 100 72 257 -47 -152 50 -149 144 -22 59 72
3811 72 -88 -133 113 51 2 43 52 1 54 143 -29 214 76 -65 -49 -128 39 -246 -147 203 -35 -56 10 195 175
3836 175 -3 -85 -138 -62 94 -117 34 -8 52 48 79 154 -12 109 -40 216 -48 67 -109 217 229 28 -123
3859 -123 24 -6 56 187 -64 -31 -101 -126 -83 -99 -48 9 61 282 -88 71 -132 -41 -84 123 99 -123 11 95 64
3884 64 -17 -137 10 97 -89 52 -31 -161 -172 147 189 -107 -35 165 78 246 48 -43 -116 -211 5 -25 85 -84
$$ packed form
3714b55K12K65k42M3N3j21k0J41r5Qj60P6J75M8k98K42j64P6k5O6j85q4J61p9
3738a62J77K0K4l2M4k37J3L18J09j13j76q7J09R2q6J59p1j71l2L80J9k34j73o0
3762a70J05R3p4l2J05j30K02j39J77k63P3Q2m1j02RQ8K8J00q6r6J0m1J78r4k4
3787d2p8M1k5J01q1l4J76l6m0l9J92m03K65J03k8J85l04j05K02j99K93j66Q1J3
3811G2j60m5K46o2m9M1Rn1N3Q9j72K43j38j41J6p9J67k85R9L50k38k1O6J85k0
3836A75j78q2n3P6J56k11J51m2O0mL1P5j66J21j49K56k64J15j76L26J2k01j51
3859a23J47l0O2J31k51L3p0k5M3j6N1N7N2K21l70J59k03R1m3K07k4k22J34Q4l1
3884F4q1j20J47Q7j86J41q3j30j1L19M2k96P2K00q7J68j98r1p3r5K16l0J10j69
$$ plain form
3908 -84 59 10 137 2 8 172 -87 -36 -2 -136 -81 70 -42 -113 -151 7 75 95 52 -45 -35 12 -97 -222 306
3933 306 -71 -99 179 -34 -38 -57 55 85 87 144 -57 83 267 -132 -130 73 -340 68 9 46 10 181 185 1 -183
3958 -183 -180 123 56 146 98 -20 12 85 85 177 -20 -89 -30 138 57 173 -73 71 190 -119 69 -87 14 -19 -13
3983 -13 -81 54 -218 97 81 -132 137 187 -19 71 19 220 62 91 -16 -50 116 -87 151 111 -137 196 218
4006 218 40 -75 107 95 10 52 -109 220 92 -25 40 12 -218 81 -58 3 -198 219 37 1 112 28 61
4029 61 -25 4 20 -12 -78 79 -10 -6 67 -50 -198 -73 -27 -161 -19 -108 -15 -3 -92 -100 261 -2 -85 -105 -276 134
4055 134 2 51 -10 160 191 -314 -38 11 -56 -73 15 120 -11 -120 -57 -134 -23 37 147 33 132 -157 14 -111
4079 -111 138 -167 -96 -25 -154 111 -73 72 75 245 -136 -204 -113 196 -32 -21 -105 117 89 219 43 -45 -21 155
$$ packed form
3908h4J43m9J27j35OJ64k59N1L4j34N5J51j12p1l8J58O8K0m3r7J0M7j09j25N28
3933C06l77k8K78k13mj9J12L0KN7k01J40J84l99KK03m13M08n9L7l6J71Mj84j84
3958a83LL03o7R0m8j18L2P3%R2j97o9N9J68q1J16k46J44J19l09J88j56J01l3O
3983a3o8J35k72L15j6k13K69N0k06R0n2K01j58K9j07l4J66k03K38m0k48L33K2
4006B18j78j15J82j2q5M2j61L29j28j17O5k8k30K99j39O1k01M17j82l6J11q4L3
4029F1q6K9J6l2o6J57q9MP3j17j48J25M6j34J42q9R3J2q9qL61k63q3k0j71M10
4055A34j32M9o1J70L1n05K76M9o7j7Q8J05j31j09O3p7J11O0J10j14R9k89J71j25
4079a11K49l05P1P1j29K65j84J45LJ70l81o8R1L09k28J1q4K22k8J30j76q8K4J76
$$ plain form
4103 155 -232 -51 -63 -117 -226 -176 142 54 79 -135 70 -12 -224 73 61 -74 114 -4 -27 91 -7 -96 -1 -70
4127 -70 154 -4 -19 135 148 238 -80 213 102 -21 72 -57 245 37 -119 34 154 98 211 -166 31 0
4149 0 63 9 162 -136 -65 122 -27 -149 23 -49 -110 84 -90 6 92 212 1 17 -89 -157 121 -144 84 51
4173 51 -150 -47 84 -31 -44 174 -53 79 86 -198 -73 -12 62 -173 -222 -113 145 65 -7 -82 -104 -44 61 -13
4197 -13 -122 -80 139 -91 -65 163 -20 228 -26 43 27 32 244 -132 -242 -28 10 166 36 89 132 158 14 67
4221 67 153 -86 7 -164 -57 124 51 -44 -26 -137 -30 -38 181 329 36 -213 -72 6 -92 -86 3 -45 -100 -75 -34 -83
4247 -83 -71 -25 77 -89 44 -4 -81 93 28 205 55 -78 -128 -49 -180 41 99 -12 33 -99 111 15 3 -204
4271 -204 -258 -23 -149 139 -32 85 -63 8 -14 1 -3 -187 -109 86 125 -150 -70 -21 208 83 -61 84 28 -58
$$ packed form
4103A55l87J81j2n4j09N0L18q8K5k14K05q2k12K97j2j35J88j18k3J18r8q9R5o9
4127g0K24j58j5J54J3R0l18K93j11j23R3j29L02k08j56J53J20n6J13l77J97l1
4149@O3n4J53k98P1J87j49j22J72p2o1J94j74R6Q6J20k11J6j06o8K78k65K28l3
4173E1k01J03J31j15j3K18k27J32Pk84J25O1P4k35m9J09K58q0p2p5k2O0J05p4
4197a3j09M2K19k30K6K28j83K48k54O9j6NK12l76j10K14L8J56j30N3M3K6j44N3
4221F7Q6k39R3j71J07J81p3r5J8j11J07qK19J48k93k49J41P8r8OQ9m8n5K5M1m9
4247h3J2M6J02j66J33m8p7J74o5J77j50j33n0P9j31K21N8j11M5j32K10r6j2k07
4271b04n4K35j26K88j71J17j48P1k2J5mj84P8J95L9k75Q0M9K29j25j44J45n6q6
$$ plain form
4295 -58 -25 -34 163 -182 9 31 -77 27 -62 45 154 -1 -7 21 156 -62 198 0 92 -115 -33 -140 -18 -56
4319 -56 109 110 -147 208 42 13 215 112 -15 -1 94 125 -8 -24 2 21 141 -13 -13 -210 -5 82 -68 -124 181
4344 181 52 89 22 -162 156 134 -7 -47 -105 2 -98 60 17 48 7 111 -143 -12 88 105 130 -198 131
4367 131 -196 -153 4 20 94 -68 129 -148 84 86 -103 -147 132 217 135 176 90 30 138 123 -147 92 -12 -137
4391 -137 -146 55 -89 65 -204 59 228 15 0 182 285 -58 -223 -46 59 69 207 184 -73 3 -193 83
4413 83 -81 -97 179 -50 -173 -33 -38 138 -30 127 15 -76 129 128 30 5 185 -32 20 -131 12 -264 -23
4436 -23 174 6 -16 -15 10 -39 -26 12 9 -154 -96 108 76 -37 181 -103 44 36 52 -274 22 53 -91 -1 -95 -13
4462 -13 134 105 32 74 22 52 157 133 40 165 68 105 16 62 -30 -175 32 -303 200 -153 -139 -108 -34 -115 34 33
$$ packed form
4295e8L3rJ97l45J91K2j08J04q9J07J09j55oK8J35k18K60j98R2k07Q2j07J22l8
4319e6J65Jk57L55j66k9K02j03j27J4R5L1j33j6K6J9J20j54%j97K05Q7j50n6L05
4344A81j29L7o7j84L18k2j41m0n8J07j00J58m3L1m1J04k54J31J00J7K5l28L29
4367A31l27M3J57J6P4j62J97k77K32Kj89m4K79Q5q2M1q6o0J08j5k70K39j04j25
4391a37rK01j44J54k69K63J69k13j5J82J03l43j65J77J05J0J38k3k57P6j96K76
4413H3j64j6K76k29j23J40nJ76j68J57j12r1K05jr8k5J80k17N2j51J43k76K41
4436b3J97j68k2JK5m9J3L8lj63N8K04l2j13K18k84J47qJ6l26K96L1j44R0r4Q2
4462a3J47k9p3M2n2L0J05k4r3J25r7L7q9M6r2j45K07l35N03l53J4L1P4q1J49j
$$ plain form
4488 33 30 29 -70 -31 94 -216 -31 -161 89 -242 -127 86 69 -67 77 1 -1 -44 -118 -7 -86 -29 -90 93 74 -88
4514 -88 -254 -241 -225 115 60 -51 -103 -91 -234 78 -73 -11 30 90 85 31 24 -32 -185 57 51 -80 240 113 -67 -46
4540 -46 -86 39 -226 81 -111 -102 49 -213 189 91 -237 146 131 81 -57 196 -156 89 47 -39 152 234 -250
4563 -250 -92 -29 -228 72 247 74 -23 -48 47 -32 174 10 174 102 40 -80 -38 161 47 250 -52 -41 206
4586 206 -134 38 131 98 -93 8 95 -80 -119 63 -107 36 54 -162 63 39 57 -108 -7 28 -72 14 86
4609 86 -47 -104 5 -211 24 120 -47 168 -41 68 -8 4 42 82 165 99 37 -236 170 -13 -42 -237 108 92
4633 92 33 -15 38 -139 98 -125 112 140 -87 37 59 227 -63 86 33 -33 129 -162 -32 106 -270 -94 18
4656 18 27 150 -67 104 86 172 -178 -4 -103 -58 132 -9 -174 6 41 45 -135 65 -96 -150 3 30 12 -201
$$ packed form
4488C3ljr9L9J25l10J85j30K50l31J15K13j7j36J44p6km3p4J11p9N7o1J83j9j62
4514h8j66J3J6L40n5j11n2J2j43L12j51O2M1O0nn4pn6j53K42oj31L20j27j80K1
4540d6m0J25k65L07j92RJ51k62M02r8l28L83j5n0j38K53l52K45m2q6J91Q2m84
4563b50J58O3j99L00J75j73r7k5R5p9K06j64J64p2o2j20M2J99j14K03l02J1K47
4586B06l40J72R3l3j91J01Q7j75l9J82j70J43J8k16K25k4J8j65J01L5j00Q6P2
4609H6j33n7J09k16K35R6j67K15k09J09p6J2L8M0Q3o6o2k73M06j83k9j95L45j6
4633I2n9m8N3j77K37k23K37K8k27J24K2J68k90J49n3o6J62k91J30J38l76J76J12
4656A8RJ23k17J71j8Q6l50J74r9M5J90j41j65J80L5Mj80K00j61n4J53K7j8k13
$$ plain form
4680 -201 22 -12 113 -59 -11 -100 -87 -248 -69 -127 -33 65 127 58 46 -47 19 -46 28 -6 -45 -163 202 -124 -87 256
4706 256 -7 115 -48 14 163 14 75 13 -112 -24 1 78 96 -21 127 -94 -221 -32 252 -125 -116 -84 194
4729 194 -2 -75 138 -48 -10 -127 122 19 -84 46 -74 -1 104 -72 9 367 126 -59 -105 -4 58 -5
4751 -5 88 8 -98 -72 239 130 -108 -6 72 47 38 -123 -302 -52 20 -24 -17 79 -48 105 112 -53 -79 -99 -107 89 -170
4778 -170 27 -23 126 9 37 54 5 73 49 98 -110 163 -118 -105 23 38 -89 99 112 29 41 56 -75 -126 -49
4803 -49 -27 54 -73 -153 -34 -142 -256 82 175 -91 76 -26 -27 -38 297 149 157 -236 174 -62 137 132 -104 114
4827 114 -26 62 71 -65 89 -60 35 47 -70 153 -89 -95 -1 -57 -112 54 72 97 55 94 177 109 -18 13 9 172
4853 172 22 120 -34 -65 -53 63 50 110 58 -83 270 26 151 67 69 -231 98 -219 -124 28 -107 38 81 -124
$$ packed form
4680b01K23l4J25j72M8q9J3j61J79n8R4R8O2o9j2r3O6o5P4l4l9j18L65l26L7L43
4706B56k63J22j63O2J49j49O1o2j25Q8K5P7J8j17J48k21j27J89K84l77RL2K78
4729A94j96p3K13j86L8j17K49j03j03J30j20P3J05j76Q1L58k41j85m6J01O2o3
4751eR3q0j06K6L11j09k38J02P8k5rj61j79K50P2m4PR6j27J53Pj65k6k0qJ96k59
4778a70J97n0J49j17K8J7m9O8k4M9k08K73k81J3J28J5j27J88J3q3J2J5j31n1P7
4803d9K2Q1j27q0J19j08j14L38R3k66J67j02jj1L35j48Ql93M10k36J99nk36K18
4827A14j40Q8Rj36J54j49R5J2j17K23k42oR4n6n5J66J8K5m2L9Q3o8j27L1mJ63
4853A72j50R8j54l1J2J16j3O0n2j41L53k44J25q4Kl00L29l17R5J52j35J45M3k05
$$ plain form
4877 -124 -215 -102 -25 94 -79 -123 -119 -42 122 5 95 100 60 127 180 62 -177 -86 -87 44 -73 -7 66 -240 -51 -48
4903 -48 -36 126 129 78 -49 304 29 -129 -81 -231 -66 -134 169 -14 -75 30 34 -155 97 -167 -152 82 29 85
4927 85 133 -12 -165 165 174 -5 -22 -23 136 7 -29 84 69 -190 -75 -173 -73 -107 59 164 66 147 0 63 -1
4952 -1 -291 321 -10 21 -15 -131 60 129 -27 -193 -42 -2 173 -124 -124 -30 70 -26 -45 30 -32 -98 -114 -9 -102
4977 -102 -28 -24 79 -67 148 77 -183 80 29 -32 25 -73 -98 35 50 107 78 -68 -55 -2 -22 175 -30 -77 9 45
5003 45 189 31 -89 72 -47 79 134 -91 70 48 3 1 -69 36 14 -171 10 -121 -33 42 71 151 21 38
5027 38 -37 -114 30 -70 -80 -14 -48 -39 -111 0 -47 194 -328 -164 186 -60 82 142 -91 80 119 72 -148 -96 18
5052 18 -110 154 37 -120 -26 25 -22 243 142 160 -18 161 135 -42 -171 192 145 56 136 11 -49 29 222 148
$$ packed form
4877a24r1J13P7J19j73m4MP7J64j17R0Nm0O7N3j18k39R1jJ31j17O6P3l06J89L
4903d8J2J62Ln1j27L53k75j58M8j50J65o8L03j83o1J05Mj89K52k64J5K34n3N6
4927H5M8j45j53L30Rj79j7jJ59j29l6J13j5k59J15r8J00l4J66J05r8Q1j47O3o4
4952ak90O12l31L1l6j16J91O9j56j66J51M0J75k97%R4J00r6j9P5o2o6j6J05r3
4977a02P4MJ03j46K15p1k60K63n1o1N7r8k5J33J5N7k9j46J3N3k0J97k05m7Q6L6
5003D5J44j58j20J61j19J26N5k25J61k2m5kp0J05k2j85J81j31Q8P5K9Q0j30J7
5027C8p5p7J44j00j0O6l4Rp2J11m7K41n22J64L50k46J42O0k33J71L9m7k20N2J14
5052A8j28K64j17j57R4N1m7K65j01J8j78J79k6j77j29L63m7q9Q0j25o0P8J93p4
$$ plain form
5076 148 -24 -80 -7 92 -93 -88 -96 -180 -188 -42 222 -41 -69 -207 -31 -49 150 -199 -8 46 176 196 9 158 -69
5101 -69 -34 -134 -61 -260 207 198 33 39 -121 -129 135 64 64 -114 -95 32 -96 41 -190 5 134 -25 36 88 -77
5126 -77 -198 -56 83 4 -64 -293 67 116 -208 60 -126 48 -127 128 208 -214 53 -103 -116 -54 0 131 -45
5149 -45 -61 -247 69 -45 89 -38 -56 -45 -18 308 28 -144 -255 0 -226 151 -53 -75 158 -20 -81 41
5171 41 72 45 88 -80 10 141 -46 95 -178 -244 18 150 32 155 245 -198 13 -67 190 -47 -190 116 1
5194 1 2 80 119 -56 41 287 31 -14 -13 10 176 54 -19 -44 27 -46 90 130 -65 -114 11 -29 79 75 38 -19 -43 -98
5222 -98 141 169 150 55 24 -87 95 -50 233 142 265 -193 -253 -10 -36 -3 27 -77 56 152 -60 -89 235 61
5246 61 74 -12 -214 -31 17 -49 -28 157 100 -55 -49 -45 -97 -106 104 -67 39 -34 47 -36 59 68 -8 -171 17 -55 45
$$ packed form
5076A48j72n6P3R9j85Nqq4qJ46K64k63k8j38J76j8J99l49J91N4J30K0j87J49k27
5101f9L5j00P3j99M67rj65Oj60qK64p1%j78J9J27j28J37k31J95J29j59O1N2j65
5126g7j21J42J39p9o8k29L60M9l24K68j86J74j75K55Q0m22K67j56j3O2N4J31j76
5149d5j6j86L16j14J34j27j8J1K7L26k80j72j11K55k26L77k04k2K33j78o1J22
5171D1L1k7M3j68R0J31j87J41k73o6K62J32j18J23R0m43K11q0K57k37j43L06j15
5194AJP8L9j75R7K46k56m5JK3J66j22p3k5P1p3J36M0j95m9J25m0J08ml7n7k4n5
5222i8K39K8j9r5l1j11J82j45K83r1J23m58o0K43k6L3L0j04J33R6k12k9L24j74
5246F1J3q6k02J83M8o6K1J85n7j55OMn2rK10j71J06p3Q1q3R5Rp6j63J88p2J00
$$ plain form
5273 45 -5 211 -110 97 -88 -9 -97 108 -18 -38 -169 -249 50 25 -165 109 -146 -85 -30 25 115 183 168 1
5297 1 228 102 -109 46 120 -79 -56 -11 119 -102 -65 -41 -199 89 214 31 176 12 -3 -79 -48 12 98 -140
5321 -140 61 4 -17 44 -51 154 94 145 -79 -94 -181 -159 -178 -102 18 -69 93 32 -74 6 174 88 -16 -35 -43 -27
5347 -27 146 -68 -89 262 -33 107 -35 -227 -56 12 -18 190 16 75 -164 -96 -81 -126 49 -67 201 128 66
5370 66 -10 -114 -54 182 232 -88 -52 18 -61 64 155 -53 -106 260 -125 101 269 -97 40 125 201 -10 -21 15
5394 15 256 -64 -77 -151 -43 -5 213 11 -54 -67 -32 23 26 -222 -226 15 -161 -208 49 82 54 41 -37 253 38 -89
5420 -89 76 23 -12 171 128 18 87 87 28 178 10 -52 -68 142 -93 221 110 98 -44 18 63 -100 -75 -225 49
5445 49 32 102 178 26 136 -189 -205 183 205 125 140 -85 -20 98 -100 -211 32 168 -220 108 37 59 20 73
$$ packed form
5273D5n0K16l21K07j85P9q8K05j26k0j31q0K99k5j90K74k55O1N5N5R0O8j5j67
5297AK27j26k11J55P4j99K3M5J30k21L7K4j58K88J25j83J45j64j5p6L1O0Q6k38
5321a40K01n7k1O1r5K05o0N1k24j5q7K2j9P6J20q7J62o1j06Q0J68q6j04j9qJ6
5347b7J73k14k1L51k95J40j42j92J71O8l0K08j74N9k39O8J5m5J75j16K68p3o2
5370F6p6j04O0K36N0l20L6P0p9J25R1k08n3L66l85K26J68l66J37Q5P6k11j1L6
5394A5K41l20j3p4J08L8K18k02o5j3L5N5Lk48mK41j76m7K57L3k8j3p8K90k15j27
5420h9J65n3l5J83m3j10O9%n9J50j68o2j6K10k35L14j11j2j42O2M5j63K5j50K74
5445D9j7P0P6j52J10l25j6L88K2q0J5k25O5J18j98j11K43J36l88L28p1K2l9N3
$$ plain form
5469 73 15 -178 -2 -64 45 63 181 120 10 -179 190 12 -25 125 54 -11 -90 -124 48 187 -102 17 59 -16
5493 -16 52 88 -14 99 -54 -9 135 0 93 -32 88 -184 66 -112 43 163 -127 -178 101 -62 80 -97
5515 -97 -78 15 -1 -180 -59 -2 -165 118 -134 59 -9 -5 -3 66 33 -95 -83 -2 -80 140 74 -45 -89 -159 -18 -161
5541 -161 -188 24 -295 -31 100 -42 -106 56 143 55 75 74 -167 126 148 55 -69 -10 39 -3 19 8 -197 -107 -1
5566 -1 44 5 76 6 -126 -44 -42 -57 -78 -43 69 287 -57 -60 269 57 -10 151 9 94 214 120 -102 -36 -16 -43 -98
5593 -98 151 -6 -168 165 6 153 15 106 150 -130 97 -80 5 230 7 -188 -62 -33 70 -119 -73 111
5615 111 -3 -73 29 21 -69 -73 74 92 64 -86 -106 166 -187 -117 130 6 -97 25 -218 -177 1 67 178 -135
5639 -135 -33 -7 -118 -208 -48 6 108 15 -83 -44 -194 123 73 -52 -175 30 -3 33 -148 112 70 127 -33 245
$$ packed form
5469G3n8j93J76o2J09J8J18o1j10j89L69j78l7J50p1o5p9l4J72J39k89J19M2p5
5493a6O8L6j02J13j53M5J44j35R3j25J20k72K50j78J55J20k90n1K79j63J42j77
5515i7J9R3j6j79J21N7j63K83k52J93o8MKO9l3j28J2Q1p8K20o6j19m4p0J41j43
5541a61k7K12l19K64J31j42o4J62Q7q8K0jk41K93K2r3j24N9M9m2K2j1k05R0J06
5566aM5l9P1p0j32Q2Kj5k1L5J12K18l44lL29k12o7J61j42Q5J20r4k22O6K0k7n5
5593i8K49j57j62L33j59J47j38R1M4k80K27j77Q5K25k23j95J26K9J03j89M6J84
5615A11j14p0J02qr0mJ47J8k8j50k0K72l53P0K47j24j03J22k43M1J78O6J11l13
5639a35J02K6j11r0J60N4J02r3r8L9j50L17n0j25j23K05l3L6j81K60m2N7j60K78
$$ plain form
5663 245 330 128 -1 -75 -10 -207 95 113 185 16 -148 -38 -157 -83 -66 -52 1 46 -49 164 -54 -122 21 -90
5687 -90 -75 17 -35 106 -134 -84 -66 64 24 -250 126 -69 -2 19 33 47 -91 55 6 140 65 -57 63 145 -59
5712 -59 -135 -23 -1 5 207 -161 -398 158 -85 4 -81 -129 37 35 19 -35 104 -16 -89 177 -206 64 -251 -101
5736 -101 -100 -209 154 102 85 -99 -103 18 -55 34 -45 97 122 113 89 -37 105 -21 -66 -35 -94 149 -53 -89 4 96
5762 96 -50 92 103 -29 -35 -85 -74 52 -17 -66 -140 -94 -95 -137 22 43 11 -71 -9 26 -50 -204 -52 121 -8 -33 132
5789 132 122 274 -61 156 -138 -68 87 -181 -59 111 109 -182 79 67 103 96 -63 116 75 136 90 -42 189 90
5813 90 -142 -33 18 34 -101 -79 33 150 -66 106 170 -28 69 70 139 111 154 254 -194 4 232 -35 -209 -136
5837 -136 -185 -132 46 68 -113 -33 157 8 -35 -29 52 -32 153 48 -188 38 70 -16 192 -159 -183 170 158 -174
$$ packed form
5663B45Q5k02j29p4O5j97L02J8P2j69j64J10j19P4J7J4N3M5r5K13k18o8J43j11
5687i0J5R2n2J41k40N0J8J30m0k74L76j95O7K1J4J4j38J46m9J34p5j22J20Q2k04
5712e9p6J12K2OK02l68k37N56k43Q9q5m8J66kj6n4J39j20p3K66l83K70l15J50
5736a01Jj09L63n2j7j84mJ21p3Q9p9J42K5rk4j26J42j26m5L1n9K43k02l6R3R2
5762I6j46J42J1j32on0J1J26o9m9p4M6jm2J59K1l2q2O2L5p6j54J52J73j29k5J65
5789A32j0J52l35K17k94P0J55k68J22J70kk91K61j2L6pj59J79m1O1m6j32K31r9
5813I0k32J09N1J6j35K2J12J17k16J72O4j98R7JO9k8M3J00m48J98K28k67j74P3
5837a36m9N3J78K2j81Q0J90j49m3OQ1q4J85j05k36K26L2q6K08l51k4L53j2l32
$$ plain form
5861 -174 -192 104 124 29 37 -121 158 92 163 24 29 111 -132 -117 -1 -16 0 0 68 97 -6 44 -35 -96 85 232 -120
5888 -120 -117 -45 -65 -119 154 -19 49 271 -54 -245 32 -1 8 36 208 -86 -15 -103 56 68 -3 -196 -60 65 -96
5913 -96 2 -18 113 -33 181 134 -48 144 -63 142 -24 -104 -39 -42 32 -23 -157 68 38 103 59 -57 -128 -93 9
5938 9 174 -123 58 66 21 -292 2 26 -34 -71 202 -42 -63 -95 33 199 255 -110 -156 39 -21 -52 161 -76 20
5963 20 48 74 111 158 85 109 -64 -145 45 28 -129 77 -63 13 -187 -210 163 242 202 43 9 239 9 52 31
5988 31 166 -66 57 32 64 -2 -59 186 13 -20 -215 -30 11 160 -101 -113 -153 224 -193 12 12 -210 -62 -165
6012 -165 63 69 -85 -1 -232 108 35 144 178 61 73 -252 207 -167 -15 -16 62 43 65 -92 184 -24 40 71
6036 71 20 12 56 207 53 -14 5 -98 58 -165 -24 12 -6 -98 -4 178 -283 -163 253 10 194 197 -72 -143 -175
$$ packed form
5861a74j8K96K0r5Qj58K79o6P1j39NQ2k43J5J16j5J6%O8K9j03N0p9o1J81J47l52
5888a20LP2k0n4K73j73O8K22l25j91K77l3RK8J72k94P1q8J59J2p1j93J36J25j61
5913i6R8k0J31j46K14m7j82J92k07K05j66q0O5lP4n5j34K25l0O5m4j16p1L5J02
5938IJ65k97J81Qm5l13K94K4o0l7K73k44k1l2J28J66N6l65m6J95o0l1K13k37R6
5963B0K8K6L7M7p3K4j73q1J90j7j57K06j40P6k00k3L73P9m0j59l4K30k30M3k1
5988C1J35k32J23k5L2o6n7K45j73l3j95J85M1J49k61j2m0L77m17K05%k22J48j03
6012a65K28Oj54Q4k31L40p3J09L4j17J2l25M59l74J52jP8j9K2j57K76k08O4L1
6036G1n1qM4J51j54o7J9j03J56k23J41L6j8r2R4J82m61J20M16k43J84Lk69p1l2
$$ plain form
6061 -175 88 -80 -38 -6 103 -83 -82 -58 31 59 113 48 -28 -110 -53 -39 129 93 -117 27 40 -113 -27 -51 4 -44
6087 -44 33 -58 -51 -36 -174 46 -134 -263 -59 167 -43 -204 -59 123 -15 -42 32 -19 -159 89 -132 -1 -80
6110 -80 137 91 110 -40 5 -57 200 -87 -149 236 168 -89 -241 7 254 373 -224 94 -23 174 1 -237
6132 -237 -56 122 -90 -210 -211 48 127 15 116 216 -39 -6 -65 -32 87 -161 -11 -160 -244 -84 -234 49
6154 49 -74 -112 217 -47 -154 -60 132 129 88 10 216 -151 -47 -64 33 -173 71 -207 7 -3 -97 -156 -19 -53
6178 -53 -51 -90 -4 11 -20 -85 52 -63 149 -148 -50 -91 -48 98 -83 -116 -179 39 34 -52 168 -29 -40 -99 5 -145
6204 -145 -142 -169 25 69 174 127 227 103 -7 -67 -61 234 -6 61 -93 91 209 -162 89 102 -61 106 45 104
6228 104 9 -34 -59 7 72 -151 -285 76 46 227 91 53 -134 -127 171 -28 35 -273 123 -132 38 -79 -28 230
$$ packed form
6061a75K63j68M2L2J09j86JK4Q9K8N4o5p6q2N7J4J68l6k10J44J3j53Q6k4N5m8
6087d4P7r1PJ5j38K20j80j29K04K26k10j61J45J82j38k7P4n1j40K48k21J31p9
6110h0K17m6J9j50M5o2K57k87o2L85o8k57j52K48K47J19n97L18j17J97j73k38
6132b37J81J78k12j20jK59P9j12J01J00k55L3n9L3J19k48J50j49q4J60j50K83
6154D9j23l8L29k64j07R4J92lm1p8K06l67J04j7R7k06K44k78K14j0r4n9J37l4
6178e3Kl9Q6J5l1o5J37j15K12k97R8m1M3J46j81l3o3K18nq6K20j97j1n9J04j50
6204a45Lk7J94M4J05m7J00j24j10o0OK95k40O7j54J84J18l71K51J3j63J67o1N9
6228A04r5m3k5O6O5k23j34L61l0J81j36l8j87PK98j99O3l08L96k55J70j17N1K58
$$ plain form
6252 230 5 211 -31 110 -94 -121 32 177 -27 -132 143 21 -131 -244 45 45 110 74 -115 -87 100 31
6274 31 28 21 72 -3 30 24 -71 -117 -111 42 133 52 12 130 40 175 -23 72 44 43 -321 149 255 -92 -14 -176 -39 -32
6302 -32 73 110 -24 136 39 176 181 104 239 -2 103 11 20 -243 -74 -339 163 -147 205 20 -94 127 156
6325 156 38 -188 63 124 -166 -54 -15 -16 -52 88 215 -112 124 -178 -47 -18 90 -9 -259 56 -145 -94 -25
6348 -25 -107 -90 52 93 -67 146 -164 -1 173 0 23 202 -22 -10 -50 -116 7 -187 -79 284 83 -131 72
6371 72 -54 -25 -91 -7 276 -57 -86 -12 -99 -48 -49 109 24 94 105 162 -133 97 -92 -240 257 -162 89 93 58 -51
6397 -51 129 -31 -37 117 -71 -116 -14 54 -28 97 46 35 108 49 -64 73 -159 3 -39 -13 -92 -114 288 -31 223
6422 223 -17 -116 190 119 51 -170 119 -36 -109 -34 43 -52 57 -45 -174 133 6 39 -20 60 145 -172 -168 -39
$$ packed form
6252B30k25K06k42J41k04k7J53J45k04j05K75j22j52j13K89%O5l6j89K8J87o9
6274C1lpN1p5L3or5m6OJ53R1q1m0J18r0J35j98R5k8jl64M70J06l47P8j62J37P
6302c2J05L7j34J60r7J37Np7J35k41J05r2Rk63J69k65N02l10L52j85j14K21K9
6325A56j18k26K51O1k90J12L9jl6J40J27l27K36l02J31K9J08r9k50L15k01N1O9
6348b5q2J7J42M1j60K13l10J63J74j73K3J79k24J2m0o6J23j94J08L63k01k14K03
6371G2j26K9o6Q4K83l33k9P4q7N1jJ58q5P0J1N7k95K30j89j48M97m19K51Ml5j09
6397e1J80j60oJ54j88m5J02O8q2J25n1j1P3n9j13J37k32J62m2K6p9k2M02l19K54
6422B23k40r9L06p1o8k21K89j55p3P5P7r5J09j02j29L07j27L3n9Q0Q5l17MJ29
$$ plain form
6446 -39 -43 -8 -20 76 -197 -154 -106 53 -38 20 -37 22 -81 36 4 81 226 -60 -236 65 -128 -83 -141 122 100 17
6472 17 33 101 95 -216 -5 119 -23 -168 -80 -129 -56 -89 48 -92 41 -9 -44 -161 173 -118 -47 -48 54 -81 -49
6497 -49 -36 -114 77 17 33 -39 106 -21 -7 -38 -184 -208 -18 -10 83 2 -174 -160 -24 -180 28 11 -31 162 -44
6522 -44 -80 -10 -95 51 131 -48 -10 131 -120 -48 -86 -20 89 -68 124 -122 -58 -104 44 122 -112 -64 -63 284 -66
6547 -66 79 66 138 8 58 131 31 -233 161 -201 -120 244 -238 201 14 -26 -60 68 70 -200 146 -111 40
6570 40 2 107 165 78 -105 -92 22 -59 -43 81 4 93 29 50 177 123 96 143 -37 -71 110 -90 148 -47 -144
6595 -144 -36 124 -111 124 -57 -44 -12 37 -141 155 -66 55 44 -24 -91 7 -28 74 43 182 -54 85 33
6618 33 90 201 -28 103 -116 -57 67 181 81 10 -7 55 8 185 -44 97 -150 -28 -32 3 -161 54 -10 -13
$$ packed form
6446c9mL5j2R6k73M3M8J59r1N8n7N9j03J17l2P7J45k86j76L01j93M5n8K63k2q3
6472A7J6O8ol11K11J24j42j45Q8m9P3l3J37j40J33n0l5j17L34k91P1jJ02j35L2
6497d9J3p8J91o0J6p2J45j27J4l1j46k4J90QR3q1j76J4J36j56K08j7m2J93k06
6522d4l6P0q5J46Q0j79L8J41k51P2l8O6J09j57J92k46O4m6J48P8k34M8JL47l50
6547f6J45j3P2j30N0P3j00k64L94l62Q1L64m82M39j87m0l4J28Kk70L46k57J51
6570D0l8J05N8q7j83J3J14q1J6J24p7Q9o4K1J27n4k7M7j80l4J81k00K38j95r7
6595a44J08J60k35K35j81J3L2M9j78K96k21J21j1o8o7R8l5J02l1J39k36J39n2
6618C3N7J11k29J31k19N9J24J14j00p1j7O2m7J77k29J41k47J22mL5j64K15o4l
$$ plain form
6642 -13 55 53 -167 77 9 35 -148 53 -154 -158 194 -73 -158 -117 -67 232 48 9 -75 -174 254 -25 -200 81 33
6667 33 -205 -138 -13 82 54 38 232 26 83 -84 166 35 208 44 53 48 6 72 126 -133 12 211 20 15 -140
6692 -140 25 -52 191 104 -168 142 5 3 -75 -81 173 -272 -59 -24 -43 -61 -74 124 87 -83 60 -64 -143 39
6716 39 8 33 72 31 99 -2 156 76 46 117 93 -26 102 30 -53 125 52 19 1 -37 -86 89 -157 -64 150 127
6742 127 152 -22 134 -85 -8 -29 146 93 -34 -44 36 -42 -47 107 -123 -145 7 65 -14 -87 -116 -171 251 175 82 123
6768 123 97 121 152 -166 -94 27 -33 8 -104 -26 -32 35 112 109 160 71 51 -47 37 -134 33 46 103 60 107 -110 -161 69
6796 69 222 -38 11 144 -14 152 27 42 -77 87 -138 0 -96 -34 56 7 65 187 310 89 -52 -76 3
6819 3 122 -118 33 -96 -236 11 172 0 -86 84 56 227 -172 -16 86 -12 135 98 208 56 101 55 124
$$ packed form
6642a3O8kk20K44o8K6j83K01k07mL52k67q5M1N0K99j84l9q4r9M28k79j75K81m8
6667C3k38O7J25R5k8j6J94k06N7j67K50j31J73j64Rnm2O6N4k59J45J99j91nj55
6692a40J65p7K43q7k72L10j37kp8oK54m45K13L5j9j8j3J98l7j70J43j24p9J82
6716C9l1K5L9m1O8j01J58q0l0P1k4j19J28p2q3J78p3l3j8l8m9J75k46R3K14k3
6742A27K5j74J56k19P7k1J75n3j27j0Q0p8nJ54k30k2J52N8p9p3k9n5M22p6r3M1
6768A23k6K4L1l18P2J21o0M1j12P8oO7P7lN1q9k0r8Q4j71J67J3N7m3M7k17n1K30
6796F9J53k60M9J33j58J66j25J5j19J64k25J38r6O2R0m9N8J22J23k21j41k4P9
6819CJ19k40J51j29j40K47J61j72q6J70k8J71l99J56J02r8J47l7J10j52M5m6O9
$$ plain form
6842 124 -178 -9 -65 -26 -157 164 -193 -73 21 -168 -40 57 6 -124 -47 94 -305 96 -170 89 15 32 112
6865 112 19 -135 -291 120 80 62 -118 1 126 12 -22 -10 -209 -37 -2 61 23 -26 43 -107 30 -11 -129 -21
6889 -21 78 72 -47 -62 -17 127 -71 2 -26 -64 -44 25 -208 99 4 158 90 -8 46 76 137 -59 43 141 -154 338
6915 338 -181 -79 111 208 2 -107 -38 -132 67 -191 -114 -66 -95 -14 -138 -101 54 -12 -49 -223 94 165 110 58
6939 58 -52 70 -5 -135 182 -114 8 125 -167 196 128 -129 40 -84 7 -2 63 -96 -10 -134 74 234 142
6962 142 -37 41 185 116 6 -245 -50 81 23 -116 29 196 -107 14 119 24 -186 96 -5 -143 -21
6983 -21 -204 12 -263 -103 -84 -23 -90 -96 -140 136 -22 5 180 70 126 -175 -23 -73 56 166 -2 360 -94
7006 -94 161 4 -2 2 -163 -75 -42 150 -57 73 -118 -73 -121 68 121 18 -173 -79 95 -29 75 26 -273 73
$$ packed form
6842A24l02J69n6L9j31L21l57J20R4j89J28R7n1j30P7J41l99M01k66K59p4J7Q0
6865A12r3j54j56M11m0j8j80J19J25j14l4J2j99J72L5O3l8m9O9j50J37m1j18J08
6889b1R9oj19j5M5J44j98P3k8l8K0O9k33L07r5J54o8r8N4L0O1j96J02R8k95M92
6915C38n19J02J90R7k06j09O9r4J99k58P7M8k9Q1j24L7J55o6l7j74L17P1n5n2
6939E8j10J22p5j30L17k96J22J17k92L63o8k57J69j24R1rO5j59Q6j24K08J60r2
6962A42j79P8J44o9j10k51J95J31n8j39J45J67l03J21J05r5k10K82j01j38J22
6983b1j83K16k75J60J9O1o7om4K76j58K7J75j10N6l01J52n0J29J10j68L62m54
7006i4K55j57oMj65Q8L3J92k07J30j91M5m8J89N3j03j91R4J74j24J04m9k99L46
$$ plain form
7030 73 -5 -36 54 31 -79 -38 29 -124 204 34 8 1 148 -1 129 -127 -114 -33 -31 99 49 139 7 130 -62
7055 -62 -101 -64 -20 121 84 71 -76 -204 111 -40 -77 68 -8 -16 -190 -43 3 -106 13 -167 174 -12 -60 -8
7079 -8 -41 6 -211 56 124 -77 -170 -55 8 79 -162 157 29 -53 -91 -10 96 22 74 -168 148 -22 55 97 82
7104 82 -24 32 -80 128 -32 -78 -32 -73 -119 132 -71 -9 10 58 20 8 164 -116 -76 7 -255 -119 20 291
7128 291 74 20 67 -12 63 14 -15 -123 -185 -88 1 -124 103 -125 -128 46 114 76 -87 -211 43 -145 78 177 -154
7153 -154 -67 -98 -115 -95 174 -11 82 -17 -92 168 -40 -23 124 -14 24 56 92 -90 -65 -47 105 -83 156 -45
7177 -45 151 -214 22 79 -253 53 16 17 -46 55 144 16 -11 83 184 -25 70 67 59 240 -62 -82 -41 155 297
7202 297 -31 260 -151 90 -216 164 -181 -75 28 -12 -102 -18 71 -27 175 257 -145 247 17 -147 -77 -72 -71 -110
$$ packed form
7030G3p8l1R0k3j10M1O7j53L28j70k6pJ47j49J30k56J3Q1KJ30n0R0j32J23j92
7055f2l9L7M4J41l7j3j47j28L15j51l7J45p6qj74J47M6j09J19j80L41j86m8N2
7079hl3M7k17K67O8k01r3J15O3P1k41L19j28q2l8Q1J06p4N2k42L16j70P7M2j5
7104H2j06N6j12K08j60m6M6m1m6K51k03O2J9M8l8j2J56k80M0Q3k62J36J39K71
7128B91k17n4M7p9P5m9k9j08o2R7Q9j25K27k28lJ74O8l8j63j24K54j88K23R9l31
7153a54Q7l1j7K0K69j85R3r9p5K60k08J7J47j38L8L2L6j82K5J8J52j88K39k01
7177d5J96l65K36N7l32L06l7Jo3J01Q9j28k7R4J01k09R5lqJ81l02k0M1J96J42
7202B97l28K91m11K41l06L80l45J06J03m0r0Q4Q9r8K02Q2m02L92k30j64P0NJl9
$$ plain form
7226 -110 -219 6 184 128 107 -84 184 -35 67 -144 -1 3 -2 2 20 61 89 83 16 139 270 -305 70 153 46
7251 46 -67 280 -30 -7 -8 94 -47 -3 -79 -218 -104 -88 16 -152 177 90 -205 -11 -139 -27 -71 30 -157
7274 -157 237 80 -16 36 -264 -305 57 -28 -234 -68 135 -162 74 -114 96 -28 -116 4 23 31 -40 2 -75 88
7298 88 -67 -40 -80 102 152 84 -39 64 -72 72 -133 69 -172 143 -106 9 6 3 193 -94 -38 -42 143 114
7322 114 40 -94 34 -144 165 -55 117 -40 -27 52 42 14 -92 -30 -127 130 -72 51 82 96 -123 160 -74
7345 -74 -55 -168 27 26 44 -60 -56 102 47 31 85 -148 -248 -38 22 16 158 13 44 -29 -121 -14 177 -48 66
7370 66 -152 -92 -78 40 83 -21 96 -260 -7 -135 69 -39 18 83 -115 -11 38 107 56 -22 -88 -104 162 -231
7394 -231 101 81 -53 -2 -46 29 77 -190 93 -14 28 51 60 69 -197 -61 255 -109 -97 16 192 93 -69 -36 -68
$$ packed form
7226a10j09K25J78n6k1j91K68k19J02k11J43MnMJ8M1K8oo7J23J31n75L75Q3j07
7251D6j13L47l10K3jJ02j41M4p6j39J14J6J04j68L29q7k95J94j28J12m4J01j87
7274a57L94j57r6N2l00m1L62q5k06J66K03k97K36j88K10j24q8J20J9Qp1M2p7J63
7298H8j55K7m0J82N0o8j23J03j36J44k05K02k41L15k49J15llJ90k87N6mJ85k9
7322A14p4j34J28j78L09k20J72j57J3P9j0k8j06O2r7K57k02J23L1J4k19K83k34
7345g4J9j13J95jJ8j04MJ58n5j6N4k33j00K10O0oJ42j45L1p3r2J07J91k25J14
7370F6k18O0J4J18M3j04J17l56K53j28K04j08N7O5j98J04M9O9n1p8o6j6K66l93
7394b31L32k0j34N1m4P5M8k67K83j07M2K3RRk66J36L16l64J2J13J76r9j62L3l2
$$ plain form
7419 -68 -84 33 -69 24 93 -28 -206 20 -77 -45 -146 224 -135 57 77 88 0 -127 -25 -184 204 0 94
7442 94 131 -26 110 89 148 147 -179 8 138 237 -29 66 75 -54 -75 57 180 57 -133 -24 22 -194 115 -66
7466 -66 -77 97 -22 82 18 143 -46 -230 -194 203 95 127 -86 218 -153 177 32 -98 -149 -95 -97 110 73
7489 73 -81 -241 -82 15 -21 -50 -38 39 -85 24 199 -22 -38 276 94 -78 91 -124 -93 123 -80 -68 -243
7512 -243 -20 94 -84 2 -193 151 79 -415 118 -83 1 84 77 -59 215 122 -62 -183 -33 1 200 -70 -66
7535 -66 5 134 66 -44 120 82 35 41 7 -89 173 -17 -8 -124 -93 -95 100 -70 -32 30 -66 33 9 129 -77 183
7561 183 -197 -232 -226 -209 70 -53 -217 20 146 -75 13 -147 249 10 -162 92 -137 -164 200 89 100 12 -129
7584 -129 -64 81 61 100 -44 7 -150 -45 62 -33 160 40 -115 -6 -202 -93 -420 19 24 -129 8 -220
$$ packed form
7419f8j6J17j02R3O9j21j78K26r7L2j01L70l59J92K0J1q8j27J02j59L88k04R4
7442I4L7j57J36k1N9jl26J87J30R9k66R5Rj29k1J32J23j23j90J09M6k16L09j81
7466f6j1J74j19J04o4J25j89j84L6L97j08L2k13L04l71L30j45j30n1N4kK07l7
7489G3j54j60J59R7l6k9J2P7j24J09J75k21j6L14j82j72J69k15L1K16k03J2j75
7512b43K23J14j78Q6j95L44p2m94N33k01Q4Q3pj36K74r3j84j21J50L4J99k70M
7535f6P1J29o8j10J64l8m7Ol4r6K62j90Rj16L1kJ95j70L8O2r6R9k4J20k06K60
7561A83l80l5OJ7K79j23j64K37J26k21Q8j60L96k39j72K54k29k7L64j11J1q8j41
7584a29O5J45k0L9j44N1j57J05J07r5J93j20j55J09j96J09l27M39Nj53J37k28
$$ plain form
7606 -220 -157 86 112 -47 90 -82 -168 13 169 32 138 -11 -61 36 106 193 -133 -48 -55 8 58 176 -170 219
7630 219 80 -3 -179 -120 -15 -155 48 -99 -27 -10 49 -92 35 -8 -31 187 2 -158 -58 44 -20 -107 124
7653 124 102 -30 -33 -55 -35 162 -125 43 -44 112 122 72 124 140 70 -95 215 5 78 87 -36 -24 195 -91 169
7678 169 -40 -49 -53 -274 -171 -58 -58 -57 -104 -8 231 18 82 -38 222 -128 78 24 84 20 -68 139 103 -18 -60 -54
7704 -54 84 101 -12 86 49 -22 -124 13 58 38 -87 -12 7 257 136 -83 -197 -57 49 108 -23 -72 -2 -95
7728 -95 116 -30 143 69 -188 51 110 -95 206 -33 106 1 -1 -12 99 -128 107 -41 11 -44 -51 18 9 30 -120
7753 -120 -140 -82 58 2 27 -124 141 196 56 129 117 165 -74 225 227 67 47 -31 158 -32 -101 -177 108 6 65
7778 65 83 -28 -5 10 -163 -68 45 -19 219 -37 -249 -91 -37 12 -12 36 104 219 58 80 52 98 -133 47 -29
$$ packed form
7606b20O3K43K6j59J37j72q6J81J56j37J06j49n0R7P0Q7l26Q5pO3N0J18l46L89
7630B19j39q3j76N9J05j40K03j47P2J7N9j41J27m3k3K18j85j60J00J02o4q7K31
7653A24k2j32lk2K0J97k87J68q7J56J0n0N2J6p0j65L10k10P3Rj23J2K19k86K60
7678A69k09rmk21J03J13%Jm7R6K39k13O4j20K60l50K06n4O0o4q8K07l6j21m2O
7704e4J38J7j13R8l7p1j02J37M5k0j25P5J9K50j21k19j14J40J06N9j31m9P0r3
7728i5K11j46J73p4k57K39N9k05L01k39J39j05kj1J11k27K35j48N2n5pO9rK1j50
7753a20k0N8J40n6K5j51K65N5j40P3j2M8k39K99Kj60k0p8J89j90o9p6K85j02N9
7778F5J8j11K3J5j73R5J13o4K38k56k12J58N4M9k4M8O8J15j61K2k8M6k31J80p6
$$ plain form
7803 -29 -294 67 -156 75 -87 -134 96 306 162 112 185 8 203 -110 -8 -140 -161 -83 -212 -210 8 -98 -86
7826 -86 -125 -14 -11 18 4 1 1 208 -110 -20 44 264 167 66 -42 -8 19 155 92 -148 28 -8 -99 -71 -24 -85 -53
7853 -53 89 -83 18 -81 -60 85 -3 -2 63 155 76 37 -92 -96 -91 171 -68 -7 52 -5 92 -32 -99 85 -269 -24
7879 -24 -142 1 106 -75 77 -25 228 -8 14 22 -128 -79 -23 120 87 38 134 -92 -114 -125 -36 109 -60 73
7903 73 -136 -51 24 106 46 -5 -135 291 37 12 34 87 50 -71 126 -70 124 34 42 -98 143 -58 -171 8
7927 8 -76 158 -86 129 169 -181 51 32 -198 47 74 27 30 -219 -98 -21 187 103 94 130 -190 -105 182 -102 -29
7952 -29 66 260 -45 -54 21 28 109 -70 -7 118 98 -206 8 -19 57 169 142 -83 -34 73 -35 -27 153 -78 -77 91
7978 91 301 24 -78 -270 -68 -229 53 -136 -31 57 -14 16 181 76 22 33 29 -22 -165 14 43 184 -31
$$ packed form
7803b9k65L61k23K31j62m7K30K10j44n0P3j77J95l13J02j32k1P8j29KK18j06J2
7826h6l9J11LK9j4l%K07l18R0O4K20r7j01j08L4K7J36o3k40J76l6r1K8M7o1L2
7853e3J42j72J01r9K1J45q8JO5R2p9l9j29mNK62k39O1N9n7R7j24o7J84l54K45
7879b4j18J43J05j81J52j02K53k36K2Qj50M9N6J43l3m9R6k26k2j1Q9J45j69J33
7903G3k09Q5P5Q2o0n1j30M26k54k5K2N3l7j21J97j96J94r0Qj40K41k01j13J79
7927Hq4K34k44K15M0l50K32j9k30K45K7m7Lk49J21P7K08q4rL6l20Q5K87k84P3
7952b9R5J94l05rP5PQ1j79O3J25k0l04K14k7P6J12k7k25M9J07j08QJ80k31JJ68
7978I1K10k77j02j92K02j61K82j89J05Q8p1L0J65j05n4J1mn1j43J79K9J41k15
$$ plain form
8001 -31 -53 -124 6 27 108 203 4 73 -104 -138 126 -126 0 -177 -7 75 27 -236 25 78 57 87 17 -12 -30
8026 -30 -70 -314 -122 -18 8 -50 208 -132 63 7 -101 -124 111 128 -103 -24 -42 233 -58 -249 128 54 96 -101
8050 -101 3 0 -216 -17 106 22 -31 9 -13 -2 -118 -54 -135 -122 -95 -11 152 -1 130 21 150 140 -169 -61
8074 -61 -30 17 18 254 162 44 97 -2 -207 101 55 110 -120 -122 -46 163 133 141 36 243 -14 -159 -104 -60 -135 -1
8100 -1 -74 191 -55 -1 46 -164 8 19 35 34 -96 -61 -140 130 35 38 -199 15 263 -136 -92 -4 -48 111 -110 107
8126 107 -17 -136 -259 78 6 -143 86 -150 -93 -23 -75 -108 57 -143 80 99 -249 -46 -64 -176 197 -72
8148 -72 -67 40 -148 -186 -85 -118 114 132 -64 222 172 -74 -175 250 111 -73 -116 -10 80 -23 -101 -33 71 161
8172 161 66 -57 43 61 -63 3 -76 223 36 36 153 -73 -93 -172 38 -125 42 -9 -132
$$ packed form
8001c1k2p1J30K1Q1R5j99O9j77l4K64k52J26j77J70Q2m8k63K61N3k1L0p0k9j8
8026c0m0k44J92J04K6n8K58l40J95n6j08k3K35J7k31P9j8K75k91j91L77p4M2j97
8050a01J04lk16J99J23q4n3M0k2J1j16O4q1J3K7Q4J63j53J31j09J29j0l09J08
8074f1L1M7JK36r2j18N3r9k05L08m6N5k30kP6K09l0Qj05K07k57j45N5M4p5J34
8100ap3K65k46N4M7k10J72J1J6jj30L5p9K70r5Lk37K14K48l99M4Q8m4J59k21K17
8126A07j24j19j23L37p2j49K29k36N7P0n2l3J65k00K23J9l48K03j8j12L73k69
8148g2NJ07j88l8J01l3K32J8j96K86n0k46j01M25j39j84m3J06R0j03p8O8J04R0
8172A61r5j23J00J8j24O6p9K99j87%J17k26k0p9K10j63J67n1j23
8191a32
$$ Imaginary data points
##PAGE= N=2
##DATA TABLE= (X++(I..I)), XYDATA
$$ plain form
0 0 0 0 0 0 0 0 0 0 0 0 0 0 0 -8 8 -8 8 -8 16 -16 16 -24 24 -32 39 -40 48 -56 64 -76 88 -97 112 -128 144
35 144 -161 183 -204 228 -255 283 -314 349 -386 427 -473 521 -574 634 -698 769 -847 934 -1030
54 -1030 1137 -1262 1398 -1559 1744 -1961 2223 -2544 2950 -3476 4195 -5242 6903 -9966 17491
69 17491 -79589 -38228 128642 19943 -72475 -31704 31523 883 9520 27346 -11336 -48202
81 -48202 15084 60173 15296 -38068 -14578 23393 26709 -2033 -25556 -21346 11435 21684 -1976
94 -1976 -21888 -13184 -3046 7202 15115 -1436 -28636 -11698 25872 17641 -14134 -5986 13556
107 13556 -408 -10607 13790 14848 -19773 -18799 22409 19972 -23010 -18472 23284 15428 -23945
120 -23945 -13212 22634 9328 -20083 -1963 22463 115 -20827 2378 20399 -1249 -18973
$$ packed form
0@%%%%%%%%%%%%%qJ6j6J6j6K4l2L2m0M8n6P1p9Q8j04J20j40J64j85K09k40K72
35A44l05L44l87M32m83N38n97O63p35Q13r00R94j095J208j332J467j616J781j964
54a030K167k399K660k957L303l705M184m767N494o426P671r437J2145j6869K7457
69A7491r7080M1361J66870j08699r2418M0771O3227l0640Q637J7826l8682l6866
81d8202O3286M5089m4877n3364K3490L7971L316k8742k3523M210L2781J0249k3660
94a976j9912Q704J0138J0248P913j6551k7200J6938L7570q231l1775Q148J9542
107A3556j3964j0199K4397J058l4621R74M1208k437m2982M538M1756p856l9373
120b3945J0733L5846j3306k9411J8120K4426k2348k0942K3205J8021k1648j7724
$$ plain form
132 -18973 -4339 10104 4012 -9018 -11713 -363 11167 3004 -11332 -4695 7800 2079 -970
145 -970 11020 4742 -14265 1120 27288 6452 -23567 -3686 19469 -2422 -16232 6526 7893
158 7893 -17860 -9020 15944 -563 -22753 -1554 16495 -3932 -13211 6474 10722 -3940 1645
171 1645 11648 -1349 -9530 5571 12698 420 -5509 -1089 -224 845 3415 -2492 -8977 -2485
185 -2485 2200 -3069 -1581 6399 28 -10573 -247 12245 1226 -10447 972 9571 -1752
198 -1752 -5659 5457 4260 -7122 -2676 7087 -1828 -10751 2523 10701 -2963 -9591 3444 8227
212 8227 -1517 -2670 3780 595 -2987 3373 4347 -4022 -3491 3286 -620 -5959 -1224 1424 -3892 -2671
228 -2671 2336 -1637 -4119 3975 5130 -3801 -1817 7933 3228 -3554 3420 7458 -2421 -3937 6525
$$ packed form
132a8973J4634J4443o092j3030k695J1350J1530q163j4336O637J2495n721l049
145i70J1990o278j9007J5385K6168k0836l0019J9881K3155k1891j3810K2758J367
158G893k5753Q840K4964j6507k2190K1199J8049k0427r279J9685M248j4662N585
171A645J0003j2997q181J5101P127j2278n929M420Q65J069K570n907o485O492
185b485M685n269J488P980o371j0601J0326J2492j1019j1673J1419Q599j1323
198a752l907J1116j197j1382M446R763q915q923J3274Q178j3664o628J3035M783
212H227r744j153O450l185l582O360R74q369N31O777l906n339M735K648n316J221
228b671N007l973k482Q094J155q931J984R750m705o782O974M038r879j516J0462
$$ plain form
243 6525 2980 -8165 -2567 5784 -2496 -9097 174 3746 -5409 -4831 3636 1098 -4753 1055 5211
258 5211 -1056 -1719 5659 3845 -3030 598 5610 350 -3217 994 1399 -2808 -716 2083 -3209 -4485
274 -4485 2672 2016 -5066 -2395 4478 1148 -3770 1428 4354 -1331 -1639 4184 1432 -4582 115 4677
290 4677 -1630 -4917 1596 2546 -3631 -2516 3251 -118 -3238 1783 3528 -1501 -916 4154 2003 -2122
306 -2122 1161 3003 -1306 -2241 1574 -211 -3694 -827 1251 -2883 -3481 1060 380 -3129 -521 3124
322 3124 166 -1445 2889 3002 -1095 508 4233 1617 -2070 1197 2992 -1220 -2766 941 197 -3568
338 -3568 -1532 616 -2150 -2883 689 804 -1933 -570 2620 1261 -949 1921 2721 -120 104 2957
354 2957 885 -1597 354 1621 -1454 -2087 608 -129 -2789 -738 1333 -1072 -2067 1188 1736 -1116
$$ packed form
243F525l545j1145N598Q351q280o601R271L572r155N78Q467k538n851N808M156
258E211o267o63P378j814o875L628N012n260l567M211M05m207K092K799n292j276
274d485P157o56p082K671O873l330m918N198K926n685l08N823k752o014M697M562
290D677o307l287O513R50o177J115N767l369l120N021J745n029N85N070k151m125
306b122L283J842m309r35L815j785l483K867K078m134n98M541o80l509K608L645
322C124k958j611M334J13m097J603L725k616l687L267J795m212j546L707p44l765
338c568K036K148k766p33L572J15k737J363L190j359k210K870Q00k841K24K853
354B957k072k482J951J267l075o33K695p37k660K051K071k405r95L255N48k852
$$ plain form
370 -1116 -409 2299 769 -1303 1325 2021 -1184 -1200 1605 750 -2405 -1082 676 -959 -1773 364 558
387 558 -1542 -182 2134 355 -898 1411 1947 -256 102 2311 571 -1648 464 1231 -1806 -1752 783
404 783 -753 -2946 -1046 714 -1102 -1544 832 522 -1384 899 3164 120 -907 2169 2513 -290
420 -290 557 1495 -834 -1388 1154 459 -2897 -1824 902 -594 -2183 -398 85 -1190 -99 1445 -353
437 -353 -711 2035 2489 -2 35 1326 120 -34 1363 651 -1853 -1677 944 322 -1597 -1570 -859 -470
455 -470 77 622 66 -278 75 379 960 1025 593 -34 241 473 392 255 -564 -1107 -270 -155 -1174 -1001 717
476 717 150 -1186 -162 1204 419 -151 1487 1077 -739 20 2258 947 -775 -390 -625 -1077 328
493 328 145 -2581 -1967 1336 186 -2557 -250 1806 -973 -1021 2050 1504 -406 879 2215 -314 -768
$$ packed form
370a116P07K708j530k072K628O96l205j6K805q55l155J323J758j635q14K137J94
387E58k100J360K316j779j253K309N36k203L58K209j740k219K112P67l037N4K535
404G83j536k193J900J760j816m42K376l10j906K283K265l044j027L076L44k803
420b90Q47R38k329n54K542o95l356J073K726j496j589J785M83j275J091J544j798
437c53l58K746M54k491L7J291j206j54J397p12k504J76K621o22j919K7P11L89
455d70N47N45n56l44L53L04N81O5m32o27K75K32q1j37q19n43Q37J15j019J73J718
476G17n67j336J024J366p85n70J638m10j816P59K238j311j722L85k35m52J405
493C28j83k726O14L303j150k743K307K056k779m8L071n46j910J285J336k529m54
$$ plain form
510 -768 1437 1388 -781 -283 -134 -2381 -890 1901 -789 -4050 -1271 1857 -52 -1041 491 190 -1126
527 -1126 1082 2372 413 -69 903 -65 -88 1887 1020 -1731 -1304 433 -858 -1267 843 436 -2004
544 -2004 -1396 880 741 -30 -201 117 369 1306 958 256 335 383 -768 -1199 654 632 -500 -900 -736 -1129
564 -1129 -268 587 -417 -601 -194 -288 344 2311 1837 -1020 -1002 1497 1403 -202 611 279 -1529 -783 1098
583 1098 -192 -1515 -349 -782 -2423 -432 2348 70 -1797 482 1650 -352 649 2426 -164
598 -164 -1316 1617 1910 -839 -454 945 -860 -2350 188 583 -1469 -1017 323 -1366 -1148 1395 1313
615 1313 -1233 18 1631 337 163 1749 698 -1609 166 1660 -76 -881 14 -590 -1358 -343
631 -343 432 -1003 -1085 9 200 -411 921 1289 -168 -34 682 311 170 927 525 -850 -524 244 -185
$$ packed form
510g68K205m9k169M98J49k247J491K791k690l261K779L128j909r89J532l01j316
527a126K208J290j959m82R72r68k3J975q67k751M27J737j291m09K110m07k440
544b004O08K276j39p71j71L18K52R37l48p02P9M8j151m31J853k2j132m00J64l93
564a129Q61Q55j004j84M07r4O32J967m74k857J8K499r4j605Q13l32j808P46J881
583A098j290j323J166m33j641J991K780k278j867K279J168k002J001J777k590
598a64j152K933K93k749L85J399j805j490K538L95k052M52J340j689K18K543q2
615A313k546J251J613j294j74J586j051k307J775J494j736q05Q95o04p68J015
631c43P75j435q2J094J91o11J332L68j457J34P16l71j41P57m02j375L26P68m29
$$ plain form
650 -185 -548 -583 -1039 -1004 -262 378 199 -49 -352 -605 370 1317 988 -36 -2 576 446 841 661 -617 -1079
671 -1079 86 -69 -743 -313 -86 -1301 -991 314 333 -556 113 543 136 336 1359 1027 126 621 766
690 766 -633 -377 913 -202 -1162 -746 -88 -857 -576 255 -572 -1267 -26 818 126 230 781 434 -204
709 -204 958 1146 205 -290 -33 24 -253 -55 -181 -697 -752 -59 -387 -420 -311 33 -70 168 326 533 438
730 438 466 305 274 475 291 -108 -196 -200 -287 -180 -522 -601 -538 -232 -607 -313 71 -75 -206 481 623 205 -14
753 -14 747 677 115 151 605 -48 -393 319 -259 -795 -191 -204 -540 -943 -253 32 -387 191 437 -42 74 601
775 601 694 273 453 553 231 -46 84 18 -615 -419 -61 -504 -675 -2 -300 -836 -421 318 41 -179 357
796 357 582 237 252 436 402 40 189 265 -38 -481 -268 -4 -324 -428 -201 -307 -298 -164 345 -29 86 190
$$ packed form
650a85l63l5m56L5P42O40j79k48l03k53R75R47l29j024L4N78j30L95j80j278m62
671a079J165j55o74M30K27j215L10J305J9q89O69M30m07K00J023l32r01M95J45
690G66j399K56J290j115r60M16O58p69K81Q31q27o95J241Q44o92J04N51l47o38
709b04J162J88r41m95K57N7k77J98j26n16n5O93l28l3J09L44j03K38J58K07r5
730D38K8j61l1K01j84l99q8mq7J07l42p9O3L06l75K94L84j46j31O87J42m18k19
753a4P61p0n62L6M54o53l45P12n78n36O04j3l36m03O90K85m19N78K46m79J16N27
775F01R3m21J80J00l22k77J30o6o33J96L58m43j71O73k98n36M15P39k77k20N36
796C57K25l45J5J84l4l62J49P6l03m43K13K64l20j04K27j06RJ34N09l74J15J04
$$ plain form
818 190 507 200 445 496 190 296 315 -29 -443 -283 -267 -529 -566 -447 -94 -463 -252 -80 105 -285 77 509
840 509 265 373 636 467 -13 237 416 -42 -252 89 118 -477 -444 -150 -72 -709 -409 53 -255 -214 276 245
862 245 67 258 620 236 -132 549 412 -43 66 120 -91 -342 -42 -121 -566 -499 34 -81 -483 -106 -144 -14
884 -14 146 588 233 -64 482 302 230 37 380 -40 -233 -153 6 -321 -469 -323 -136 -155 -226 -153 48 67 262
907 262 19 165 329 396 417 364 238 -193 -124 19 22 -316 -379 -469 -224 -167 -473 -255 0 -148 -101 104 209 254
931 254 121 547 578 123 358 433 -204 -242 -52 -349 -494 -86 -30 -517 -493 68 14 -397 9 573 -94 -26 560
954 560 673 363 460 456 -14 -162 247 -57 -32 -186 -463 -818 -263 337 -321 -738 -157 320 -16 -285 409 194
976 194 -48 327 685 270 164 312 -131 -99 46 -156 -516 -87 -417 -541 -345 170 -114 -424 -288 310 420
$$ packed form
818A90L17l07K45N1l06J06J9l44m14J60J6k62l7J19L53l69K11J72J85l90L62M32
840E09k44J08K63j69m80K50J79m58k10L41K9n95L3K94P8o37L00M62l08M1M90l1
862B45j78J91L62l84l68O81j37m55J09N4k11k51L00p9m45O7N33j15m02L77l8J30
884a4J60M42l55k97N46j80p2j93L43m20j93Q0J59l27j48J46J87j9p1P3K01J9J95
907B62k43J46J64O7K1n3j26m31O9J43Ll38o3r0K45N7l06K18K55j48M7K05J05M5
931B54j33M26L1m55K35P5o37l8J90k97j45M08N6m87K4N61n4m11M06N64o67O8N86
954E60J13l10R7mm70j48M09l04K5j54k77l55N55O00o58m17N81M77l36k69O94k15
976A94k42L75L58m15j06J48m43L2J45k02l60M29l30j24J96N15k84l10J36N98J10
$$ plain form
997 420 533 456 169 -124 443 425 242 157 20 -553 -274 260 -153 -590 -296 -99 -451 -101 174 113 -122 284
1019 284 211 185 668 710 -199 -89 600 135 -339 338 433 -627 -824 80 157 -763 -281 38 -480 -26 486
1040 486 505 -350 230 163 276 682 617 -250 -429 349 238 -374 30 151 -653 -664 160 2 -418 -70 53
1061 53 -289 -245 627 392 68 154 509 -115 208 604 8 -653 -161 69 -135 17 -125 -922 -546 94 183
1082 183 -344 27 -144 -481 154 934 378 -212 229 267 -198 222 713 -225 -551 -391 -112 -460 17 -155
1102 -155 -725 -369 182 52 -127 394 377 -382 82 996 491 -224 239 449 -343 58 488 -368 -633 -94
1122 -94 -125 -409 21 285 -368 -450 108 192 -26 446 342 -141 -49 885 85 -101 262 99 -699 -35 352 -193
1144 -193 -657 -57 53 -473 -168 312 -280 -527 120 383 150 305 327 -235 -85 483 267 -241 -64 -141 -399
$$ packed form
997D20J13p7k87k93N67j8j83q5j37n73K79N34m13m37K94J97l52L50K75o1k35M06
1019B84p3k6M83M2r09J10O89m65m74O77R5j060j97R04P7r20M82L19n18M54N12
1040D86J9q55N80o7J13M06o5q67j79P78j11o12M04J21q04j1Q24j58m20L48J23
1061E3l42M4Q72k35l24Q6L55o24L23L96n96o61M92K30k04J52j42p97L76O40Q9
1082A83n27L71j71l37O35P80n56n90M41L8m65M20M91r38l26J60K79l48M77j72
1102a55n70L56N51j30j79N21j7p59M64R14n05p15M63K10p92M01M30q56k65N39
1122i4l1k84M30K64o53q2N58Q4k18M72j04m83R2R34q00j86L63j63p98O64L87n45
1144a93m64O00J10n26L05M80n92k47O47K63k33J55K2n62J50N68k16n08J77p7k58
$$ plain form
1165 -399 -129 71 -351 -760 -346 -21 -339 -241 558 7 -318 82 570 49 264 273 96 -275 241 93 -151
1186 -151 -266 -23 -213 -148 284 -90 -375 -183 -237 -142 31 539 -19 -84 304 224 94 52 160 -242 -146 115
1208 115 59 -201 -174 -40 -379 -538 133 -103 -173 -113 -144 -113 429 282 205 -18 272 542 -241 146 361 -89
1230 -89 -422 174 19 -255 -314 -129 -77 -349 56 -11 -11 58 -89 92 237 259 113 -22 -71 177 -44 294 -15
1253 -15 -242 -115 -112 -67 -307 -411 33 -102 -258 150 -81 -37 80 47 46 168 23 347 165 58 -64 -29 -52
1276 -52 -132 -47 -283 -116 -317 -184 -5 6 -5 -110 167 63 236 295 221 228 231 144 3 8 -109 96 -207 -196 -288
1301 -288 -251 -127 -250 32 -245 -7 72 -169 271 191 260 186 244 333 88 277 60 299 -180 -39 -164 -230 -388
1324 -388 -284 -99 -206 -191 -45 -80 -56 81 153 269 71 456 137 152 438 156 74 -3 -106 -104 -188 63 -17 -264
$$ packed form
1165c99K70K00m22m09M14L25l18R8P99n51l25M00M88n21K15Rj77l71N16j48k44
1186a51j15K43j90O5M32l74k85J92n4R5J73N08n58o5L88q0j30m2J08m02R6K61
1208A15n6k60K7J34l39j59O71k36p0O0l1L1N42j47p7k23K90K70p83L87K15m50
1230h9l33N96j55k74n9J85N2k72M05o7%O9j47J81J45K2j46j35m9K48k21L38l09
1253a5k27J27LM5k40j04M44j35j56M08k31M4J17l3jJ22j45L24j82j07j22L5k3
1276e2q0Q5k36J67k01J33J79J1j1j05K77j04J73N9p4PLq7j41Nj17K05l03J1r2
1301b88L7J24j23K82k77K38P9k41M40q0O9p4N8Q9k45J89k17K39m79J41j25o6j58
1324c88J04J85j07J5J46l5K4J37P2J16j98L85l19J5K86k82q2p7j03Kq4K51q0k47
$$ plain form
1348 -264 -219 89 -154 -153 66 134 141 150 387 132 31 255 191 212 -34 -59 -187 -6 -260 -127 -149 -126 -348 -213
1372 -213 20 -79 191 180 59 152 156 256 227 240 134 218 62 -32 42 -154 -331 46 -160 -256 -270 -224 -157 50 143
1397 143 -64 137 84 190 0 299 351 -22 -54 99 149 -91 -45 37 -274 -450 30 -288 -485 -165 67 -139
1419 -139 -165 167 381 132 86 196 278 68 170 246 -29 166 4 -20 -162 -106 -207 -186 -278 -297 -244 100 -70
1442 -70 89 -10 308 169 43 146 278 259 36 191 24 -17 -164 -78 -317 -178 79 -86 -8 174 -150 -92
1464 -92 -38 238 115 171 89 171 76 143 335 83 -69 -21 -126 -28 -141 -198 -440 -208 -152 -281 -294 -125 -67 -64 30
1489 30 423 126 -15 76 329 -163 170 159 -167 -126 -181 2 -106 -51 33 -457 -256 -47 87 -317 75 263
1511 263 -312 299 422 264 254 -17 113 -128 85 -120 151 -148 -183 94 -158 -109 72 -187 -253 -78 -76 199
$$ packed form
1348b64M5L08k43JK19O8PRK37k55j01K24o4K1k46k5j28J81k54J33k2K3k22J35
1372b13K33r9K70j1j21R3MJ00k9J3j06Q4j56r4P4j96j77L77k06r6j4M6O7K07R3
1397A43k07K01n3J06j90K99N2l73l2J53N0k40M6Q2l11j76M80l18j97L20K32k06
1419a39k6L32K14k49m6J10Q2k10J02P6k75J95j62k4j42N6j01K1r2j9N3L44j70
1442g0J59r9L18j39j26J03J32j9k23J55j67m1j47Q6k39J39K57j65P8J82l24N8
1464i2N4K76j23N6q2Q2r5O7J92k52j52M8j05R8j13n7k42K32N6j29j3J69N8LR4
1489C0L93k97j41R1K53m92L33j1l26M1n5J83j08N5Q4m90K01K09J34m04L92J88
1511B63n75O11J23j58j0k71J30k41K13k05K71k99l5K77k52M9J81k59o6J75KK75
$$ plain form
1533 199 354 196 -17 71 382 199 -168 44 -124 -290 7 41 -61 -265 -179 46 -305 24 69 -661 -99
1554 -99 272 91 0 465 251 -362 27 429 92 36 467 -22 -253 -106 291 -128 -265 -180 -17 -311 159
1575 159 205 -95 -318 274 265 -89 355 308 -382 -26 194 181 -174 -67 234 -301 -125 247 -130 -426 -12 -66
1597 -66 -350 204 342 52 -196 144 301 111 234 297 -64 -313 398 204 -85 -13 -28 -386 -167 31 47 -523
1619 -523 68 -9 -23 22 374 8 -56 233 74 59 209 201 -9 -141 108 -136 -344 -44 -112 -285 -189 183 215
1642 215 -97 57 -150 -168 203 392 11 -135 190 122 -89 33 134 -313 -257 -5 -29 -16 -82 -170 -364 -172
1664 -172 64 -138 -55 135 241 -29 -29 442 -144 -180 106 151 -45 14 219 -142 -303 -55 -40 -366 35 175
1686 175 -128 -164 277 -1 -292 192 294 -106 48 441 121 84 -90 32 89 158 229 -119 -247 -126 -220 -145
$$ packed form
1533A99J55j58k13Q8L11j83l67K12j68j66K97L4j02k04Q6K25l51L29M5p30N62
1554i9L71j81r1M65k14o13L89M02l37n6M31m89k31J47L97m19j37Q5J63k94M70
1575A59M6l00k23N92rl54M44m7o90L56K20j3l55J07L01n35J76L72l77k96M14n4
1597f6k84N54J38k90k48L40J57j90J23O3l61k49P11j94k89P2j5l58K19J98J6n70
1619e23N91p7j4M5L52l66o4K89j59j5J50qk10j32K49k44k08L00o8j73R6L72L2
1642B15l12J54k07j8L71J89l81j46L25o8k11J22J01m47N6K52k4J3o6q8j94J92
1664a72K36k02Q3J90J06k70%M71n86l6K86M5j96N9K05l61j61K48J5l26M01J40
1686A75l03l6M41k78k91M84J02m00J54L93l20l7j74J22N7O9P1l48j28J21r4P5
$$ plain form
1708 -145 65 179 -242 -34 186 85 193 127 238 -114 -97 40 -177 -122 245 -238 -256 -299 100 -229 -43 -247
1730 -247 -112 -303 86 353 -78 -59 123 311 139 118 190 -4 155 119 -132 42 -207 -48 -296 -92 100
1751 100 -530 -190 -143 -23 -77 196 209 -198 -230 160 279 73 106 103 81 44 30 -14 -107 15 -74 -86 -339 -70 -72
1776 -72 -11 -132 34 -7 -8 145 201 212 133 12 387 55 -111 -129 -220 -4 -168 -206 -184 -4 -172 112 -242 -119
1800 -119 9 103 102 96 136 302 53 112 -80 195 191 30 -127 -263 -113 -7 -103 -65 -109 -151 5 -85 154 -148 -77
1825 -77 81 171 -98 57 67 -24 97 -12 132 -134 -108 13 8 -131 -108 -26 -172 -118 -67 21 -98 -136 8 89 13
1850 13 198 98 -82 -71 46 40 -35 174 165 -182 -267 167 -160 87 7 -131 67 -256 143 -72 -38 -87 74 57
1874 57 -162 160 115 -108 -252 -98 -60 -39 -83 -99 -41 -151 14 -147 -127 -101 -77 87 50 25 82 14 32 144 306
$$ packed form
1708a45K10J14m21K08K20j01J08o6J11l52J7J37k17N5L67m83j8m3L99l29J86k04
1730b47J35j91L89K67m31J9J82J88j72k1P2j94J59l6k51J74k49J59k48K04J92
1751A00o30L40M7J20n4K73J3m07l2L90J19k06L3lk2l7j4m4r3J22q9j2k53K69k
1776g2O1j21J66m1jJ53N6J1p9j21L75l32j66j8r1K16j64l8K2J80j68K84l54J23
1800a19J28R4joM0J66k49N9j92K75mj61j57j36J50J06r6L8m4m2J56r0K39l02P1
1825g7J58R0k69J55J0r1J21j09J44k66K6J21nj39K3Q2j46N4N1Q8j19l8J44Q1p6
1850A3J85j00j80J1J17op5K09rl47q5M34l27K47q0j38J98l23L99k15L4m9J61j7
1874E7k19L22m5k23j44J54L8K1m4j6N8j10J65j61K0K6K4J64l7k5N7o8J8J12J62
$$ plain form
1899 306 77 24 -16 -102 -142 2 280 -174 44 26 -195 -289 -6 -41 7 7 45 33 196 268 117 90 266 45 -208
1924 -208 97 78 -5 -180 -268 -162 -104 30 39 182 -273 103 -8 171 62 70 27 -11 45 129 -111 -35 41 -231 -128
1949 -128 -199 -201 -281 20 -328 39 16 79 58 29 186 -70 86 26 206 132 40 121 51 -18 41 22 -202 -24 -222
1974 -222 -48 -31 -58 -185 -149 -95 -17 112 85 240 249 93 -11 52 150 -186 -198 92 -335 -10 -96 -97 -122 55 -23
1999 -23 -32 -150 -18 -43 -126 216 165 -8 146 165 27 -90 190 -11 -117 18 12 -183 -170 120 -85 -167 119 -75
2023 -75 -212 160 360 -58 2 137 82 17 -7 136 67 12 110 -145 -105 -93 134 -154 -207 110 -38 -82 -48 103
2047 103 -122 181 433 -47 -24 78 71 -208 213 168 -27 108 -21 57 -47 60 -49 -227 -133 57 -128 225
2069 225 244 -65 -92 118 157 52 -146 33 77 13 262 23 110 -282 7 -285 -156 66 239 -267 -38 327
$$ packed form
1899C06k29n3m0q6m0J44K78m54K18j8k21r4K83l5M8%L8j2J63P2j51k7J76k21k53
1924b08L05j9q3j75q8J06N8J34RJ43m55L76j11J79j09Qm3l8N6Q4k40P6P6k72J03
1949a28p1kq0L01l48L67k3O3k1k9J57k56J56o0J80p4r2Q1p0o9N9j9k24J78j98
1974b22J74J7k7j27L6N4P8J29k7J55Rj56j04O3R8l36j2K90m27L25q6jk5J77p8
1999b3rj18J32k5q3L42n1j73J54J9j38j17K80k01j06J35oj95J3K90k05q2K86j94
2023g5j37L72K00m18O0J35n5o5k4J43o9n5R8k55M0J2K27k88n3L17j48m4L4J51
2047A03k25L03K52m80K3J02pk79M21m5j95J35j29P8j04J07j09j78R4J90j85L53
2069B25J9l09k7K10L9j05j98J79M4o4K49k39Q7l92K89k92J29K22J73n06K29L65
$$ plain form
2091 327 30 -16 211 54 -194 146 232 -84 -140 17 -94 -328 144 -47 -32 -93 66 16 -26 140 10 -176
2113 -176 -401 274 107 -58 145 -237 -248 216 404 -193 -134 46 -79 -181 126 27 -47 -225 -160 -6 -17 -15 117
2136 117 -10 110 102 284 -196 101 -37 -87 121 248 -68 -107 78 -58 -339 79 72 -84 -78 84 15 -296 71
2159 71 194 -176 3 181 66 200 69 -73 -283 -105 -68 58 -130 -180 29 -155 113 198 90 -114 61
2180 61 167 59 222 -9 -89 -39 222 -33 -19 114 90 -73 58 115 106 16 -223 -202 -238 -127 -50 -89 -41 25 211
2205 211 -68 118 197 -197 196 102 31 188 -63 -33 -325 -40 -123 -107 -77 -192 110 77 2 62 -134 -31 56 84
2229 84 87 225 209 38 -17 -98 150 -17 215 123 -117 197 -67 -264 -77 -60 -80 105 -58 17 93 -124 121 35
2253 35 -91 -35 17 223 -90 64 133 -99 -114 42 -93 -50 -72 2 -205 -9 236 139 62 152 -28 85 93 185 150
$$ packed form
2091C27k97m6K27j57k48L40Q6l16n6J57j11k34M72j91J5o1J59n0m2J66j30j86
2113a76k25O75j67j65K03l82j1M64J88n97N9J80j25j02L07r9p4j78O5J54j1KJ32
2136A17j27J20qJ82m80K97j38n0K08J27l16l9J85j36k81M18pj56OJ62o9l11L67
2159G1J23l70J79J78j15J34j31j42k10J78L7J26j88n0K09j84K68Q5j08k04J75
2180F1J06j08J63k31q0N0K61k55J4J33k4j63J31N7rr0k39K1l6J11P7l9M8O6J86
2205B11k79J86P9l94L93r4p1J57k51L0k92K85q3J6L0j15L02l3p5O0j96J03Q7K8
2229H4LJ38j6j71n5q1K48j67K32r2k40L14k64j97J87J7k0J85j63P5P6k17K45q6
2253C5j26N6N2K06l13J54O9k32j5J56j35M3k2P4k07J96K45r7p7R0j80J13QR2l5
$$ plain form
2278 150 239 27 -36 -49 -124 169 -75 -87 60 -151 -140 156 62 7 -57 -203 205 -37 80 116 2 57 158 -23
2302 -23 2 -51 -36 253 -60 -229 -95 15 150 90 -28 -56 21 -105 21 12 68 152 26 189 -1 187 -18 -72
2326 -72 35 -128 -369 25 -57 15 -106 173 -35 -278 -102 53 37 62 11 7 116 41 -58 200 -45 216 -88
2349 -88 -128 122 -210 -142 39 -320 53 76 135 56 -51 195 179 -8 92 -9 72 154 221 -89 -21 -81 -145 -5
2373 -5 87 -103 -139 -250 36 -143 -200 112 -128 -67 37 121 52 19 112 61 62 -42 -104 33 195 -166 -91 -93 -154 201
2399 201 -61 30 -128 187 -118 -22 -9 71 -4 133 274 25 71 281 -93 -111 27 -115 44 -207 27 30 -192
2422 -192 -264 -146 -8 -4 45 -28 50 150 142 100 140 -52 35 -27 256 102 -119 243 99 -109 102 156 -113 -231
2446 -231 -74 -34 -97 -26 -232 -70 -40 154 -72 28 21 -41 45 -366 119 -107 -36 -179 -79 -169 -159 -27 -102 -91
$$ packed form
2278A50Q9k12o3j3p5K93k44j2J47k11J1K96r4n5o4j46M08k42J17L6j14N5J01j81
2302b3K5n3J5K89l13j69J34J10J35o0j18k8P7j26J26rN6Q4j26J63j90J88k05n4
2326g2J07j63k41L94q2P2j21K79k08k43J76J55j6K5n1mJ09p5r9K58k45K61l04
2349h8m0K50l32O8J81l59L73K3N9p9j07K46j6j87J00j01Q1Q2O7l10O8o0o4J40
2373eR2j90l6j11K86j79n7L12k40O1J04Q4o9l3R3n1Jj04o2J37J62l61P5ko1L55
2399B01k62R1j58L15l05R6J3Q0p5J37J41k49M6K10l74j8J38j42J59k51K34Lk22
2422a92p2J18J38MM9p3P8J00qm2M0j92Q7o2K83j54k21L62j44k08K11N4k69j18
2446b31J57M0o3P1k06J62L0J94k26J00po2Q6m11M85k26P1j43J00r0J0J32p5J1
$$ plain form
2470 -91 -23 -29 86 -100 25 99 263 57 -74 -45 -50 125 -54 -177 -75 -10 221 64 -42 -71 -95 -22 118 -48
2494 -48 -153 -42 -139 116 -17 195 61 78 110 55 -153 -2 215 140 26 38 -91 -74 -76 67 -201 -92 -68 -219
2518 -219 -158 -84 209 66 -37 164 103 -94 40 27 66 183 -13 -74 36 109 -213 -156 25 83 10 187 -90
2541 -90 14 -46 74 140 -3 8 283 -46 -79 232 37 -164 222 18 -169 -72 -6 -4 -302 -25 -94 173 -158
2564 -158 -71 34 27 -83 86 -74 98 -96 -90 -82 -38 37 71 -43 88 -57 19 68 -98 -101 -35 169 33 309 35
2589 35 -123 277 -63 -81 51 60 143 -31 -158 200 -166 -57 110 25 -209 134 58 -13 36 36 -204 67 3 5 24
2614 24 110 43 46 -101 -60 181 -9 34 -6 -110 -147 100 -141 66 -37 138 -24 -5 175 226 -110 163 25 34
2638 34 164 43 -36 -99 -240 99 184 15 99 -135 -162 98 82 14 -92 -7 138 -27 96 197 -210 -81 155
$$ packed form
2470i1O8oJ15j86J25P4J64k06j31K9nJ75j79j23J02O5K31j57j06k9k4P3J40j66
2494d8j05J11r7K55j33K12j34J7L2n5k08J51K17p5j14J2j29J7kJ43k68J09K4j51
2518b19O1P4K93j43j03K01o1j97J34j3L9J17j96o1J10P3l22N7J81N8p3J77k77
2541i0J04o0J20O6j43J1K75l29l3L11j95k01L86k04j87R7O6Kk98K77o9K67l31
2564a58Q7J05pj10J69j60J72j94OQM4P5L4j14J31j45P6M9j66lO6K04j36K76k74
2589C5j58M00l40j8J32RQ3j74j27L58l66J09J67q5k34L43p6p1M9%k40K71o4KJ9
2614B4Q6o7Lj47M1K41j90M3m0j04l7K47k41K07j03J75j62J9J80N1l36K73j38R
2638C4J30j21p9o3j41L39Q5j69Q4k34k7K60j6o8j06Q5J45j65J23J01m07J29K36
$$ plain form
2661 155 -157 133 312 -6 -289 167 74 95 -28 113 -87 -251 -2 31 -44 -178 16 -148 7 -42 269 58
2683 58 43 -61 32 81 56 14 -239 -170 287 130 14 -126 1 45 7 -41 99 48 -71 -131 -54 101 50 -115 98
2708 98 -128 27 -90 -120 42 41 -133 -21 -139 -86 75 -213 -82 95 135 185 35 37 197 -147 50 241 -23
2731 -23 -159 -78 -22 -86 40 -106 -19 66 -34 72 -87 124 -4 171 -75 150 35 -47 -116 25 -152 65 129
2754 129 -9 -12 109 56 -110 187 153 -165 13 14 208 147 -43 -127 -98 24 -40 -179 -105 168 57 20 64 -3 -306
2779 -306 -78 45 -118 -76 -140 -95 -102 -55 -26 186 6 -151 -157 -29 95 -82 -79 -128 -14 -132 -232 -45 -79 -98 2
2804 2 260 95 -123 94 -16 23 55 -254 -8 -57 -75 44 141 35 -240 124 88 -72 -84 -20 59 -19 102 -99
2828 -99 -120 -32 96 -85 -148 147 91 85 -22 42 29 246 -189 -211 -59 -90 -251 21 214 74 -2 114 227 93
$$ packed form
2661A55l12K90J79l18k83M56r3K1j23J41k00j64K49L3p5j34J94j64J55m9L11k11
2683E8j5j04R3M9k5m2k53O9M57j57j16j40J27M4l8m8J40n1j19o0P7J55n1j65K13
2708I8k26J55j17l0J62jj74J12j18N3J61k88J31J77M0N0j50KJ60l44J97J91k64
2731b3j36Q1N6o4J26j46Q7Q5j00J06j59K11j28J75k46K25j15q2o9J41j77K17O4
2754A29j38lJ21n3j66K97l4l18J78JJ94o1j90q4K9J22o4j39P4K73j11l7M4o7l03
2779c06K28J23j63M2o4M5pM7K9K12j80j57oJ28J24j77Lm9J14j18j00J87l4j9J00
2804BK58j65k18K17j10L9L2l09K46m9j8J19R7j06k75L64l6j60j2O4P9p8J21k01
2828i9k1Q8J28j81o3K95n6oj07O4j3K17m35k2J52l1j61K72J93j40p6J16J13j34
$$ plain form
2852 93 12 95 137 35 32 86 267 -153 209 164 -137 -41 -260 2 -44 -103 -2 -112 128 -138 -176 -4 78 36 218
2877 218 -154 55 -143 -35 145 48 -19 -54 -67 82 -22 -1 -22 -143 -95 45 -55 -52 -202 -108 -50 -51 -64 -53 -25
2902 -25 194 186 -121 -240 44 143 -43 105 59 -68 -225 73 -53 -144 59 -12 209 -298 110 196 -8 16 101
2925 101 -48 106 73 80 113 -61 75 -182 -84 17 -118 54 26 -37 68 -70 37 -53 -41 65 41 109 55 172
2949 172 28 -112 -126 36 -41 131 40 7 -130 -333 23 -93 -75 -66 141 24 -195 27 29 49 -104 -91 2 134
2973 134 131 45 115 -158 -5 87 -89 51 -205 -23 97 66 -91 24 21 -166 -111 71 -86 -1 -26 -10 -14 113 -56
2998 -56 -28 78 39 -14 9 15 114 -118 -30 2 46 -168 -12 -56 -109 -99 -1 -32 -27 59 -143 -57 -114 50 11 -89 -144 111
3026 111 161 23 10 22 -41 -75 88 46 7 38 -108 -222 255 82 91 114 19 -45 56 218 63 73 -27 45 46 -25
$$ packed form
2852I3q1Q3M2j02lN4J81m20L62m5l01R6k19K62m6n9J01j10K40k66l8J72Q2m2J82
2877B18l72K09j98J08J80r7o7l5j3J49j04K1k1j21M8J40j00Lj50R4N8jj3J1K8
2902b5K19ql07j19K84R9j86J48m6j27j57K98j26r1K03p1K21n07M08Q6k04K4Q5
2925A01j49J54l3PL3j74J36k57R8J01j35J72k8o3J05j38J07r0J2J06k4O8n4J17
2949A72j44j40j4J62p7J72r1l3j37k03L56j16J8RK07j17k19K22KK0j53J3R3J32
2973A34lq6P0k73J53R2j76J40k56J82J20l1j57J15lj87N5J82j57Q5k5J6mJ27j69
2998e6K8J06l9n3K3OR9k32Q8L2M4k14J56m4n3J0R8l1NQ6k02Q6n7J64l9j00n5K55
3026A11N0j38j3J2o3l4J63m2l9L1j46j14M77j73RK3r5o4J01J62j55J0j00P2Jp1
$$ plain form
3052 -25 47 -78 39 36 -97 -63 -104 158 -21 -112 -38 -37 82 -34 42 82 60 -289 -78 8 194 -47 -69 -184 -12
3077 -12 65 -77 -227 -166 8 259 228 168 -58 105 23 209 179 -74 -30 -51 19 -131 154 -170 -87 81 1 74
3101 74 17 14 149 -155 -278 106 85 -56 207 107 -63 -40 2 65 -52 -127 128 -27 -137 -27 -22 11 -14 27 -172
3126 -172 -85 176 -83 244 -131 209 22 -27 108 -102 -82 -163 -124 -126 -135 -207 -2 273 66 -27 -10 9 9 46 -252
3151 -252 -26 120 33 130 174 -66 76 -22 90 21 125 185 8 38 -155 -2 -99 241 93 57 -151 114 -57
3174 -57 -34 10 -30 -35 -172 29 13 -31 38 -120 13 -16 -24 82 -13 147 -1 86 177 -98 -112 68 -65 -125 1 28
3200 28 -25 -88 26 -109 -166 65 -77 25 -104 97 17 51 143 76 -16 -29 -39 -75 -41 -23 -44 200 -124 244 21
3225 21 -144 -146 124 -97 -64 -24 55 -13 92 -1 24 -79 191 -40 -147 -44 186 56 -66 95 -140 56 54 -30
$$ packed form
3052b5P2j25J17lj33L4m1K62j79r1P4JJ19j16P6M0k2l49K11Q6J86k41k2j15J72
3077a2P7j42j50O1J74K51l1o0k26J63q2J86l0k53M4k1P0j50K85l24Q3J68q0P3
3101G4n7lJ35l04j23L84k1j41K63j00j70K3M2O3j17p5K55j55j10J10NL3k5M1j99
3126a72Q7K61k59L27l75L40j87m9J35k10K0q1L9krp2K05K75k07r3J7J9%L7k98
3151b52K26J46q7R7M4k40J42r8J12o9J04O0j77L0j93J53r7L40j48l6k08K65j71
3174e7K3M4m0nj37K01j6m4O9j58J33k9qJ06r5J60j48Q7R1k75j4J80j33o0J26K7
3200B8n3o3J14j35n7K31j42J02j29K01q0L4R2o7r2j3j0l6L4J8k1K44l24L68k23
3225B1j65kK70k21L3M0P9o8J05r3K5j03K70k31j07J03K30j30j22J61k35J96kq4
$$ plain form
3249 -30 12 -34 172 51 -2 -37 0 147 -47 -16 -81 -175 201 -1 154 -77 -69 -122 -245 176 95 -223 38 -135
3273 -135 -105 -31 84 -49 97 -18 -72 77 0 48 134 144 134 -28 -109 59 22 139 -37 36 -108 10 -99 -160
3297 -160 -223 -35 -62 -16 60 56 27 0 50 314 15 -22 -59 17 -4 -34 -35 52 -66 -178 -65 96 2 38 -11 -65 81
3324 81 -49 156 29 -70 -110 -58 -80 130 -62 -2 -244 -168 55 71 77 25 -8 -128 -74 198 0 11 209 -6 -29
3349 -29 10 -39 209 7 -58 235 -23 -89 -148 -72 128 -147 -106 -109 -50 -7 -44 204 -148 42 -131 -198 -159 -83 -25 -40
3375 -40 280 150 -15 -63 -143 -178 -24 104 -148 104 -47 -13 74 -155 45 64 150 153 3 194 139 40 172 -135
3399 -135 214 -193 87 -76 2 -106 -22 22 46 -88 125 -166 180 -73 4 -13 -120 83 -132 -142 -71 -139 -23
3422 -23 -211 8 -27 86 -109 -36 -72 -124 -16 2 -95 -30 -121 38 65 -24 -92 33 85 121 235 80 -14 -199 -53
$$ packed form
3249c0M2m6K06j21n3l5L7J47j94L1o5r4L76k02J55k31Qn3j23M21q1l18K61j73
3273a35L0P4J15j33J46j15n4J49p7M8Q6J0j0j62q1J68l7J17j76P3j44J18j09o1
3297a60o3J88k7M6P6mk9k7N0K64k99l7l7P6k1l0jQ7j18j12J13J61r4L6m9n4J46
3324H1j30K05j27r9m0N2k2K10j92O0k42P6K23J6On2l3j20N4K72j98J1J98k15k3
3349b9L9m9K48k02o5K93k58o6n9P6K00k75M1lN9M3l7K48l52J90j73o7L9P6N8j5
3375d0L20j30j65m8q0l5J54J28k52K52j51L4Q7k29K00J9Q6Lj50J91n5r9J32l07
3399a35L49m07K80j63P8j08Q4M4K4j34K13k91L46k53P7j7j07K03k15j0P1o8J16
3422b3j88K19l5J13j95P3l6n2J08J8r7O5r1J59K7q9o8J25N2L6J14j55r4j85J46
$$ plain form
3447 -53 68 3 -65 -109 20 23 -74 15 66 -88 40 74 382 90 -22 -29 -27 9 18 94 263 174 86 77 97 65 11 -127
3475 -127 95 32 -121 115 68 88 51 288 -122 -51 234 62 -125 150 -126 93 -98 69 -138 219 -285 49
3497 49 155 88 195 -67 48 4 98 13 -219 -96 -1 42 105 -7 -94 -36 223 -148 72 33 -19 -272 33 -22
3521 -22 -3 147 21 -94 -41 -164 61 -160 -43 -128 23 -52 -111 -133 -100 -169 75 24 -122 -146 -15 -80 27 -29
3545 -29 120 52 23 28 17 65 -93 -55 -92 -169 -56 -34 102 -199 -2 -9 118 -18 -49 24 94 61 177 68 60 63 4
3572 4 32 231 231 -68 10 41 98 15 -70 -57 -74 33 -182 32 61 -250 126 102 86 2 48 140 -100 93 -97 203
3598 203 155 181 22 -8 -209 39 32 -13 -34 -146 -91 -99 -7 -20 185 -81 -174 -78 -120 26 77 217 3 42 31 -183
3624 -183 -131 23 27 -102 -70 11 -92 35 -59 54 95 -101 102 -19 91 -18 78 42 49 -7 130 -81 34 -124
$$ packed form
3447e3J21o5o8m4J29Lr7Q9N1j54J28L4L08k92j12pKL6RP6J69q9q8rK0l2n4j38
3475a27K22o3j53K36m7K0l7K37m10P1K85j72j87K75k76K19j91J67k07L57n04L34
3497D9J06o7J07k62J15m4R4q5k32J23R5M3O3j12q7N8K59l71K20l9n2k53L05n5
3521b2J9J50j26j15N3j23K25k21J17q5J51p5n9k2L3o9K44n1j46k4J31o5J07n6
3545b9J49o8k9Nj1M8j58L8l7p7J13K2J36l01J97pJ27j36l1P3P0l3J16j09qLn9
3572DK8J99%k99P8L1N7q3q5J3j7J07k15K14K9l11L76k4j6q4M6R2k40J93j90L00
3598B03m8K6j59l0k01K48pm5k1j12N5qR2j3K05k66r3R6m2J46N1J40k14L9j1k14
3624a83N2J54Mj29L2Q1j03J27r4J13M1j96K03j21J10j09R6l6Pn6J37k11J15j58
$$ plain form
3648 -124 -11 -5 32 5 -127 296 -100 -125 38 32 -164 -22 44 -17 -222 -121 41 103 45 129 94 -109 -11 48 -36
3673 -36 -75 24 -28 308 185 -77 102 114 104 32 119 115 66 -47 32 48 60 -72 -29 31 8 80 -55 5 65 -101 1
3700 1 47 -57 20 -135 32 -6 164 47 24 25 -5 160 8 -18 -42 19 -28 204 -3 160 -97 156 -30 -169
3724 -169 -89 49 -210 -91 227 -2 161 -28 12 89 130 106 54 -76 2 -43 36 127 9 180 -72 82 107 157
3748 157 236 -73 -141 64 -223 -149 34 120 116 137 -24 45 -103 -19 181 31 -32 -86 -20 -83 11 102 135 29 78 17
3774 17 82 -171 -103 104 -108 -46 49 34 151 -23 -161 -24 -24 -16 -32 92 -198 -223 94 163 -21 37 53 -106 -29
3799 -29 -26 90 48 96 -259 76 11 -135 -27 56 -1 161 63 -237 175 -55 60 55 112 3 -177 -38 -123 -22
3823 -22 102 170 -3 -92 4 48 73 -206 -10 -124 34 87 -117 202 104 282 -2 41 -64 99 248 75 -12
$$ packed form
3648a24J13OL7k7j32M23l96k5J63oj96J42O6o1k05J01J62O2n8Q4l5k03R8N9q4
3673c6l9R9n2L36j23k62J79J2j0p2Q7mm9j13P9J6J2j32M3O0k3P2j35O0O0j66J02
3700AM6j04P7j55J67l8J70j17k3Jl0J65j52k6k4O1m7K32k07J63k57K53j86j39
3724a69Q0J38k59J19L18k29J63j89M0P7M1k4n2j30P8m5P9R1j18J71k52J54K5N0
3748A57P9l09o8K05k87P4J83Q6mK1j61O9j48Q4K00j50o3n4O6o3R4R1L3j06M9o1
3774A7O5k53O8K07k12O2R5j5J17j74j38J37%Qj6J24k90k5L17O9j84N8J6j59P7
3799b9LJ16m2M8l55L35o5j46J08Q3n7J62r8l00M12k30J15nN7j09j80J39q5J01
3823b2J24O8j73q9R6M4K5k79J96j14J58N3k04L19r8J78k84M3j05J63J49j73q7
$$ plain form
3846 -12 -82 185 -174 8 -120 -150 -106 170 82 -184 -62 -43 60 -44 -250 127 -54 -24 101 -179 -32 -182
3868 -182 -7 -17 -12 -23 -67 -42 79 -41 -95 -255 35 -68 -16 94 -88 -228 -29 59 -283 160 76 -186 5
3891 5 -134 -142 -191 52 -6 -49 -102 -223 161 -114 31 -169 -15 36 -82 23 77 37 -73 -169 144 -28 74 154
3915 154 38 46 127 -31 92 -194 -52 179 149 -13 86 33 -83 45 -114 115 -2 122 -14 31 22 266 103
3938 103 82 19 17 92 -96 -18 -7 81 11 2 38 -93 39 -27 80 -123 138 -13 -94 -92 -111 -28 23 -137 -123 -156 346
3965 346 86 -114 -118 -21 -134 -98 -4 22 110 -20 -20 -22 -33 -149 -199 98 106 185 202 89 -78 -85 -13 -118 68 -6 -11 -58
3993 -58 27 55 113 -45 -194 -128 -113 -51 -184 -101 124 -118 -110 110 89 -71 6 6 47 -16 90 -140 -63 -114 19 167
4019 167 -56 -99 122 20 86 8 -56 140 93 42 -25 7 62 36 -143 83 -60 159 22 -115 -16 -78 111 -28
$$ packed form
3846a2p0K67l59J82j28l0M4K76q8k66J22J9J03j04k06L77j81L0J25k80J47j50
3868a82J75j0Nj1m4K5J21j20n4j60K90j03N2J10j82j40J99Q8l42M43q4k62J91
3891Ej39qm9K43n8m3n3j21L84k75J45k00J54N1j18J05N4m0j10r6L13j72J02Q0
3915A54j16QQ1j58J23k86J42K31l0j62R9n3j16J28j59K29j17J24j36M5rK44j63
3938A03k1o3kP5j88P8J1Q8p0rL6j31J32o6J07k03K61j51q1Kj9Q3N1j60J4l3N02
3965C46k60k00mR7j13L6R4K6Q8j30%kj1j16n0K97QP9J7j13j67pP2j05J86p4nm7
3993e8Q5K8N8j58j49O6J5O2j33Q3K25k42QK20k1j60P7%M1o3J06k30P7n1J33J48
4019A67k23m3K21j02O6p8o4J96m7n1o7L2N5k6j79K26j43K19j37j37R9o2J89j39
$$ plain form
4043 -28 20 -44 52 71 -260 139 151 -94 100 60 95 133 -55 -16 35 -220 61 91 -9 0 -4 113 -76 24 114 208
4069 208 -60 -26 68 33 -138 -21 48 64 -54 58 81 25 -213 -151 168 -132 -13 89 117 -212 64 80 233
4092 233 -254 295 23 -44 234 -1 3 -237 136 -40 -43 -84 235 31 89 230 67 -171 -68 -9 82 -32 95
4115 95 -72 -124 -145 38 -296 43 -37 -123 -36 82 -195 149 194 2 65 -210 11 -136 -152 6 47 198 48
4138 48 -94 -26 -5 -1 -108 136 -82 49 -31 51 -60 -9 -22 22 -6 44 -71 233 70 175 111 154 134 -170 -123
4163 -123 -8 -5 -132 -83 71 -64 2 113 80 -444 -245 -33 -17 70 1 -7 277 51 -144 84 115 -143 34 28
4187 28 127 -43 72 239 -36 -15 -81 21 213 36 20 178 -32 -2 -28 -96 87 34 -67 35 107 -168 -134 -74
4211 -74 16 193 36 15 94 -167 -163 57 -165 216 -28 39 25 126 -150 84 36 -4 -56 -74 165 -90 -83 -109 -142
$$ packed form
4043b8M8o4R6J9l31L99J2k45J94m0L5L8j88L9N1k55K81L0j00RmJ17j89J00R0R4
4069B08k68L4R4l5j71J17O9J6j18J12K3n6k38O2L19l00J19J02K8l29K76J6J53
4092B33m87N49k72o7K78k35Mk40L73j76lm1L19k04N8J41j63k38J03N9R1j14J27
4115I5j67n2k1J83l34L39q0q6Q7J18k77L44M5j92O3k75K21j47j6J58M1J51j50
4138D8j42O8K1Mj07K44k18J31q0Q2j11N1j3M4k8N0j15L04j63J05o4M3k0l04M7
4163a23J15Lj27M9J54j35O6J11l3n24J99K12J6Q7o9qK84k26j95K28L1k58J77o
4187B8R9j70J15J67k75K1o6J02J92j77j6J58k10L0k6o8J83n3j01J02P2k75L4O0
4211g4R0J77j57k1P9k61MK20k22L81k44O7j4J01k76K34m8m0n2j8K39k55Pk6l3
$$ plain form
4236 -142 149 108 190 178 -141 -276 60 0 -145 163 15 -44 95 14 6 70 -214 32 85 5 157 80 229 -74
4260 -74 111 -233 110 167 -198 -24 124 -78 -89 -10 98 120 -41 93 67 212 -172 40 -97 -85 -203 127
4282 127 -171 -171 -2 -87 -104 -75 -7 24 84 214 34 307 -87 -167 25 -120 113 -183 138 -136 -95 122 65 16
4306 16 -55 -38 106 140 -47 -164 24 -74 129 -102 105 42 -15 249 -34 123 -25 84 37 -2 -69 -82 400 -124
4330 -124 161 107 -175 -256 20 23 -92 -206 -60 54 -104 77 -189 97 49 28 -87 -171 -179 121 -20 -78 11 58
4354 58 161 -41 105 -381 -85 -17 87 -151 238 -49 13 172 93 -68 -148 -99 -57 -45 7 37 -35 -101 -58 171
4378 171 222 27 -38 -279 -51 -137 3 -8 -202 77 63 48 14 3 -141 -62 34 202 -64 91 -28 -43 -101 68
4402 68 32 -13 1 28 129 114 202 -40 -69 8 96 -101 -20 -12 -29 -189 6 166 46 -117 -188 -108 -97 107 7 69
$$ packed form
4236a42K91m1Q2j2l19j35L36o0j45L08j48n9J39q1qO4k84K46N3q0J52p7J49l03
4260g4J85l44L43N7l65J74J48k02j1P9J08K2j61J34k6J45l84K12j37J2j18L30
4282A27k98%J69q5j7K9O8L1O0J30j80K73l94q0J92j45K33k96L21k74M1K17n7m9
4306A6p1J7J44L4j87j17J88r8K03k31K07o3n7K64k83J57j48J09m7l9o7j3M82n24
4330a24K85n4k82q1K76Lj15j14J46J14j58J81k66K86m8k1j15q4qL00j41n8Q9M7
4354E8J03k02J46m86K96O8J04k38L89k87O2J59p9j61q0M9M2J2N2L0p2o6M3K29
4378A71N1j95o5k41K28q6J40j1j94K79j4j5l4j1j44P9R6J68k66J55j19j5n8J69
4402F8l6m5J4K7J01j5Q8k42k9P7Q8j97Q1Qj7j60J95J60j20j63p1Q0J1K04j00O2
$$ plain form
4428 69 17 11 -105 188 -90 -61 -47 41 -107 167 216 61 -149 -67 -161 102 91 -113 -25 68 70 34 56 103 71 -132
4454 -132 105 86 -135 157 187 -32 -62 -111 -137 42 44 -184 105 73 -46 42 -60 -64 -90 -122 95 -152 -33 -245
4478 -245 -72 69 121 -41 -71 -223 42 -47 -127 48 -163 -38 37 -46 -67 100 72 103 -156 44 19 76 83 -28
4502 -28 55 -110 121 102 -161 -54 -13 -126 35 128 -18 -16 -56 47 -60 -66 91 -48 62 22 211 85 24 76
4526 76 -11 -20 -90 -21 -100 12 -21 -109 44 -139 13 223 118 -140 138 0 -70 124 -126 115 -237 153 97 -17
4550 -17 47 21 144 -78 83 -85 -76 23 -123 24 35 32 -134 -13 13 -87 50 43 24 -3 201 72 186 -137 184
4575 184 59 -26 -83 49 -268 -187 -5 6 -63 99 60 12 -3 119 -64 -87 74 -104 -71 118 42 38 176 -93
4599 -93 272 239 115 -98 -174 -88 -56 -49 -28 68 -44 -196 -26 -59 51 -44 -31 23 89 -28 -71 70 188 201 157 59
$$ packed form
4428F9n2oj16K93k78K9J4Q8j48K74M9j55k10Q2r4K63j1k04Q8R3Kl6K2M7l2k03
4454a32K37j9k21K92L0k19l0m9k6J79Kk28K89l2j19Q8j02mk6l2K17k47J19k12
4478b45J73J41N2j62l0j52K65q9q0J75k11J25P5q3k1J67k8L1k59K00k5N7Pj11
4502b8Q3j65K31j9k63J07M1j13J61R3j46Km0J03j07oJ57j39J10m0J89j26o1N2
4526G6q7rp0O9p9J12l3q8J53j83J52K10j05k58K78j38p0J94k50K41l52L90n6j14
4550a7O4k6J23k22J61j68RR9j46J47J1lj66J21K6j00J37pj9k7K04j29J14l23L21
4575A84j25q5n7J32l17Q1J82J1o9J62l9m8j5J22j83k3J61j78L3J89p6mJ38k69
4599i3L65l3j24k13p6Q6L2PK1R6j12j52J70l3J10r5J3N4O6j17m3J41J18J3m4r8
$$ plain form
4625 59 -35 -14 -175 -16 1 -23 61 34 -206 -113 137 101 49 -94 16 -94 -51 34 247 -51 108 51 -25 166 229
4650 229 8 1 -168 -102 43 -174 53 25 189 -48 172 -91 -69 -140 -67 210 -14 -32 218 78 25 64 -134
4673 -134 -65 -39 125 -89 41 -89 -111 -194 -221 20 297 127 68 140 -63 40 221 243 241 -248 131 74 -395 47
4697 47 -120 130 102 -166 87 45 -299 58 -168 -57 38 -40 7 -147 196 73 -24 208 -73 -96 77 0 -79
4720 -79 145 65 52 -24 -127 -17 -47 -107 71 69 171 -103 199 -28 -101 -246 -49 -115 -41 -12 165 -138 -171 1
4744 1 15 -23 72 319 14 -53 -73 -121 19 -184 53 -53 115 -73 142 161 -36 36 -158 -69 184 98 14 104 -47
4769 -47 -41 23 132 -66 310 -146 -30 -89 143 30 -25 96 136 25 92 -74 -134 5 52 -130 -56 173 -116 -33
4793 -33 -169 -112 -59 21 -4 -246 117 -15 -175 -127 196 -105 26 -4 121 189 102 212 -154 -143 -53 -60 160 32
$$ packed form
4625E9r4K1j61J59J7k4Q4k7k40R3K50l6n2j43J10j10M3Q5K13k98J59n7p6J91O3
4650B29k21pj69O6J45k17K27k8J64k37K20k63K2p1P3K77k24j8K50j40n3L9j98
4673a34O9K6J64k14J30j30k2q3k7K41K77j70n9P2k03J03J81K2km89L79n7m69M42
4697D7j67K50k8k68K53m2l44L57k26J11R5p8M7j54L43j23r7K32k81k3J73p7p9
4720g9K24q0j3p6j03J10l0o0J78kJ02k74L02k27p3j45J97o6P4K9J77l03l3J72
4744AJ4l8R5K47l05o7k0m8J40k03K37j06J68j88K15J9j97P2j94Q9K53q6q4R0j51
4769d7OO4J09j98L76m56J16n9K32j13n5J21M0j11O7j66o0J39M7j82P4K29k89Q3
4793c3j36N7N3Q0k5k42L63j32j60M8L23l01J31l0J25O8q7J10l66J1R0pK20j28
$$ plain form
4817 32 -204 58 115 -40 -184 46 -121 21 -89 43 -158 236 90 -42 -130 -129 48 143 -26 34 -81 146
4839 146 94 -45 44 82 42 30 -40 -70 -133 -119 -52 -20 -3 -119 -93 -16 -236 16 46 24 -133 -28 -74 -103 10 44
4865 44 -155 219 77 54 -94 -25 41 118 -211 204 -11 79 78 -280 5 -221 60 103 -9 14 -19 -97 23 -164
4889 -164 41 211 -113 50 -193 62 -60 -142 -166 -80 120 135 209 -50 -25 -173 44 -95 -68 -47 -127 -49 -36 -201
4913 -201 170 -85 -85 -166 151 -67 75 -37 -113 118 65 -118 90 85 -90 94 -106 113 39 -9 158 -125 164
4936 164 97 2 -100 -194 -39 36 -130 -69 -129 138 114 208 32 106 189 -23 -100 -54 -9 35 -158 126 148 -64 84
4961 84 -186 111 -29 -134 155 123 217 49 12 37 112 117 -90 150 124 171 92 -15 94 133 -23 111 10 158
4985 158 -29 62 113 71 34 39 -133 -78 -44 128 -99 -95 -213 -7 -93 -154 -114 43 -117 -37 96 -65 -125 -224 18
$$ packed form
4817C2k36K62N7j55j44K30j67J42j10J32k01L94j46j32q8JJ77R5j69O0j15K27
4839A46n2j39Q9L8m0j2p0l0o3J4O7L2J7j16K6P7k20K52L0k2j57J05m6k9J13L4
4865D4j99L74j42k3j48O9O6P7l29M15k15R0jl58K85k26K81M3j12K3l3p8J20j87
4889a64K05J70l24J63k43K55j22q2k4Q6K00J5P4k59K5j48K17j39K7K1q0P8J3j65
4913b01L71k55%q1L17k18J42j12p6K31n3j83K08nj75J84k00K19p4m8J67k83K89
4936A64o7r5j02r4J55P5j66O1o0K67k4R4j76P4Q3k12p7M6M5M4j93K84K2k12J48
4961H4k70K97j40j05K89l2R4j68l7K5P5Nk07K40k6M7p9j07J09L9j56J34j01J48
4985A58j87R1N1m2l7Nj72N5L4J72k27Mj18K06q6o1M0J57j60Q0J33j61o0r9K42
$$ plain form
5010 18 -57 -57 14 4 -60 118 -83 -50 120 3 -4 8 49 7 -123 158 40 265 -35 225 53 143 -72 -47 186
5035 186 18 164 119 28 -86 93 -78 -90 -2 -59 14 -85 45 -60 -86 17 -102 0 159 174 -65 108 167
5058 167 -24 140 65 -104 128 -182 145 -47 -217 -6 23 -7 136 120 24 -5 -92 103 -75 -200 -66 -241
5080 -241 -120 219 79 -103 -144 238 37 261 -57 -142 -18 76 -47 -180 17 3 160 69 80 -75 -95 59
5102 59 -108 -46 -135 110 -140 -71 -8 62 241 86 -70 -140 -123 289 103 -147 196 46 22 -20 104 -20 -238
5125 -238 -66 -49 -226 111 6 83 -335 85 -4 -16 -73 86 268 99 105 -180 -144 -248 -53 -1 196 108 -231
5148 -231 -317 34 48 13 -3 -17 90 -169 -6 -93 202 -6 -171 22 34 7 -74 -90 147 233 222 149 -41 27 -88
5173 -88 -100 188 11 22 23 278 -73 178 88 -91 79 29 102 -125 225 -61 1 68 -83 -58 104 -22 -223 21
$$ packed form
5010A8p5%P1j0o4J78k01L3J70j17pJ2M1m2j30K81j18K25l00K60j72R0k15K5K33
5035A86j68J46m5r1j14J79j71j2Q8n7P3r9J30j05k6J03j19J02J59J5k39J73N9
5058A67j91J64p5j69K32l10L27j92j70K11K9l0J43j6r6k9q7J95j78j25J34j75
5080b41J21L39j40j82m1L82k01K24l18q5J24R4j23j33J97j4J57r1J1j55k0J54
5102E9j67O2q9K45k50O9O3P0J79j55j56p0J7M12j86k50L43j50k4m2J24j24k18
5125b38J72J7j77L37j05P7m18M20q9j2n7J59J82j69Ok85L6j04J95N2J97q8l39
5148b31q6L51J4l5j6j4J07k59J63q7K95k08j65J93J2k7q1j6K37Q6j1p3j90O8j15
5173h8j2K88j77J1JK55l51K51r0j79J70n0P3k27L50k86O2O7j51K5J62j26k01K44
$$ plain form
5197 21 262 -132 105 2 31 -119 147 -166 0 -129 108 -16 -17 -123 69 -36 -124 -123 9 77 -71 -153 -140
5220 -140 -52 15 100 36 -135 195 -26 129 47 -63 27 -25 136 -118 -126 -86 -71 200 208 -69 77 -109 -27 -31 -108 -41
5246 -41 -73 -32 48 -214 -69 -162 32 -168 32 -53 74 75 72 -22 2 140 140 -21 22 303 50 -8 20 -16 136 -54
5272 -54 -157 -99 -101 -25 72 -91 -7 146 99 -5 -2 -34 -24 48 174 18 80 -56 67 -120 -227 275 -121 14 139
5297 139 48 57 25 4 -85 -82 -62 -221 144 -77 133 -155 -25 123 8 -167 62 -81 5 31 -225 -19 -91 216
5321 216 -64 2 -8 -83 11 109 -15 -222 -13 -31 -189 125 -27 -81 -3 -108 43 -95 116 45 -1 -56 59 -66
5345 -66 217 149 59 -125 -95 220 6 -89 61 149 -111 -130 60 -23 -31 85 -13 -125 82 191 -118 99 -88 47
5369 47 -8 9 -7 234 46 154 208 -136 -131 78 203 26 -187 20 36 -91 110 -41 -153 -68 -19 -14 -41 149
$$ packed form
5197B1K41l94K37j03K9j50K66l13J66j29K37j24jj06J92j05q8JJ32O8j48q2J3
5220a40Q8O7Q5o4j71L30k21J55q2j10R0n2J61k54qM0J5K71Qk77J46j86Q2mp7O7
5246d1l2M1Q0k62J45r3J94k00K00q5J27Jlr4K4J38%j61M3K81k53n8K8l6J52j90
5272e4j03N8kP6R7j63Q4J53m7j04Ll2J0P2J26j56O2j36J23j87j07N02l96J35J25
5297A39r1Rl2k1q9LK0j59L65k21K10k88J30J48j15j75K29j43Q6K6k56K06p2L07
5321B16k80O6j0p5R4R8j24k07K09j8j58L14j52n4P8j05J51j38K11p1m6n5J15j25
5345f6K83o8r0j84L0L15k14r5J50Q8k60j9J90q3qJ16r8j12K07J09l09K17j87J35
5369D7n5J7j6K41j88J08N4l44NK09J25j77k13K07J6j27K01j51j12Q5M9Nk7J90
$$ plain form
5393 149 63 36 -65 -150 -93 43 58 98 4 97 -89 74 -53 56 -106 111 -91 50 -17 -106 -62 65 5 -219
5417 -219 -27 -294 87 -4 68 -6 0 91 30 71 190 -113 -28 201 164 80 123 248 154 110 -180 17 40 78 -60
5442 -60 -24 -19 31 -100 -43 71 66 152 -70 35 135 -180 42 18 97 185 -39 -2 205 -30 20 -242 -16 -85 73
5467 73 -14 -10 119 82 -37 130 -54 -54 -260 115 -76 26 -24 -103 8 80 263 -20 19 61 -51 -153 180 64
5491 64 -147 146 25 -264 -40 -77 -123 52 127 177 230 -1 -221 28 185 -158 21 106 -93 -236 -50 32 -160
5514 -160 177 -98 -143 -148 15 -29 139 -60 -217 69 33 -125 23 96 -28 67 -106 75 -48 92 -4 62 165
5537 165 -50 -131 70 152 154 42 145 -96 30 102 128 -154 -154 -29 99 -134 -24 -87 56 -237 -258 150 92 -33
5561 -33 -19 -1 -136 -9 41 1 -39 -52 59 -186 209 86 -156 -51 -104 -189 -127 -46 112 78 -7 -118 140 253
$$ packed form
5393A49q6k7j01q5N7J36J5M0r4R3j86J63j27J09j62K17k02J41o7q9M4J27o0k24
5417b19J92k67L81r1P2p4OR1o1M1J19l03Q5K29l7q4M3J25r4m4k90J97K3L8j38
5442f0L6NN0j31N7J14nQ6k22J05J00l15K22k4P9Q8k24L7K07k35N0k62K26o9J58
5467G3q7MJ29l7j19J67j84%k06L75j91J02n0p9J11P2J83k83L9M2j12j02L33j16
5491F4k11K93j21k89K24l7m6J75P5N0N3k31k20K49J57l43J79Q5j99j43J86Q2j92
5514a60L37k75m5nJ63m4J68j99j57K86l6j58J48P3j24R5j73J81j23J40r6O6J03
5537A65k15q1K01Q2Kj12J03k41J26P2K6k82%J25J28k33J10o3J43k93k1M08n8j25
5561c3J4J8j35J27N0m0m0j3J11k45L95j23k42J05n3q5O2Q1J58l4q5j11K58J13
$$ plain form
5585 253 99 -201 113 -157 -122 34 117 -44 -46 -115 -47 -109 -38 178 132 -10 7 111 -80 -89 -92 39 61 -70 61
5610 61 30 38 -301 89 -158 62 249 -277 111 113 187 -3 -52 -252 24 48 -319 -89 -38 -128 78 -25 147 -31
5634 -31 152 -12 -76 -94 -83 -50 132 247 76 335 48 -118 8 -40 33 90 -56 101 -29 -36 117 130 68 53
5658 53 8 22 27 -28 38 -30 143 -22 136 -292 146 104 -35 67 -76 -77 -8 -45 -254 -35 -8 -18 7 46 -27 80
5684 80 120 -82 72 -163 166 -35 -138 -52 -144 154 -67 -294 -37 -71 144 112 -78 -18 18 39 -127 -156 -149 69
5708 69 -83 -157 136 -102 232 20 -10 12 -209 -2 -119 -78 -243 -56 251 153 -106 280 22 0 3 8 134 -59
5732 -59 -286 -70 17 -39 55 0 -45 33 48 -82 191 -74 55 33 -87 138 21 51 -80 -157 -22 123 28 63
5756 63 32 -147 -212 -70 28 -258 -122 85 -158 186 -91 54 -9 31 60 -180 -121 -123 -94 192 -92 62 169 48
$$ packed form
5585B53j54l00L14k70L5J56Q3j61ko9O8o2P1K16m6j42J7J04j91rlJ31K2j31J31
5610F1l1Ql39L90k47K20J87n26L88KP4j90m9k00K76K4l67K30N1r0K06j03J72j78
5634c1J83j64o4j8J1L3J82J15j71K59k87j66J26m8P3N7j46J57j30pJ53J3o2j5
5658E3m5J4Nn5O6o8J73j65J58m28M38m2j39J02j43jO9l7k09K19K7j0K5L9p3J07
5684H0M0k02J54k35L29k01j03Q6r2K98k21k27K57l4K15l2j90O0L6K1j66k9PK18
5708F9j52p4K93k38L34k12l0K2k21K07j17M1j65J87L07r8k59L86k58k2LNJ26j93
5732e9k27K16Q7n6R4n5m5P8J5j30K73k65J29k2j20K25j17L0j31p7J35J45r5L5
5756F3l1j79o5J42R8k86J36K07k43L44k77J45o3M0K9k40N9kK9K86k84J54J07j21
$$ plain form
5780 48 -35 87 -141 -142 -120 -22 25 -104 35 -86 130 -182 62 198 59 -71 94 -21 175 -158 -203 33 -23
5803 -23 225 -25 -27 45 70 221 -53 -63 32 -267 64 -3 -152 93 4 43 -107 239 6 -126 -85 -74 26 -169
5827 -169 29 -52 88 54 111 -86 -69 -48 -58 -49 -92 77 41 -32 44 161 121 101 -105 -128 142 3 8 -12 -111 -46 -36
5854 -36 -120 -38 34 -33 -130 57 -73 -43 -59 -82 107 51 75 176 -110 130 255 -66 -28 85 -217 35 237 174
5878 174 -62 86 30 79 -188 32 -80 23 101 -217 -93 11 16 -2 -20 -94 136 -70 26 83 -19 -139 -102 3
5902 3 107 -94 -52 -76 32 -28 -15 -8 -26 101 39 141 33 19 19 -125 236 -40 -61 133 175 -50 23 -114 -197 55
5928 55 -47 -264 -85 52 -207 -209 -42 -101 -12 61 -155 32 -55 -115 -107 142 151 -67 191 -41 -19 -171 35 23 -14
5953 -14 25 -45 -13 113 15 -85 -3 198 -171 34 -122 -142 -82 -16 67 -226 -29 -101 237 -100 110 3 -124 -2
$$ packed form
5780D8q3J22k28jK2R8M7j29J39j21K16l12K44J36j39j30J65j15J96l33m5K36n6
5803b3K48k50kP2K5J51k74j0R5k99L31o7j49K45q9L9j50L46k33j32M1J1J00j95
5827a69J98q1J40l4N7j97J7K1j0Rm3J69l6p3P6J17m0k0k06k3K70j39Nk0r9O5J0
5854c6q4Q2P2o7r7J87j30L0j6k3J89n6K4J01k86K40J25l21L8J13l02K52K02o3
5878A74k36J48n6M9k67K20j12J03P8l18J24J04Nj8j8p4K30k06R6N7j02j20L7J05
5902CJ04k01M2k4J08o0J3Pj8J27o2J02j08j4%j44L61k76k1J94M2k25P3j37q3K52
5928E5j02k17J79J37k59kJ67n9Q9P3k16J87q7o0QK49Rk18K58k32K2j52K06j2l7
5953a4L9p0L2J26r8j00Q2K01l69K05j56k0O0O6Q3k93J97p2L38l37K10j07j27J22
$$ plain form
5977 -2 22 139 -88 105 -62 -199 183 94 84 -93 -1 153 56 -39 -177 80 -249 210 -105 -29 -56 49 122 -82
6001 -82 15 44 -111 -65 16 -54 122 -143 25 -10 107 -31 88 67 -101 -9 -81 168 -227 84 5 164 -66 248
6025 248 113 -89 -48 214 232 -31 116 -51 110 63 354 195 46 -284 146 -82 -179 9 -143 -142 -157 -60 70
6048 70 20 -20 -80 59 45 -38 157 -106 -165 54 -93 59 58 -159 -89 -234 -101 11 -20 -10 -3 0 -66 0 -171 84
6074 84 128 -82 82 33 150 85 -108 -110 -9 7 217 71 -147 -153 4 32 -157 43 158 48 50 16 -1 -96 81
6099 81 2 31 -104 150 -32 8 193 -115 51 121 34 92 7 -49 80 83 -7 -65 100 66 212 103 178 -6 -133
6124 -133 -4 -62 -98 -177 29 -47 -36 0 42 -50 180 40 73 -219 -182 -15 23 33 25 178 -239 19 25 -104 22
6149 22 -22 -104 38 -34 -131 -167 96 -3 56 53 -25 -54 -45 -78 159 -202 164 -80 -7 35 -83 -1 -26 -110 -101 33 86 180
$$ packed form
5977bK4J17k27J93j67j37L82q9j0j77R2J54r7r5j38K57l29M59l15P6k7J05P3k04
6001h2R7K9j55M6Q1p0J76k65J68l5J17j38J19k1j68R2p2K49l95L11p9J59k30L14
6025B48j35k02M1K62J8k63J47j67J61m7K91j59j49l30M30k28r7J88j52Jj5R7J30
6048G0n0m0o0J39j4q3J95k63n9K19j47J52jk17P0j45J33J12l1J0PLo6O6j71K55
6074H4M4k10J64m9J17o5j93kJ01J6K10j46k18oJ57K8j89K00J15j10Kl4j7r5J77
6099H1p9K9j35K54j82M0J85l08J66P0q7N8q5n6J29Lr0n8J65l4J46j09P5j84j27
6124a33J29n8l6p9K06p6J1L6M2r2K30j40L3k92L7J67L8J0qJ53m17K58Oj29J26
6149B2m4q2J42p2r7l6K63r9N9lp8k9Rl3K37l61L66k44P3M2j18Q2k5q4RJ34N3R4
$$ plain form
6177 180 -204 75 28 -38 121 -2 50 -61 -133 14 -151 -119 -137 -77 -140 62 75 -132 22 136 -12 -233 -157
6200 -157 -83 43 99 47 38 31 21 -72 -152 -61 58 -160 -36 124 -1 -4 -37 17 82 -29 -124 -95 154 15 -205 125
6226 125 -173 68 -84 10 -74 161 39 -9 74 76 232 34 107 79 53 70 171 226 150 -1 49 110 4 -82 -61
6251 -61 -9 117 -60 -27 135 -152 70 -85 115 191 38 -62 -207 100 77 -2 -79 86 108 -12 -12 114 27 33
6275 33 -23 -32 38 123 -82 -132 32 -134 96 -63 -28 128 55 -187 46 -96 -63 27 -321 -113 131 -143 -21 14
6299 14 -4 -17 28 14 -171 34 4 -56 2 -59 -180 -46 2 78 -15 -20 -64 138 -224 52 73 106 -151 -32 -93 94
6325 94 -44 155 312 12 -111 -43 13 -145 -28 73 -81 -95 32 -133 296 38 64 -157 1 -39 100 29
6347 29 -112 68 103 -122 -164 -62 -102 -170 -104 -206 -148 3 -29 4 -150 142 207 41 -53 190 64 -37 -145 -31
$$ packed form
6177A80l84K79m7o6J59j23N2j11p2J47j65L2j8O0o3K02J3k07J54J14j48k21P6
6200a57P4J26N6n2rpj0r3q0R1J19k18J24J60j25ll3N4O5j11r5K9K49j39k20L30
6226A25k98K41j52R4q4K35j22m8Q3KJ56j98P3k8k6J7J01N5p6j51N0O1j06q6K1
6251f1N2J26j77L3J62k87K22j55K00P6j53j00j45L07k3p9p7J65K2j20%J26q7O
6275C3n6rP0Q5k05n0J64j66K30j59L5J56p3k42K33j42L3R0l48K08K44k74J22L5
6299A4j8j3M5j4j85K05l0o0N8o1j21J34M8P6r3nm4K02l62K76K1L3k57J19o1J87
6325I4j38J99J57l00j23O8N6j58J17J01j54j4J27j65M29k58K6k21J58m0J39p1
6347B9j41J80L5k25m2J02m0o8O6j02N8J51l2L3j54K92O5j66r4K43j26j01j08J14
$$ plain form
6371 -31 4 -181 -58 -130 110 132 49 129 190 -2 -25 -88 -182 54 -73 39 170 -94 -3 -25 260 85 80 -24 2
6396 2 -32 -57 -79 8 43 -183 111 -111 -142 -94 98 -142 11 143 -80 82 -22 210 175 -22 -34 -113 54 -224
6420 -224 180 80 -48 -76 -135 136 -146 -55 -96 -14 -234 76 136 -84 100 37 -149 -43 -211 21 103 -164 76
6443 76 78 46 -82 -19 -16 -3 98 56 -23 -52 -1 -89 192 56 -93 105 -5 -89 102 114 -67 -163 -49 13 -48 -110
6469 -110 5 25 -47 -76 388 196 143 97 -205 278 56 76 -47 123 228 179 85 179 25 -298 -147 13 -142
6492 -142 95 -253 -47 -275 -66 71 88 -118 -6 111 5 300 91 161 -31 -148 -3 33 -117 -83 -100 -246
$$ packed form
6371c1L5j85J23p2K40K2q3Q0O1j92k3o3r4K36j27J12J31k64R1k2K85j75nj04K6
6396Bl4k5k2Q7L5k26K94k22l1M8J92k40J53J32k23J62j04K32l5j97j2p9J67k78
6420b24M04j00j28k8n9K71k82R1m1Q2k20L10O0k20J84o3j86J06j68K32Q2k67K40
6443G6Kl2j28O3LJ3J01m2p9k9N1q8K81j36j49J98j10q4J91J2j81r6J14O2o1o2
6469a10J15K0p2k9M64j92n3m6l02M83k22K0j23J70J05m9r4R4j54l23J51J60j55
6492a42K37l48K06k28K09J37J7k06J12J17j06K95k09P0j92j17J45L6j50L4j7j46
$$ [...]
8191B41
##END NTUPLES=NMR FID
##END=
