##TITLE=1H_Pr Am-Bzl
 CDCl3, 8 sc, 
 6.08.2021
##JCAMPDX= 6.0         $$ Bruker NMR JCAMP-DX V2.0
##DATA TYPE= NMR FID
##DATA CLASS= NTUPLES
##ORIGIN= UXNMR, Bruker Analytische Messtechnik GmbH
##OWNER= root
$$ XWIN-NMR		Version 3.5
$$ Fri Aug  6 12:16:11 2021 Russian Standard Time (UT+4h)  she@DPX200
##.OBSERVE FREQUENCY= 200.131506
##.OBSERVE NUCLEUS= ^1H
##.DELAY= (6, 6)
##.ACQUISITION MODE= SIMULTANEOUS
##.ACQUISITION SCHEME= undefined
##.AVERAGES= 8
##.DIGITISER RES= 18
##SPECTROMETER/DATA SYSTEM= spect
##.PULSE SEQUENCE= zg30
##.SOLVENT NAME= CDCl3
##.SHIFT REFERENCE= (INTERNAL, CDCl3, 0, 15.7039)
##AUDIT TRAIL= $$ (NUMBER, WHEN, WHO, WHERE, WHAT)
$$ ##TITLE= Audit trail, XWIN-NMR		Version 3.5
$$ ##JCAMPDX= 5.01
$$ ##ORIGIN= Bruker BioSpin GmbH
$$ ##OWNER= she
$$ F:/spectra/data/she/nmr/H-F/1/audita.txt
$$ ##AUDIT TRAIL=  $$ (NUMBER, WHEN, WHO, WHERE, WHAT)
(   1,<2021-08-06 12:14:55.65 +0400>,<she>,<DPX200>,
      <created by zg, POWCHK disabled, PULCHK disabled
       configuration hash MD5:
       00 E9 B6 7A A2 85 ED C7 34 08 36 98 17 FE 4E 26
       data hash MD5: 16K
       95 5D 6D AA EF 61 3A 51 47 AC 89 9E 13 34 F3 7F>)
$$ ##END=
$$ 
$$ hash MD5
$$ 11 6E 81 7E 1D 77 1E B5 57 D6 CF 7E 76 DC 63 20
##$RELAX= 
##$RELAX= 
##$RELAX= 
##$RELAX= 
##$RELAX= 
##$RELAX= 
$$ Bruker specific parameters
$$ --------------------------
##$DU= <F:/spectra>
##$EXPNO= 1
##$NAME= <H-F>
##$PROCNO= 1
##$TYPE= <nmr>
##$USER= <she>
##$AMP= (0..31)
100 100 100 100 100 100 100 100 100 100 100 100 100 100 100 100 100 100 
100 100 100 100 100 100 100 100 100 100 100 100 100 100 
##$AQSEQ= 0
##$AQ_mod= 1
##$AUNM= <au_zg>
##$AUTOPOS= <>
##$BF1= 200.13
##$BF2= 200.13
##$BF3= 200.13
##$BF4= 200.13
##$BF5= 200.13
##$BF6= 200.13
##$BF7= 200.13
##$BF8= 200.13
##$BYTORDA= 1
##$CFDGTYP= 0
##$CFRGTYP= 5
##$CHEMSTR= <none>
##$CNST= (0..31)
1 1 145 1 1 1 1 1 1 1 1 1 1 1 1 1 1 1 1 1 1 1 1 1 1 1 1 1 1 1 1 1 
##$CPDPRG= <>
##$CPDPRG1= <>
##$CPDPRG2= <>
##$CPDPRG3= <>
##$CPDPRG4= <mlev>
##$CPDPRG5= <mlev>
##$CPDPRG6= <mlev>
##$CPDPRG7= <mlev>
##$CPDPRG8= <mlev>
##$CPDPRGB= <>
##$CPDPRGT= <>
##$D= (0..31)
0 1.2 0 0 0 0 0 0 0 0.06 0 0.03 0 0 0 0 0.0002 0 0 0 0 0 0 0 0 0 0 0 0 
0 0 0 
##$DATE= 1628237695
##$DBL= (0..7)
120 120 120 120 120 120 120 120 
##$DBP= (0..7)
150 150 150 150 150 150 150 150 
##$DBP07= 0
##$DBPNAM0= <>
##$DBPNAM1= <>
##$DBPNAM2= <>
##$DBPNAM3= <>
##$DBPNAM4= <>
##$DBPNAM5= <>
##$DBPNAM6= <>
##$DBPNAM7= <>
##$DBPOAL= (0..7)
0.5 0.5 0.5 0.5 0.5 0.5 0.5 0.5 
##$DBPOFFS= (0..7)
0 0 0 0 0 0 0 0 
##$DE= 6
##$DECBNUC= <off>
##$DECIM= 32
##$DECNUC= <off>
##$DECSTAT= 4
##$DIGMOD= 1
##$DIGTYP= 9
##$DL= (0..7)
0 120 120 120 120 120 120 120 
##$DP= (0..7)
150 150 150 150 150 150 150 150 
##$DP07= 0
##$DPNAME0= <>
##$DPNAME1= <>
##$DPNAME2= <>
##$DPNAME3= <>
##$DPNAME4= <>
##$DPNAME5= <>
##$DPNAME6= <>
##$DPNAME7= <>
##$DPOAL= (0..7)
0.5 0.5 0.5 0.5 0.5 0.5 0.5 0.5 
##$DPOFFS= (0..7)
0 0 0 0 0 0 0 0 
##$DQDMODE= 0
##$DR= 18
##$DS= 0
##$DSLIST= <SSSSSSSSSSSSSSS>
$$ [...]
##$SUBNAM2= <"">
##$SUBNAM3= <"">
##$SUBNAM4= <"">
##$SUBNAM5= <"">
##$SUBNAM6= <"">
##$SUBNAM7= <"">
##$SUBNAM8= <"">
##$SUBNAM9= <"">
##$SW= 20.0188882624521
##$SWIBOX= (0..15)
0 0 2 0 0 0 0 0 0 0 0 0 0 0 0 0 
##$SW_h= 4006.41025641026
##$TD= 16384
##$TD0= 1
##$TE= 0
##$TE2= 300
##$TE3= 300
##$TEG= 300
##$TL= (0..7)
0 120 120 120 120 120 120 120 
##$TP= (0..7)
150 150 150 150 150 150 150 150 
##$TP07= 0
##$TPNAME0= <>
##$TPNAME1= <>
##$TPNAME2= <>
##$TPNAME3= <>
##$TPNAME4= <>
##$TPNAME5= <>
##$TPNAME6= <>
##$TPNAME7= <>
##$TPOAL= (0..7)
0.5 0.5 0.5 0.5 0.5 0.5 0.5 0.5 
##$TPOFFS= (0..7)
0 0 0 0 0 0 0 0 
##$TUNHIN= 0
##$TUNHOUT= 0
##$TUNXOUT= 0
##$USERA1= <user>
##$USERA2= <user>
##$USERA3= <user>
##$USERA4= <user>
##$USERA5= <user>
##$V9= 5
##$VALIST= <valist>
##$VCLIST= <CCCCCCCCCCCCCCC>
##$VD= 0
##$VDLIST= <DDDDDDDDDDDDDDD>
##$VPLIST= <PPPPPPPPPPPPPPP>
##$VTLIST= <TTTTTTTTTTTTTTT>
##$WBST= 1024
##$WBSW= 4
##$XGAIN= (0..3)
0 0 0 0 
##$XL= 0
##$YL= 0
##$YMAX_a= 643956
##$YMIN_a= -980744
##$ZGOPTNS= <>
##$ZL1= 120
##$ZL2= 120
##$ZL3= 120
##$ZL4= 120
##$ABSF1= 10
##$ABSF2= 0
##$ABSG= 5
##$ABSL= 3
##$ALPHA= 0
##$AQORDER= 0
##$ASSFAC= 0
##$ASSFACI= 0
##$ASSFACX= 0
##$ASSWID= 0
##$AUNMP= <proc_1d>
##$AZFE= 0.1
##$AZFW= 0.1
##$BCFW= 1
##$BC_mod= 2
##$BYTORDP= 1
##$COROFFS= 0
##$CY= 11.3945322036743
##$DATMOD= 1
##$DC= 2
##$DFILT= <>
##$DTYPP= 0
##$F1P= 2.36226072786647
##$F2P= -0.459571619588291
##$FCOR= 0.5
##$FTSIZE= 0
##$FT_mod= 4
##$GAMMA= 1
##$GB= 0.15
##$INTBC= 1
##$INTSCL= 1
##$ISEN= 128
##$LB= 0.24
##$LEV0= 0
##$LPBIN= 0
##$MAXI= 10000
##$MC2= 0
##$MEAN= 0
##$ME_mod= 0
##$MI= 1.114404
##$NCOEF= 0
##$NC_proc= 0
##$NLEV= 6
##$NOISF1= 3.799351
##$NOISF2= 2.8
##$NSP= 1
##$NTH_PI= 0
##$NZP= 0
##$OFFSET= 15.70392
##$PC= 1
##$PHC0= -13363.72
##$PHC1= 21.60099
##$PH_mod= 1
##$PKNL= yes
##$PPARMOD= 0
##$PSCAL= 0
##$PSIGN= 0
##$REVERSE= no
##$SF= 200.130013532006
##$SI= 16384
##$SIGF1= 3
##$SIGF2= 2
##$SINO= 400
##$SIOLD= 16384
##$SREGLST= <1H.CDCl3>
##$SSB= 0
##$STSI= 0
##$STSR= 0
##$SW_p= 3612.71676300578
##$SYMM= 0
##$S_DEV= 0
##$TDeff= 0
##$TDoff= 0
##$TI= <>
##$TILT= no
##$TM1= 0
##$TM2= 0
##$TOPLEV= 0
##$USERP1= <user>
##$USERP2= <user>
##$USERP3= <user>
##$USERP4= <user>
##$USERP5= <user>
##$WDW= 1
##$XDIM= 8192
##$YMAX_p= 0
##$YMIN_p= 0
$$ End of Bruker specific parameters
$$ ---------------------------------
##NTUPLES= NMR FID
##VAR_NAME=  TIME,          FID/REAL,        FID/IMAG
##SYMBOL=    X,             R,               I
##VAR_TYPE=  INDEPENDENT,   DEPENDENT,       DEPENDENT
##VAR_FORM=  AFFN,          ASDF,            ASDF
##VAR_DIM=   8192,          8192,            8192
##UNITS=     SECONDS,       ARBITRARY UNITS, ARBITRARY UNITS
##FACTOR=    0.0002496,     1,               1
##FIRST=     0,             0,               0
##LAST=      2.0444736,     0,               0
##MIN=       0,             -980744,         0
##MAX=       2.0444736,     643956,          0
$$ Real data points
##PAGE= N=1
##DATA TABLE= (X++(R..R)), XYDATA
0@%%%%%%%Qj6J6j6K4m0M8n6P2q8J12j43J74k07K47k94L47m08M75n56O48p46Q58
30D59r84J124j279J451j645J856k086K340k618K926l263L629m028M467m947N469
46B871o040O663p345Q094q916R821j0821J1934j3175J4567j6144J7939k0011K2435
60A1872k5307K8781l3085L8575m5858N6040p1388R7434j52932M70806o02762o11144
72h38968J319953Q5990q83716M8616P09366l00704m05251K36695K31085j79929
82B3137p322l2515j13582J70112K37181l28574k61997L44899K18910l50434o4744
93a64929L09249p4309l07037J37158K25775r8482q3107M6866j22363j7721K71535
104A22635M352l43730K7197L24921q3020k54172J49589J48479k06319o1808K22197
$$ plain form
0 0 0 0 0 0 0 0 0 8 -8 8 -8 16 -24 24 -32 40 -48 64 -79 95 -112 135 -159 188 -220 255 -301 347 -399 459
30 459 -525 599 -680 771 -874 982 -1104 1236 -1382 1544 -1719 1910 -2118 2349 -2598 2871
46 2871 -3169 3494 -3851 4243 -4673 5148 -5673 6261 -6914 7653 -8491 9448 -10563 11872
60 11872 -13435 15346 -17739 20836 -25022 31018 -40370 57064 -95868 374938 -227824 -838968
72 -838968 480985 566975 -316741 -268125 441241 140537 -264714 -28019 203066 23137
82 23137 15815 -16700 -130282 39830 277011 -51563 -313560 31339 250249 -100185 -164929
93 -164929 144320 70011 -237026 -99868 125907 27425 -55682 -8816 -131179 -148900 122635
104 122635 126987 -216743 -189546 135375 52355 -201817 -52228 96251 -110068 -171876 50321
115E0321J8919j58226q179K5747j1860J07211M9154j70527n3891J67423k842j31465
127a18215J04471J09178j93053p6755K43601K6212k38686O5175J96601j75560
137e7031j16625K96036M6703l76070J0503L89718n3488l19207J24833K25319k01025
148c0334j41445K50738R3396k23872m3833J44524q282l8259O2053m8526q3100
159f6940J10576P1381j31042j6697J31058n7020j22638J29601J21846j58480j01727
170i0082J40374M6628r5309L8961N8016j11649l0608J38190m219j14823N2666
181B8145O1441j06553q337J40892l2834j49112M9992J15699o0461n7673O5990
192D7189j1466p9039M8441O9620n5646l3355L4276l9567j9462J03052j299j42270
$$ plain form
115 50321 69240 -88986 -97165 -71418 -83278 23933 73087 -97440 -151331 16092 13250 -118215
127 -118215 -13744 95434 -97619 -174374 69227 95439 -143247 -78072 118529 -57031
137 -57031 -173656 122380 169083 -206987 -196484 193234 139746 -179461 -54628 170691 -30334
148 -30334 -171779 78959 172355 -51517 -95350 49174 40892 2633 64686 16160 -66940
159 -66940 43636 115017 -16025 -32722 98336 41316 -81322 48279 170125 11645 -90082
170 -90082 50292 96920 1611 40572 98588 -13061 -43669 94521 90302 -24521 28145
181 28145 89586 -16967 -25304 115588 82754 -66358 -16366 99333 38872 -18801 47189
192 47189 35723 -43316 5125 74745 19099 -14256 20020 -19547 -39009 64043 62744 -79526
204g9526K4610J34754p1528j08342J20488O7784j69775l9443J90900J3947j82113
215i8244J191J34970k4175p8911M4608L1234n3590j0452K9433J319K0097O112
227C592p4683j7146J07975K1677j14175j0946J02607j4990q3691M7937O7925o9641
239c3559n2384P2206L5988m8505n671J7619l1200J2016O4680k3250o9335L1003
251c0392N3190l6705k2171N2360L200n7962O834N3207n12k5287k812o482P533
264e999L9774k815n3703P085N4126j7956l9273M3804L1422o3982k7213P3268K7644
277F6182o0571j5033L9970n383j7196K8417L889l7925M898L2884j2750j4181K4453
290C7654p792l5540K1235L9849k1948l2143J3135J0840q078J1921O263k7966p061
$$ plain form
204 -79526 -54916 79838 8310 -100032 20456 88240 -81535 -120978 69922 83869 -98244
215 -98244 -97053 37917 13742 -65169 -20561 10673 -42917 -53369 -23936 -22617 -2520 3592
227 3592 -71091 -88237 19738 41415 -72760 -83706 18901 3911 -79780 -31843 36082 -33559
239 -33559 -85943 -13737 22251 -26254 -31925 -14306 -45506 -33490 31190 7940 -61395 -30392
251 -30392 22798 -13907 -36078 16282 19482 -38480 -31646 21561 21049 -4238 -7050 -13532 -5999
264 -5999 33775 30960 -22743 -15658 38468 20512 -18761 25043 56465 -7517 -34730 38538 66182
277 66182 5611 -9422 30548 25165 7969 36386 40275 2350 7248 40132 27382 13201 37654
290 37654 29862 -5678 15557 55406 33458 1315 14450 25290 17212 29133 35396 7430 369
303C69K6294k648j9026J8030Q189l9840o639N0305M022n3119l067L8876p822k5611
317a1687J7009J1269k8658r598K5872N892j5207m401o709n233J7931J1558k4325
330a6287j3698J8564K714j6465J0307J4914k3781j6975K5058J4829k0099q382
342b9301J0313n029m562J8679K089k5165j265K1354k270j0787J2679J744k2166
355c3687K613K7410j604j9387K861P106l616O960R262j1913q600J3471N970p904
369a1058O721O329j5512m502K3450Q569j9081m920J3732j86m609J1771L832j4801
383b65k362J4606N070o165K39M12m851N952J0788n341q119M649L032k778O732
398B1599N657j2004q125J2628R248p696m413L160k412k594P525L019q523l881
$$ plain form
303 369 26663 24015 4989 23019 31208 -8632 -15271 35034 39056 -14063 -17130 21746 13924 -11687
317 -11687 5322 16591 -12067 -21665 4207 10099 -5108 -9509 -16218 -21451 -3520 8038 -16287
330 -16287 -29985 -11421 -8707 -25172 -14865 49 -23732 -40707 -15649 -820 -20919 -29301
342 -29301 -18988 -24017 -28579 -9900 -7811 -32976 -34241 -12887 -15157 -25944 -13265 -11521 -33687
355 -33687 -31074 -3664 -5268 -24655 -21794 -14688 -18304 -11344 -2082 -13995 -22595 -9124 -3154 -11058
369 -11058 -4337 1992 -13520 -18022 5428 13997 -5084 -10004 3728 3542 -1067 10704 14536 -265
383 -265 -2627 11979 17049 10884 11123 11535 6684 12636 23424 18083 9964 14613 17645 14867 21599
398 21599 27256 15252 7127 19755 29003 21307 16894 20054 17642 15048 22573 25592 17069 13188
412A3188M125m7j009N748k285j3410p78J5089K061j5443m209P844J074n649M25
427F724K136k027o673m424N804J0505o099k0088P86K0578k61k1183j278J5154
441c46l026j4430M005J1787n393j3543m28J0774O082q424j2096Q37J2382L730
455h089j1324o562R339N074j0363l611J2341M845j4210p627J3865J1088q613j1982
469b5829M284J1524M33o943O36M658j353j152L854K946r60m34l81j732N381Q424
485C356l799j0555K621J3739L338j0443m255Q454P335l211o399L161R919k60j2653
500C48j276K0456R029k5101j5772K9756K4820l0234k8334L1794L0514l2416k9261
513a5677L4851K9242l4638k9035L1023L0312k4687k8927J5456K4254o339j8767
$$ plain form
412 13188 17313 17266 16257 22005 19720 6310 5532 20621 22682 7239 3030 10874 11948 6299 6724
427 6724 8860 6833 160 -4264 1540 12045 5946 -14142 -13356 7222 6961 -14222 -15500 -346
441 -346 -3372 -17802 -13797 -2010 -7403 -20946 -21374 -10600 -4518 -12942 -25038 -24201 -11819 -8089
455 -8089 -19413 -25975 -16636 -11562 -21925 -25536 -13195 -8350 -22560 -30187 -16322 -5234 -13847 -25829
469 -25829 -21545 -10021 -9588 -16531 -15895 -11237 -12590 -13742 -9888 -6942 -7902 -8336 -8717 -10449 -5068 3356
485 3356 -443 -10998 -8377 5362 8700 -1743 -5998 2456 9791 6580 181 3342 13261 13001 348
500 348 -928 19528 28557 3456 -12316 17440 42260 12026 -16308 15486 46000 13584 -15677
513 -15677 19174 48416 13778 -15257 15766 46078 21391 -7536 7920 32174 25835 7068
525G068l109J2989R617j0669j7089P618K4481p683l5692O290M0009n226m4707
538a6103J518M0531l87l9730k21L3241l687k9188J917K2677l082j9044K8Q546
552b984P24j32l052j1370K216J6227m031k0906M511K1560j0145k2213J4103J9595
566D103j7722j6416J6710J2027j8058l815J7611o223j7546J6066J8768k5173j8399
579c8067L3974J4446l8268p289M2019J952m1945M056M0596n199l4071P714K6092
592F010n643j2637M986J821j057R664j072j6811Q596K6532j5402l0795K3613L7180
606C4985k7483l7580K9741L9042k7691l3855K6140K9528k2244k2436J7570K0161
618B5878r698j7234K591J5199N693j1592j1655Q939J7167n410k0809L139K3707
$$ plain form
525 7068 3959 16948 26565 15896 -1193 6425 30906 23223 -12469 -6179 33830 28604 -16103
538 -16103 -14585 25946 25559 -14171 -14392 18849 15162 -14026 -12109 10568 7486 -11558 -11530 -2984
552 -2984 -2260 -2392 -5444 -16814 -14598 1629 -2402 -23308 -18797 2763 -7382 -29595 -15492 4103
566 4103 -13619 -30035 -13325 -1298 -19356 -23171 -5560 -11783 -29329 -13263 5505 -19668 -38067
579 -38067 -4093 10353 -27915 -35204 6815 8767 -33178 -29122 11474 6275 -27796 -20082 6010
592 6010 367 -12270 -7284 -5463 -6520 3144 2072 -14739 -6143 20389 4987 -25808 -2195 34985
606 34985 7502 -30078 -337 38705 11014 -22841 3299 32827 10583 -11853 5717 25878
618 25878 16180 -1054 1537 16736 22429 10837 -818 8121 25288 19878 -931 2208 25915
631B5915k059k5595K674K6158l716k6580J105K7283j825k5352J726K2098m586
644A7246k0249P292J7039j2667j5124J4703J1190j8307p787J8371J596k0693K869
657d521J7946o999j8219P414J3529q463r425M555K875l025R35k115o117O189O292
672H51j2205p365J5329P743k0217q969K1575Q074k1144q635J7771Q249j4319q070
686b1332J1022P920p182j0714L990J3800o18j5832j646J5963M969j4487n701J2705
700g143Q226j0521q415R556J1284p216j2004N526J6060k135j5505K15J8229R50
714G107j5737l13J6403j99j3167K415J2112k051q719L573O522j814j967K849j280
729E734j397M978J525n831J10O308n90n162K825M362k106l855J563L296j18j518
$$ plain form
631 25915 23856 -1739 935 27093 23377 -3203 -2098 25185 23360 -1992 -266 21832 17246
644 17246 -3003 4289 21328 8661 -6463 8240 19430 1123 -6664 11707 13303 -7390 -4521
657 -4521 13425 6426 -11793 -4379 9150 687 -8738 -4183 -1308 -4333 -3398 -5513 -11630 -5441 851
672 851 -11354 -18719 -3390 4353 -15864 -24833 -3258 4816 -16328 -24963 -7192 1057 -13262 -21332
686 -21332 -10310 -2390 -9572 -20286 -16296 -2496 -3114 -18946 -20592 -4629 340 -14147 -19848 -7143
700 -7143 1083 -9438 -17853 -8297 2987 -4229 -16233 -10707 5353 3218 -12287 -12072 6157 7107
714 7107 -8630 -8943 7460 7261 -5906 -3491 8621 6570 -2149 1424 7946 6132 4165 7014 5734
729 5734 4337 9315 10840 5009 5119 11427 10837 5675 8500 12862 10756 6901 8464 11760 11642 10124
745A0124l35j153J444K833k513l461K509L303l377l088L161K694o042m58K526
760H167J292k282j699n63L67J645p05l931l36L269r03m639K23L703j568n672J446
777b186L668j553l847q72J408J863j907l521L33K913j339m935J649N289m430n908
793a3375M250N003m440m804M287K162l997p44K857o98j633N48M09K10J164r13
809i714j736J390L172j632k288K545K036k401j88L466J16k535J493K646j104K62
825d472J988q97q00K646K099k674k63L766P43k412J147L162m45k150J398K403
841E239N60p36o77J189K435l86k255J053L227n99k594R87L534r26k903R60K911
858A1019m84k141N7J667k49l94q5r61K84J620k270j019J851L85k551j724K158
$$ plain form
745 10124 9789 8636 10080 12913 10400 6939 9448 12751 9374 6286 9447 12141 6099 5641 8167
760 8167 9459 7177 5478 4915 5282 6927 6222 2291 1955 5224 4321 -318 -95 3608 2040 -3632 -2186
777 -2186 1482 -71 -3918 -4790 -3382 -1519 -3426 -6947 -6614 -3701 -5040 -9975 -8326 -3037 -7467 -13375
793 -13375 -9125 -4122 -8562 -13366 -9079 -6917 -10914 -11658 -8801 -9499 -11132 -10584 -10175 -9965 -8801 -9714
809 -9714 -11450 -10060 -6888 -8520 -10808 -8263 -6227 -8628 -8816 -5350 -5234 -7769 -6276 -3630 -4734 -4472
825 -4472 -2484 -3381 -4181 -1535 564 -2110 -2373 1393 2136 -276 871 4033 3588 1438 2836 5239
841 5239 5799 5063 4386 5575 8010 7624 5369 6422 9649 9050 6456 7443 10977 10051 7148 8108 11019
858 11019 10535 8394 8451 10118 9869 9475 9390 8429 8713 10333 8063 7044 8895 9280 6729 5005 7163
875G163J550l074j923J583Q99j551j352l94O32l27k075n22R86L73l054k450L308
892b28J053m296j869L396J358n308q26L342l1l959j002L328J75l303j057J770
908g457L92j317j484Q91J819q67k691J195K694j218l002O22L986j390l178J992
924i013J986o56j215J902N16r47P84J303j339J086K325j977j044L201J730k121
940c479j80L174P18j904J171J806j62R7R24m06J68K766m40k048K366K441j763
957E249k170L571J557j930p21K635l67j011J687L03k304K517J727l667j304M542
973A0314J354n736l03M947k83m946M19L766o39k707q20J414P91p19k507j035L234
990F544O18m781j634M639N67n073k056M944n2m936q52L135j95k070j861N29M87
$$ plain form
875 7163 8713 5639 3716 5299 6198 4647 3295 2901 3533 3206 1131 609 1595 1968 -1086 -3536 -228
892 -228 825 -3471 -5340 -1944 -586 -5894 -6720 -3378 -3409 -7368 -8370 -5042 -4867 -8170 -9227 -7457
908 -7457 -7065 -8382 -9866 -8975 -7156 -8023 -10714 -9519 -6825 -8043 -11045 -10423 -6437 -7827 -11005 -9013
924 -9013 -7027 -7683 -8898 -6996 -6480 -7427 -6643 -5340 -6679 -5593 -3268 -5245 -6289 -3088 -1358 -3479
940 -3479 -3659 -485 233 -1671 -500 1306 1144 1241 2165 1759 1927 4693 4253 2205 4571 7012 5249
957 5249 3079 6650 8207 6277 5556 8191 7824 6813 8500 8803 6499 9016 10743 7076 5772 10314
973 10314 11668 5932 5629 10576 10293 5347 5766 9532 8893 6186 5366 6780 7571 6852 4345 3310 6544
990 6544 7162 2381 747 5386 5953 880 -1176 3768 3716 -1220 -2072 1063 868 -1202 -3063 -2534 -2047
1007b047K62j721j960J582J392k982j234K125M3j888q51J175n91l1J173k384j939
1024i876L694J466n151q96O078J25o538M63O781j939n012K975L117k868o88L502
1040d767j412k165M600J576p016R21R218k184q564M589R116m649p400O078O768
1055D709n578l715N103K908k505p31R36K60J868J456l084j288O415J171o810j20
1071I95P658L84o578l35O644O65m700j350M629K335l773l149L430L989l782l579
1087C483L861K985m880j024M190r02l740L419J232n561O7O368k967o965N163N537
1103A0266p977m673Q887J247r362M21P985l894o978O241K663q799Q6R059n190
1118a8q734P402P423j1021n563J1122K318j1368l36R037k139o701K393L192k653
$$ plain form
1007 -2047 -1785 -3506 -5466 -3884 -2492 -5474 -6708 -4583 -4540 -6428 -7279 -6104 -6695 -6726 -5553 -7937 -9876
1024 -9876 -6182 -4716 -9867 -10763 -4685 -4560 -11098 -10635 -3854 -5793 -10805 -7830 -4713 -7581 -8269 -4767
1040 -4767 -6179 -8344 -3744 -2168 -9184 -8263 955 -1229 -9793 -5204 3912 -737 -8137 -2059 4709
1055 4709 -869 -4584 519 3427 922 191 1127 1387 3255 4711 1627 339 6754 7925 1115 995
1071 995 8653 9037 2459 2124 8768 9433 4733 3383 8012 10347 6574 3425 6855 10844 7062 3483
1087 3483 7344 10329 5449 4425 8615 7713 3973 7392 8624 3063 3130 9498 6531 -434 4729 10266
1103 10266 2289 -2384 6503 7750 -1612 -1191 6794 2900 -4078 2163 4826 -3973 -3887 5172 -18
1118 -18 -8752 -1350 6073 -4948 -10511 611 2929 -8439 -8775 262 -1877 -8578 -6185 -2993 -5646
1133e646m39J540k679o36M686j521n587K327O413l774o474M705N853l778n460
1148a0470L858M055j994l626O48L590J866m007k380N293L153n323k756O733K123
1163G63n368j030N650M17l966K490J706k724J771L289l877j928P444M91q399K732
1179e39R031m380p635O829O408p749k969R052j83p725L472O308n315l547P195
1194H253Q22p084J860O907m374m512N044K166n388O06M296k505l003L756N43m523
1210B864J876L676l918l476M861J563n258q52M356j679l042J297N87j023L02l74
1226A760k837J577K672m491k579N093J042o757l98O837k420n971L045L395m259
1241d291k237M161j128k920K656O30l857L17M989l203n039M631L748o282j974
$$ plain form
1133 -5646 -6085 -4545 -7224 -7860 -3174 -4695 -10282 -7955 -1542 -5316 -11790 -7085 -1232 -5010 -10470
1148 -10470 -6612 -2557 -4551 -8177 -7529 -3939 -2073 -6080 -8460 -3167 -14 -5337 -8093 -1360 763
1163 763 -4605 -5635 15 432 -3534 -1044 662 -2062 -291 2998 -879 -2807 4637 5128 -3271 -539
1179 -539 8492 4112 -3523 3306 9714 1965 -1004 8048 7865 140 3612 9920 4605 1058 8253
1194 8253 9075 1991 3851 10758 6384 1872 6916 9082 3694 4300 8596 6091 3088 6844 7387 2864
1210 2864 4740 8416 4498 1022 5883 7446 2188 1336 5692 4013 971 2268 2855 1832 2134 1760
1226 1760 -1077 500 3172 -1319 -3898 1195 2237 -4520 -4918 1919 -501 -6472 -3427 -32 -4291
1241 -4291 -6528 -2367 -3495 -6415 -3759 -3129 -6986 -6669 -1680 -4883 -9922 -5291 -1543 -7825 -9799
1256i799P200m57o780K431O225m915l241N753M25n259K201M446l630j669N094
1271a975l27m346K366M168l782k366N875P49n702K050N032k275l489M566J914
1286B458m026N70M122j740k057L407Q31k872J330L380k987j553M792K3m510K553
1302C721M104l464k356M334O91l983J321L468k421k190L639J94l157J389K480
1317G770k442j973L451P7l618J447K620l077j411L394p37l930K266K275m116j361
1333F35M081p22m620J956L460l864k850M084K48m727J019L255l076k714L676K5
1349a34m551J531L133l556k263L913N4m467Q49L697k934k518L333Q14l698L28
1365f469L514k767k342L828L14l748J284L562k781k047L567P09l323P37L264j744
$$ plain form
1256 -9799 -2599 -3056 -9836 -7405 -1180 -6095 -9336 -3583 -3158 -8417 -6216 -1770 -5400 -7069 -1975
1271 -1975 -2302 -6648 -4282 -114 -3896 -6262 -387 362 -5340 -3290 1742 -533 -4022 544 2458
1286 2458 -1568 -998 3124 1384 -673 2734 3565 693 2023 5403 2416 863 5655 5678 1168 3721
1302 3721 7825 4361 2005 6339 7030 3047 4368 7836 5415 3225 6864 7058 3901 5290 7770
1317 7770 5328 3355 6806 6883 3265 4712 7332 4255 2844 6238 5501 1571 3837 6112 1996 635
1333 635 4716 3994 -626 1330 4790 926 -1924 2160 2408 -2319 -1300 1955 -1121 -3835 -159 -134
1349 -134 -4685 -3154 -21 -3577 -5840 -1927 -1873 -6340 -5491 -1794 -4728 -7246 -3913 -3099 -6797 -6469
1365 -6469 -2955 -5722 -8064 -4236 -3922 -7670 -6386 -2824 -5605 -7652 -4085 -3376 -6699 -5962 -2698 -4442
1381d442j667K778R84k925O08L174j397j664K986P06k496P33K563l02k001K069
1397b93J368j838P41K316j822p47L029Pk143J440K671k306j659L519J176l681
1413A778J176L439j730k264K444J385k727M82K023p94j496J873K63k187R90J669
1429F324j507j505K003O04l061N86K452j927j573J703Q72k701J27K478j959j834
1445A082K014K9k664M19K182j628k432J992Q02k997j10K343j329k317J246J267
1461a01k377n54J678p84j653J094M40j876J67J320j120j132J164M25j819M20J248
1478c460j284j178K011K61k052P72J668j253j300K139J37j805N75J870r95q03
1494d697J317Q49j201N54J081l71m89J356J0r33J111J372j465m18K347L85k294
$$ plain form
1381 -4442 -6109 -3331 -2347 -5272 -4664 -1490 -2887 -4551 -1565 -859 -3355 -2622 -59 -361 -2362 -293
1397 -293 1075 -763 -22 2294 472 -275 2754 2761 618 2058 4729 2423 764 4283 5459 1778
1413 1778 2954 6393 4663 2399 4843 6228 3501 3983 6006 5212 3716 5589 5852 3665 4655 6324
1429 6324 4817 3312 5315 5919 2858 3444 5896 3969 2396 4099 4971 2270 2397 4875 2916 1082
1445 1082 3096 3125 461 880 3062 1434 -998 994 1796 -1201 -1311 1032 -297 -2614 -1368 -101
1461 -101 -2478 -3032 -1354 -2138 -3791 -2697 -2257 -4133 -3966 -2646 -3766 -4898 -3734 -3309 -5128 -4708 -3460
1478 -3460 -4744 -5922 -3911 -3650 -5702 -4930 -3262 -4515 -5815 -3676 -3539 -5344 -4769 -2899 -3894 -4697
1494 -4697 -3380 -2531 -3732 -3178 -2097 -2468 -2957 -1601 -1591 -2524 -1413 -41 -1506 -1924 423 808 -1486
1511a486R71K616j089j774K055J312j545n74K304j9j414J039J318j260l10J798
1527C942Rj268N72J233o55n46O26O57q42pO69j47m75L77j33k13L83J8p62j56P46
1548D028j62r67K95L90n75l71J90l02l31K67m22p13N90K76j523n50J522l93j890
1567f41M13J326j081j728R87P52j412q05J116k33j598M90Q42j056o58R50j05j096
1585c537K47P94r55p70Q83K37j297J96R47n09n85P30K02q10L3Q83J29j048M34
1604c796J067l87j108Q19J495o86j275J077J568q26j296J169J724j014j041J373
1620a137J269j077p32J468P49q32J0J069L21m89L29N30l14J85R82m65k68R55N42
1639C095o50n68J385M02r12m8J143L1j044L51J216o67q16O93Q43j332p1J191j3
$$ plain form
1511 -1486 -515 2101 1012 -762 1293 2605 1060 486 2790 2771 1357 2396 3714 2454 2144 3942
1527 3942 3951 2683 3255 4488 3833 3287 3913 4570 3728 3721 4390 4243 3768 4145 4012 3799 4182 4200 3438 3282 4028
1548 4028 3866 2899 3194 3584 3009 2638 2828 2526 2195 2462 2040 1327 1917 2193 670 120 1642 1249 -641
1567 -641 -228 1098 17 -1711 -724 28 -1384 -2189 -1073 -1306 -2904 -2414 -1572 -2628 -3286 -2336 -2441 -3537
1585 -3537 -3290 -2496 -3451 -4221 -3338 -3101 -4398 -4202 -3255 -3764 -4349 -3619 -3417 -4227 -4194 -3311 -3182 -4230 -3796
1604 -3796 -2729 -3116 -4224 -3405 -1910 -2596 -3871 -2794 -1226 -2052 -3348 -2179 -455 -1469 -2510 -1137
1620 -1137 132 -945 -1677 -209 540 -292 -282 787 1108 619 948 1478 1164 1349 2331 1866 1598 2553 3095
1639 3095 2445 1877 3262 3664 2752 2704 3847 3878 2834 3185 4401 3734 2918 3611 4454 3122 3051 4242 4229
1658D229j541M71R86r23r69J010O50j238m34J012r3j318j06J092q32p70L02K92
1676A820q49k91L09j99r27M26K65p58r10N26N85j060p33O46L25j287l84P41k6
1695a781p27j65M53k85p10L85J65q11M7O95o71r07Q62R30j210p87J479L26j519
1714d231l02J611N41j860J51J835k46j521N77J439k65j304R85J161m76m86P77
1731a614M00k03K34K08K42K8O11J09m46R76N29o72q8J014N16j049L62J408o2j233
1751A270N96J567m98j325J213J049q58p54J013O81j037j36P98L96p05k62P65l9
1769C734n79J32K67k37j42M92o86m45O12Qq62j73Q14j34j385n2J008n29j073K89
1789A059P18q27j040N05O38p40q22K50K79o84l36Q2J46p60j15J13j80m55P8o4
$$ plain form
1658 4229 2688 3159 4145 3222 2253 3263 3913 2675 2241 3253 3160 1842 1736 2828 1996 1226 1528 1820
1676 1820 971 680 989 790 -137 289 554 -204 -1114 -588 -3 -1063 -1796 -1150 -825 -2112 -2496 -1755 -1781
1695 -1781 -2508 -2673 -2220 -2505 -3215 -2830 -2665 -3476 -3429 -2734 -3405 -4312 -3450 -2520 -3730 -4517 -3038 -2712 -4231
1714 -4231 -4533 -2922 -2381 -4241 -4090 -2255 -2501 -4022 -3445 -2006 -2271 -3575 -2590 -1429 -1905 -2391 -1614
1731 -1614 -1214 -1417 -1183 -975 -733 -705 -94 15 -431 545 1074 402 314 1328 1844 795 1157 2565 2503 1270
1751 1270 1866 3433 2935 1610 2823 3872 3014 2260 3273 3954 2917 2781 3579 3975 3270 3008 3773 3734
1769 3734 3155 3287 3554 3317 3175 3667 2981 2536 3148 3156 2294 2121 2935 2801 1416 1364 2372 1843 770 1059
1789 1059 1777 950 -90 415 1053 313 -509 -259 20 -664 -1000 -918 -772 -1532 -1647 -1534 -1714 -2169 -2091 -2155
1809b155m06K78q6o49j85N37j50p32K90O24m11p88K75Q84n26p52O78N66o08k89
1829c605P85J48o56K13O49k6j69K44J86j13K46J83O8J49M05L34l73M19M88N0k41
1850f16K29P75k65n5N53O91m99qM56M68l08J5M76K79o6j41M37L50l70j40Q58l2
1872C087n16M35K68k59l09N56P0l30j89L11P6m13J3L06j77m40L9K25l57k04J49
1893B341l6n03p7n5j90j94j3m0n41K9J01n35k07O8n1n08j03L40m27m85J89J03
1915g94n76m04L17K10p18l92O49Pq66J40K58q3n38n0L62Q3k96m34L53M53o65k10
1937c194O64J87l20l50M99M06l37l06P13K93n14K06K66J01O6j98J65L95J37o5
1957a186o0P35q3l7q1Q42J55n71r7J034L0n29K84P48K02l81K97J13L48k51K16
$$ plain form
1809 -2155 -2561 -2283 -2369 -3018 -3203 -2666 -2816 -3548 -3258 -2634 -3045 -3833 -3558 -2674 -3200 -3952 -3274 -2708 -3316 -3605
1829 -3605 -2820 -2672 -3328 -3115 -2466 -2492 -2661 -2417 -2231 -2344 -2098 -1915 -1847 -1698 -1293 -959 -1332 -913 -425 -375 -616
1850 -616 -387 388 123 68 621 1312 813 805 1261 1729 1421 1436 1912 2191 2125 1984 2421 2771 2401 2261 3119 3087
1872 3087 2571 3006 3274 3015 2706 3262 3332 3002 2813 3124 3200 2787 2800 3106 2929 2489 2528 2753 2396 2192 2341
1893 2341 2305 1802 1725 1670 1480 1286 1273 1233 692 721 822 287 80 148 97 -411 -514 -174 -601 -1086 -897 -794
1915 -794 -1370 -1774 -1457 -1247 -1965 -2357 -1708 -1701 -2567 -2427 -2169 -2252 -2790 -2840 -2478 -2395 -2691 -3125 -2772 -2319 -2984 -3194
1937 -3194 -2530 -2343 -2663 -3013 -2514 -2108 -2445 -2751 -2038 -1745 -2259 -2053 -1787 -1686 -1620 -1818 -1653 -1258 -1121 -1186
1957 -1186 -1246 -511 -594 -631 -712 130 285 -286 -383 651 681 152 436 1184 1386 1005 1302 1415 1763 1512 1728
1978A728K41K00l53j25L55O63o12N0K33J68J47m15M05J85k12mJ5j00l79K4K50
1999B464l03j07J15k52J41j19r2j98l6L11q49k42J77L20l21o81M63r1n59n4L43
2020D30m35l62j4K87n14k30L20k99k34q4L12l84o35L13M60j157J55P43n10q50
2040b688P24L41o45k61K43P08p41l63P05K68j026J36J049m07n07J55M04l38k31
2059b474N30J44Q8k77K14o9M05J99L34n0L5j15K90k37M19N86m26J55L37J80k98
2080c0j6O90O34o53j2Q00l3p13J95J304o05p82P85J087j06j574J130P75r12k82
2100A682Q05k28m09J07M99M28j065P52K30m08j06m25j10L04k21O69o90J17L73
2119B304r05r34R26M16n21o73J313q52o27K40L40k30o07k76L19J49r40L96n1l08
$$ plain form
1978 1728 1969 2169 1816 1691 2046 2709 2097 2147 2380 2548 2695 2280 2685 2870 2658 2654 2669 2569 2190 2214 2464
1999 2464 2161 2054 2169 1917 2058 1939 1847 1649 1613 1924 1075 833 1010 1330 1009 328 791 700 141 87 430
2020 430 -5 -367 -381 -94 -608 -838 -518 -817 -1051 -1135 -823 -1207 -1842 -1529 -1069 -2226 -2071 -1328 -1838 -2688
2040 -2688 -1964 -1623 -2268 -2529 -2286 -1578 -2319 -2682 -1977 -1709 -2735 -2599 -1550 -1957 -2464 -2309 -1905 -2243 -2474
2059 -2474 -1944 -1800 -1712 -1989 -1775 -1844 -1439 -1240 -906 -956 -921 -1036 -746 -983 -564 22 -404 -249 88 268 -30
2080 -30 -46 644 1278 625 613 1413 1380 667 862 2166 1561 779 1564 2651 2545 971 2101 2876 1964 1682
2100 1682 2487 2259 1850 1957 2456 2884 1819 2571 2801 2393 2287 1862 1752 2056 1835 2504 1814 1931 2304
2119 2304 1399 465 1391 1807 1286 613 1926 1074 447 687 1027 797 190 -86 233 382 -558 -162 -213 -521
2139e21j95l57M48K28j150M03J41m0o94nM23m39n76O16q0m4k01j08J50j67k51
2160b419Q5K20J38k42q8K12p5L45p33J095k33M55j339O87O38o49pL23N28l56k97
2181a712P09P49j405Q57P22l00j22P60l14J76J90n79Q10M96o85M98J84j71K71
2200A134P5L62l11M5J83K03J72k95L17K33j71J25L70k62k04M57p24R6L56K24l14
2221B071o08J085M3p17J32J76o0m98P2K57j16o93N54k30r92L68J02Q4k20N7j59
2242G08m64O12l70q6o61L43M46j193l4P8M21j123Q27k31j64n19j98P14o75m43
2262b012K86L92k37j42l73K72j60O0n24N6M56J7m88M98Q7l8j18k93J71K25p5M90
2284a450M0j50N9n39O87j21L08k53L37N48l85J84j07M70m75N18K55lP7N40K71
$$ plain form
2139 -521 -716 -1073 -625 -397 -1547 -1144 -1003 -1043 -1737 -1742 -1319 -1758 -2334 -1718 -1798 -1842 -2043 -2151 -2001 -2168 -2419
2160 -2419 -2334 -2114 -1976 -2218 -2306 -2094 -2169 -1824 -2557 -1462 -1695 -1240 -2579 -1892 -1254 -1903 -1910 -1587 -1059 -1415 -1712
2181 -1712 -1003 -254 -1659 -802 -80 -380 -502 258 -56 120 310 -269 541 1037 352 850 1034 863 1134
2200 1134 1209 1571 1260 1305 1488 1691 1863 1568 1885 2118 1947 2072 2442 2180 1976 2433 1709 1805 2161 2385 2071
2221 2071 1463 2548 2591 1874 2006 2182 2122 1624 1696 1953 1837 1144 1698 1468 476 844 946 1030 810 867 708
2242 708 244 856 486 400 -261 82 528 -665 -699 -621 -200 -1323 -496 -727 -891 -1410 -1608 -894 -1569 -2012
2262 -2012 -1726 -1334 -1571 -1713 -2086 -1814 -1974 -1914 -2438 -2382 -1926 -1909 -2397 -1899 -1812 -1850 -1968 -2261 -2090 -1865 -1940 -1450
2284 -1450 -1410 -1560 -1501 -2040 -1353 -1474 -1166 -1419 -1082 -534 -919 -735 -842 -372 -847 -329 -74 -77 0 540 811
2305H11r53L69P65l22o13J222J30n98k63Q84j51j55O29n7j99L7K25N13m02l40
2325A532J066o28m36M93J08m96O22J00n52k73R03m82l78j3M61o02n9J29j54m67
2345H74N88K21p75L49m83k24l85K41m86P9K65J83m06m41N24k89l31J55J22o80
2365h99l23J64M59m77m79O46J0q17K43J11K13p89L22L06n49j9K08k21l39Q87m37
2386a780k84N03J22o79O0N07J55m24L91L08J50q42L66N25m50M90J52j70k34M4
2406a090O92J1j34J08M8J83N81n46o2K65J98K79n5L06j7m13L61J11J92j37k09
2427F72K36K8L90R3l48M3J003o40Q8k49J56k59l01J618p57n81J84P09r38M15M8
2448A610J82o77N58O2n56L3N92m10k04J87n11j51r1J35O12m34m24K0j57o7l01
$$ plain form
2305 811 -142 227 992 670 57 1279 1409 811 548 1432 1281 1126 1755 1698 1499 1536 1761 2274 1872 1532
2325 1532 2598 1970 1534 2027 2135 1639 2261 2361 1809 1536 2439 1957 1579 1566 2027 1425 1366 1495 1341 874
2345 874 1462 1683 908 1257 774 550 165 406 -80 -1 264 447 41 -400 124 -165 -496 -341 -219 -899
2365 -899 -1222 -1058 -599 -1076 -1555 -909 -899 -1716 -1473 -1362 -1149 -1938 -1616 -1310 -1859 -1878 -1670 -1891 -2230 -1343 -1780
2386 -1780 -2064 -1561 -1439 -2118 -2058 -1551 -1396 -1820 -1429 -1121 -971 -1813 -1447 -922 -1372 -882 -730 -900 -1134 -1090
2406 -1090 -398 -387 -521 -413 -365 -182 399 -147 -209 56 254 533 478 784 767 354 715 826 1018 881 672
2427 672 908 936 1326 1419 1071 1114 2117 1477 1565 1316 1472 1213 912 2530 1773 1192 1376 2085 1147 1562 1610
2448 1610 1792 1115 1673 1735 1179 1212 1804 1394 1190 1377 866 715 624 759 1371 937 513 533 376 309 8
2469HN68k85l26m1o1m00K61O8o49M2L34n21K85j05o6p3m0k3l30l68M89j07J60
2492a180k05j55j41o02J025o8l45q4M14p46J99O35j84n16L51N12p55R7R14m2l01
2513a177j28P26r97M67NO93l16j32R59r49O73q5J1J20L59L58j128N89L96j58J11
2534C97j02Q36p51J37K91J06J4M0R15l89o15Q21k74J55j71J74J19l39M54m37J1
2555A392j02J072j205P71n0r5l12M04L81j209J39K79K92p26n5N68n69k20O33k75
2575A113l53N2j70o36O44q08K68J61m56L61k17o95L46q4L02m90L60n08k63K46
2595h27K78p75M96k01k92N6L08J15o83L42l73k68P63q0k86l94M20lk3j48O01k86
2617a260k46J07M06j055N84K53L49n26L30K17o1j29N29q2p39Q61j51L25l44L70
$$ plain form
2469 8 576 291 -35 -76 -137 -537 -276 -208 -857 -815 -481 -1002 -717 -822 -888 -961 -1001 -1024 -1354 -1722 -1233 -1340 -1180
2492 -1180 -1385 -1540 -1681 -2283 -1258 -1326 -1671 -1755 -1341 -2087 -1888 -1253 -1437 -1953 -1602 -1090 -1845 -1748 -834 -876 -1177
2513 -1177 -1305 -579 -1576 -1109 -1104 -411 -727 -859 100 -849 -176 -261 -250 -130 229 587 -541 48 444 286 397
2534 397 295 1131 380 517 808 914 928 968 1883 1494 879 1700 1426 1581 1410 1584 1703 1364 1818 1381 1392
2555 1392 1290 2362 1157 1928 1878 1783 1471 1875 2256 1047 1186 1465 1757 1031 976 1544 975 755 1388 1113
2575 1113 760 812 642 6 650 -158 110 271 -185 176 -41 -736 -390 -474 -172 -662 -302 -810 -1073 -827
2595 -827 -549 -1324 -828 -1029 -1321 -1265 -957 -842 -1525 -1183 -1556 -1824 -1061 -1141 -1427 -1821 -1401 -1404 -1427 -1575 -974 -1260
2617 -1260 -1506 -1399 -993 -2048 -1464 -1211 -862 -1388 -1058 -841 -902 -1031 -502 -584 -1323 -462 -613 -288 -632 -262
2637b62P71q15K1K26L2J99o9J65J01J54P65k53l28O36l50j86K48j1J12M1R6K07
2659A500K86n13K90l98R61l54m07N06l09K76P8m16N10k72o25O60r13J74K81N72
2679A887j036J86M04o74N67l71j72J04m56M11KL28j042O27l42m87J38j5N6m28
2699c13L93l70Lo72M48l20L2N33n03o03j97M41p3j3K61o4m60L08K1o6Jo19P62
2722a070m96R5J2J49k97j12L50K15L4k83K50j08j51M15q9n04P38l64M26j55N5
2743h90L14k49O60l15J58oK85k47M04L13l19J82k5M18o15M24rnN61m07K32k2M47
2766A289j69J96M8J56k08L19J97m85J52j81J42L54P0n15M0l39K05N11j99j96M7
2787A434j86m27M58n1l04N02l30j01kj91N2l47K96p1j16l64P0Jj8l44K16k55J73
$$ plain form
2637 -262 509 -306 -285 -59 -27 172 103 268 369 523 1288 1035 707 1343 993 807 1055 1044 1156 1197 1293 1500
2659 1500 1786 1273 1563 1165 2126 1772 1365 1871 1562 1838 1916 1500 2010 1738 1113 1773 860 1034 1315 1887
2679 1887 851 1037 1441 767 1334 963 791 895 439 850 852 1180 138 765 423 -64 74 59 115 -313
2699 -313 80 -290 -287 -959 -511 -831 -799 -266 -769 -1372 -1569 -1128 -1201 -1214 -953 -1017 -1477 -1169 -1148 -1214 -1213 -1832 -1070
2722 -1070 -1566 -1471 -1459 -1310 -1607 -1719 -1369 -1154 -1120 -1403 -1153 -1261 -1412 -997 -1086 -1590 -852 -1216 -790 -945 -890
2743 -890 -576 -825 -165 -480 -322 -328 -43 -290 114 427 108 290 265 683 68 492 483 478 1039 632 864 842 1289
2766 1289 1120 1316 1364 1520 1312 1631 1828 1343 1495 1314 1456 1810 1880 1365 1405 1066 1271 1782 1583 1387 1434
2787 1434 1248 821 1279 1228 924 1426 1096 995 993 802 854 507 803 732 616 252 322 323 305 -39 177 -78 95
2810I5l34K35K4k77K5l47j98l23J88l5M25q09O89n64Q01n51l00J2K07O4k57K48
2832i82j45k0j90q2k7K3j12K10p3J36K14J94Rk75l76O99n78R00m00l34R37m82
2854g54m64J75M09N63k79rP6p8K89m7J57l16k33N90j28M87L3J65l41N98K7m14
2876E06j72M80K54n75L06k54K61K4J27l9K35rK26J80k65K19n31O03l88K33l94
2897A027K66k40l6rm2K2K02M43n57l41j81K99j5r6K53k77R2k88k66j82j05J46
2919A15L75j56m58N08j042M46J2n43M27l96K19r2J85k13k25K76p84L66k66PJ4
2940a225M60L7k39n96L17L84k83q4M90l78J42l15k65N95k21K67j57J17Kj90J53
2961i89j74j71L80J97l18P5M45k25L6R5L14j06L01J77m33K50L3J25o1M14J65j52
$$ plain form
2810 95 -239 -4 20 -257 -232 -579 -777 -1100 -912 -947 -522 -1331 -642 -1206 -405 -956 -1256 -1244 -1037 -973 -1230 -982
2832 -982 -1127 -1147 -1337 -1419 -1446 -1423 -1535 -1325 -1398 -1262 -1048 -854 -845 -1120 -1496 -797 -1375 -475 -875 -1209 -272 -754
2854 -754 -1218 -1043 -634 -71 -350 -359 -283 -361 -72 -119 38 -278 -511 79 -49 438 471 636 295 893 920 506
2876 506 334 814 1068 493 799 545 806 830 957 918 1153 1144 1370 1550 1285 1504 973 1576 1188 1421 1027
2897 1027 1293 1053 1017 1008 966 988 1190 1633 1076 735 554 853 838 742 995 718 810 522 256 74 -31 115
2919 115 490 334 -124 384 -658 -212 -200 -743 -316 -712 -493 -585 -400 -613 -838 -562 -1346 -980 -1246 -1239 -1225
2940 -1225 -765 -728 -967 -1563 -1246 -862 -1145 -1229 -739 -1117 -975 -1290 -1555 -960 -1181 -914 -1071 -954 -952 -1142 -989
2961 -989 -1163 -1334 -954 -757 -1075 -1000 -555 -780 -744 -649 -335 -441 -140 37 -396 -146 -113 12 -49 365 530 378
2983C78m75L27M58m17o3O15J73l22P4J26M7J03J38k08J27k9K19j69K45o13O31
3004A365p8j45o8J49j67O9J45K2k29P7J4o7k17M7K00j06l71J44J63l60j53K45
3026F79J22m09J49m49M23l67j61J65j28K2k69J90k05k59M94m58j91J25j72q3j32
3047i14K08J51n75J81L3n2m15JM59k89q5K87l33K9j86K22l6k24M67m2N7l87M56
3070i87k00O1M11n7j86k11J78K5N8K01m1K15l34L54K06k31J03K41J32J9j82P48
3092E23J16m72r8L03J56l21L68M3K64k32J0J18K55l17M07l54K76J87L14l89k9
3113A128J00K32p4l40O5M67l96L75j97j83J41l65L82l5o65N17j2m07K87l18K99
3134A001l3k2m04j10J12J80k01J28l29J1J36j67l62J44J9k98j17J7p6P7k72N5
$$ plain form
2983 378 -97 230 688 271 208 823 996 674 748 874 921 1024 1162 954 1081 1052 1271 1102 1347 734 1365
3004 1365 1287 1142 1074 1223 1056 1125 1270 1292 1063 1140 1154 1087 870 917 1117 1011 640 784 947 587 434 679
3026 679 801 392 541 92 515 148 -13 152 24 46 -223 -33 -238 -497 -3 -461 -652 -527 -699 -782 -914
3047 -914 -706 -555 -1130 -949 -916 -968 -1383 -1382 -923 -1212 -1297 -1010 -1343 -1314 -1500 -1278 -1314 -1538 -1071 -1113 -1056 -1443 -987
3070 -987 -1187 -1126 -715 -772 -958 -1169 -991 -966 -908 -707 -748 -533 -867 -513 -307 -538 -435 -194 -62 -43 -225 523
3092 523 639 167 69 372 528 207 575 618 882 650 660 778 1033 716 1123 769 1045 1232 1546 1157 1128
3113 1128 1228 1460 1386 1046 1111 1578 1182 1557 1360 1177 1318 953 1335 1300 635 1152 1140 733 1020 702 1001
3134 1001 968 946 542 432 544 724 523 651 322 333 469 302 -60 84 103 -195 -312 -295 -371 -294 -566 -511
3156e11K61n03O3k90q4L22l46J29k34K94m2k96j78N53k92j77L2J84J27l44J07
3177a225K26j38J46m03M64K14p20N63Q8j76N9J81L02m11K86J73k90k36N13j17
3197e01K17p1M31j53L3k55L09l3L4L11J41l43N22K12l36j81N9O64m23k09N83j34
3219H77j54L57r9n06Q76m36N31m99J1R3o5L20j40J36k10o1r0L83l78j32M69j91
3241A092l11J04n9j79j64L56K66n76n0J91k26k81J34oJ63k16k38K20l33M7k4k4
3263a14l81L0K48%l38n1M02n67j70K41k9j37L46k21k52O0J6N3j23k31M02J80p36
3286a372J78O03j59m96K56J81l69q9J41L14m45K87K84j27n6K76l8j52j28N50l04
3307f65K00K04J41k87J47l13P26l38J84R8M7m35K75L24p4PJ01J91k3Oj85J66K4
$$ plain form
3156 -511 -250 -753 -690 -980 -1064 -742 -1088 -959 -1193 -899 -941 -1237 -1415 -862 -1154 -1331 -1299 -1115 -988 -1332 -1225
3177 -1225 -999 -1137 -991 -1394 -930 -716 -1436 -873 -785 -961 -902 -721 -419 -830 -544 -371 -661 -897 -384 -501
3197 -501 -284 -355 76 -77 -44 -299 10 -23 11 322 463 120 642 854 518 337 396 1060 637 428 1011 877
3219 877 723 1080 981 475 1351 915 1446 947 958 1051 986 1306 1166 1302 1092 1031 941 1324 946 814 1283 1092
3241 1092 781 885 826 647 483 839 1105 529 479 670 444 163 297 291 454 238 0 220 -113 -66 -90 -114
3263 -114 -495 -465 -217 -217 -555 -606 -204 -771 -941 -700 -729 -866 -520 -741 -993 -933 -917 -864 -987 -1218 -816 -636 -1372
3286 -1372 -1194 -591 -750 -1246 -990 -809 -1178 -1267 -1126 -812 -1257 -970 -686 -813 -869 -593 -631 -783 -911 -361 -665
3307 -665 -465 -261 -120 -407 -260 -573 153 -185 -1 97 144 -291 -16 308 234 241 342 533 510 516 331 497 521
3330E21J51j5J07j43K31q6R9j91N55k31P4l10L70k66J99l8O5j4J44j28K9j53l30
3353F40M75l33N5k16N2J79l13J99J24j93L7j33Q8n07J0L10m79p3L33m30K82n5
3375E2J1m48J82K67k18l40M6R1k04j86K07n6o1k52P3Ro2k36J10J51j22o0Q3k95
3399a258J04o9J33q3J99j70J4J15M04m42K66j25J34l75M10L34l12j20K57L2j13
3420f65K10N5q0q5K47L50r2L9K49l78k18N64J69n6m6pJ5J24J83mK09j78r8K89
3444G96m76k59J069m27J10J66k8J8j59L70k75JR5k50K62K20l99P4k13M47k20m4
3466H78L03k20J88o20J40J67k03m3M80k11k03L4l03J97J2j33k92m9o3j08j22J94
3488B3P7J8l69k33K99m0k87O1m70L64j11N9n46J60L88j34j56R9k81j83J29M83
$$ plain form
3330 521 672 657 764 621 852 766 865 674 1229 998 1072 762 1132 866 1065 1027 1092 1078 1222 1094 1123 970 640
3353 640 1115 782 837 621 673 852 539 738 862 669 706 573 661 154 164 474 -5 -78 255 -175 107 52
3375 52 63 -385 -203 64 -154 -494 -448 -357 -561 -747 -540 -596 -657 -909 -836 -827 -889 -1125 -1015 -864 -986 -1046 -963 -1258
3399 -1258 -1154 -1223 -1090 -1173 -974 -1144 -1130 -1015 -611 -1053 -787 -912 -778 -1153 -743 -409 -721 -841 -584 -552 -665
3420 -665 -455 -400 -480 -565 -318 32 -60 -21 228 -150 -368 196 365 309 263 256 271 395 578 574 783 605 507 796
3444 796 320 61 1130 703 813 979 951 969 810 1180 905 906 1001 751 1013 1233 834 908 695 1142 922 878
3466 878 1181 961 1149 529 669 836 633 590 1070 859 656 690 387 584 596 463 171 122 59 -49 -171 23
3488 23 100 118 -251 -484 -185 -225 -512 -451 -921 -557 -668 -609 -1155 -995 -607 -741 -897 -798 -1079 -1262 -1133 -650
3510f50l24O0N6k08QL00j89j60j24K40j76P4K53j09n4P84m13jQ3L5j75Q3L1J10
3534d66P6k24M48J7k80m2K69J97k07J05J35J29j33O65k34k38K02O7j04M41k12
3555F11J72m13L28K0r2L10K16N9m16M77l35M60m80L24k27p9q5L47k23J28k86J83
3577I99k64P40p11K19k3J05n2j20j69k81J33J16K77k46j86j37M3l73M25j50M0
3598C85j72k07L85n79k6O33o83O9j90n8L9K57j41o99M05K02j81m71J62J23k93
3619a040j9M26n26k2M79k19K12n33K93q9K6l87N24J62l62J10J82k03K50R4k11
3640h53J16M08l03j17L78Q7k02q6J90K13K36n01J95M86k32l9k59Q17j97j84K11
3661C64k15L1N70j14m09Q78j95n42L68p8n0n4L46m94J43N82l29j7R6L12m80k6
$$ plain form
3510 -650 -974 -914 -858 -1066 -1058 -758 -947 -1107 -1231 -991 -1167 -1093 -840 -949 -1003 -219 -632 -633 -550 -515 -690 -607 -576 -466
3534 -466 -390 -614 -166 -149 -429 -471 -202 -5 -212 -107 28 157 24 689 455 217 419 486 382 823 611
3555 611 783 370 698 718 626 936 1152 1211 795 1272 937 1397 917 1241 1014 935 850 1197 974 1102 816 999
3577 999 735 1475 764 983 960 1065 1013 893 724 443 576 692 969 723 537 400 443 70 495 345 385
3598 385 213 6 391 -188 -214 419 -264 -195 -385 -443 -404 -147 -288 -987 -582 -380 -561 -1032 -870 -747 -1040
3619 -1040 -1059 -633 -1159 -1181 -702 -921 -709 -1242 -949 -1038 -1012 -1399 -875 -713 -1075 -965 -783 -986 -736 -642 -853
3640 -853 -737 -329 -632 -749 -371 -284 -486 -572 -382 -169 67 -434 -239 247 15 -24 -283 534 337 153 364
3661 364 149 180 750 636 227 1105 910 368 736 658 608 554 900 406 549 1131 802 785 881 1193 713 687
3683F87J49j25J56J74m08N1L75o0M8o1m57J06O84j069K30M93k65l07R2l0k88M16
3705E91j63J98m68M5K64k64m1j2J72k75m80j15N5N33l55l19K59O7J21J17p92K34
3727f28K7L08L9n49k15K37J00n4K75N3J45m40q7k43K45K9K30m41KP1M22n83N45
3750e12j27n68M87l13N88l05r5L12K35p7R7M27k49j39K73j66J37m70M87K50j17
3771A55k15M8k12N23k19L21j66J12l47O49m6n10O18m12P50o49N18q1p1l24O83
3792A125j00m48L36L4l58l0L33R1Oj35j38r8K36j92K52J07K5j36j57l44M82r4
3814G97m37j96N48J37k47m05m9M66k23o4P6l2q02M96j5m45j15o7N84j70k11J46
3836b28J06o9k61j92j84L67P02q96m13M60l70j10j46L75J39p6P7Nl46q0M31m46
$$ plain form
3683 687 836 711 867 1041 633 684 1059 999 1047 986 529 635 1319 250 480 973 708 401 493 463 175 591
3705 591 428 626 158 203 467 203 162 150 322 47 -433 -548 -493 40 -315 -634 -375 -308 -187 -70 -862 -628
3727 -628 -601 -293 -254 -803 -1018 -781 -681 -735 -460 -407 -262 -702 -789 -1032 -787 -758 -528 -969 -967 -896 -474 -1057 -512
3750 -512 -639 -1207 -720 -1033 -445 -750 -845 -533 -298 -375 -278 149 -100 -239 34 -132 5 -465 22 272 155
3771 155 -60 -12 -224 299 80 401 235 347 0 649 603 93 711 299 1049 400 918 837 766 442 1125
3792 1125 1025 577 913 947 589 559 892 983 989 854 716 618 854 662 914 1021 1046 910 753 409 891 797
3814 797 360 164 712 849 602 197 148 614 391 327 403 371 -431 65 50 -395 -510 -577 7 -163 -374 -228
3836 -228 -122 -191 -452 -644 -828 -461 241 -655 -1068 -608 -978 -1088 -1234 -859 -720 -796 -719 -714 -1060 -1140 -709 -1155
3858a155N26k49J54j41m2L89k30L88j27j26k40N35k71J42l75L52j71M14Qo0l08
3879e87J56Ln5K25R76j20k75k31l32M30j92M5M16l74K51K69j31Q9K80l4j05j70
3901E34N43l65m16P69m9l17R6J41k9k05K16m5k09K81r9K59p00K07rq4M86j71j06
3924G28J3k16K83n9k72L31K01k83k26k70M97n85Q9J88j17j87j50k04j43P35m48
3945i5R0m53j7n49K75M24K98q56L73Q7j45R7l93l33o1M62j16K10m17L78k83%J63
3968h61r7J07J79J74l22M7K79j36L3m51M79J06k03J6n1K27q3K8R0q4o0M76K45
3991A38k54j22J66l16J90J90K26M77p57L7J73J83j63L76q5j34L08j25O2k5j21
4012D24j26J82J8J59rP7M16k89m56O75Q7m2j37j53L26nL38j206O92k05pnJ14q7
$$ plain form
3858 -1155 -629 -878 -724 -865 -907 -518 -748 -360 -487 -613 -853 -318 -589 -447 -822 -470 -641 -227 -219 -279 -587
3879 -587 -431 -428 -483 -258 718 598 323 92 -240 190 -2 43 459 85 336 605 474 563 843 809 704 534
3901 534 1077 712 296 1065 1016 699 795 936 907 702 918 873 664 945 846 1105 405 612 603 519 1005 834 728
3924 728 741 525 808 749 477 808 1009 726 500 230 727 142 231 419 302 115 -35 -239 -382 353 -95
3945 -95 -5 -458 -475 -1024 -749 -325 -27 -883 -510 -423 -568 -471 -864 -1197 -1258 -796 -912 -702 -1119 -741 -1024 -1024 -861
3968 -861 -958 -851 -672 -498 -820 -773 -494 -630 -597 -1048 -569 -463 -666 -650 -701 -474 -557 -529 -439 -523 -583 -107 138
3991 138 -116 -238 -72 -388 -198 -8 218 695 -62 -25 148 331 168 544 459 325 633 508 570 545 424
4012 424 298 480 498 657 648 725 1141 852 396 1071 1158 1116 979 826 1152 1147 1485 279 971 766 759 754 868 781
4036G81j7K47o19L86j10n9n68K69k9K04l05%K25rl2j95j72k86l4L18p5J34p19
4059f65K04J63l85J04K21j30j96L03p5j61k5N2k34J54m36M64l41Q7J85j53Q7K14
4081e63Q5j91j52J43l29L41J02Q0m73J00J20NL36k14J29p7L13K68k67o40L98J25
4103c61J21k19N43k17K48l3j94K31l63K52K32j16m3p5L47K82m42L27k32M80j96
4124E72k11J43L03K47j097R54m37J33K04j51K29k01L65q9k42k4N4jk02K07K43
4145I99n07J40J61L1k57J09k95J93r9J82K71q35K79J56j16k53J59l1k88K40k34
4166Ej1M1K50k44l78J95R1l95J78j00K1k45j09L99r3K21j23nm99K38l29N49l60
4189g03J52MJ46l62Lk26L29O3j16j37L17j45L7j71L24k13K10L32j75l29l24L15
$$ plain form
4036 781 764 1011 392 778 668 609 41 310 281 485 180 180 405 396 364 169 -3 -289 -323 -5 -80 54 -665
4059 -665 -461 -298 -683 -579 -358 -488 -684 -381 -456 -617 -642 -590 -824 -670 -1106 -642 -983 -896 -711 -864 -777 -563
4081 -563 -478 -669 -821 -678 -1007 -666 -564 -484 -957 -857 -737 -732 -396 -610 -481 -558 -245 23 -244 -884 -486 -361
4103 -361 -240 -459 84 -133 115 82 -112 119 -244 8 240 124 81 6 353 635 193 520 288 768 572
4124 572 361 504 807 1054 -43 911 474 607 811 660 889 688 1053 964 722 698 752 751 549 756 999
4145 999 492 632 793 824 567 676 381 574 475 657 928 93 372 528 412 159 318 287 -1 239 5
4166 5 -6 35 285 41 -337 -142 -51 -446 -268 -368 -347 -592 -701 -302 -395 -174 -297 -302 -801 -563 -892 -343 -703
4189 -703 -551 -547 -401 -763 -760 -986 -657 -594 -710 -847 -530 -675 -638 -809 -485 -698 -488 -156 -331 -660 -984 -669
4211f69K71j44k56O03j11K85l55K39M4J09k11Q7j25Q4m1J05N93o96N35m6K7j93
4233A35J59J19NJ44J26k04j19K90O9P9k21L8K41l68M01k11m74Q29k91mJ65j05
4255H03j55L46m21J1J68q2o3m7P1j81N49j48j61k64n68Q37r2l89m7M47q6k38K4
4278C14m3J81j96J33m74mJ39J14n10Kk92M33K98n78J78j61N14m31L4n00J47j48
4300h50L49J99l46k55J97k6j69M68k65L30n39o2K56l21N5J57M17l36j67J09q6
4321h85J63J41j06j13K48k62M19r4k72J18J90J23J46k73N8LJ18O9K81L45j83q5
4343A49l85L59L9K75j77K10j22M52l82M15k97Q7N2j21J57k00J10p2K46j90J68
4364G73j97M34k94J33l4J6j72l4Q7k15K67j07K44j19l79L35J0k47K04J24j93k25
$$ plain form
4211 -669 -398 -542 -798 -195 -306 -21 -376 -137 -93 16 -195 -108 -233 -149 -190 -85 508 -188 347 301 328 135
4233 135 294 413 418 562 688 484 365 655 724 803 582 620 861 493 894 683 209 1038 747 743 908 803
4255 803 648 994 573 584 752 670 607 560 631 450 999 851 690 426 -142 695 603 214 167 614 528 290 314
4278 314 271 452 256 389 -85 -89 50 164 -346 -344 -636 -203 95 -483 -305 -466 48 -383 -349 -849 -702 -850
4300 -850 -501 -302 -648 -903 -706 -732 -901 -433 -698 -368 -907 -969 -713 -1034 -979 -822 -405 -741 -908 -799 -885
4321 -885 -722 -581 -687 -800 -552 -814 -395 -489 -761 -643 -453 -330 -184 -457 -399 -396 -278 -209 72 417 234 149
4343 149 -236 123 162 437 260 470 348 800 418 833 536 623 675 554 711 511 621 549 795 605 773
4364 773 576 1010 716 849 815 831 659 625 712 497 764 657 901 782 403 738 748 501 705 829 636 411
4386D11K02k03k43K71Jk50n5PK95l86j5R1p3M5k83M27l48j61J48j12n7l7J27r0
4410b88k68r6P3l3k78L4j4K80j26L18n46J18L51k04k33J73L7m4pK3kq9r3J60J3
4435g41N3K50k63K62N6j75q5L55J51J46l02l0J51l37J41L93J62m27K30L02m0j98
4457E4K14k19J00K48n28P20p8J49k79J05j42L64r5L91k76J02l5j19J65J14j38
4478H17J50k97O2l6o8K96q2m21L68j45j83O39l77N7l11Q9j07M12n35J25j32j52
4500A69K3L7J6J31L5m0l95LK92J05l17j54mq9p6j89N37m91k8rJ73o20M70j40J1
4525e50l15K58O3j02M4k10J41j68M21k61n70L79J06M0K48j50K22q53O34k08J79
4546f52o5O73m78k09P2J68L37m37O0k37L33N34l11l45M43r3L7j80J70p2J45j2
$$ plain form
4386 411 613 410 167 438 439 189 134 141 436 50 35 126 53 98 -185 242 -106 -267 -119 -231 -288 -325 -198 -288
4410 -288 -556 -652 -579 -612 -890 -856 -870 -590 -716 -398 -944 -826 -475 -679 -912 -739 -702 -746 -753 -730 -732 -821 -914 -754 -741
4435 -741 -688 -438 -701 -439 -383 -558 -643 -288 -137 9 -293 -323 -172 -509 -368 25 187 -240 -10 292 252 54
4457 54 268 49 149 397 -131 589 511 660 381 486 344 708 613 1004 728 830 795 676 841 955 817
4478 817 967 670 732 696 628 924 842 421 789 644 461 1100 723 780 469 558 451 863 328 453 321 169
4500 169 192 229 245 376 411 371 -24 -21 271 376 59 -95 -99 -188 -264 -453 84 -407 -435 -444 -271 -891 -421 -561 -550
4525 -550 -865 -607 -544 -646 -602 -812 -671 -839 -418 -679 -1249 -870 -764 -724 -476 -626 -404 -1257 -623 -831 -652
4546 -652 -717 -44 -522 -731 -659 -491 -154 -591 -531 -768 -435 99 -212 -557 -114 -207 -170 -350 -180 -252 -107 -119
4568a19J56j14J20J35R7o1J9J94k77K12MK79j59r0J44l63L06L5N9J64r9J02k9
4591G15j63j52O4J27O7J42o4j00M23o64K75O0J78k45L29j76j14m33L44p1j50j7
4613C75j61Q4K9j74K63J11m58J94j62j12M07n69j0L08Qj81P0J06l79l4j24j07
4635e16L7K25k96K93m20L43l52R7P3j42n2qM79k80o08M36K70k65k1j69J41L2k4
4658g27Pr0J79O4k91L16l78O95j18k67J47p4R4K0p8J14NJ43K40k36L65j06j5K44
4682B53j57k73L47O7J07l14L01J52P4k04M2J25N5j47P5J2j32J16j90M23j93j26
4704D13L2L30j24L04m21k23K88k25L20K62m65L95k52j16J56R1L5n3J20m74r1j0
4726B92l1M99l68J1Q0q9M8q0J99o28L8K04J3m01L66k56k24J42m1j02n6J99p4j32
$$ plain form
4568 -119 37 -77 43 178 275 214 233 427 150 362 366 645 486 396 540 177 483 518 577 741 642 744 715
4591 715 552 400 464 591 658 800 736 636 1059 395 670 730 908 663 992 816 702 269 613 542 392 375
4613 375 214 298 327 153 416 527 69 263 101 -11 396 -173 -183 125 133 -48 22 128 -251 -285 -409 -516
4635 -516 -479 -254 -550 -257 -677 -334 -686 -589 -516 -658 -710 -718 -239 -519 -1127 -691 -421 -686 -707 -876 -735 -703 -727
4658 -727 -720 -810 -631 -567 -858 -542 -920 -225 -343 -610 -463 -537 -443 -423 -501 -387 -382 -239 1 -235 130 24 9 253
4682 253 96 -177 170 237 344 30 331 483 557 353 395 520 575 428 503 515 383 499 309 732 539 413
4704 413 445 775 651 955 534 311 599 374 694 956 491 886 634 518 674 765 800 747 867 393 302 292
4726 292 261 760 392 403 483 394 442 362 561 -67 -29 175 188 -213 153 -103 -327 -185 -226 -328 -384 -185 -259 -391
4750c91J67p51M42k65J91K28r0K39m46j31j5r3L77m00J20K46j74n6o4qO07k15
4772d82l21K93o1L0r8pj5RM2J99k09KN0K67k71K65K8PQ7kJ16l7j02J75N4O9r4
4799fKJ79Q1j76K61q6K25j35j62L31N8j46J27j04K87j29q8J31J86j34j0m8J76
4822H20j58J33j86J89o0r3p6J10j23N2J74j69K5j04O4o8O5L5j36k3M9k44n8J7
4846B35N1j70K8j18J84j14j72Km7o8j10K78j57k26J18O3k30K3J0n8mj46oK06p7
4871e05j11M9j87J20j36Jm3O5Nl8MJ20r5J09j23O8nM1P8Q7k72J09L6J21l3m2J96
4898c81P4n5J57j51O0j21J28K48K6r6P7J3J25K3J4M5o6K02MM0k9J45n8l6N4K56
4924F98j50pJ03k0r8N2J54k06O4J48n8J57k13M3q4J11op8J49j27P2jr2K5J49j90
$$ plain form
4750 -391 -224 -975 -533 -798 -607 -379 -469 -230 -676 -807 -822 -915 -538 -938 -818 -572 -746 -802 -866 -874 -267 -482
4772 -482 -803 -510 -571 -541 -639 -646 -661 -652 -610 -411 -620 -618 -568 -301 -572 -307 -279 -272 -185 -187 -71 -108 -210 -35 19 88 -6
4799 -6 -4 175 256 80 341 255 480 345 183 514 572 426 553 449 736 607 519 650 836 702 692 644 820
4822 820 662 795 609 798 738 645 569 679 556 608 782 613 638 534 598 530 595 630 494 471 520 276 218 235
4846 235 286 116 144 26 210 96 -76 -74 -121 -189 -299 -21 -178 -404 -286 -223 -453 -430 -420 -478 -482 -628 -634 -428 -505
4871 -505 -616 -567 -754 -634 -770 -769 -812 -747 -742 -780 -776 -656 -751 -642 -765 -697 -702 -661 -583 -496 -768 -659 -623 -502 -535 -577 -381
4898 -381 -307 -362 -205 -356 -296 -417 -289 -41 -15 -111 -34 -21 104 127 141 186 120 322 326 366 337 482 424 388 442 698
4924 698 548 541 644 624 526 578 732 526 590 738 680 837 624 667 583 694 688 610 759 632 704 703 611 636 785 595
4950E95K4j57L4r8l0o9J60j26J12k74j06R4kj00l6n8J32k23k6j0j78J44K8q2L9
4975b13q6M8k35O5j30K0k09J81k7K16m03J26Q1L4p1J10j50o2M7Mp3m2K69j91N4
5000f37N2P7j3o0l4R8k11R8J99J59k30J10P5J58l01K02Po0K38j91K49j26RJ52
5024B0j3K2M02j10j57O9J18l01K02J83O3r5L0K5O9j28K29j54P6n6J68K5j12Q3
5048F58l1k15O6K10K3j4j94P8rM7L5L4l19J82k64K83k07J07N7m9J62k62r4j51
5072A33J18Q0q7j34M8q6J56j15k09L7J7j6j0q9K5n1KKk82R5n2P3j82P2Lj13MJ17
5100d44j32k3K0o3J19k18K08j60J68k72K99j64K4J42o6j7o9J30J14k72K58l4J2
5123d40j69J61P8p6j5J83j23j10K28J51J6L1o4j9K7n2K36J64j3n6o3R0j14J82
$$ plain form
4950 595 619 462 496 398 368 299 459 333 445 171 65 159 157 57 21 -37 95 -128 -154 -164 -342 -198 -170 -252 -213
4975 -213 -299 -251 -486 -421 -551 -531 -740 -559 -586 -370 -773 -647 -566 -532 -603 -493 -643 -705 -658 -654 -727 -769 -500 -691 -637
5000 -637 -585 -508 -521 -581 -615 -517 -728 -630 -431 -272 -502 -392 -317 -159 -460 -258 -251 -311 -73 -264 -15 -141 -132 20
5024 20 7 29 431 321 164 233 351 50 252 435 498 403 433 458 527 399 628 474 550 494 662 687 575 658
5048 658 627 412 478 688 711 697 503 581 572 619 654 688 369 551 287 570 363 470 527 478 640 378 284 133
5072 133 251 331 244 110 158 72 228 113 -96 -59 -42 -58 -68 -157 -132 -183 -181 -179 -461 -366 -418 -345 -527 -455 -452 -565 -561 -444
5100 -444 -576 -599 -579 -642 -523 -741 -533 -693 -525 -797 -498 -662 -638 -496 -562 -579 -648 -518 -404 -676 -418 -452 -440
5123 -440 -609 -448 -370 -446 -461 -278 -401 -511 -283 -132 -116 -85 -149 -168 -141 -193 43 207 194 138 75 165 51 233
5147B33J12o8L0Q8q8J94M9j86K64j40N1q8J99m3P2j44M3K14j83j09R8J24K22m76
5171D68K56q1J9L8k39J1K14j44N5p2j39O6m0l9N8l55J08Q2k66J94k37j63K47Q3
5195A24k58K16j69P3j79J4J13j96r7M9o7J20q0j97N3K9J7Nk0%j42j57J00j87q
5220h44O1K24n0On9j21R7r4J31J61m3l7r0O2J8r7K65j81Q2j0J09P9j2j2q4mK56
5247a87J16n2k26K65J14K7j42P6J83Lj44K56j50K1J8J57J29j23K36j82R2R7j97
5270C87J86L4lr6L5l1P2K36j27J74l10J52l6lj33J83j59J02L8j21P0pk28R8M8
5295E61j43K0j38m5K32j33J1j9m1j19j26J11p9j19P5p8n1p8l7r2J03k30K38j35
5319c12jr7K43l42J59k9j40m7j81J58n2RR5q9p0O6j21J60j96m0o6L78j03j02P8
$$ plain form
5147 233 345 277 307 395 307 501 550 364 628 488 539 451 650 607 679 535 578 792 609 500 598 722 944 468
5171 468 724 643 662 700 461 472 686 542 597 525 386 452 412 373 431 76 184 266 0 194 -43 -206 41 124
5195 124 -134 82 -87 -14 -193 -179 -66 -262 -359 -310 -377 -257 -337 -534 -481 -452 -435 -430 -450 -450 -592 -749 -649 -836 -844
5220 -844 -783 -559 -609 -603 -662 -783 -686 -780 -649 -488 -531 -568 -658 -596 -578 -675 -410 -591 -509 -519 -410 -331 -343 -355 -439 -443 -187
5247 -187 -71 -123 -349 -84 30 57 -85 -9 174 177 33 289 139 160 178 335 464 341 577 395 487 584 387
5270 387 573 607 604 508 543 512 584 820 693 867 557 709 673 670 537 720 561 663 701 580 650 643 415 513 561
5295 561 418 438 300 255 487 354 365 346 305 186 60 171 92 -27 48 -30 -81 -159 -196 -288 -185 -415 -177 -312
5319 -312 -313 -410 -167 -509 -350 -379 -519 -566 -747 -589 -641 -632 -537 -626 -696 -630 -751 -591 -787 -827 -893 -515 -618 -720 -642
5344f42ML9J12n4m6J25oj8j11L0K08M2p1m5K30OO6P7J07q8k9m1Q9NK40j22J94
5371C01m8Q7PR0j47J84KQ9j72P7N7J03j92K00j45kJ23j49L52j43l3M3J5k13J96
5396F82n2j5q7J92k01j04M7R9N1k75N6P8j68K36k02q6M6j15J15k04Q4m7L0q0k6
5421E4j23Q6kk91Q5k1qR4%j19kM9j45q5r9J16p4q6J01q4L7j67L4P6K7k3qqK4m6
5451f08O2l06P5K12Qj28J99L4K1O3k53R2J12J4K6J42k37J92q2m4J34N8o7O2J48
5476g1p7m4J20J01j08Q7j9K7J74j80K80OM4l2p6K07k5j88J67j0J62j37J65K4M9
5501F46o4l2M1o7j5L0rK2j37J28M3j29K5q1K20k30PJ64k76K08j90K03j88j18K13
5526D14j33q0M9O9j54r6j3j02J30Jp6j73L9J1J42k14J1K1j39n3K22j72j8L7n6
$$ plain form
5344 -642 -638 -599 -487 -541 -587 -462 -468 -486 -597 -567 -359 -317 -388 -433 -203 -197 -131 -54 53 -35 -64 -105 -16 -11 229 107 301
5371 301 253 340 347 437 290 474 476 565 393 470 527 630 438 638 493 491 614 465 817 674 641 684 699 486 682
5396 682 630 615 528 720 519 415 462 561 612 337 393 471 303 539 337 251 297 182 297 93 177 130 160 80 54
5421 54 -69 17 15 -276 -191 -212 -220 -126 -126 -245 -247 -198 -343 -428 -527 -411 -485 -571 -470 -554 -517 -684 -650 -574 -547 -570 -578 -586 -562 -608
5451 -608 -546 -852 -777 -565 -557 -685 -486 -452 -431 -368 -621 -529 -417 -403 -377 -235 -472 -280 -362 -406 -272 -214 -281 -219 -71
5476 -71 -148 -192 -72 29 -79 8 -11 16 190 10 290 296 340 308 232 439 414 226 393 383 545 408 573 597 646
5501 646 582 550 591 524 509 539 530 552 415 543 586 457 482 401 621 391 398 562 286 494 304 507 319 201 414
5526 414 281 201 250 319 165 69 56 -46 84 85 9 -164 -125 -114 28 -186 -175 -154 -293 -346 -124 -296 -314 -277 -333
5551c33J4j42J55k68J32lq0p7K11j33j56m7J45Qm6J7n5O1j4p9J23m9j3K62j30
5576d97R6L4j96K45J23r1QL9K6j30K66q3L9j63o7J85L4J46J09J11j01j17L1J67
5600B14j07J08J45oJ14j63J57k4j07P2P8J01j72J25K4mo3R3L3J39j90j03K06o2
5624F08k0K3r2Q6o1J51k90K29p7j18L3M9k4o3P6M2k05j38j4O7L6k85J70j50P5
5649A08m3J5k3k9o6R7r4l12J90l67K00O8K4j44Ll2l2k1j08O2M8j73L3R1j76Mm0
5676g17J81m4j18L4k3L6p0J62Q2k20K45qj65J92q2N3P1q0K5L4J23R3J7n0M6J52
5702c1k49J57l1j99K69J31k0R6P1j99K13P7q5J9J4K05j07Q8j48L6P3J85l7J55
5726F83m7r3n9J51l4p1J31k7J0j39P5k8Q6j05Q1J15j54j71K56j8n3M8k42Q2rl4
$$ plain form
5551 -333 -319 -461 -306 -574 -442 -445 -525 -602 -391 -524 -680 -727 -582 -574 -620 -603 -658 -597 -611 -690 -567 -616 -629 -367 -497
5576 -497 -401 -367 -563 -318 -195 -286 -278 -239 -213 -343 -77 -160 -121 -284 -351 -166 -132 14 123 234 133 16 47 214
5600 214 107 215 360 354 468 305 462 438 331 403 481 582 410 535 559 555 492 585 618 757 567 464 670 608
5624 608 588 611 519 605 544 695 405 634 557 439 472 521 497 434 510 552 347 209 195 262 298 13 183 33 108
5649 108 65 80 57 28 -38 59 -35 -347 -157 -524 -324 -256 -232 -376 -373 -405 -437 -458 -566 -504 -456 -629 -596 -505 -681 -677 -717
5676 -717 -536 -580 -698 -664 -687 -651 -721 -559 -477 -697 -452 -460 -625 -433 -515 -462 -391 -471 -446 -412 -289 -196 -179 -229 -183 -31
5702 -31 -280 -123 -154 -353 -84 47 27 123 194 -5 208 285 200 219 233 438 331 419 271 307 380 565 528 683
5726 683 636 543 484 635 601 530 661 634 644 505 580 552 638 533 614 729 575 404 660 642 589 637 395 477 468 434
5752D34j20p6K09k02k57j4L58k64j08o0M4J39k17q2K9J14j12J49j91J10j12j46
5774c75l1Q7P6q0j05p1Q2Jj99J17m9K4j90K08j39Kr2R9M6K4j1j30K34j80J80P9
5800c93j73K0m8K84p9m4j78L05o4K18o6k07J89j23R6J69n9L9O6%l3R8J70j50j04
5825f7K89k1k3p9P0R2K2O3R9M4j38J29J61j63N7j62J33O1J03k7n6l2J30Mj58q3
5851D48J04j41j0K43j23p7J01m9j15J21kj34M2l3R7k43l5J20k14J90k61J94j58
5874F5J62j15p4K9j89J10o7J40k39J9m9L5J14o2k68o3J34Q2J04m28J37K8r8MR6
5899c93n2j36o2J86K3j65n7J18J40j27k6k7J45m1O3KJ14j56J5q4J92k2J79j56
5923c27j13K47K1oj89J60k3J63q5J29J19k17J19o9J23nR1J2NJ04j72K56j16J35
$$ plain form
5752 434 314 238 447 245 -12 -26 332 68 -40 -100 -56 83 -134 -216 -187 -73 -185 -36 -227 -117 -229 -375
5774 -375 -406 -319 -243 -323 -428 -499 -417 -416 -615 -498 -547 -523 -713 -505 -644 -642 -734 -635 -589 -565 -576 -706 -472 -652 -472 -393
5800 -393 -566 -546 -594 -310 -389 -433 -611 -306 -370 -152 -218 -425 -236 -359 -263 -94 -153 -114 -48 -48 -81 17 187 37 -67
5825 -67 222 201 178 99 169 261 283 346 445 489 351 480 641 478 535 373 506 567 670 643 587 555 685 689 531 448
5851 448 552 411 401 644 521 444 545 496 381 502 500 366 408 375 472 229 194 314 100 290 29 223 65
5874 65 227 112 38 67 -122 -12 -79 61 -178 -159 -208 -173 -59 -121 -389 -452 -318 -236 -132 -560 -423 -395 -493 -489 -393
5899 -393 -445 -581 -643 -457 -434 -599 -656 -538 -398 -525 -551 -578 -433 -474 -411 -409 -295 -451 -436 -520 -328 -350 -171 -327
5923 -327 -440 -193 -172 -178 -367 -207 -230 -67 -152 -23 96 -121 -2 -71 52 47 138 150 155 259 87 343 227 362
5947C62K8k09K51K9r2R2J41j61J50l21M5P0K28r2J8k59K42lj37J84j60L43j83
5970E66j60lR7l9N5n0j24J11p8k7P5j48j51J11n3L9r5K6m7RM1k78N7Qp4J6J10
5997fr8o9j00K1J17j21o2p4L0q5J37lj07j05J64l5n7j57K18j21n0J98k71J14o4
6022e86P0J12k68K17Q8o1j9j1j21J02Q9P9j82J62q2L7n7M5R6j0q3K98k6q7L8K7
6048a33p7L17j05l6J99j31R9J36j24K22m3j7o5N0J62o0j08K95j53J76j53l7J10
6071E24n3O3o6L1O3k7n5K2J21j04o0m5O4q0mj69J20M7p3R6j15J6M0j11J07L9j40
6098B51l8R0j80o1m7J27k07J90o0k12P9Q5p4j70R7j0k9k02RR0j81KJ42k3k67K87
6124c12l06K77r8m5j8J30j39j25mJ60r5JJ25j61K5J2Q1QnJ00j80Q0J11l5K3N1
$$ plain form
5947 362 390 181 432 461 369 461 602 441 591 270 315 385 613 521 539 280 522 519 382 566 406 749 566
5970 566 406 403 500 461 516 466 342 453 375 348 423 275 124 235 182 221 126 152 105 114 155 -123 -66 -58 -132 -116 -6
5997 -6 -104 -173 -273 -252 -135 -256 -318 -392 -362 -447 -310 -313 -420 -525 -361 -396 -453 -610 -392 -513 -563 -365 -636 -522 -586
6022 -586 -516 -404 -672 -455 -367 -428 -447 -458 -579 -477 -388 -309 -491 -329 -411 -374 -431 -386 -290 -300 -383 -85 -111 -198 -160 -133
6048 -133 -210 107 2 -34 165 34 133 269 145 367 324 307 242 292 454 394 286 581 428 604 451 414 524
6071 524 471 534 468 499 562 535 480 502 623 519 459 414 478 398 394 225 345 392 319 415 300 316 356 245 352 391 251
6098 251 213 303 123 62 15 142 -65 125 65 -147 -68 17 -57 -227 -130 -140 -169 -371 -362 -272 -453 -451 -309 -332 -599 -312
6124 -312 -618 -341 -439 -484 -502 -372 -511 -636 -640 -480 -575 -574 -449 -610 -585 -573 -492 -484 -489 -389 -569 -489 -378 -413 -390 -339
6150c39m7J11K1J06q7K28k19k7K22m5n9J48N2n6K0J12o8R6J29j38J97j18j17l9
6174H3L22j39J11n0R0J02k07R1lJ16N9q0m8j25J22J01j87L2on7J49j57L01j77
6198D43N0k04J02Q4m8J6j82K25n1l14K27k02P9L6k44J68j08J28j84N7k68l2J93
6221b9n7R5K7j94o4J52j70j52J83j54K1mk0j52J16q8J58r8J15q3j87L5J4j36J35
6246e37m4jJ02n6N7LK1o8R4P4n5K50k76Q9m7N7KJ52j14J37r7kK33j49n6Q9J52
6273A0K8q3p7J09O0k6L1m2J17j09J20L32k17k1J8J5R4K5n5J65l6M2j47M3j99K34
6299D31M7rl9j48J16L8j3K2o5p8J64j17j48J01J88k56R5J59j23k0kKq9k1l9m6
6325A50J14r0K5j39Q4j92K33Pk08j44J85r9K6k4m8l5R7k37J94l33J10N8j21j2
$$ plain form
6150 -339 -386 -275 -254 -148 -235 -7 -226 -253 -31 -76 -135 13 65 9 29 141 73 169 298 160 357 239 122 83
6174 83 405 266 377 327 417 519 312 403 400 516 575 495 447 322 444 545 358 390 384 327 476 319 620 443
6198 443 493 289 391 475 427 443 261 486 435 121 348 146 225 261 17 185 77 205 21 78 -190 -222 -29
6221 -29 -86 9 36 -158 -222 -70 -240 -392 -209 -363 -342 -346 -366 -518 -402 -490 -332 -430 -315 -398 -585 -550 -536 -672 -537
6246 -537 -581 -582 -480 -536 -479 -476 -455 -523 -429 -355 -410 -160 -436 -347 -394 -337 -335 -183 -297 -160 -257 -259 -26 -175 -231 -142 10
6273 10 38 -45 -122 -13 47 21 52 10 127 18 138 470 253 232 250 265 359 384 329 494 458 500 353 396 197 431
6299 431 478 469 430 282 398 436 423 445 380 302 466 349 201 302 490 234 329 488 365 345 343 345 256 235 196 150
6325 150 264 174 199 60 144 -48 185 192 -16 -160 25 -74 -48 -72 -120 -155 -58 -295 -101 -434 -324 -266 -387 -399
6349c99q9K65l57K64K4j66J04n5j06K1k0K65j74J67j74l6J87k35J55N4J19j87
6371c73l1R2N9j45J19k1J53m0j66J84km0OK49r7j0M1J95k59k8n4K19j14L01j16
6396A22L3q0J81o2J51Jj85K65j10Mj40K24Q9l5j88K20q2p9k1l5P7R4k1l7L0p5
6422C41J73j34R8j29K5j50P0J15k23J40N6L8k15P0j07n4j15L10j59k25J23J52
6444B00k8j5j91P3j2j4j76q1K2%P0J4J62k21j00Q4j99J42J5n2j06J1J32l6O7q2
6470c21j04KJ2J92q0j24K6p8J36p5n2K61q0lo8o5KJ01k5J1K2P6k5o1Q5L2l0J97
6498c6k9j91K12K1J24j1r5j09P7J34O3n7mm7r5L72j23O8k9J0j6jQ8j32K67k6k8
6525D07j05L10j45r1J19j20j60J09PR2M5j55l3J08j57P9k2J16jq6n7j44J98o8
$$ plain form
6349 -399 -488 -223 -580 -316 -292 -458 -354 -409 -515 -494 -514 -249 -423 -256 -430 -466 -279 -514 -359 -305 -186 -373
6371 -373 -404 -312 -253 -398 -279 -300 -147 -187 -353 -169 -171 -211 -205 44 -53 -63 -22 173 -86 -114 -168 51 -63 238 122
6396 122 155 75 256 194 345 346 161 426 316 320 180 404 493 458 270 490 408 329 308 273 350 444 423 386 416 341
6422 341 514 380 478 349 374 224 294 409 186 326 382 420 205 275 168 114 -1 309 150 -75 48 200
6444 200 172 157 -34 39 27 13 -163 -244 -222 -222 -152 -138 24 -197 -297 -213 -412 -270 -255 -307 -413 -402 -270 -306 -239 -321
6470 -321 -425 -423 -411 -219 -299 -423 -397 -475 -339 -414 -466 -205 -285 -288 -356 -421 -419 -318 -343 -332 -310 -234 -259 -320 -235 -203 -233 -36
6498 -36 -65 -256 -44 -23 101 90 -5 -114 -37 97 160 103 99 52 -43 329 206 274 245 255 239 238 326 194 461 435 407
6525 407 302 612 467 376 495 375 215 324 331 423 468 313 280 388 231 310 288 404 403 317 260 116 314 246
6549B46Kj45K29j89j07o2J87j86J17k37kj1o6J80j1O9Jm5j90Q5Q6k45k8R9j3k6
6575b62m7M3j66Q9j20K01j50oJ09j47O2j44N8oN3p6J00J9j13K06L0r8J1j7M0R7
6601b34r2K83k14J20j80M8J85j90O4J77q2J17n8J06n6Q9mN3p1J67j15j40K31k1
6625A83l8N7j2r7J59p0N2J74r3L9J71r7N2j78M0J03P5l1m5%j67L20j80j07q7J30
6651C53R1l17K42Rj24J4L0j41J9M4j3J48l10J03N8q8L4L7j63Kn5j23Q9M4J09j66
6677g4k0m1J76k39N%J11j27r0R3j96J40M6J02k68O8P0o1J7j38K0P8R4k15K0J69
6703b60j27KQ1K9j0J33j27j90J98J3k8q4J34q8J32o5J22q3J25Q5j16J27j73mJ29
6728d5M1R4l7r2J57o8O8J33J2j00km3L27k73N8L1K42k41q5J62j29J19j23K54n
$$ plain form
6549 246 248 103 332 143 36 -26 161 -25 92 -145 -147 -158 -224 -44 -55 14 15 -30 -220 -135 -49 -294 -322 -223 -236 -262
6575 -262 -309 -266 -432 -343 -463 -262 -412 -418 -309 -456 -394 -538 -480 -486 -433 -509 -409 -390 -503 -297 -267 -365 -354 -371 -331 -234
6601 -234 -326 -43 -257 -137 -317 -269 -84 -274 -210 -33 -115 2 -56 50 -6 83 79 132 61 228 113 -27 204 183
6625 183 145 202 190 93 252 182 234 408 315 354 525 428 480 302 342 445 520 489 444 444 277 597 417 310 223 353
6651 353 444 127 369 378 254 268 298 157 176 220 207 355 45 148 206 118 152 189 26 28 -27 -150 -61 -17 92 -74
6677 -74 -94 -135 41 -198 -193 -193 -82 -209 -299 -206 -402 -262 -216 -114 -382 -314 -244 -305 -288 -426 -406 -328 -234 -449 -429 -260
6703 -260 -387 -385 -304 -275 -285 -152 -279 -469 -271 -258 -286 -370 -236 -324 -192 -257 -135 -218 -93 -8 -124 3 -170 -174 -45
6728 -45 -4 90 53 -39 118 50 118 251 263 163 161 118 445 172 230 261 503 262 177 339 210 329 206 460 455
6753D55p6q2k0L7k4J0j07JK33k86K59o7l0m5j96K51l6j08Ll8J18n4j51l1K17r5
6779A38Q5q5j41N3K13j23n6j27N8j9j51l0J5p3J06j5pj33L8M1L5L7p2J07k77J47
6805b36j6O5j74P6j25L10j00k18r7L58j83r0P9N6Q8j52J91j21L5j9n7J66n0P0
6829a44m8K7o9m3N6j7N9R3m6J15j40J73K1J08j39j3m8M5P9J18M8lN5Or3p4N9J70
6857C55j42P4J20ml07R3P7OJ68l55J88L7o6J30J3r9o5N1j89J29O1N6j9n8j22O6
6883A98m2J14l3j48J90k1Mj87J05j0n0j07J34j05Jmk7l5o8n6Q8K5j53m2J00J2
6909a17J15j44l8oj94J76j01R7K4j88Q8N9l6m5l5J20j0j17j2O3n4R1j28N7M2L
6935b90JJ0l1O2J7M4J09j63j24K06j6j38R7k6K49k35J12K5p5K54k47K73j12J38
$$ plain form
6753 455 379 297 277 314 290 300 193 194 427 141 400 333 303 258 62 313 277 169 172 134 252 198 47 16 233 138
6779 138 223 138 -3 50 263 140 84 -43 15 -4 -155 -185 -170 -243 -137 -152 -159 -292 -254 -213 -178 -141 -213 -106 -383 -236
6805 -236 -252 -187 -361 -285 -410 -100 -200 -418 -515 -157 -340 -430 -351 -295 -207 -359 -168 -289 -254 -273 -330 -164 -214 -144
6829 -144 -192 -165 -234 -277 -221 -238 -179 -86 -132 -17 -157 16 37 145 6 -7 -55 -10 69 187 235 232 287 293 200 126 185 355
6857 355 213 287 407 403 96 189 266 272 440 85 273 310 244 374 387 288 223 274 85 214 275 331 312 254 132 198
6883 198 156 270 237 89 279 258 262 75 180 170 120 13 147 42 43 39 12 -23 -91 -147 -59 -34 -187 -229 -129 -117
6909 -117 -2 -146 -184 -190 -384 -208 -309 -212 -188 -376 -288 -229 -265 -310 -345 -225 -235 -352 -364 -301 -355 -264 -392 -335 -293 -290
6935 -290 -289 -279 -310 -248 -231 -187 -78 -241 -365 -159 -175 -313 -216 -242 7 -228 -116 -91 -166 88 -159 114 2 140
6959A40J5l1O0j08JM6Pj56J37R4j09P1R1j1j29R5J10l38L16k5L2N3p4R5n7l04
6985B1K82J47n6r5l6r7J19j50K12J92k25Kq8J9O8m7l7L6j42o8k2J54p7n8q3L1
7011BQ9J47k35M3m2j35J10k27K49k76J20k0M5j19J1r3N3n1K6QJ25l26J46P8p8
7036c50R3m7K0J5n7J50j11j18rP2R2J11j90O2m0k5K16j6m8m1J03n5j1O6K0j50
7062b48K95k52m0R9L03j49J29k7jn9j34N3J26N3N3P7O3j51n1o7L60k84j4J8o7
7087H5J75j9N7J3n4r4J50n3N6pl5J8P3N2p0j43M9R8p6R9k58R6j51K3K4J7L6r5
7115F6Q2r3p6o3J64j36kM9n7J7q2N0j91L00j13k3j33J88l7l7j30K7J68K3j57o3
7141b59J8K0M1j56n0j30J87Q3M3j23k5J07pj23J19n8M4J4J6J02j87p0K18j9P0
$$ plain form
6959 140 155 124 184 76 77 123 130 -26 111 205 96 167 258 247 118 213 323 -15 301 276 308 361 287 382 325 21
6985 21 303 450 394 299 263 166 285 135 347 539 314 316 228 247 315 268 231 267 125 57 35 189 112 54 -29 2
7011 2 91 238 3 46 4 -131 -21 -248 1 -275 -155 -175 -130 -249 -238 -331 -278 -329 -303 -295 -170 -496 -350 -272 -350
7036 -350 -257 -304 -284 -269 -326 -176 -287 -405 -414 -342 -250 -139 -329 -267 -307 -332 -116 -132 -180 -221 -118 -173 -184 -118 -98 -248
7062 -248 47 -205 -245 -146 157 8 137 110 109 50 -84 -31 95 148 201 278 341 190 139 72 432 148 134 152 85
7087 85 260 241 298 311 257 163 313 260 316 309 274 292 365 417 347 204 253 351 275 374 116 212 61 84 108 125 161 66
7115 66 148 55 -21 -84 80 -56 -58 -9 -66 -49 -131 -81 -272 28 -85 -108 -241 -53 -90 -127 -257 -230 -62 -39 -196 -259
7141 -259 -241 -221 -180 -336 -386 -516 -329 -246 -203 -326 -351 -244 -251 -374 -255 -313 -269 -255 -239 -137 -324 -394 -176 -195 -125
7166a25k12J12q2O3q0K08j00O9K07l0r0J23lo2L1j59K25R2m7k60K98j83j02L59
7190B52j88J69j75K86j10j02O4k6J28l6m7j21k8Q4J66l3j14K05J4l6p8q8k6Q8
7214B48nq1J19j34J66r1R2q9o3j27L0O9N8o4l4J69n2k20J04M5j59m4k3j1K84k36
7240d9K0o6N5j43Q7n3L5J06k4PJ6p1j2j29J4Q3l62K43n1J03L7m3L7j28O7R4Lj69
7268b93Q2l6j35K99j70pO8K4j28M4Q3O8j27J10R3j19J10j13R4j09oR1Q0j18M5
7293g0q8J38R6k09J65J5lK22p5l1M6K5j26J08J01j16m4k6L00j40PRj12K8%M4j7
7320B47n9l1J7P1rQ0m4j63J50j5m8j00J79k5l5pO1j53J99l32P2O4j47J68l7J12
7346B15k66J41m5r6P1L3p4M1j84J33l0k35J87PJ55l59J13K2n2M5j89Q0J39qo6
$$ plain form
7166 -125 -337 -225 -307 -244 -324 -116 -216 -147 60 30 -60 63 60 -2 29 -130 95 187 140 -120 178 -5 -107 252
7190 252 64 233 58 344 234 132 196 170 298 262 215 94 66 150 316 283 169 374 388 352 274 186 160 248
7214 248 243 162 281 147 313 222 314 225 162 35 65 134 192 128 94 263 211 -9 95 140 -19 -63 -86 -97 187 -49
7240 -49 -29 -95 -40 -183 -96 -149 -114 -8 -32 -25 -9 -80 -92 -221 -207 -124 -486 -243 -294 -191 -154 -197 -160 -288 -221 -127 -124 -293
7268 -293 -211 -247 -382 -83 -253 -260 -192 -168 -296 -252 -169 -101 -228 -118 -25 -144 -34 -147 -53 -162 -168 -77 3 -115 -70
7293 -70 -158 -20 76 -133 32 47 44 266 191 160 206 231 105 213 314 198 154 128 428 288 295 304 192 220 220 264 247
7320 247 188 157 174 245 236 316 272 109 259 244 196 96 275 250 215 208 269 116 315 -17 55 119 -28 140 103 215
7346 215 -51 90 45 -51 20 53 -21 20 -164 -31 -61 -296 -109 -102 53 -306 -193 -171 -223 -178 -367 -287 -148 -156 -222
7371b22M1r5q1J11J18k85L20j18m1J34j62P3j10L05k23%M4j1K4M7o3M0Q5j01M8
7396a22n3p2J42J4p9J41k0J5n5J77j57O2J39j10j02K02J3j27K52k05q0o4J00J32
7420A43Q8k1j04J90k0j20N4j72J91J00j44J37l5m0l2j47K98m4j5k06J8Q5KP5n2
7445B29j33j8J01K7l0j15Q1R7n0p4n2o0N9N3j38p0K83k88J39p3k0j31J80k7k7
7470e7K9q7l2n3j03J51Oj00P0j35J22o1k9p2K8J39r0M2r9j16J26J06L9m0j8J2
7496b22J37k19J38j71J73oj2N5K4J06m5n1j14J70l4j2j53J82m8K77l58J76O0p4
7520b1P7j38R5L0j39J31j2L3J50j24MQ3j0J25j52J22o2N5o4J14l8K31l99P0R5
7545B56K3p0K3P6L5n9N7j82k6R0J1j5j9o9R1l9k23N7J9J04N7j23M1j86K1K57k18
$$ plain form
7371 -222 -181 -276 -357 -246 -128 -413 -93 -211 -252 -118 -280 -207 -317 -12 -235 -235 -191 -202 -178 -131 -194 -154 -69 -170 -122
7396 -122 -175 -247 -105 -91 -170 -29 -49 -34 -89 88 -69 -7 132 22 -80 122 135 8 260 55 -25 -89 11 143
7420 143 231 210 106 296 276 156 210 38 229 329 185 322 287 247 215 68 366 322 307 101 119 204 206 281 229
7445 229 96 78 179 206 176 61 142 239 189 115 63 3 62 115 -23 -93 190 -98 41 -32 -52 -183 -3 -30 -57
7470 -57 -28 -115 -147 -200 -303 -152 -146 -246 -176 -311 -189 -250 -279 -351 -323 -184 -274 -232 -331 -447 -321 -215 -176 -216 -234 -222
7496 -222 -85 -304 -166 -337 -164 -170 -182 -127 -103 3 -42 -93 -207 -37 -71 -83 -236 -54 -102 175 -183 -7 53 -21
7520 -21 56 -82 13 43 -96 35 23 56 206 82 86 169 159 284 132 254 192 247 183 297 259 490 91 161 256
7545 256 279 209 232 308 343 284 341 159 133 223 234 219 200 131 222 183 -40 17 36 140 197 74 115 -71 -50 207 -11
7572a1K6P9j28P3k96J89q7R3j24Q2m8N4l77M33j30J6O3l6L5j37l5J45K0K0j44
7597b25L5k69K31m6Q2p8O4j25J85qj78J69j6K6j15P2K5j23J28j47J10J07Mo3J4
7622a41J09M3j15R6Q2m6N0o0O9k23K55q6n5L2M5J51j99J37l41L26K5L6n4r0J74
7647B20q3O7OJ7K14k30M8j09J31j8rm8k6R3j19j3l3J74n2p9j5J44l7k08J52M4
7673B31j25M7oj16m7N1j9NO8L4j32M0R4L1k33K3j37J69o6o8J74k21P1n3J08L5
7699d2m3j85L2J33qO0j45m2PN2J96j23m5J13k14K0J76j57J25j75L6N4n4J01k24
7724c52K38J4m7j32J41m6L8J10j38K00L9j28o4j3O5j47L43p5j26K5J8Q2K2k59
7748a92J27J1J66q5J67N9j89n0K32l4j67K03l6j56J0M6n7O5J74r8K6j04J10J78
$$ plain form
7572 -11 15 94 -34 39 -257 -68 -155 -62 -186 -104 -152 -98 -475 -42 -172 -156 -93 -129 -94 -231 -266 -121 -101 -81 -225
7597 -225 -190 -459 -228 -274 -192 -270 -206 -331 -146 -154 -332 -163 -179 -153 -268 -196 -171 -294 -166 -313 -203 -96 -92 -155 -141
7622 -141 -32 11 -104 -8 74 28 78 18 87 -136 119 33 -22 10 55 206 7 144 -197 129 154 190 136 46 220
7647 220 137 204 210 227 441 211 259 150 281 263 254 206 180 273 154 141 108 282 230 151 136 280 243 35 187 231
7673 231 106 153 147 31 -16 35 16 21 89 123 -9 31 125 156 -77 -54 -191 -22 -88 -156 18 -203 -132 -185 -77 -42
7699 -42 -85 -270 -238 -105 -113 -53 -198 -240 -233 -181 15 -108 -153 -40 -254 -234 -58 -215 -90 -265 -229 -175 -229 -128 -352
7724 -352 -114 -100 -147 -279 -138 -184 -146 -36 -174 26 65 -63 -127 -140 -75 -222 121 46 -80 -55 -37 45 67 -192
7748 -192 -65 -54 112 27 194 253 64 14 246 212 45 248 212 56 66 112 55 120 294 196 222 118 228 406
7772D06l02q2M6O1Q8pj16Q8J8n1J64m4p1j35J44q6K7N0j83J43j76J39k0jl6m3
7798B1L3J8o0m1J53j25R7j13j74L41k33p4J51r2k52N0J69r5J30n6J6j55O6r6Q1
7823b40N6j85K84J1O8k26J9M5r2Q4k98K62Q3J14o4j9j42J61j59K35p5m8qm7Q9
7848i2j16K1KJ06K9j27K22k24J63J17j90O0K7M0J4J05j06J87o0j13J26l8J12r7
7872A68K8r5J62j10K25j88O2M2j63%N1J4M3L1j18J34R8j56j0j04l4J44m4j94P9
7897F5L6K8m5M6J01j99K5j7Q5M1j02M6%j71N4O8j42M6J6j34J04J40k44K61k87
7922a79N9n5J89j38q9O5K08j99K14k53n7k4m4K65r4j81J83j65J18mj39J28Ok2
7946b08N3qk52J23Q4n0J10M9M0j70J20j02P2J26k27R5qK33j37p0Q7K5J74l9Rj02
$$ plain form
7772 406 104 22 68 129 217 210 94 182 200 149 313 269 198 63 207 121 148 198 15 158 -18 121 101 100 64 21
7798 21 54 72 12 -29 124 -1 96 -17 -191 150 -83 -157 -6 -98 -350 -300 -131 -226 -96 -152 -136 -291 -225 -321 -240
7823 -240 -184 -369 -85 -74 -6 -232 -213 -168 -260 -176 -474 -212 -129 -15 -79 -98 -240 -79 -238 -3 -78 -126 -134 -181 -92
7848 -92 -208 -187 -185 -79 -50 -177 45 -179 -16 101 -89 -29 -2 38 52 157 51 238 178 65 191 153 265 168
7872 168 196 101 263 153 378 190 252 294 131 131 182 196 239 270 152 286 384 228 218 114 80 224 180 -14 65
7897 65 101 129 84 130 231 32 57 40 125 166 64 110 110 -61 -7 61 -81 -35 -19 -153 -49 91 -153 108 -179
7922 -179 -120 -175 14 -124 -213 -148 60 -139 75 -178 -235 -259 -303 -38 -132 -313 -130 -295 -177 -181 -320 -192 -186 -208
7946 -208 -155 -163 -415 -292 -208 -258 -148 -99 -59 -229 -109 -211 -139 -13 -240 -145 -153 80 -57 -127 -40 -15 159 120 129 27
7972B7rJ9J86k32J34n0J57k58J89L1n1K0Qn3O8Rp8J17J5j76K40n7l7j05J05M1
7998B60r7OqN9j59J61j59N4J61j25O4L3J3j11j03J04j54K41k30O3pJ23k59J13
8022D3J9J56j65j00Q9j84O2O8p7P9j20K0Qk11J02J15j52N5j3J69r7j77J58j58
8046c11J52kl6J43j67J8O4L3q1K6n5p3J8K06k9l09K66n7r5J34J16r2l0l5K22j51
8072a25Jj2M4m5M2j37N3K64L4j27j59K04j56L29p5M5j64M9J44l0q9R1j9r6j7J62
8098B11j9j69K26l0o9Q3mqQ5j01n0J55p2q5K16k10J74k69J50J28j66K07k04m6
8122A33j53J90lk0n5K9p9RJ21j76J03j20Q2k10K00j15q1J85n3J68l06J42J6k2
8146a5k34M7K1J12J4j73M3r5L9M7J1oN9j30k0o4M7n0K11R3n8j98J2J28j09k8J83
$$ plain form
7972 27 18 37 223 -9 125 75 232 -26 163 194 143 163 171 118 186 195 117 234 249 73 313 256 219 114 219 260
7998 260 163 169 161 220 61 222 63 117 278 153 217 250 263 152 49 153 -1 240 10 73 66 189 -70 43
8022 43 62 218 53 -47 42 -142 -80 -12 -89 -10 -130 -110 -102 -313 -211 -96 -248 -193 -206 -37 -134 -311 -153 -311
8046 -311 -159 -161 -197 -54 -221 -203 -139 -106 -187 -161 -216 -289 -271 -65 -94 -403 -137 -194 -289 -155 -39 -131 -161 -196 26 -125
8072 -125 -124 -136 -92 -137 -95 -232 -179 85 119 -8 -167 37 -119 210 135 180 16 65 209 179 90 181 162 66 49 211
8098 211 192 23 249 219 150 233 229 221 306 205 155 310 238 153 369 159 333 64 214 342 176 383 179 133
8122 133 -20 170 167 147 92 121 42 51 172 -4 99 -21 61 -149 51 -64 -145 40 -13 155 -151 -9 7 -15
8146 -15 -249 -202 -181 -69 -55 -228 -185 -280 -241 -194 -183 -189 -130 -260 -280 -344 -297 -347 -136 -43 -101 -299 -287 -159 -268 -296 -113
8173a13m0J17j49R4j40K0k6Q9N3N2o1j0J10R8l41K80O7j67
$$ plain form
8173 -113 -153 -36 -185 -91 -231 -211 -237 -148 -95 -43 -104 -114 -4 94 -247 33 100 -67
8191f7
$$ Imaginary data points
##PAGE= N=2
##DATA TABLE= (X++(I..I)), XYDATA
0@%%%%%%Qq%qJ6j6J6k4L3m1N3o2P4r0J10j34J58j83K15k54K95l40L88m45N11n80
32c08O57p43Q40r45J058j185J324j475J641j822K019k235K471k728L008l317L654
49A914m024M433m882N383n944O573p283Q091r025J0117j1410J2969j4894J7343
63I361k0569K5023l1584M2194o2082J11336m43502o10921J348598K76102j061143
74d17187n1187Q20157k17968n37963K71374L28089k31007j04405O7454n0697R6074
85b7266J88315k64025k53372L43059K59702l54944j43970L26060p201l11736J23793
96a21585K75659j21519j64894P3906j8833k5423K06727J5242l18816J0715L44885
107A56064n0594k94072J17952K04188j77494r9311K24313L6635j98456j1131R9139
$$ plain form
0 0 0 0 0 0 0 0 8 0 0 -8 8 -8 8 -16 17 -24 29 -33 41 -49 61 -73 85 -98 117 -137 158 -182 206 -239 272 -308
32 -308 349 -394 446 -499 559 -626 698 -777 864 -958 1061 -1174 1297 -1431 1577 -1740 1914
49 1914 -2110 2323 -2559 2824 -3120 3453 -3830 4261 -4764 5353 -6057 6912 -7982 9361
63 9361 -11208 13815 -17769 24425 -37657 73679 -369823 -980744 367854 643956 -417187
74 -417187 -468374 351783 133815 -404148 -132774 195315 -35692 -140097 -72643 -123340 -27266
85 -27266 161049 -102976 -356348 -13289 246413 -108531 -252501 73559 66358 -245378 -121585
96 -121585 154074 32555 -132339 -58433 -77266 -102689 104038 119280 -199536 -188821 156064
107 156064 105470 -188602 -70650 133538 -43956 -143267 81046 117681 -80775 -91906 7233
118G233K947M8372L3226j47661n5212J76209L5904j47453N2137J21800j51516
129b4014r1833K25654N6199k45963J7203K23709j17311j57503K38247Q0439l42678
140a37851j4953L93811l0242l61643Q6087K72310j63762j79173K32699J14677
150B11960k47033p0191J89182J7677r2479L6393q924p7983Q2829Q1022j26258
161c805m9480J31360k0102j27775R5034J20752j52309j17379J52931P7421j20505
172a3857p305P2804q1438m5804J29857J3319j33502K4835Q7906q2212l5916J25292
184E3979j6342j50915M2186J35523n7086r0590O1408K0904p4171L3770P6895n6680
196b1119n6808M5830j316k6499P3975R497j27935J1483J43288m5542j23046R6281
$$ plain form
118 7233 10180 58552 91778 -55883 -111095 65114 101018 -46435 5702 127502 -24014
129 -24014 -115847 109807 166006 -79957 -62754 160955 43644 -113859 124388 204827 -137851
140 -137851 -152804 241007 210765 -150878 -64791 207519 43757 -135416 97283 211960
150 211960 -35073 -105264 83918 101595 9116 45509 36585 -41398 41431 122453 -3805
161 -3805 -53285 78075 57973 -69802 25232 145984 -6325 -123704 29227 106648 -13857
172 -13857 -21162 51642 -29796 -75600 54257 67576 -65926 -41091 46815 -35397 -71313 53979
184 53979 37637 -113278 -71092 64431 7345 -83245 -21837 -933 -75104 -41334 35561 -21119
196 -21119 -77927 -32097 -33413 -59912 14063 23560 -104375 -92892 50396 4854 -118192 -21911
208b1911Q8517j45955n1607J85095K6723j90326n038J62811j0915j05540L6020
219c2126N3900n0889j7033M7335O223n394L204m7316j0439R6209K2195j12978
231d7109j7313J11212N64r1789L2850P6526n9709n8844P5075M6376o1685k1510
243a5356L4402j1508m34N0887j8319o9911K8183O4246l2603l7028M5218J1373
255D9150n6264L997N8196m674m0824j255R768N708K4263n581m9320L491N5875
268E2530j1237m7931K9590L3757n5469k9238P0041K7209o9764k3721M9730M573
280C0070k8714J6567Q485l6283l80L6308r811k5612J6595J666l1269J4666L7718
293C0006k4599l8936J6553K1433j0966j84N362k2577q471K7823K441k3902Q510
$$ plain form
208 -21911 66606 -79349 -130956 54139 80862 -109464 -114502 48309 37394 -68146 -32126
219 -32126 21774 -29115 -46148 1187 7410 2016 5220 -42096 -52535 43674 65869 -47109
231 -47109 -64422 46790 47354 -44435 -11585 64941 5232 -53612 21463 67839 6154 -15356
243 -15356 19046 7538 7104 57991 39672 -30239 -2056 62190 29587 -7441 37777 49150
255 49150 -7114 -3117 55079 50405 9581 8326 18094 23802 48065 42484 -6836 -3345 52530
268 52530 41293 -6638 22952 56709 1240 -27998 42043 69252 -512 -24233 25497 30070
280 30070 1356 17923 26408 -9875 -10255 26053 16242 -9370 7225 8891 -22378 -7712 30006
293 30006 5407 -33529 -16976 4457 -6509 -6693 -1331 -23908 -32379 -4556 -2115 -26017 -17507
306a7507J1995k9755p299M5566M545n3726m218M6684j977l2352J1805J7489k3494
319c2244r105K8444Q048k1603n321N048N44J4038R063k1320j2837K2448J0114
332d683j6070M589J6529j7632j4654K6923J7265k1989j1650J5838M054o081J3025
345E464M005k1668j079K5672J454j5528P849O539j6475K160K6901j709k3934K748
359B399J4583k320J159O918r536q891J3924Q628j0617K75P208j1397m773K0646
373B8206O681k2347o925J6385K909q519N746L479j4402l592J5509M226j1495l268
387A2593K266k581K392P427o594j0810L867N831m614J204K911j0754q066J2025
401G097Q745j1561q579L738J69k818M465J268r220m986N494J527l312J437j733
$$ plain form
306 -17507 -5512 -35267 -42566 3000 7545 -46181 -50399 -3715 -5692 -38044 -26239 -8750 -32244
319 -32244 -41349 -12905 -4857 -26460 -31781 -26733 -26189 -12151 -3088 -24408 -37245 -14797 -4683
332 -4683 -20753 -16164 365 -17267 -31921 -4998 12267 -9722 -21372 -5534 -1480 -7561 5464
345 5464 9469 -12199 -13278 12394 13848 -1680 6169 12708 -3767 -1607 25294 23585 -349 2399
359 2399 16982 14662 15821 22739 13203 4312 18236 26864 16247 16522 23730 12333 7560 28206
373 28206 34887 12540 5615 22000 24909 16390 22136 25615 11213 7621 23130 27356 15861 12593
387 12593 14859 12278 14670 22097 15503 4693 8560 14391 9777 10981 13892 3138 -4928 7097
401 7097 15842 4281 -4298 -560 -391 -3209 1256 2524 -6696 -11682 -6188 -4661 -7973 -6536 -8269
416h269j0810O16J3830P74j6682m369J1596K566p481p86L383k515m032j016O124
431a7071O948o065j5719L581K1222J21k1714m03J8637k69j4200L969J3678m535
445a1820j2084L527J3501L864r249q884O003J3572K806j1196m578J1190O835q242
459d755l147J2430M609j2515n011J5530J0700j0863j1268P106J3245l47q825L81
473G270O205J03k074L230K596k201j681Q21J07L046N340m514r898L797J2480L19
489B4946j2466m167R682N503n995p107K742P645k041j1651l13J5643M050k3214
503C257j2966K6944K0116l0512k8059L0332K9123l2701l1075L3107K8251l5609
515B08k9932L2436K9116k9080l0818J9504K5771j1476k2060M0J4964N314j1733
$$ plain form
416 -8269 -19079 -18463 -4633 -3859 -20541 -24910 -13314 -10748 -18229 -19015 -15632 -18147 -22179 -23195 -17071
431 -17071 -10123 -16188 -31907 -28326 -7104 -6983 -28697 -29100 -10463 -10732 -24932 -20963 -7285 -11820
445 -11820 -23904 -20377 -6876 -3012 -12261 -21145 -15142 -1570 1236 -9960 -14538 -3348 3487 -4755
459 -4755 -7902 4528 9137 -3378 -8389 7141 17841 6978 -4290 2816 16061 15714 6889 7270
473 7270 13475 13578 11504 14734 17330 15129 13448 14269 14376 17422 22762 18248 8350 12147 24627 24946
489 24946 12480 8313 17995 23498 17503 10396 13138 20783 18742 7091 6778 22421 26471 3257
503 3257 -9709 17235 37351 6839 -21220 9112 38235 5534 -25541 7566 35817 208
515 208 -29724 2712 31828 2748 -28070 -8566 17205 5729 -16331 -16291 -1327 3987 -7746
528g746j3993Q126J9909q176l0686O662L7853o154m4356L173M3432m68m2533M80
542c4477L6384k553l0680K946K6121k542k1057K036J3848N56l812k075n115K615
556a7805J4358j979j7956M451K1797o578k0878J2743K1080j4862j7761J7567J6569
569A0746j6879q260J8125O24j6476J1673J8547j9863j7147K9996J7007l5084j0407
582a7398M1142N316m1993L067M1634m716l7512P203L1060o480j8852N739Q008
595A6218l205L675Q28j3460M969K1926j2429k8617J9286L3059k4549l7215K7346
608G832L9362l0266l6942K7146L0861k4876k5811J8574K1846j4828j9657O577
620a82J5648J051j4072j0573J0276J4347q082j9085L755K0485k478k4672J306
$$ plain form
528 -7746 -21739 -13613 6296 -1880 -32566 -25904 11949 5795 -38561 -35388 8044 7576 -34957 -34477
542 -34477 1907 -646 -31326 -28380 -2259 -4801 -25858 -23822 -9974 -9418 -13230 -15305 -20420 -17805
556 -17805 -3447 -5426 -23382 -18931 2866 -3712 -24590 -11847 9233 -5629 -23390 -5823 10746
569 10746 -6133 -14393 3732 4356 -12120 -447 18100 -1763 -18910 11086 28093 -6991 -17398
582 -17398 23744 29060 -12933 -9866 31768 27052 -10460 -3257 27803 21323 2471 8210 16218
595 16218 13013 16688 17516 4056 9025 30951 18522 -10095 9191 42250 17701 -19514 7832
608 7832 47194 16928 -20014 7132 37993 13117 -12694 5880 27726 12898 -6759 -182
620 -182 15466 16517 2445 -8128 2148 16495 8413 -10672 -6917 13568 11090 -13582 -12276
633a2276K5172l531k7756K138K6883k747k6962J757K2656l537k1078O008J7359
646D086j0300j6911J4143J2111j6713j0091J8093M840j9223J89J8954m696j8983
659b4501P825J5829p652j1625O069P159l835p11J116m153N048O557q209p301J4329
674d055Q465j7931p472K1204R148k1095p476K0274Q213j5180p247J3041Q129q499
688d81q313O240J2389r86j3898j218J6638M179j4612n204J4442Q109j2206q097
702c018J0590J0552p808j1400O446J4170l343j6089J592J7811K10j6498j524J6691
716A8382m13j4757J371J3352k349j1305K858P467k326m571J511l74k228L334R96
731A0948o594o28N388n49n679J257L871k792m823J448L377j439l188j121k74J156
$$ plain form
633 -12276 12896 9365 -18391 -16253 10630 7883 -19079 -17322 5334 1797 -19281 -13273 4086
646 4086 -6214 -23125 -8982 3129 -13584 -23675 -5582 -742 -19965 -19776 -822 -5518 -24501
659 -24501 -16676 -847 -8499 -20124 -14055 -6896 -10731 -11442 -10326 -14479 -9431 -2874 -11083 -18384 -4055
674 -4055 4410 -13521 -20993 211 9359 -11736 -19212 1062 9275 -5905 -13152 -111 8018 -481
688 -481 -8794 -2554 9835 8849 -5049 -6267 10371 14550 -62 -5266 9176 17285 5079 -3018
702 -3018 7572 18124 10316 -1084 5362 19532 16189 100 1692 19503 19713 3215 1691 18382
716 18382 17969 3212 4583 17935 15586 4281 7139 14606 12280 7709 9220 8846 6618 9952 10948
731 10948 4354 3726 9114 8565 2886 4143 8014 5222 399 1847 5224 3785 597 -524 -798 358
747C58J643k745l644J349L231l108m506L241K167m633k526L619R32l004j352j78
763i156J226J101r80k882q06L915o05m124L30M562j324m427J186M954j607l625
779a2262O6L088K006j855k309J304L268l37l944K193N432k550n067M296O068l699
795d302m316M511L943l504r97M027J70j647J658J419J49R57j20j074J759L025
811E658j126k269K687K379j951m48L170O15k827J117K879j075r21J949k91j572
827G974K186J704k962j427L431N50l080L02K414o06l075O70K392p53j903j168
843F649J214J166q66k776L26K182j329k927L46K185j047l901K73L179j627l011
859C6q68J463m87j309j147L92n06j97j455r75J332K31l008j145K264J063l477
$$ plain form
747 358 2001 -744 -4388 -3039 192 -2916 -7422 -4181 -2014 -6647 -9173 -5554 -4622 -7626 -8978 -9156
763 -9156 -7930 -6829 -7809 -10691 -11497 -7582 -8187 -12311 -11981 -7419 -8743 -13170 -11984 -7030 -8637 -12262
779 -12262 -12196 -9108 -7102 -8957 -11266 -9962 -6694 -7031 -10975 -8782 -3350 -5900 -10967 -6671 -603 -4302
795 -4302 -8618 -4107 -164 -3668 -4665 -638 -468 -2115 -457 962 1111 2068 1948 874 2633 5658
811 5658 4532 2263 4950 7329 5378 4930 8100 8715 5888 7005 9884 8809 7888 9837 9546 7974
827 7974 10160 11864 8902 7475 10906 11456 8376 8678 11092 10486 7411 8081 10473 9720 7817 6649
843 6649 7863 9029 8163 5387 5713 7895 6566 3639 3985 6170 5123 1222 1495 4674 3047 36
859 36 -832 631 144 -1165 -2312 -1920 -2426 -2623 -4078 -5053 -3721 -3490 -6498 -7643 -5379 -4316 -7793
876g793r92J403R77j723j148M60J129p15k055M21J690M40k584j162K968K271l560
893i973j686L660J590l100j010L859J402l482m13L774J098k904K87J933R69m88
909d484q6J017K193M99k515J304L523n15l074K464L608q74k432J662L228j113
925D405j200J831J006n87n4R29n76J613J505k080q98L089N64k224p06K956L74
942I947k357L46K540j389j228N21k68m5J799j217k294J066K202k172k575K216
958G092P28k147j616K150n85k174J69N73j908J31J098k860k013L546Q16n226j487
975c713N279m39n798N3L868j253l889M05J338L38q21k438q12L023N47m170j714
992a0196M619J147n128j211M230J341m720p24M109L91k637m12Q29J499K87j423
$$ plain form
876 -7793 -8785 -7382 -6405 -8128 -9276 -8816 -7687 -8402 -10457 -10036 -8346 -7906 -10490 -11652 -8684 -6413 -9973
893 -9973 -11659 -7999 -6409 -9509 -10519 -6660 -5258 -8740 -9153 -5379 -4281 -7185 -6898 -4965 -3996 -4484
909 -4484 -4570 -3553 -1360 -861 -3376 -2072 1451 936 -2138 326 3934 3060 628 2290 5518 4405
925 4405 3205 5036 6042 5455 5401 6330 5754 7367 8872 6792 5894 8983 9547 7323 6617 9573 9947
942 9947 7590 7936 10476 9087 7859 8380 8112 8067 9866 8649 6355 7421 9623 7451 4876 7092
958 7092 7820 5673 4057 6207 5622 3448 3617 4190 2282 2413 3511 651 -1362 2184 3000 -2226 -3713
975 -3713 1566 1127 -4671 -4618 -750 -2003 -5892 -5487 -4149 -3811 -4632 -7070 -7882 -4859 -4312 -8482 -10196
992 -10196 -5577 -4430 -9558 -10769 -6539 -5198 -9918 -10642 -6533 -6142 -8779 -9191 -8362 -6863 -6576 -7999
1008g999q69J782K065k072j055K539J114k067O20K144q07J087M36l97j195L674
1024a000J757m505j38N266J407n434L14O672r99n065K715M681k597j991L890Q5
1040E058k550L386K211n782J55Q118j030r001L917Q730m656q158O064P302o367
1055G397n172N248L290l743j639J595L93J92O45k437j548M282Q03o332j169O986
1071H791L62p974l20O174L84n706j784M360J307m298l279L535L402m121m342L460
1087d9L243n021k717M646o75m183K226J913m832n72N616k219p203M199O507o774
1103e895o221Q509L297r986l53R198k838p969O328M214p990r39Q940k917q896
1118a3518O311Q421r379o305J1785L557j1117l96J0424q68p942L043N288k603
$$ plain form
1008 -7999 -8868 -7086 -5021 -7093 -8148 -5609 -4495 -6562 -5942 -3798 -4605 -3518 -3082 -3479 -4674 -1000
1024 -1000 757 -3748 -3886 1380 2787 -2647 -2333 4339 3340 -1725 990 5671 3074 1083 4973 5058
1040 5058 2508 5894 8105 2323 2478 10596 9566 565 4482 13212 8556 398 6462 13764 7397
1055 7397 2225 7473 10763 7020 5381 6976 7369 7561 8206 5769 4221 8503 9306 2974 1805 8791
1071 8791 9153 1179 859 7033 7417 1711 -73 4287 5594 1296 -1983 1552 4954 833 -3509 -49
1087 -49 3194 -1827 -4544 102 -573 -4756 -2530 -617 -5449 -6021 -405 -2624 -9827 -5628 879 -5895
1103 -5895 -12116 -3607 -310 -10296 -10649 -1451 -4289 -12258 -5930 -1716 -9706 -10645 -1705 -4622 -13518
1118 -13518 -7207 1214 -8165 -14470 -2685 872 -10245 -10641 -217 -1085 -9027 -5984 -696 -3299
1132c299j640K590j322k50L732m9n099K318P120l577o141M789O839m221n235M581
1148A136M570k499l708J769L938J134m235j702N067L186n119l350O266L218n900
1163C771k076O239J63m560J714K448k423K59K968k864k946O064O08p498R59Q625
1179A1451l830q600N745O587p459m857P805J982r106J381P124m495n509O315J898
1194F432p917M17O746l226n846M519K571n762q16M060j536m000K968J360m566
1209d596N18L956l001l935M306J716n354q69M698p82l793J227J569j444M9Q23
1225d912k250J363J980k445k997M909K084o148j050O964p15n879K206N045l049
1240d894k787M048J083l264J558L015l901L93N007k021m621M942M265n812k005
$$ plain form
1132 -3299 -4939 -2349 -3671 -3921 -189 -238 -5337 -3019 4101 524 -5617 -828 6011 1790 -3445 1136
1148 1136 5706 3207 -501 1268 5206 6340 2105 403 5470 8656 3537 187 6453 9671 3771
1163 3771 1695 7934 8097 3537 5251 7699 5276 5535 8503 5639 2693 8757 9365 1867 2826 11451
1179 11451 7621 -979 4766 11353 3894 -963 6842 8824 -282 1099 8223 3728 -1781 4534 6432
1194 6432 -1485 -1068 5678 2452 -3394 1125 3696 -2066 -2882 1178 -358 -4358 -1390 -30 -4596
1209 -4596 -4078 -122 -3123 -7058 -2752 -1036 -6390 -7259 -2561 -3343 -7136 -5909 -4340 -5784 -5735 -4912
1225 -4912 -7162 -5799 -3819 -6264 -9261 -4352 -2268 -8416 -9466 -2502 -3217 -9096 -6890 -1845 -4894
1240 -4894 -7681 -3633 -2550 -5814 -4256 -1241 -5142 -4749 258 -1763 -6384 -1442 2823 -2989 -4994
1255d994P437P98p257K189O723l420m480N983K223n515Q70N507k826l079M993
1270E152Q63m450J303M967l228l562N424J960n553L31N796k377m178L681K531
1285H660m446o95M179j088k943K366J333l466K12L222k282k764L704O64m882R14
1301B688M018l102l481L584J675n024J67L330j943l136L022N01l627J35K903k369
1317f59k782L148M68m005P88K987k802k196K890K86l916J186L079l136k426M087
1333c003m4m591J280M250l418k815L870J457n030O93M420k189k691L137J176l474
1349f972P08L677k384k169L324J887m188J039L831j835k511L064K098l769P55
1364c445L901j284k588L357J568l420P57L704j337k457L155J983l434M9L786r15
$$ plain form
1255 -4994 2443 3241 -4016 -1827 4896 1476 -3004 2979 5202 -313 557 6064 3238 159 5152
1270 5152 6015 1565 2868 7835 4607 1045 6469 8429 2876 3207 9003 6626 2448 6129 8660
1285 8660 4214 3519 7698 6610 3667 6033 7366 3900 4112 7334 5052 2288 5992 6656 1774 2688
1301 2688 6706 3604 123 3707 5382 358 525 3855 1912 -1224 1798 2299 -1328 -1193 1710 -659
1317 -659 -3441 -293 175 -3830 -3042 -55 -2857 -5053 -2163 -1877 -5793 -4607 -1528 -4664 -7090 -3003
1333 -3003 -3047 -7638 -6358 -2108 -5526 -8341 -4471 -3014 -8044 -7351 -2931 -5120 -7811 -4674 -3498 -6972
1349 -6972 -6264 -2587 -4971 -7140 -3816 -1929 -6117 -5078 -1247 -3082 -5593 -2529 -431 -4200 -3445
1364 -3445 456 -828 -3416 -59 1509 -1911 -1154 2550 1213 -1244 1911 3894 460 509 4295 3380
1380C380k715K907J651k607O3L161r81k266K441J431k784R9L078r68k377J921
1396E434J172k011o77K650j242j294J628M27k672N81K724k507k112K857J025l634
1412B349j35L029j321l325J975J709k817p69K320r31k297J031P95k521p6K113
1428A129j272k338K054Q34l075r1K151j018k787K177R23k850m26K616j274k565
1444e812K149P25k470k95K475p62k690K091J650l144j30K640n58j919J355J421
1460c274j771j23J920j65j624Q69J455j272LJ379n9p68R72J120j476L48J834n62
1478a194j157J946Q49j406M08K202r59j101J638J031j737N79K213q49j334J456
1494B585J332j290k32J795l97q48J319j1n81L83J385j409p75J755L75k157L20
$$ plain form
1380 3380 665 3572 5223 2616 2679 5840 4859 2593 5034 6465 3681 3780 6858 5890 3513 5434
1396 5434 6606 4595 3918 6568 5326 4032 5660 6087 3415 3996 6720 4213 2101 4958 5983 2349
1412 2349 2214 5243 3922 597 2572 4281 1464 695 3015 2084 -213 818 1613 -908 -984 1129
1428 1129 -143 -2481 -427 407 -2668 -2759 -608 -1626 -4413 -2236 -1313 -4163 -4589 -1973 -3247 -5812
1444 -5812 -3663 -2938 -5408 -5703 -3228 -3990 -6680 -4589 -2939 -6083 -6213 -3573 -4131 -6050 -4695 -3274
1460 -3274 -5045 -5168 -3248 -3413 -5037 -4168 -2713 -3985 -3982 -2603 -2662 -3430 -2458 -1338 -2814 -2466 -632 -1194
1478 -1194 -2351 -405 444 -962 -554 1648 689 -412 1226 2257 520 1099 3312 2463 1129 2585
1494 2585 3917 2627 2395 4190 3793 2945 4264 4253 3672 4055 5440 4031 3256 5011 5386 3229 3549
1511C549K044o18k362J760J654k203j210J871J48k054N33J295j145j177J133M30
1527C648j883K12J066p61j203M01K78q25m11M69m65m97o3r2o30J02L27j028m48
1546a803N45l5j216K24K40l42n09O9n5k47k4k35n97O91J06q16m70J366J9j657
1566d746J00J808p49j579J090J391j167j042J339Q11j202J34J409o50m80J012
1582b521L56j079N65J168n24m30R41O79r82J27J235J89n88N65P33l13j59Q28M17
1601A207o32J87J462j64j021N30J623m63j230O98J874q94j360J201J657j222j169
1618B284J294J136j135r80J218O79j082l08R80k55l35K6K89m99j99P77m79q36
1636B575N94M22j114o00J086p5j302l28R47p5j152j24Q09n02j140M74L71j256
$$ plain form
1511 3549 5593 4975 2613 4373 6027 3824 2614 4485 4633 2579 3112 4407 3262 2085 3218 3648
1527 3648 1765 1977 3043 2282 1079 1480 1758 933 522 991 526 29 -34 -126 -756 -654 -327 -1355 -1803
1546 -1803 -1258 -1293 -2509 -2285 -2045 -2387 -2896 -2827 -2882 -3129 -3153 -3388 -3985 -3294 -3188 -4004 -4474 -3108 -3089 -4746
1566 -4746 -4646 -2838 -3587 -5166 -4076 -2685 -3852 -4894 -3555 -2744 -3946 -3812 -2403 -3053 -3533 -2521
1582 -2521 -2165 -3244 -2679 -1511 -2035 -2465 -1524 -845 -1827 -1700 -465 -276 -864 -299 434 121 -38 790 1207
1601 1207 575 762 2224 2060 1039 1569 3192 2729 1499 2197 4071 3177 1817 3018 4675 3453 2284
1618 2284 3578 4714 3579 2599 3817 4496 3414 3106 4086 3831 3496 3522 3811 3312 3113 3890 3411 2575
1636 2575 3169 3591 2477 1877 2963 2888 1586 1258 2205 2130 978 854 1663 1161 21 495 866 -390
1654c90l88J007j90j597L04R89j055j339J106O18j417p66J143K76j645J7J227
1671b100m85r10O2O77o29m76M97J56q00M6R05l34p91N65O45n95n26Q94M68p95
1691c526j60Q41L24o95Q0Q70ol37L52N44m07K76O62K08p59P22J170p31n75J235
1711H8J162j614q3J817K40j408Q2J876L24j762N49J668j27j255P71J229n68o71
1729B318R10L21l17j52L81M0j12J47O8m65M32N01p47k39O26J91r79k21J210m75
1749C438j233K24J164p66j409P68J113j324j243J032M38j098p84J042j41r99n11
1766b89O34k8r90r0L42k81n18K07l52m95J77K5o93k61N96m3r62n1R87l37j221
1787c643L28P81n60p21N43O55q46n23P53L46n48j69N47R2m35J18L81J12p0M26
$$ plain form
1654 -390 -778 229 39 -1558 -1254 -265 -1320 -2659 -1553 -935 -2352 -3118 -1975 -1699 -3344 -3327 -2100
1671 -2100 -2585 -3495 -3433 -2756 -3385 -3861 -3364 -3208 -4008 -3962 -3057 -3391 -4182 -3617 -2972 -3567 -4093 -3199 -2731 -3526
1691 -3526 -3686 -2845 -2521 -3216 -3136 -2266 -2272 -2609 -2257 -1713 -2120 -1844 -1182 -974 -1733 -1011 159 -572 -1147 88
1711 88 1250 -364 -447 1370 1610 202 284 2160 2484 722 1271 2939 2812 1557 2328 3557 2989 2318
1729 2318 3228 3549 3232 3080 3461 3501 3389 3536 3604 3139 3571 4072 3325 3086 3712 3903 2924 2703 3913 3438
1749 3438 2205 2429 3593 2827 1418 2186 3299 1975 732 1764 2202 1104 320 1362 1221 222 -289
1766 -289 345 317 -673 -763 -421 -702 -1220 -1013 -1365 -1860 -1683 -1658 -2351 -2612 -2016 -2059 -3021 -3072 -2085 -2422 -3643
1787 -3643 -3315 -2534 -3094 -3815 -3272 -2617 -3463 -3986 -3233 -2887 -3435 -3604 -3057 -2965 -3400 -3282 -2901 -2789 -2859 -2433
1807b433k15N3M05J44k94J86O45M8k20K29O70K68q24M25J113l61l91R11O59m55
1827E63l10R06N40p20J89P34j15o5J76K76J88R3O7Q0q9M36J34l89L38M32k86l77
1849B801K77M63j50n37M36L37n59m03L89J32l34m78L55Q1m07m11L40q3l60k73
1869A616J82o4p22j3J89j47o35j14K27m84m49K03r5l90o6R1k83o07J79R1l93l21
1891b005R5P9l41j38J29k23l11L26k04k40M8J43m33M8K81K07n64J00M42k80r9
1912b940K42K50m20K1N00L00k72k67P35J81m57j1P82J05n10K18P18K02l14JO14
1933c22L73k29l50Q36L35l14j60M76L42K8k76M83O12o12J73K84K38L5j40J14N60
1954B486j8j24m3L24K16m07Q3N4N24o56l27O31J10n13j5L99j0o33J56L03j24q03
$$ plain form
1807 -2433 -2648 -2595 -2190 -2046 -2340 -2154 -1509 -1461 -1681 -1452 -782 -514 -1338 -913 200 -161 -552 359 1018 563
1827 563 253 1159 1699 979 1168 1902 1787 1722 1898 2174 2362 2455 2522 2602 2513 2949 3083 2694 3032 3464 3178 2801
1849 2801 3078 3541 3391 2854 3290 3627 3068 2665 3054 3186 2852 2374 2729 2810 2403 1992 2332 2249 1889 1616
1869 1616 1798 1734 1012 999 1188 1041 406 292 519 35 -414 -211 -306 -696 -762 -671 -954 -1561 -1382 -1291 -1684 -2005
1891 -2005 -1910 -1831 -2172 -2310 -2181 -2404 -2715 -2389 -2593 -2833 -2785 -2642 -3075 -3027 -2746 -2539 -3103 -3003 -2561 -2841 -2940
1912 -2940 -2698 -2448 -2868 -2847 -2347 -2047 -2319 -2586 -1851 -1670 -2127 -2138 -1356 -1251 -1761 -1543 -825 -623 -937 -936 -322
1933 -322 51 -178 -528 308 643 329 169 645 987 1015 739 1222 1834 1222 1395 1679 1917 1952 1812 1926 2486
1954 2486 2468 2344 2301 2625 2841 2434 2517 2571 3095 2439 2112 2743 2853 2340 2325 2724 2714 2081 2237 2540 2416 1613
1976A613K98J83k76m40Q5Q4O1m39k84K24j01m21q6j5J17o54p5K26q3n26l90K61
1998f38K2m47Nj67k44N8k27n7P4j47r6n16M87on84j80O16Q0n45l68O61M5n53N29
2022b198J63k18k51J60K96l23M11r7Q4m1M99j51k37j12J006k58o99P05P21o71
2042a211j15P16M31p07J90Q84K69n38k13P63L91n86J74Q16k71k54L72Q7OK18j35
2063A287N19j49k63K0M79J76j14j8J86K29j2n25L1M18K4n12K31N89K04q36j53
2084A811O56N7j279K53Q29m97l47K22K86m08j003O02P31q65m17J90K16m52p31
2103a46P07j32n25O7P2k98n05L0n31M13P40j473M22l21P28n86p04N88j58k30m74
2124b316J034k94q49n3Q20k25k91j82N62Rp60Q1N09J24m92j41M41L06k54k41L70
$$ plain form
1976 1613 1911 2094 1818 1378 1463 1547 1608 1169 885 1109 1008 587 501 486 603 -51 -126 100 17 -509 -899 -638
1998 -638 -616 -1063 -1058 -1225 -1469 -1411 -1638 -1695 -1621 -1768 -1864 -2380 -1893 -1899 -2483 -2663 -2047 -1967 -2512 -2880 -2219 -2174 -2727 -2198
2022 -2198 -2035 -2253 -2504 -2344 -2048 -2371 -1960 -2057 -1973 -2014 -1515 -1666 -1903 -2015 -1009 -1267 -1966 -1261 -540 -1211
2042 -1211 -1326 -610 -179 -886 -696 188 457 -81 -294 469 860 274 448 1264 993 739 1111 1198 1204 1422 1287
2063 1287 1806 1657 1394 1414 1893 2069 1955 1937 2123 2352 2340 1815 1846 2264 2288 1776 2007 2596 2800 1964 1811
2084 1811 2467 2524 1245 1498 2327 1830 1483 1705 1991 1583 580 1182 1913 1048 631 821 1037 585 -146
2103 -146 561 429 -96 -29 43 -255 -760 -730 -1261 -848 -108 -1581 -1159 -1480 -752 -1338 -2042 -1454 -1612 -1842 -2316
2124 -2316 -1282 -1576 -2425 -2478 -1658 -1883 -2174 -2356 -1794 -1785 -2545 -2464 -1955 -1831 -2323 -2464 -2023 -1717 -1971 -2212 -1842
2145a842n8l42K2Q63O9k26L12p4N52r94J110J67j88O0N34L45m74M66pp7o4P68
2167I22o38Q5P05J62r22J191M20n39nO0M55l06l8N96J85o17k19K64M12r5O7P5
2189B220m51n5L13N00k13o3j01N3j41J38l65r0P8k20j28l63M84k55m23L92l85
2210I25K80n0o86J13N34q64m82L79N18p66o56O31l17m37J83j24N07j174K97M14
2230g75o9r13K69K70o84r1N51k04o39J38N20m21r4O4M60o44J49N50n43m42M82
2251b066N97m34k90K44J57L2Q4L49l38L33j34K38p4L32K23l70K34N7N96k37N27
2272F0m32l7O49k4K45l8Q6J08K66m04J72N87o6J73j20N6J79j9J2M53j86Q3p38
2295A065J183M20j244L25N98l10l98pM71l51l12J036l53m62p5L71m8n33K19o6
$$ plain form
2145 -1842 -1900 -2242 -2220 -1357 -1288 -1514 -1202 -1276 -724 -1718 -608 -441 -629 -569 -35 310 -164 302 295 218 154 922
2167 922 284 369 1074 1236 314 1505 1925 1386 1381 1441 1896 1590 1552 2148 2333 1716 1497 1761 2173 2078 2145 2220
2189 2220 1769 1714 2027 2527 2314 2251 2150 2203 2062 2200 1835 1745 1823 1603 1475 1112 1596 1341 918 1310 925
2210 925 1205 1155 469 582 1116 252 -230 149 667 -99 -755 -124 -441 -878 -695 -819 -312 -1486 -1189 -775
2230 -775 -844 -1757 -1488 -1218 -1902 -1993 -1442 -1646 -2285 -2147 -1627 -2048 -2142 -2078 -1618 -2262 -2113 -1563 -2106 -2548 -2066
2251 -2066 -1469 -1903 -2193 -1949 -1792 -1760 -1676 -1327 -1665 -1332 -1466 -1228 -1302 -970 -747 -1117 -883 -826 -230 -467 60
2272 60 -372 -409 240 216 461 423 509 617 883 479 651 1238 1172 1345 1225 1281 1460 1441 1453 1906 1720 1803 1065
2295 1065 2248 2668 1424 1749 2347 2037 1639 1632 2103 1752 1440 2476 2123 1661 1586 1957 1909 1376 1595 1529
2315A529p83P42K02r28l25N16L45k83p43R02n43m29j07J22j44p39M52J57m27l79
2335h63N16m48K20k7l6l20J34J3l68K46j45m44L48p00M36l41J72j64k04N09j02
$$ plain form
2315 1529 746 1488 1690 762 437 953 1298 1015 272 1174 631 202 95 217 73 -666 -214 -57 -484 -863
2335 -863 -347 -795 -575 -602 -638 -958 -824 -811 -1179 -933 -1078 -1522 -1174 -1874 -1438 -1779 -1607 -1771 -1975 -1466 -1568
$$ [...]
8191B56
##END NTUPLES=NMR FID
##END=
