##TITLE=1H_Pr Am-Bzf
 CDCl3,8 sc, 
 7.04.2021
##JCAMPDX= 6.0         $$ Bruker NMR JCAMP-DX V2.0
##DATA TYPE= NMR FID
##DATA CLASS= NTUPLES
##ORIGIN= UXNMR, Bruker Analytische Messtechnik GmbH
##OWNER= root
$$ XWIN-NMR		Version 3.5
$$ Wed Apr  7 12:06:12 2021 Russian Standard Time (UT+4h)  she@DPX200
##.OBSERVE FREQUENCY= 200.131506
##.OBSERVE NUCLEUS= ^1H
##.DELAY= (6, 6)
##.ACQUISITION MODE= SIMULTANEOUS
##.ACQUISITION SCHEME= undefined
##.AVERAGES= 8
##.DIGITISER RES= 18
##SPECTROMETER/DATA SYSTEM= spect
##.PULSE SEQUENCE= zg30
##.SOLVENT NAME= CDCl3
##.SHIFT REFERENCE= (INTERNAL, CDCl3, 0, 15.7039)
##AUDIT TRAIL= $$ (NUMBER, WHEN, WHO, WHERE, WHAT)
$$ ##TITLE= Audit trail, XWIN-NMR		Version 3.5
$$ ##JCAMPDX= 5.01
$$ ##ORIGIN= Bruker BioSpin GmbH
$$ ##OWNER= she
$$ F:/spectra/data/she/nmr/H-F/1/audita.txt
$$ ##AUDIT TRAIL=  $$ (NUMBER, WHEN, WHO, WHERE, WHAT)
(   1,<2021-04-07 12:04:52.87 +0400>,<she>,<DPX200>,
      <created by zg, POWCHK disabled, PULCHK disabled
       configuration hash MD5:
       00 E9 B6 7A A2 85 ED C7 34 08 36 98 17 FE 4E 26
       data hash MD5: 16K
       7A D1 29 E9 44 26 00 18 75 C9 DB 6E A2 63 73 9D>)
$$ ##END=
$$ 
$$ hash MD5
$$ 04 DF EF 6B 36 99 3B CD D4 B1 B8 87 29 F8 F2 F2
##$RELAX= 
##$RELAX= 
##$RELAX= 
##$RELAX= 
##$RELAX= 
##$RELAX= 
$$ Bruker specific parameters
$$ --------------------------
##$DU= <F:/spectra>
##$EXPNO= 1
##$NAME= <H-F>
##$PROCNO= 1
##$TYPE= <nmr>
##$USER= <she>
##$AMP= (0..31)
100 100 100 100 100 100 100 100 100 100 100 100 100 100 100 100 100 100 
100 100 100 100 100 100 100 100 100 100 100 100 100 100 
##$AQSEQ= 0
##$AQ_mod= 1
##$AUNM= <au_zg>
##$AUTOPOS= <>
##$BF1= 200.13
##$BF2= 200.13
##$BF3= 200.13
##$BF4= 200.13
##$BF5= 200.13
##$BF6= 200.13
##$BF7= 200.13
##$BF8= 200.13
##$BYTORDA= 1
##$CFDGTYP= 0
##$CFRGTYP= 5
##$CHEMSTR= <none>
##$CNST= (0..31)
1 1 145 1 1 1 1 1 1 1 1 1 1 1 1 1 1 1 1 1 1 1 1 1 1 1 1 1 1 1 1 1 
##$CPDPRG= <>
##$CPDPRG1= <>
##$CPDPRG2= <>
##$CPDPRG3= <>
##$CPDPRG4= <mlev>
##$CPDPRG5= <mlev>
##$CPDPRG6= <mlev>
##$CPDPRG7= <mlev>
##$CPDPRG8= <mlev>
##$CPDPRGB= <>
##$CPDPRGT= <>
##$D= (0..31)
0 1.2 0 0 0 0 0 0 0 0.06 0 0.03 0 0 0 0 0.0002 0 0 0 0 0 0 0 0 0 0 0 0 
0 0 0 
##$DATE= 1617782692
##$DBL= (0..7)
120 120 120 120 120 120 120 120 
##$DBP= (0..7)
150 150 150 150 150 150 150 150 
##$DBP07= 0
##$DBPNAM0= <>
##$DBPNAM1= <>
##$DBPNAM2= <>
##$DBPNAM3= <>
##$DBPNAM4= <>
##$DBPNAM5= <>
##$DBPNAM6= <>
##$DBPNAM7= <>
##$DBPOAL= (0..7)
0.5 0.5 0.5 0.5 0.5 0.5 0.5 0.5 
##$DBPOFFS= (0..7)
0 0 0 0 0 0 0 0 
##$DE= 6
##$DECBNUC= <off>
##$DECIM= 32
##$DECNUC= <off>
##$DECSTAT= 4
##$DIGMOD= 1
##$DIGTYP= 9
##$DL= (0..7)
0 120 120 120 120 120 120 120 
##$DP= (0..7)
150 150 150 150 150 150 150 150 
##$DP07= 0
##$DPNAME0= <>
##$DPNAME1= <>
##$DPNAME2= <>
##$DPNAME3= <>
##$DPNAME4= <>
##$DPNAME5= <>
##$DPNAME6= <>
##$DPNAME7= <>
##$DPOAL= (0..7)
0.5 0.5 0.5 0.5 0.5 0.5 0.5 0.5 
##$DPOFFS= (0..7)
0 0 0 0 0 0 0 0 
##$DQDMODE= 0
##$DR= 18
##$DS= 0
##$DSLIST= <SSSSSSSSSSSSSSS>
$$ [...]
##$SUBNAM2= <"">
##$SUBNAM3= <"">
##$SUBNAM4= <"">
##$SUBNAM5= <"">
##$SUBNAM6= <"">
##$SUBNAM7= <"">
##$SUBNAM8= <"">
##$SUBNAM9= <"">
##$SW= 16.9725357007746
##$SWIBOX= (0..15)
0 0 2 0 0 0 0 0 0 0 0 0 0 0 0 0 
##$SW_h= 3396.73913043478
##$TD= 16384
##$TD0= 1
##$TE= 0
##$TE2= 300
##$TE3= 300
##$TEG= 300
##$TL= (0..7)
0 120 120 120 120 120 120 120 
##$TP= (0..7)
150 150 150 150 150 150 150 150 
##$TP07= 0
##$TPNAME0= <>
##$TPNAME1= <>
##$TPNAME2= <>
##$TPNAME3= <>
##$TPNAME4= <>
##$TPNAME5= <>
##$TPNAME6= <>
##$TPNAME7= <>
##$TPOAL= (0..7)
0.5 0.5 0.5 0.5 0.5 0.5 0.5 0.5 
##$TPOFFS= (0..7)
0 0 0 0 0 0 0 0 
##$TUNHIN= 0
##$TUNHOUT= 0
##$TUNXOUT= 0
##$USERA1= <user>
##$USERA2= <user>
##$USERA3= <user>
##$USERA4= <user>
##$USERA5= <user>
##$V9= 5
##$VALIST= <valist>
##$VCLIST= <CCCCCCCCCCCCCCC>
##$VD= 0
##$VDLIST= <DDDDDDDDDDDDDDD>
##$VPLIST= <PPPPPPPPPPPPPPP>
##$VTLIST= <TTTTTTTTTTTTTTT>
##$WBST= 1024
##$WBSW= 4
##$XGAIN= (0..3)
0 0 0 0 
##$XL= 0
##$YL= 0
##$YMAX_a= 953094
##$YMIN_a= -663455
##$ZGOPTNS= <>
##$ZL1= 120
##$ZL2= 120
##$ZL3= 120
##$ZL4= 120
##$ABSF1= 10
##$ABSF2= 0
##$ABSG= 5
##$ABSL= 3
##$ALPHA= 0
##$AQORDER= 0
##$ASSFAC= 0
##$ASSFACI= 0
##$ASSFACX= 0
##$ASSWID= 0
##$AUNMP= <proc_1d>
##$AZFE= 0.1
##$AZFW= 0.1
##$BCFW= 1
##$BC_mod= 2
##$BYTORDP= 1
##$COROFFS= 0
##$CY= 11.3945322036743
##$DATMOD= 1
##$DC= 2
##$DFILT= <>
##$DTYPP= 0
##$F1P= 15.9154993809931
##$F2P= -4.1035820241983
##$FCOR= 0.5
##$FTSIZE= 0
##$FT_mod= 4
##$GAMMA= 1
##$GB= 0.15
##$INTBC= 1
##$INTSCL= 1
##$ISEN= 128
##$LB= 0.24
##$LEV0= 0
##$LPBIN= 0
##$MAXI= 10000
##$MC2= 0
##$MEAN= 0
##$ME_mod= 0
##$MI= 1.114404
##$NCOEF= 0
##$NC_proc= 0
##$NLEV= 6
##$NOISF1= 3.799351
##$NOISF2= 2.8
##$NSP= 1
##$NTH_PI= 0
##$NZP= 0
##$OFFSET= 15.70392
##$PC= 1
##$PHC0= -11123.33
##$PHC1= 17.60092
##$PH_mod= 1
##$PKNL= yes
##$PPARMOD= 0
##$PSCAL= 0
##$PSIGN= 0
##$REVERSE= no
##$SF= 200.130013532006
##$SI= 16384
##$SIGF1= 3
##$SIGF2= 2
##$SINO= 400
##$SIOLD= 16384
##$SREGLST= <1H.CDCl3>
##$SSB= 0
##$STSI= 0
##$STSR= 0
##$SW_p= 3612.71676300578
##$SYMM= 0
##$S_DEV= 0
##$TDeff= 0
##$TDoff= 0
##$TI= <>
##$TILT= no
##$TM1= 0
##$TM2= 0
##$TOPLEV= 0
##$USERP1= <user>
##$USERP2= <user>
##$USERP3= <user>
##$USERP4= <user>
##$USERP5= <user>
##$WDW= 1
##$XDIM= 8192
##$YMAX_p= 0
##$YMIN_p= 0
$$ End of Bruker specific parameters
$$ ---------------------------------
##NTUPLES= NMR FID
##VAR_NAME=  TIME,          FID/REAL,        FID/IMAG
##SYMBOL=    X,             R,               I
##VAR_TYPE=  INDEPENDENT,   DEPENDENT,       DEPENDENT
##VAR_FORM=  AFFN,          ASDF,            ASDF
##VAR_DIM=   8192,          8192,            8192
##UNITS=     SECONDS,       ARBITRARY UNITS, ARBITRARY UNITS
##FACTOR=    0.0002944,     1,               1
##FIRST=     0,             0,               0
##LAST=      2.4114304,     0,               0
##MIN=       0,             -663455,         0
##MAX=       2.4114304,     953094,          0
$$ Real data points
##PAGE= N=1
##DATA TABLE= (X++(R..R)), XYDATA
$$ plain form
0 0 0 0 0 0 0 0 -8 8 -8 8 -8 16 -16 24 -32 40 -48 56 -64 80 -96 112 -130 154 -184 212 -244 282 -324 372
30 372 -424 481 -545 616 -694 780 -874 978 -1091 1216 -1350 1499 -1662 1838 -2028 2240
46 2240 -2469 2720 -2996 3299 -3635 4006 -4419 4880 -5397 5983 -6656 7433 -8345 9431
60 9431 -10749 12388 -14490 17285 -21192 27035 -36680 55286 -103689 490427 839975 -663455
72 -663455 79452 802876 -50378 -281965 399182 313631 -243532 -221320 387713 213091
82 213091 -471084 -100095 465512 -176729 -386765 298998 131359 -413839 -286 313025
92 313025 -114018 -281790 99575 203279 -142314 -167220 210649 76650 -244267 92762
102 92762 272388 -143581 -111802 239944 105079 -100420 41574 158761 32697 -67078
$$ packed form
0@%%%%%%qJ6j6J6j6K4l2M0n6P2q8J04j20J44j76K08k42K84l38L96m56N26o06O96
30C72p96R05j026J161j310J474j654J852k069K307k566K849l161L500l866M268
46B240m709N189n716O295o934P641q425R299j0277J1380j2639J4089j5778J7776
60I431k0180K3137k6878L1775l8477M8227o3715R1966j58975N94116L49548j503430
72f63455P42907P23424q53254k31587O81147q5551n57163K2212O09033j74622
82B13091o84175L70989N65607o42241k10036O85763j67639n45198M13553L13311
92C13025m27043j67772L81365J03704l45593k4906L77869j33999l20917L37029
102I2762J79626m15969L1779L51746j34865k05499J41994J17187j26064r9775
$$ plain form
112 -67078 101151 162004 -91439 -65115 207196 41696 -157121 84418 119064 -109766 -17362
123 -17362 108073 -27031 -79110 12732 54813 -20951 -97308 10987 62102 -102365 -66508
134 -66508 89430 -54713 -135162 50184 31666 -119807 -43517 46554 -37129 -80633 6226
145 6226 32637 -63411 -56974 60038 15568 -81711 13635 67868 -39200 -20838 70092 12517
157 12517 -32490 31475 54567 9567 -12478 30452 51162 -6481 -1259 56092 7173 -30912
169 -30912 37496 36756 -29126 -9536 24494 -2887 -16597 1006 -906 -21730 -18309 6472 -4684
182 -4684 -34784 -16874 3064 -17717 -17727 -5628 -21874 -18239 2405 -8748 -16795 -10593 -10307 -2047
196 -2047 1508 -7862 -9336 -5012 4640 8450 -4707 -4189 7019 2717 5825 14321 -698 -6700 15103
$$ packed form
112f7078J68229O0853k53443K6324K72311j65500j98817K41539L4646k28830R2404
123a7362J25435j35104n2079R1842M2081p5764p6357J08295N1115j64467L5857
134f6508J55938j44143q0449J85346j8518j51473P6290R0071q3683m3504Q6859
145F226K6411r6048O437J17012m4470r7279R5346N4233j07068J8362R0930n7575
157A2517m5007O3965K3092m5000k2045M2930K0710n7643N222N7351m8919l8085
169c0912O8408p40o5882J9590L4030k7381j3710J7603j912k0824L421K4781j1156
182d684l0100J7910J9938k0781j0J2099j6246L635K0644j1153q047O202K86Q260
196b047L555r370j474M324R652L810j3157N18J1208m302L108Q496j5019o002K1803
$$ plain form
211 15103 17553 723 1045 7229 6695 7068 7803 5556 -1945 -4125 11768 12448 -11337 -8095 10316
226 10316 -48 -8293 3110 -2186 -14337 -4398 8954 -3959 -20647 -4894 8418 -9063 -12404
239 -12404 4030 -4601 -16044 2949 10437 -12454 -14190 9318 7853 -9852 -2764 10404 -1011
252 -1011 -7400 12635 12590 -11411 -2624 21006 5959 -9851 8219 14501 -3740 -1446 16906 6412
266 6412 -12432 4614 19352 -3956 -11365 11615 7746 -12265 -341 13139 -6471 -14320 7194
279 7194 8219 -14294 -9439 9596 -1999 -15947 999 7989 -13708 -11610 10168 405 -17015
292 -17015 -1536 9639 -7053 -10971 7289 5358 -12651 -2810 14019 -1572 -12090 7786 11159
305 11159 -8092 -2764 13859 2382 -9358 7045 13487 -5029 -5308 12412 6772 -8458 2647
$$ packed form
211A5103K450j6830L22O184n34L73P35k247p501k180J5893O80k3785L242J8411
226A0316j0364q245J1403n296j2151R939J3352j2913j6688J5753J3312j7481l341
239a2404J6434q631j1443J8993P488k2891j736K3508j465j7705P088J3168j1415
252a011o389K0035m5k4001Q787K3630j5047j5810J8070O282j8241K294J8352j0494
266F412j8844J7046J4738k3308p409K2980l869k0011J1924J3480j9610p849K1514
279G194J025k2513M855J9035j1595j3948J6946O990k1697K098K1778r763j7420
292a7015J5479J1175j6692l918J8260j931j8009R841J6829j5591j0518J9876L373
305A1159j9251N328J6623j1477j1740J6403O442j8516k79J7720n640j5230J1105
$$ plain form
318 2647 12837 -3320 -7300 10090 6775 -9649 -1264 10472 -1588 -8762 4100 5843 -8261
331 -8261 -4698 8379 -948 -11065 1397 6369 -7197 -6556 5276 -74 -9047 91 5786 -5362
345 -5362 -7216 4885 3474 -7351 -1869 6499 -1659 -5957 4851 4615 -6226 -1267 7825 657
359 657 -5369 3261 5742 -3049 -2229 6142 1837 -5463 2192 6781 -2539 -4119 4919 3044 -4609 -188
375 -188 5126 -2066 -4512 3559 2984 -5081 -2509 4334 -253 -5228 799 2975 -4092 -2802 3550 164
391 164 -4925 1 3730 -1786 -3474 2598 1739 -3281 0 3905 -784 -3027 2701 3015 -2012 -643
407 -643 3348 484 -1737 1815 2670 -1331 -698 2809 1400 -1795 659 2327 -641 -1085 1770 722
423 722 -1817 -104 1560 -874 -1434 831 85 -1732 -327 447 -1245 -1458 -82 -432 -1443 -870 -147
$$ packed form
318B647J0190j6157l980J7390l315j6424Q385J1736j2060p174J2862J743j4104
331h261L563J3077r327j0117J2462M972j3566O41J1832n350q973R138N695j1148
345e362j854J2101j411j0825N482Q368q158m298J0808k36j0841M959R092p168
359F57o026Q630K481q791Q20Q371m305p300P655M589r320j580R038j875p653M421
375a88N314p192k446Q071n75q065K572O843m587m975O027K176p067J290O352l386
391A64n089M926L729n516j688O072q59n020L281L905m689k243N728L14n027J369
407f43L991k864k221L552Q55m001O33L507j409l195K454J668k968m44K855j048
423G22k539J713J664k434n60K265p46j817J405P74j692k13J376l50j011N73P23
$$ plain form
440 -147 -890 -1265 -233 -235 -1191 -909 159 -258 -1044 111 615 -866 -324 998 -57 -619 754 810 -58
459 -58 189 716 359 278 615 747 436 322 381 773 450 -142 540 726 -174 214 697 -174 -224 563 319 -206
481 -206 26 -111 -127 194 -368 -376 144 -498 -550 472 -278 -809 -258 227 -340 -238 18 -2 -109 -513 105 277
503 277 -377 -286 793 242 -940 189 945 -427 -439 763 308 -821 203 993 -455 -879 809 459
521 459 -796 -244 811 -77 -811 192 545 -589 -690 797 561 -1057 -364 1020 -466 -1077 656
538 656 321 -1190 -172 831 -372 -767 534 582 -520 -453 699 174 -660 287 974 -304 -462 855
556 855 353 -640 155 960 -165 -310 603 614 -284 -176 765 11 -444 340 495 -561 -36 834 59 -448
576 -448 201 515 -295 -508 389 27 -793 -114 519 -548 -709 594 193 -905 -196 627 -553 -565 309
$$ packed form
440a47p43l75J032kr56K82J068m17p86J155N04j481N42J322j055n62J373N6q68
459e8K47N27l57q1L37J32l11j14N9L92l23n92O82J86r00L88M83q71n0P87k44n25
481b06K32j37j6L21n62qN20o42n2J022p50n31N51M85n67J02K56k0j07m04O18J72
503B77o54R1J079n51j182J129P56j372j2J202m55j129J024P90j448m24J688l50
521D59j255N52J055q88p34J003L53j134j01J487k36j618O93J384j486o11J733
538F56l35j511J018J003j203l95J301M8j102O7J152n25q34R47O87j278j58J317
556H55n02r93P95Q05j125j45R13J1q98J08R41p54m55P84J55j056N25Q70p75n07
576d48O49L14q10k13Q97l62q20O79O33j067j61J303m01j098P09Q23j180j2Q74
$$ plain form
595 309 199 -592 -180 299 -114 -446 -27 458 -365 -554 354 306 -694 223 695 -197 -468 447 250 -339
615 -339 74 471 -11 -308 289 308 -265 -46 572 98 -276 231 397 -88 -22 395 18 -218 65 170 -185
636 -185 -182 293 213 -523 65 280 -90 -219 133 233 -107 -115 126 -20 -214 90 45 -176 -287 253 -68 -231
658 -231 213 123 -115 -148 187 -82 -456 67 201 58 -202 22 37 -313 -42 -3 -120 -193 47 89 -264 -89
680 -89 154 -120 -179 17 51 -79 33 186 -8 -144 120 111 -102 -217 231 -18 -252 147 229 -37 66 144 220
703 220 -119 155 197 74 -12 260 -68 -35 -19 198 140 92 16 48 -84 20 10 -61 -157 91 -29 -252 -107 -159
727 -159 91 52 -29 -48 -13 175 23 71 -43 124 86 -110 87 44 -65 -117 7 -110 -258 37 -1 -25 -92 149
751 149 -26 -135 43 -34 -95 40 -53 147 44 -126 91 -56 39 -76 126 -127 72 -52 -37 47 -73 117
$$ packed form
595C09j10p91M12M79m13l32M19M85q23j89R08m8j000R17M72q92k71R15j97n89
615c39M13L97m82k97N97J9n73K19O18m74l74N07J66m85O6M17l77k36K83J05l55
636a85LM75q0p36N88K15l70j29L52J00l40qK41j46j94L04m5k21j11N40l21j63
658b31M44r0k38l3L35k69l74N23J34j43k60K24J5l50K71L9j17p3K40M2l53J75
680h9K43k74n9J96L4j30J12J53j94j36K64rk13j15M48k49k34L99Q2k66J03P8P6
703B20l39K74M2j23q6K72l28L3J6K17n8m8p6L2j32J04j0p1r6K48j20k23J45n2
727a59K50l9q1j9L5J88j52M8j14J67l8j96J97m3j09n2J24j17j48K95l8k4o7K41
751A49j75j09J78p7o1J35r3K00j03j70K17j47R5j15K02k53J99j24J5Q4j20J90
$$ plain form
773 117 114 -4 127 8 65 88 275 -91 -37 -77 -8 -81 68 158 -51 -71 81 -32 -176 -61 67 -7 -46 -42 -8
798 -8 118 26 73 -108 34 -86 -103 -90 -31 76 -83 -83 75 -8 24 114 77 11 -139 34 86 4 22 4 31 -42 24
825 24 -49 -139 -35 -34 -162 -5 48 102 -44 34 -165 76 -146 -8 32 -102 -91 131 -63 -125 50 142 -22 -74 23
850 23 63 -40 -45 91 38 66 5 91 42 -31 31 146 -1 105 35 52 -80 0 68 -8 16 77 99 -9 60 73 15 125
878 125 -27 21 18 87 -21 4 -72 38 -33 56 83 150 111 5 -119 -59 -30 30 85 -11 -170 -108 0 -179 -109 -18 -81
905 -81 -49 71 -75 -3 24 -58 40 -24 -16 -6 100 3 -46 -28 -112 -62 93 134 -10 49 6 -26 111 -196 -137 -53 97
932 97 2 85 -65 -31 28 -13 31 -94 184 144 -142 57 -65 50 101 -61 20 -82 132 20 -16 32 -43 -74 -82 8
958 8 -70 9 -27 -109 13 -94 182 -61 -18 -86 36 -34 -144 -22 -83 -19 -5 -81 -90 -12 -245 -140 19 -55 -23 95
$$ packed form
773A17lj18J31j19N7K3J87l66N4m0O9p3J49R0k09k0J52j13j44J15J28p4l9ML4
798hJ26r2M7j81J42j20j7J3N9J07j59%J58q3L2R0l7o6j50J73N2q2J8j8K7p3O6
825B4p3r0J04Jj28J57N3N4j46P8j99K41k22J38M0j34J1K22j94o2J75R2j64n2R7
850B3M0j03nJ36n3K8o1Q6m9p3O2J15j47J06p0J7j32Q0O8p6K4O1K2j08O9J3n8J10
878A25j52M8lO9j08K5p6J10p1Q9K7O7l9j06j24O0K9O0N5r6j59O2J08j79P0R1o3
905h1L2J20j46P2K7q2R8o4QJ0J06r7m9J8q4N0J55M1j44N9m3l2J37l07N9Q4J50
932I7r5Q3j50L4N9m1M4j25K78m0k86J99j22J15N1j62Q1j02K14j12l6M8p5l1qR0
958Hp8P9l6q2J22j07K76k43M3o8J22p0j10J22o1O4J4p6rP8k33J05J59p4L2J18
$$ plain form
984 95 60 14 -139 -122 45 -71 -90 19 46 143 112 87 21 61 44 -9 -33 -100 207 18 98 150 42 -2 24 15 138
1011 138 159 -29 -42 99 99 30 6 96 86 -5 87 21 168 133 113 -51 118 -26 136 40 51 -45 90 86 -10 116
1037 116 -12 -2 109 -17 -55 -126 18 -55 80 -43 -57 53 18 71 41 82 -114 -45 13 -11 77 28 -40 -102 -264
1062 -264 -75 -24 -92 20 152 138 -88 80 -46 -66 -39 77 -133 23 87 76 74 -50 61 162 238 -25 -77 83
1086 83 83 -33 30 -174 -40 -41 -78 62 163 68 44 148 133 -59 -168 101 41 -50 -63 161 212 -82 -32 -60 -115 -74
1112 -74 50 17 -109 -1 0 -40 36 -82 -39 -66 140 -20 29 25 -37 -17 27 129 -38 -5 2 -141 21 38 183 -93
1138 -93 -31 -13 42 -140 8 36 56 43 107 18 -67 77 -57 238 -15 -107 11 93 86 112 35 133 92 42 0 43 53
1165 53 112 -32 -187 125 20 134 18 0 63 -19 160 33 13 -39 42 116 -71 88 157 -26 17 -95 -6 167
$$ packed form
984I5l5m6j53J7J67j16j9J09K7R7l1k5o6M0j7n3k4o7L07j89Q0N2j08m4K6rJ23
1011A38K1j88j3J41%o9k4R0j0r1R2o6J47l5k0j64J69j44J62r6J1r6J35mr6J26
1037A16j28J0J11j26l8p1J44p3J35j23j4J10l5N3l0M1j96O9N8k4Q8m9o8o2j62
1062b64J89N1o8J12J32j4k26J68j26k0K7J16k10J56O4j1kj24J11J01P6k63n2J60
1086H3%j16O3k04J34jl7J40J01r5k4J04j5j92j09K69o0r1j3K24N1k94N0k8n5M1
1112g4J24l3j26J08Jm0P6j18M3k7K06j60M9mo2K0M4J02j67L3Pj43J62J7J45k76
1138i3O2J8N5j82J48K8K0j3O4q9q5J44j34K95k53r2J18Q2pK6p7R8m1n0m2M3J0
1165E3N9j44j55L12j05J14j16j8O3q2J79j27k0n2Q1P4j87J59O9j83M3j12Q9J73
$$ plain form
1189 167 -136 -51 -87 128 -146 -139 165 -75 -125 167 -79 -80 -120 -100 64 -40 27 -123 153 123 2 -62 44 10
1213 10 17 -11 14 85 0 18 84 -104 -16 41 68 17 -133 -17 0 -16 -2 -73 -14 -127 4 -111 72 -49 -31 -201
1239 -201 48 155 -7 41 80 -4 -90 -10 -52 45 79 23 35 -115 92 183 16 -57 -155 80 -200 -102 -120 -127 41 161
1265 161 -13 55 102 -96 -31 49 -28 193 -80 -37 92 55 5 -50 42 246 35 -9 -215 -166 4 13 -46 -97 -5 13
1291 13 -126 50 -91 3 -91 -60 9 -39 123 -27 -79 -132 3 82 26 -104 -21 -180 -80 28 -67 39 57 127 -1
1316 -1 26 -5 -49 -44 57 -36 248 63 37 170 -67 34 -178 59 -163 -5 -32 19 115 -87 -106 146 -82 -80 -135
1341 -135 -1 89 -104 12 -62 19 108 71 88 -54 -113 -111 -21 131 -99 -16 -37 -172 74 145 -45 -6 -80 156 -146
1366 -146 -52 -105 56 18 -120 21 -175 107 90 76 15 29 -24 -43 -56 143 14 49 -68 47 118 -75 9 107 68
$$ packed form
1189A67l03Q5l6K15k74PL04k40n0K92k46jm0K0J64j04O7j50K76l0j21o4J06l4
1213A0Pk8K5P1q5J8O6j88Q8N7K7n1j50J16J7j6J4p1N9j13J31j15J83j21J8j70
1239b01K49J07j62M8L9q4q6Q0m2R7L4n6J2j50K07R1j67p3r8K35k80R8j8pJ68J20
1265A61j74O8M7j98O5Q0p7K21k73M3J29l7n0n5R2K04k11m4k06M9J70Rn9n1R2J8
1291A3j39J76j41R4r4L1O9m8J62j50n2n3J35P9n6j30Q3j59J00J08r5J06J8P0j28
1316aK7l1m4NJ01r3K84j85k6J33k37J01k12K37k22J58k7N1R6k02j9K52k28Kn5
1341a35J34R0j93J16p4Q1Q9l7J7j42n9KR0J52k30Q3k1j35K46P1j90L9p4K36l02
1366a46R4n3J61l8j38J41j96K82j7j4o1J4n3j9j3J99j29L5j17J15P1j93Q4R8l9
$$ plain form
1391 68 11 77 -36 122 138 -13 90 89 -12 -79 20 -19 -38 -20 -29 -24 -21 192 -4 -103 19 56 -126 143 -159 -15
1417 -15 70 197 -42 78 -26 12 43 -33 -1 -10 -75 84 -2 116 182 102 142 -118 118 -29 51 -5 -108 -13 13 36
1443 36 -120 36 36 -202 -33 -84 -109 148 -38 -6 13 -57 63 -188 -60 3 -212 91 229 41 6 -49 -48 74
1467 74 -33 0 -37 -59 -22 -22 -16 24 -159 -83 19 31 -107 42 -85 -125 -18 -134 14 -57 143 25 25 123 -69 89
1493 89 -37 -59 -94 -144 -72 -91 58 -21 -42 18 -73 9 83 3 -46 79 -42 -44 -89 45 -91 -26 48 12 -38 23 -30 -90
1521 -90 -47 130 83 -4 -56 106 103 -15 9 64 153 99 -68 54 -167 58 -100 32 156 142 -13 -66 89 45 -73
1546 -73 118 49 -46 -25 21 40 52 -49 216 -36 72 -43 -6 46 137 -27 106 135 -20 221 35 150 -106 -23
1570 -23 -54 -99 -40 2 -160 11 -28 4 26 -75 -164 21 -115 65 -104 -9 -19 151 -55 8 38 -42 -15 -18 -99 -98 71
$$ packed form
1391F8n7O6j13J58J6j51J03jj01o7R9l9j9J8rNLK13j96r9J22L7j82K69l02J44
1417a5Q5J27k39J20j04L8L1p6L2ro5J59q6J18O6q0M0k60K36j47Q0n6j03R5K6K3
1443C6j56J56%k38J69n1k5K57j86L2J9p0J20k51J28O3k15L03J38j88l5n5JJ22
1467G4j07L3l7k2L7%OM0j83P6J02J2j38J49j27m0J07j16J48p1K00j18%R8j92J58
1493H9j26k2l5n0P2j9J49p9k1O0r1Q2P4q0m9J25j21km5J34j36O5P4l6n0O1n3o0
1521i0M3J77m7q7n2J62lj18K4N5Q9n4j67J22k21K25j58J32J24j4j55n3J55m4j18
1546g3J91o9r5K1M6J9J2j01K65k52J08j15L7N2R1j64J33K9j55K41j86J15k56Q3
1570b3l1m5N9M2j62J71l9L2K2j01q9J85j36J80j69R5j0J70k06O3L0q0K7lq1JJ69
$$ plain form
1597 71 50 59 65 -4 -228 -3 -77 -1 99 -65 -1 -31 -13 -103 -72 71 -156 -68 108 18 -15 48 133 -54 60 102 41
1624 41 -41 155 132 7 51 -71 73 179 -28 170 -6 31 -59 18 -115 -22 66 -89 74 -9 -42 -76 130 49
1648 49 54 3 30 3 100 24 135 -124 -51 -26 -79 168 89 119 -37 25 95 -46 -39 111 -64 21 4 -54 -124 -52 -55 48
1676 48 25 -47 68 -11 -169 -69 48 78 -78 -63 -43 11 -25 -47 -12 -23 247 98 107 41 30 -28 -74 47 -29 -77 13
1703 13 14 43 -88 3 -174 -56 -15 -75 16 58 59 49 -53 -28 -124 59 148 48 60 230 9 117 55 -16 81 73 9
1730 9 -151 136 60 77 -31 62 -104 -52 -79 74 174 57 -72 32 48 -47 148 132 -25 66 27 51 -26 -48 -201
1755 -201 29 106 44 69 52 120 -62 6 -77 -54 -199 -234 7 6 -34 -34 -2 156 53 25 -73 70 -100 132 -199 19
1781 19 -119 109 179 38 -16 73 -76 -47 67 -1 -119 182 24 68 -1 -31 6 -45 39 -50 -66 19 2 -51 -63 -78
$$ packed form
1597G1k1ROo9k24K25p4P6J00j64O4l0J8r0L1J43k27Q8J76r0l3O3Q5j87J14M2o1
1624D1q2J96k3j25M4j22J44J06k07J98j76L7r0P7j33R3Q8j55J63q3l3l4K06q1
1648D9Nn1K7k7R7p6J11k59P3K5n3K47p9L0j56O2P0j41PJ50j75Q5j7n8p0P2lJ03
1676D8k3p2J15p9j58J00J17L0j56J5K0N4l6k2L5j1K70j49Ro6j1n8m6J21p6m8R0
1703A3JK9j31R1j77J18M1o0R1M2Jj0j02K5r6J83Q9j00J2J70k21J08o2p1R7qo4
1730Ij60K87p6J7j08R3j66N2k7J53J00j17j29J04J6r5J95j6j57R1l9K4p7k2j53
1755b01K30P7o2K5j7O8j82O8q3K3j45l5K41jm0%L2J58j03k8r8J43j70K32l31K18
1781A9j38K28P0j41n4Q9j49K9J14o8j18L01j58M4o9l0L7n1Q4q9j6Q5j7n3j2j5
$$ plain form
1807 -78 9 44 -86 38 84 26 27 -83 -2 80 66 -215 -6 49 161 -42 38 120 121 -68 68 -35 140 104 222
1832 222 13 -42 137 -38 -45 7 -42 -33 -105 -62 78 61 -86 -13 -215 14 -42 -31 -107 -22 22 -119 -94 49 -21 -127
1858 -127 86 -33 -1 59 -202 -69 72 -18 -92 -103 -24 94 -123 -33 138 -123 82 14 -118 -50 -15 -89 30 -32
1882 -32 159 8 -198 41 110 -91 29 -29 3 -1 -25 18 10 -31 -102 -109 25 -13 -46 66 -112 148 -128 25 -52 153
1908 153 -100 43 68 -24 121 26 -21 -50 14 -121 37 -45 5 67 26 -124 -122 39 88 56 -23 -48 75 50 15 5
1934 5 103 -73 -100 4 161 -33 -78 23 27 -94 -2 -1 -54 -22 -102 -124 7 30 -15 -26 -12 150 -112 -53 160 -44
1960 -44 46 -98 -198 225 -19 -92 16 90 -14 -53 -2 -68 -23 -121 -41 14 21 -112 -102 102 14 29 -139 -37 -95 -32
1986 -32 3 -10 142 -41 -68 70 -71 -85 92 4 106 28 35 -45 9 69 -49 -14 69 76 -138 22 -38 34 -34 171
$$ packed form
1807g8Q7L5j30J24M6n8Jj10Q1Q2j4k81K09N5J12k03Q0Q2Jj89J36j03J75l6J18
1832B22k09n5J79j75pN2m9Rp2M3J40j7j47P3k02K29n6J1p6Q5M4j41K5J43p0j06
1858a27K13j19L2O0k61J33J41r0p4j1P9J18k17R0J71k61K05o8j32O8L5p4J19o2
1882c2J91j51k06K39O9k01J20n8L2mk4M3qm1p1pJ34l8l3J12j78K60k76J53p7K05
1908A53k53J43K5r2J45r5m7k9O4j35J58q2N0O2m1j50KJ61M9l2p9k5J23k5l5j0
1934ER8j76k7J04J57j94m5J01Mj21R2Jn3L2q0k2J31K3m5j1J4J62k62N9K13k04
1960d4R0j44j00M23k44p3J08P4j04l9N1o6M5r8Q0N5Pj33J0K04q8J5j68J02n8O3
1986c2L5j3J52j83k7J38j41j4J77q8J02p8Pq0N4O0j18L5Q3Pk14J60o0P2o8K05
$$ plain form
2012 171 -6 -23 -12 -11 111 -128 -4 -97 -68 10 15 15 178 25 32 -75 -33 -128 -34 15 58 164 -35 9 23 -71 -5
2039 -5 66 -10 72 -189 -205 -87 -1 5 -136 98 -182 -62 -82 143 -1 99 188 -99 110 -142 71 84 185 24
2063 24 13 -66 -113 -28 44 -37 -117 -77 189 -127 1 -52 -96 127 -73 -4 -29 -31 161 133 89 60 64 -54 11 2 18 116
2091 116 -26 -64 -48 93 -20 136 59 116 134 -52 -23 -62 -82 -152 -79 27 -65 -116 91 -33 93 -17 -7 148
2115 148 -66 -124 62 -200 -18 39 75 -24 31 -14 -71 -15 51 -151 -154 38 65 -99 73 92 42 69 95 -107 93
2140 93 175 -4 15 19 52 -39 -24 182 -70 55 31 60 -3 82 101 -5 -89 26 -117 73 76 -22 -18 1 30 5 60 -100
2168 -100 -35 -18 -33 142 42 -17 -200 -40 -2 -67 184 -94 35 -93 39 -14 -48 -61 47 95 -124 -28 2 -73
2192 -73 70 90 -51 -87 -179 74 -102 169 48 90 78 -11 -86 96 30 100 -22 -13 175 8 71 61 -162 85 -14
$$ packed form
2012A71j77j7J1JJ22k39J24r3K9P8N%J63j53Pj07M2r5R4M9M3J06j99M4J4r4O6
2039eP1p6Q2k61j6J18Q6Oj41K34k80J20k0K25j44J00Q9k87K09k52K13J3J01j61
2063B4j1p9m7Q5P2q1q0M0K66l16J28n3m4K23k00O9k5kJ92k8m4k9Mj18O5rJ6R8
2091A16j42l8J6J41j13J56p7N7J8j86K9l9k0p0P3J06r2n1K07j24J26j10J0J55
2115A48k14n8J86k62J82N7L6r9N5m5n7N6O6k02lJ92K7j64J72J9n0K7K6k02K00
2140I3Q2j79J9ML3r1J5K06k52J25k4K9o3Q5J9j06q4J15j43J90Lr8MJ9K9k5N5j60
2168a00O5J7j5J75j00n9j83J60L8o5K51k78J29j28J32n3l4j3J08M8k19R6L0p5
2192g3J43K0j41l6r2K53j76K71j21M2j2q9p5J82o6P0j22RJ88j67O3j0k23K47r9
$$ plain form
2217 -14 -75 107 -27 14 -61 116 68 70 103 -160 74 -65 9 2 -28 155 -49 12 38 17 -9 -57 67 54 126 -22
2243 -22 26 46 -31 -9 87 -94 -3 41 -7 -27 140 -9 36 102 37 98 -4 -177 -79 -21 4 -66 57 -11 -23 -63 99
2270 99 -124 -98 140 50 -134 -68 94 -88 41 -175 -150 77 84 -120 84 -12 113 39 43 -171 169 8 51 -8
2294 -8 -59 96 27 52 109 -45 98 -70 109 -55 -88 87 32 -31 -70 -65 13 8 -141 18 -86 -201 76 38 13 -108
2320 -108 -47 -71 73 -26 -22 162 21 15 -129 -28 126 -19 70 49 -21 -22 -97 -32 -107 141 -18 -7 -74 43 64 -58
2346 -58 -83 37 -114 -74 1 -71 2 21 -78 -60 -50 -15 -61 19 -142 23 -88 -147 51 -113 -25 38 75 -25 129 60
2372 60 183 53 31 127 -102 61 -100 16 127 -40 -100 2 48 111 18 152 -44 -176 93 63 -33 -251 -49
2395 -49 -42 96 -85 -19 -152 58 -48 103 17 -170 59 -27 -17 -137 -76 -10 131 -32 149 14 -20 76 -41 47
$$ packed form
2217a4o1J82j34M1p5J77m8KL3k63K34j39P4pl0J83k04O1K6k1k6m8J24j3P2j48
2243b2M8K0p7K2R6j81R1M4m8k0J67j49M5O6o5O1j02j73R8N8K5p0J23o8j2m0J62
2270I9k23K6K38r0j84O6J62j82J29k16K5K27Pk04K04r6J25p4Mk14L40j61M3n9
2294hn1J55o9K5N7j54J43j68J79j64l3J75n5o3l9NP8nj49J59j04j15K77l8k5j21
2320a08O1k4J44r9MJ84j41oj44J01J54j45Q9k1p0jp5O5p5K48j59J1o7J17K1j22
2346e8k5J20j51M0P5p2P3J9r9J8J0L5m6Q0j61J65j11n9J98j64Q8O3L7j00J54o9
2372F0J23j30k2R6k29J63j61J16J11j67o0J02M6O3r3J34j96j32K69l0r6k18K02
2395d9PJ38j81O6j33K10j06J51q6j87K29q6J0j20O1O6J41j63J81j35l4R6j17Q8
$$ plain form
2419 47 36 -104 47 80 -67 10 66 -95 47 -161 31 22 12 151 -121 -21 -54 -70 25 90 56 -96 88 -18
2443 -18 45 66 41 -41 -36 -125 -77 -6 -49 4 -2 56 34 101 -186 39 -123 -21 65 142 80 -66 34 61 37 96 58 109
2471 109 8 -108 85 98 -7 -34 28 -123 -30 -192 -68 0 -18 -20 52 -16 50 -187 36 -56 -28 3 -4 60 130 78
2497 78 -37 -18 -9 23 -100 62 35 33 -31 -4 -146 -53 31 -30 110 72 69 10 -116 70 -43 0 45 31 67 150 -20
2524 -20 -31 56 37 -34 10 -2 -24 1 -17 -37 -59 -174 -52 24 -7 15 -62 -67 42 -36 130 164 -5 17 -63 62 -11 8
2552 8 4 27 65 -37 -140 74 -103 -19 -72 -73 209 -152 -69 37 -39 -110 -103 -82 57 32 38 -16 112 33 32 29 -36 -127 11
2581 11 44 -34 129 -47 -34 57 -60 -109 -72 -124 236 20 53 -102 51 20 -93 -67 -66 90 25 37 -69 -147 98
2606 98 -17 -119 -122 108 106 -154 55 -31 7 223 46 120 146 -75 -32 -38 -86 -16 -26 -13 -66 50 16 -16 47 -62 -45
$$ packed form
2419D7j1j40J51L3j47P7N6j61J42k08J92rj0J39k72J00l3j6R5O5l4j52J84j06
2443a8O3K1k5q2Nq9M8P1m3N3oN8k2O7k87K25j62J02Q6P7o2j46J00K7k4N9l8N1
2471A09j01j16J93J3j05k7O2j51R3j62J24O8j8kP2o8O6k37K23r2K8L1pO4P0n2
2497G8j15J9RL2j23J62k7ko4K7j42R3Q4o1J40l8ln9j26J86j13M3M5j4L6Q3j70
2524b0j1Q7j9p1M4j2k2K5j8k0k2j15J22P6l1K2p7nJ09p8J66L4j69K2q0J25p3J9
2552HmK3L8j02j03K14j77Q4n3jK82l61Q3J06p6p1PK1J39k5On4J28p9jlo5r1J38
2581A1L3p8J63j76J3R1j17m9L7n2L60k16L3j55J53l1j13K6JJ56o5J2j06p8K45
2606I8j15j02lK30kk60K09q6L8K16j77P4K6k21M3om8P0j0J3n3J16l4l2O3j09J7
$$ plain form
2633 -45 -83 101 -51 -2 -98 -85 39 -31 58 61 -34 42 27 -51 -55 63 -88 -35 -164 180 65 -29 -46 226 -73 -58
2659 -58 -25 -27 77 -31 1 -5 67 -69 4 -128 -63 58 -1 -2 -24 19 -7 -9 -48 102 0 -48 -93 74 -82 -36 54 69
2687 69 -116 126 -61 14 -2 20 124 69 0 92 -39 -46 112 8 -170 -30 182 -54 -182 -189 93 -123 113 94
2711 94 136 9 89 -67 20 -149 -130 43 -112 -47 -37 -1 -38 -10 -54 -45 -122 38 -105 -33 81 -221 -88 64 109
2736 109 -25 79 13 -40 -127 101 2 45 15 -27 -38 -144 59 201 -1 61 -164 -87 37 -15 -4 -116 -47 -36 82
2761 82 -52 -25 208 6 -3 53 114 89 121 60 74 25 -38 -18 -12 86 53 33 -29 0 -115 96 58 29 -67 54 -113 -51
2789 -51 2 -7 186 -74 104 108 -10 12 -39 111 19 28 48 -143 -53 66 18 19 60 -183 15 -14 -6 9 -49 33 81 -154
2817 -154 -78 74 -90 46 17 -237 142 86 -66 33 -16 17 -34 -67 -55 -18 54 34 -18 -188 -118 2 81 -105 26
$$ packed form
2633d5l8J84j52M9r6J3J24p0Q9Lr5P6j5p8mJ18j51N3j29L44j15r4j7K72k99J5
2659e8L3kJ04j08L2oP2j36P3j32O5J21n9jk2M3k6kl9J50j02m8m5J67j56M6R0J5
2687F9j85K42j87P5j6K2J04n5o9R2j31pJ58j04j78J40K12k36j28pK82k16K36j9
2711I4M2j27Q0j56Q7j69J9J73j55O5J0L6l7K8m4Rp7J60j43P2J14l02J33J52M5
2736A09j34J04o6n3q7K28r9M3l0m2j1j06K03J42k02O2k25P7J24n2J1j12O9J1J18
2761H2j34K7K33k02rN6O1k5L2o1J4m9o3K0OR8l3k0o2K9j15K11l8k9r6J21j67O2
2789e1N3rJ93k60J78Mj18K2n1J50r2RK0j91R0J19m8JM1k43J98k9QJ5n8Q2M8k35
2817a54P6J52j64J36k9k54L79n6j52R9m9L3n1l3J2L7P2k0n2j70P0J20P9j86J31
$$ plain form
2842 26 16 -17 72 -7 -10 -38 62 -2 116 70 -15 -18 -108 15 -80 2 -20 -15 -107 -70 -30 -48 93 88 7 -56 -127 -150 71 23
2872 23 -54 -48 -48 -30 -108 22 204 49 -66 56 28 46 117 146 4 -64 82 -155 -89 -40 -10 43 -20 -22 -77 119 -13
2899 -13 -185 -80 -6 -10 133 109 36 38 12 -72 80 -28 48 -111 119 19 -64 64 99 -129 125 -55 -31 -3 123
2924 123 41 -12 -9 20 56 -78 -64 -77 42 -72 23 -164 -46 56 61 -1 142 96 20 12 -148 0 -39 -19 106 -44
2950 -44 96 -109 -52 -26 -98 -66 92 47 118 162 -45 -11 45 134 10 89 93 32 -40 94 13 19 82 85 -69 -43 -72 25
2978 25 -10 -102 -15 17 -3 -35 -148 -91 16 85 -13 -46 -26 -27 61 -174 55 80 114 115 -19 -135 -73 -53 -150 45 55 -18
3006 -18 -34 -68 16 5 121 -75 50 116 50 101 -54 163 -145 50 81 179 144 -20 94 103 52 147 -83 -31 32 4
3032 4 -151 -59 143 53 70 113 97 -93 -210 112 125 -122 25 -107 -114 -9 118 40 111 -13 -18 25 -53 -38 -15 -53
$$ packed form
2842B6j0l3Q9p9lk8J00o4J18m6q5lr0J23r5Q2k2Nr2L7M0j8J41nq1o3p1k3K21m8
2872B3p7O%J8p8J30J82j55j15J22k8J8P1K9j42o8J46k37O6M9L0N3o3kn5J96j32
2899a3j72J05P4mJ43k4p3Kk6q4J52j08P6j59K30j00q3J28L5k28K54j80K4K8J26
2924A23q2n3LK9L6j34J4j3J19j14R5j87J18J02No2J43m6p6qj60J48l9K0J25j50
2950d4J40k05N7K6p2L2J58m5P1M4k07L4N6Q9j24P9Mo1p2J34q1OO3Lj54K6k9R7
2978B5l5r2Q7L2k0l2j13N7J07O9r8l3K0jQ8k35K29K5L4Jj34j16O2K0r7J95J0p3
3006a8j6l4Q4j1J16j96J25O6o6N1j55K17l08J95L1R8l5j64J14Rn1R5k30N2O3k8
3032Dj55R2K02r0J7M3j6j90j17L22J3k47J47j32pJ05J27p8P1j24nM3p8J5K3l8
$$ plain form
3058 -53 16 78 -71 54 103 215 78 -4 -43 124 93 37 172 -68 91 -99 40 -73 69 46 57 124 105 102 -65
3083 -65 -91 179 158 -13 1 72 -7 14 -12 145 19 114 -87 -26 10 142 76 25 79 -87 45 26 -137 85 -29
3108 -29 50 140 -70 34 -71 22 -73 -97 113 2 -127 132 20 -26 -60 -23 57 93 88 -105 -52 91 -46 -40 100
3133 100 -23 28 3 39 14 -47 17 -13 30 -83 -76 -12 58 15 104 11 -23 -139 103 -8 37 89 174 157 30 -110 79
3160 79 -13 -28 -74 -7 -112 -64 -4 -17 22 -9 168 35 -12 78 -42 -13 71 29 -35 30 114 -182 -94 66 141 11 -152
3187 -152 -145 40 70 -57 22 -9 -3 -75 88 -18 34 -89 18 59 79 129 -11 -25 -130 -55 4 -39 -50 52 13 54
3213 54 -93 17 34 34 55 78 55 -50 -82 37 -80 -28 -10 -89 1 65 47 48 45 15 76 52 52 132 -23 -81 -156 14 -105
3242 -105 -45 36 87 -13 70 23 -7 3 59 -45 41 56 -36 126 6 75 -66 46 54 8 99 30 -73 64 -80 -63
$$ packed form
3058e3O9O2j49J25M9J12j37q2l9J67l1n6J35k40J59j90J39j13J42k3J1O7j9lj67
3083f5k6K70k1j71J4P1p9K1k6J57j26R5k01O1L6J32o6n1N4j66J32j9j63K22j14
3108b9P9R0k10J04j05R3r5k4K10j11j29K59j12m6l4L7Q0L6nj93N3J43j37OJ40
3133A00j23N1k5L6k5o1O4l0M3j13PO4P0m3Q9r3l4j16K42j11M5N2Q5j7j27j40J89
3160G9r2j5m6O7j05M8O0j3L9l1J77j33m7R0j20K9Q4m2o4O5Q4k96Q8J60P5j30j63
3187a52PJ85L0j27P9l1Op2J63j06N2j23J07M1K0N0j40j4j05P5N9m3j1J02l9M1
3213E4j47J10J7%K1K3k3j05l2J19j17N2J8p9R0O4j8Jll0O1k4%Q0j55n8p5J70j19
3242a05O0Q1N1j00Q3m7l0J0N6j04Q6J5r2J62j20O9j41J12Qm6R1o9j03J37j44J7
$$ plain form
3268 -63 128 -14 71 -70 58 -144 -10 -64 -93 -84 -99 55 76 15 -95 -11 -97 -72 177 -16 -23 23 66 -51 112
3293 112 38 -47 14 93 62 80 22 20 53 -74 -24 47 54 65 -127 -163 -138 -104 48 -38 -21 144 27 -18 -169 -103 52
3320 52 75 -20 278 -38 97 -8 -130 164 -19 37 115 130 -88 25 -96 56 -21 48 -33 -47 114 -106 65
3343 65 -109 75 43 94 -20 -54 -12 120 -34 -59 -50 -14 -2 -38 -147 -6 19 123 1 90 -29 21 98 -46 55
3368 55 103 -62 -117 -94 8 63 -11 151 50 -133 -112 -47 109 45 26 111 -132 -12 -145 72 55 32 102 51 -58
3393 -58 -87 59 -69 10 -105 84 -5 -20 29 -30 -10 -29 77 40 52 13 -13 29 56 -77 -51 13 -193 66 203 -10
3419 -10 27 154 -99 -34 172 -173 82 -65 24 94 -115 123 -11 49 132 -37 -184 -21 183 -38 65 71 81
3442 81 44 96 -199 1 45 167 -22 146 121 80 6 130 -132 79 32 10 55 -7 16 -107 126 2 24 12 -36
$$ packed form
3268f3J91j42Q5j41J28k02J34n4k9Rj5J54K1o1j10Q4q6K5K49j93pM6M3j17J63
3293A12p4q5O1P9l1J8n8kL3j27N0P1PJ1j92l6K5L4J52q6J7J65j17m5j51O6J55
3320E2K3r5K98l16J35j05j22K94j83N6P8J5k18J13j21J52p7O9q1j4J61k20J71
3343F5j74J84l2N1j14l4M2J32j54k5RL6J2l6j09J41K5J04j22Q9j19N0P7j44J01
3368E5M8j65n5K3J02N5p4J62j01j83K1O5J56o4j9Q5k43J20j33K17j7k3P0n1j09
3393e8k9J46j28P9j15J89q9j5M9n9K0j9J06l7J2l9k6M2K7j33K6O4k06K59J37k13
3419a0L7J27k53O5K06l45K55j47Q9P0k09K38j34O0Q3j69j47J63K04k21J03OJ0
3442H1l7N2k95K00M4J22j89J68k5m1p4J24k62K11m7k2M5o2K3j23K33j24K2j2m8
$$ plain form
3467 -36 37 31 122 18 -11 83 -35 36 8 171 5 119 62 -117 -85 -18 61 66 -46 36 98 15 175 142 -125 -85 -21
3494 -21 130 156 -235 -89 4 153 62 -78 124 27 -134 -114 -30 -111 -33 -64 -2 33 -119 -124 24 -15 -52 27 -110 -2
3520 -2 70 -54 110 -142 -188 40 86 -61 -18 222 119 -62 73 35 -97 -5 43 -103 66 79 106 20 66 33 -149
3545 -149 31 40 212 126 135 -8 11 -126 45 37 -136 -55 35 33 88 34 39 20 -52 36 -171 -103 -86 57 -124 132 57
3572 57 4 -37 -6 108 26 -63 28 60 80 -49 23 -136 84 107 -13 57 54 -63 8 14 21 -80 92 70 -89 -72 57
3599 57 -25 72 -15 -93 32 79 -199 -57 -20 115 30 -94 9 65 -55 -62 39 16 105 -77 -17 130 55 7 -181
3624 -181 -22 48 -19 -7 -128 -52 104 0 108 59 84 158 -48 60 -83 138 156 -63 86 -57 -28 61 -38 -94
3648 -94 -21 -168 48 -101 -31 -42 36 75 -185 -10 -71 140 30 -76 -138 -45 122 195 -24 162 83 13 -37 57 31
$$ packed form
3467c6P3oR1j04k9R4j18P1k8J63j66J14n7j79L2O7P9Nj12Q2O2q3J60l3k67M0O4
3494b1J51K6l91J46R3J49r1j40K02r7j61K0Q4q1P8l1O2L5j52nJ48l9l7P9j37J08
3520bP2j24J64k52m6K28M6j47M3K40j03j81J35l8j32R2M8j46J69J3K7q6M6l3j82
3545a49J80RJ72q6Rj43J9j37J71qj73Q1R0kN5n4Nj9p2Q8k07O8J7J43j81K56p5
3572E7n3m1L1J14q2q9R1L2K0j29P2j59K20K3j20P0lj17P1OPj01J72k2j59J7J29
3599E7q2R7q7p8J25M7k78J42L7J35q5j24J03N6j20pJ01k3Q9j82O0J47p5m8j88
3624a81J59P0o7J2j21P6J56j04J08m9K5P4k06J08j43K21J8k19J49j43K9Q9r9n6
3648i4P3j47K16j49P0j1P8L9k60J75o1K11j10j06o2R3J67P3k19J86p9p0n0R4k6
$$ plain form
3673 31 61 14 -40 -14 -93 144 -146 -33 -123 -71 -25 -67 -127 71 16 117 -125 -36 -6 -10 40 -50 -70 90 14 98 96 -35
3701 -35 4 -86 84 7 13 -97 203 80 -170 70 45 -7 42 -159 -23 58 -60 -72 -80 -27 63 -79 51 12 -162
3726 -162 -49 -47 7 113 10 -25 -171 -64 79 -18 -43 46 -119 107 20 33 45 93 -124 -151 181 1 -71 35
3750 35 24 -80 128 6 41 119 42 -86 -59 -100 3 -9 -112 46 90 48 46 -23 24 -6 17 -71 79 22 67 -96
3776 -96 -95 85 50 95 -77 110 -65 61 176 57 25 114 -90 39 -10 44 -10 13 -49 -37 3 112 -38 158 -127
3801 -127 -16 63 -37 109 143 68 -7 58 -82 164 152 -7 -222 86 63 -23 -102 35 -107 27 -134 50 105
3824 105 27 -191 -40 41 20 30 -134 26 -100 -23 -114 23 74 -68 -32 -9 -15 -51 -64 -19 -83 127 -86 -245 73
3849 73 0 26 70 104 -32 78 -15 -40 126 -74 -143 -51 -90 21 11 4 0 -112 -131 -73 21 -37 29 -240 30 12 80
$$ packed form
3673C1L0m7n4K6p9K37k90J13r0N2M6m2o0J98n5J01k42Q9L0mN0r0k0J60p6Q4kj31
3701c5L9r0J70p7Oj10L00j23k50K40k5n2M9k01J36Q1j18j2qN3R0j42J30l9j74
3726a62J13KN4J06j03l5j46J07J43r7k5Q9j65K26q7J3J2M8k17k7L32j80p2J06
3750C5j1j04K08j22L5P8p7j28K7m1J03j2j03J58M4m2ko9M7l0K3q8J50n7M5j63
3776i6JJ80l5M5j72J87j75J26J15j19l2Q9k04J29m9N4n4K3o2J2M0J09j50J96k85
3801a27J11P9j00J46L4p5p5O5j40K46j2j59k15L08k3q6p9J37j42J34j61J84N5
3824A05p8k18J51Q1k1J0j64J60j26P7r1J37N1j42L6K3ol6j3M5o4K10k13j59L18
3849G3p3K6M4L4j36J10r3k5J66k00o9R2l9J11j0pmj12j9N8R4n8O6k69K70j8O8
$$ plain form
3876 80 5 49 78 -61 -138 -55 -79 -43 46 -27 -14 62 -93 39 67 69 110 -142 96 27 68 139 -50 27 -71 -115 68
3903 68 11 -70 -30 -17 152 27 -69 144 -14 -38 -53 -58 83 103 -80 -26 19 -11 -101 -37 52 132 -127 9 97 6 -62
3930 -62 17 -121 -50 78 59 -93 3 79 65 19 130 4 38 4 -154 69 -15 -2 -73 120 -7 -131 16 -12 48
3955 48 -117 -139 92 23 -19 96 38 2 109 -41 -107 -44 25 -11 -11 35 51 117 16 66 13 32 -7 -78 55 67 -18
3982 -18 31 116 -105 -24 102 63 37 -58 -116 102 42 -120 53 -38 51 -150 -91 -130 -41 70 -48 -54 -93 -91 80 -21
4008 -21 -31 -39 142 -142 84 151 158 -175 -27 122 37 -99 -10 -57 14 12 -14 45 -112 19 -16 -9 -65 17 -65 -82 17 36
4036 36 36 95 -98 -42 -53 -103 -8 202 21 86 -7 3 -61 -81 2 -75 10 -165 120 16 -81 35 -39 95 28 -77
4062 -77 193 -34 -63 112 -140 51 19 103 86 43 68 -228 -9 133 149 13 33 -109 72 -15 -148 -11 -33 -149
$$ packed form
3876H0p5M4K9j39p7Q3k4L6Q9p3J3P6j55J32K8KM1k52K38o9M1P1j89P7r8m4J83
3903F8n7q1M0J3J69j25r6K13j58k4j5nJ41K0j83N4M5l0r0O4Q9Q0k59J36Q8r1o8
3930f2P9j38P1J28j9j52R6P6j4m6J11j26L4l4j58K23q4J3p1J93j27j24J47k8O0
3955D8j65k2K31o9m2J15n8l6J07j50o6O3O9l6%M6J6O6j01N0n3J9l9p1J33J2q5
3982a8M9Q5k21Q1J26l9k6r5n8K18o0j62J73r1Q9k01N9l9Q9J11j18ol9KJ71j01
4008b1j0qJ81k84K26O7Pl33J48J49q5j36Q9m7P1kk6N9j57J31l5Pn6Q2q2j7R9J9
4036C6%N9j93N6j1n0R5K10j81O5r3J0o4k0Q3p7Q5j75K85j04r7J16p4J34o7j05
4062g7K70k27k9J75k52J91l2Q4j7m3K5k96K19J42J6j36K0j42J81q7j33J37k2j16
$$ plain form
4086 -149 -57 41 -21 53 -14 136 47 -61 77 -77 -5 50 -104 3 -190 29 -64 -2 43 109 17 -12 -92 -2 -103
4111 -103 -168 75 80 14 -4 43 158 -39 134 128 -133 -48 -44 -92 147 3 35 51 45 8 10 109 57 77 18 35 -30 132
4139 132 39 44 -34 -81 -102 45 -26 -118 39 12 -21 -71 -70 -19 67 59 -27 93 162 119 -42 -23 152 110 -55 86 -34
4166 -34 -29 -4 -19 4 52 -147 -157 -7 -8 23 -116 -17 -148 18 -26 -74 96 20 -126 79 -37 84 130 4 -14 4
4192 4 7 -50 46 35 -71 -135 -12 -98 7 52 26 119 -9 -116 32 40 -73 40 -52 -13 15 41 28 33 5 79 -42 87
4220 87 132 83 -60 -46 21 108 7 -19 63 -75 45 -115 -25 2 -176 59 -66 53 75 58 -25 13 -16 -21 -3 -56
4246 -56 36 -6 92 -41 -30 -69 -2 -22 -14 -14 14 -32 -65 -76 -72 -47 154 -149 -9 -95 -22 -109 -23 19 12 -91 107 102 124 -69
4276 -69 61 96 -31 50 -76 17 -39 -36 75 39 -6 -110 -81 38 -150 56 98 110 -117 -28 35 11 194 21 41
$$ packed form
4086a49R2R8o2P4o7J50q9j08J38j54P2N5j54J07j93K19r3O2M5O6r2k9q0R0j01
4111a03o5K43No6j8M7J15j97J73ok61Q5Mm8K39j44L2J6ol7KR9n2K0n9J7o5J62
4139A32r3Np8m7k1J47p1r2J57k7l3n0JN1Q6qq6J20O9m3j61J9J75m2j65J41j20
4166c4NK5j5K3M8j99j0J50jL1j39R9j31J66m4m8J70p6j46K05j16J21M6j26j8J8
4192DLn7R6j1j06o4J23q6J05M5k6R3j28j07J48Qj13J13r2L9K8K6j3Nk8P4j21J29
4220H7M5m9j43J4O7Q7j01k6Q2j38J20j60R0K7j78K35j25J19K2j7q3L8k9nJ8n3
4246e6R2m2R8j33J1l9O7k0Q%K8m6l3j1MK5K01l03J40q6P3q7Q6M2pj03J98nK2j93
4276f9J30L5j27Q1j26R3n6LJ11l6m5j04K9J19j88K06M2J2k27Q9O3k4J83j73K0
$$ plain form
4301 41 -36 48 89 -28 95 87 -123 -58 92 -10 -48 -28 216 -59 128 34 -15 -79 -178 -109 -88 -88 56 22 177 83
4327 83 -39 -129 49 183 -50 -100 75 -32 -38 -50 43 -71 -97 161 -64 -16 -60 195 74 14 -82 101 1 34
4351 34 77 165 -67 41 58 -47 86 -119 88 0 -78 46 7 -73 -70 7 -29 -87 -2 13 38 -64 -66 63 119 55 61
4378 61 59 156 -75 28 47 -100 53 -48 5 -93 78 -38 88 -48 -71 -17 138 192 -104 -59 0 -85 -57 83 45
4403 45 72 -90 -40 149 118 11 15 -47 -129 63 -120 -113 -11 25 97 51 113 57 69 35 -82 -32 -14 -47 -41 -9 37 70
4431 70 -8 128 47 46 -201 -64 12 89 38 -107 -42 -105 -26 -12 -41 -133 -70 -43 33 180 -44 25 5 38 89 19 -71 -47
4459 -47 -47 -74 -16 -22 99 -83 8 50 -51 73 39 22 -105 68 22 163 36 34 -39 -208 -46 98 -142 57 26
4484 26 96 -45 -11 -81 136 71 -122 -62 235 5 46 3 82 -41 -95 16 91 -4 34 10 -11 54 -12 124 107 49
$$ packed form
4301D1p7Q4M1j17J23qk10O5J50j02l8K0K44k75J87r4m9o4r9O9K1%J44l4J55r4
4327H3j22r0J78J34k33n0J75j07oj2R3j14k6K58k25M8m4K55j21o0r6J83j00L3
4351C4M3Q8k32J08J7j05J33k05K07q8p8J24l9q0LP7l6n8Q5J5K5j02kJ29N6o4O
4378F1kR7k31J03J9j47J53j01N3r8J71j16J26j36k3N4J55N4k96M5N9q5K8J40l8
4403D5K7j62N0J89l1j07Mo2q2J92j83PJ02L6P2m6O2n6J2l4j17N0J8l3OL2M6L3
4431G0p8J36q1jk47J37P6P7n1j45O5o3P9J4k9r2O3K7P6J47k24O9k0L3N1p0r0K4
4459d7%k7N8oJ21j82R1M2j01J24l4j7j27J73m6J41j27kp3j69J62J44k40J99l1
4484B6P0j41L4p0K17o5j93O0K97k30M1m3P9j23n4J11P5r5L8k4k1O5o6J36j7n8
$$ plain form
4510 49 -63 19 -49 56 112 -85 -41 -67 50 -167 -18 164 -20 -144 -55 32 43 -60 -16 216 -16 -27 51 39
4534 39 48 61 11 108 -139 2 58 -138 -51 -202 49 -64 -32 -51 25 -24 -100 -88 79 -85 -26 -18 -73 -25 -24 27 229
4561 229 -50 52 17 -48 94 90 -54 23 0 3 38 -6 -96 70 17 -77 162 -41 58 48 42 163 -27 -108 -129 50
4587 50 55 4 -107 93 -12 -93 139 -7 173 38 73 -37 69 56 62 -141 28 -37 38 82 -137 176 -59 166
4611 166 49 172 46 -41 26 19 -26 -23 -12 -98 3 14 -1 42 -102 32 -23 -57 19 -144 -61 105 151 -65 -105 50
4637 50 40 -78 122 -75 -85 10 126 -45 60 -25 -1 26 -35 128 -104 -40 -82 -58 37 16 79 109 4 121 28
4662 28 18 -9 -81 -33 -46 -174 -133 -29 -21 -33 -92 -166 -151 48 71 38 11 -91 178 -30 14 98 -76 -84 163 20 6
4689 6 128 112 -19 87 149 -166 13 -79 83 -122 2 79 161 -99 -80 144 -72 21 -49 -104 11 -66 -83 49
$$ packed form
4510D9j12Q2o8J05N6j97M4k6J17k17J49J82j84j24Q9Q7J1j03M4K32k32j1P8j2
4534C9RJ3n0R7k47J41N6j96Q7j51K51j13L2j9P6m9p6J2J67j64N9Qn5M8JN1K02
4561B29k79J02l5o5J42mj44P7k3LL5m4r0J66n3r4K39k03R9j0oJ21j90q1k1J79
4587E0Nn1j11K00j05q1K32j46J80j35L5j10J06j3Ok03J69o5P5M4k19L13k35K25
4611A66j17J23j26q7O7pm5LJ1q6J01J1j5M3j44J34n5l4P6j63Q3J66M6k16m0J55
4637E0j0j18K00j97j0R5J16j71J05q5K4K7o1J63k32O4m2K4R5k1O3L0j05J17r3
4662B8j0k7p2M8j3j28M1J04Qj2n9p4J5J99K3l3k7j02K69k08M4Q4j74qK47j43j4
4689FJ22j6j31J06O2l15J79r2J62k05J24P7Q2k60J9K24k16R3p0n5J15p7j7J32
$$ plain form
4713 49 -78 8 -45 -120 149 158 -28 -45 -28 23 20 -26 20 -111 55 12 105 -3 -77 -35 -136 -142 72 30 -163 -122 89
4740 89 -31 127 2 -62 -65 -61 -279 -32 98 -75 15 -29 13 -40 -1 -23 6 -22 126 117 75 -112 -151 -35 -88 -202
4766 -202 -36 -54 -132 21 122 129 -101 -3 49 -43 78 -110 -72 -142 203 -103 -9 -31 -82 88 -117 -19 85 74 50
4791 50 44 -87 -26 21 -61 19 5 -50 43 -29 -180 50 44 -96 151 -107 -94 77 9 -1 -43 -58 131 39 36 -93 -127
4818 -127 78 132 58 140 12 -1 -41 79 -67 -56 22 -5 54 83 -53 57 44 91 24 -91 -135 141 46 52 49 52 99
4845 99 -62 -64 -90 117 -55 3 36 -71 75 1 -14 51 -59 -89 0 -27 51 -35 133 5 -78 193 33 122 -59
4870 -59 -2 -40 49 46 44 -118 145 -19 37 -37 2 166 -26 -13 66 62 -53 220 -6 8 -108 20 -6 91 206 -31
4896 -31 -162 2 29 42 11 -225 37 -23 -164 -3 -89 -42 -40 62 14 59 42 -96 85 -54 -96 -171 42 13 -90
$$ packed form
4713D9j27Q6n3p5K69Rj86j7J7N1lm6M6j31J66m3R3j08p4M2j01oK14m2j93M1K11
4740H9j20J58j25o4lMk18K47J30j73R0m4M2n3L9k2K9k8J48rm2j87l9J16n3j14
4766b02J66j8p8J53J01Pk30R8N2r2J21j88L8p0L45l06R4k2n1J70k05R8J04j1k4
4791E0oj31O1M7q2Q0j4n5R3p2j51K30oj40K47k58J3J71o8j0m2j5J89r2lj29l4
4818a27K05N4p4Q2j28j3m0J20j46J1P8k7N9K9j36J10j3M7o7j15m4K76r5OlLM7
4845I9j61kk6K07j72N8L3j07J46p4j5O5j10l0Q9k7P8q6J68j28q3K71j60Q9j81
4870e9N7l8Q9lkj62K63j64N6p4L9J64j92J3P9mj15K73k26J4j16J28k6R7J15k37
4896c1j31J64K7J3l1k36K62o0j41J61q6M7KJ02m8M5j7j38J81j39m2p5K13k9j03
$$ plain form
4921 -90 -76 -9 -135 132 -72 -27 2 -111 -30 -65 -17 -46 -30 149 -87 -15 41 -42 47 51 32 9 78 -12 -118 -45 65
4948 65 -28 -8 -97 -5 53 -80 -22 -21 -12 -63 38 -37 -132 12 27 55 184 195 -106 25 -55 84 -65 133 67 -62
4974 -62 15 -112 -118 -76 -3 -35 -115 -74 101 -66 4 28 34 -58 80 119 159 -146 52 15 38 -40 32 64 -163 -115 4
5001 4 132 28 -28 -106 -208 -17 -14 -102 17 -104 75 153 51 -124 -55 -80 -48 26 -30 44 -39 46 -89 6 76 70 -11
5028 -11 -77 101 110 134 33 -16 104 -93 24 -123 66 -77 44 118 10 -36 -122 33 144 22 -58 -152 -52 70
5052 70 -8 30 5 -53 -46 63 -48 -8 148 -11 36 53 -60 98 -148 -11 96 86 120 -88 40 92 -57 -51 -62
5077 -62 54 64 34 110 8 -2 82 46 41 -72 52 -34 -123 123 -11 -10 -7 75 28 4 -87 -69 30 152 -92 11 1
5104 1 -6 32 7 -49 42 -103 -143 121 -28 -58 -44 77 3 52 48 -130 17 -85 40 98 101 146 3 51 58 -21 59 55 -62
$$ packed form
4921i0J4O7j26K67k04M5K9j13Q1l5M8k9J6J79k36P2N6q3Q9Mj9k3O9r0j06P3J10
4948F5r3K0q9R2N8j33N8JRn1J01p5r5J44J5K8J29J1l01J31q0J39j49J98o6j29
4974f2P7j27oM2P3l2q0M1J75j67P0K4Or2J38L9M0l05J98l7K3p8P2L2k27M8J19
5001DJ28j04n6p8j02J91Lq8J19j21J79P8j02j75O9k5L2P4n6P4q3Q5j35R5P0oq1
5028a1o6J78RK4j01m9J20j97J17j47J89j43J21P4j08m6q6J55J11j22q0r4J00J22
5052G0p8L8k5n8PJ09j11M0J56j59M7J7j13J58k46J37J07j0L4k08J28N2j49Oj1
5077f2J16J0l0P6j02j0Q4l6nj13J24q6q9K46j34JLQ2m7k4r1J8R9J22k44J03j0
5104ApL8k5n6R1j45m0K64j49l0J4J21p4M9mj78J47j02J25N8LM5j43M8Pp9Q0mj17
$$ plain form
5133 -62 -66 -49 18 136 -34 -77 -51 -76 -93 121 -22 224 -31 -63 34 -13 76 46 27 -32 39 98 87 128 94 -15 -16 85
5161 85 109 166 -75 -31 79 97 -49 -149 -25 263 34 11 -11 105 -30 14 12 -37 -115 -40 -141 -103 148 -19 -195
5186 -195 -12 -117 -153 -45 82 51 166 79 39 36 152 -69 11 65 60 -43 1 -140 -9 18 73 -79 12 105 -105
5211 -105 -134 -35 34 -37 -67 -85 -42 -23 -180 -105 43 57 25 -15 49 -80 6 -94 -54 64 -73 -56 2 -52 -28 80
5237 80 -76 -52 10 -55 16 75 3 41 56 51 40 -129 131 100 -88 -8 -67 -49 21 -56 78 -96 82 -35 -37 -99 11
5264 11 154 72 228 23 -84 42 -32 98 70 76 101 155 -65 16 -45 109 -69 -5 94 -183 -21 -124 -229 -39
5288 -39 -10 -63 -146 14 66 -7 143 63 -50 -67 116 -216 240 11 99 -90 -34 -92 173 71 -24 -144 7 -8
5312 -8 46 -83 66 -222 -24 -96 -37 128 -76 -66 -7 -60 19 72 -52 -125 -126 -92 -184 29 -36 32 2 22 -117 -14
$$ packed form
5133f2mJ7O7J18j70m3K6k5j7K14j43K46k55l2R7m7Q9l0j9n9P1N9j1M1l4j09jJ01
5161H5K4N7k41M4J10J8j46j00J24K88k29k3k2J16j35M4km9p8P5j01L8K51j67j76
5186a95J83j05l6J08J27l1J15q7m0lJ16k21Q0N4nj03M4j41J31K7N5j52R1R3k10
5211a05k9R9O9p1l0j8M3J9j57P5J48J4l2m0O4j29Q6j00M0J18j37J7N8n4K4J08
5237H0j56K4O2o5P1N9p2L8J5nj1j69K60l1j88Q0n9J8P0p7J34j74J78j17ko2J10
5264A1J43q2J56k05j07J26p4J30k8OK5N4k20Q1o1J54j78O4R9k77J62j03j05J90
5288c9K9n3q3J60N2p3J50q0j13j7J83l32M56k29Q8j89N6n8K65j02r5j20J51j5
5312hN4j29J49k88J98p2N9J65k04J0N9n3P9N3j24p3jL4r2K13o5O8l0K0j39J03
$$ plain form
5338 -14 128 -63 2 14 -8 -41 -118 -5 140 46 -38 35 -56 -61 25 90 -111 85 2 77 -60 -20 144 10 -38 -111
5364 -111 43 94 -83 -88 -10 136 56 -39 104 -117 -33 -90 -72 -24 42 7 53 -61 -51 -173 -33 135 -44 -25 -63
5389 -63 36 73 159 -95 -62 77 -39 -109 60 -110 -12 -32 48 97 -17 5 -51 -40 -38 -7 10 -94 -106 265 51 169
5415 169 27 171 30 58 93 -167 -24 -148 42 113 150 18 -32 -3 0 42 -174 65 80 -51 175 0 -54 129
5439 129 26 92 117 -189 -54 44 -5 -90 1 -30 -69 -63 107 183 -113 143 -91 -145 54 -7 98 -124 53 26 -157
5464 -157 -44 2 -170 16 10 -102 18 23 116 56 42 105 1 -120 89 19 22 -73 48 -110 -19 62 28 0 31 -214
5490 -214 -148 -52 -158 133 -53 0 -180 -110 -48 96 15 101 -29 47 -111 -107 -12 -165 146 92 4 84 -43 -32 -46
5515 -46 -127 29 -112 79 -19 27 -117 47 76 48 63 -28 -12 23 -142 -23 46 -51 27 -53 16 98 -39 -100 -58 61
$$ packed form
5338a4J42j91O5J2k2l3p7J13J45r4q4P3r1nQ6O5k01J96q3P5j37M0J64j34m8p3
5364a11J54N1j77nP8J46q0r5J43k21Q4n7J8M8O6l5M6j14J0j22J40J68j79J9l8
5389f3R9L7Q6k54L3J39j16p0J69j70R8k0Q0M9j14K2n6J1KL1J7j04j2L71k14J18
5415A69j42J44j41K8L5k60J43j24J90P1L7j32n0K9LM2k16K39J5j31K26j75n4J83
5439A29j03O6K5l06J35R8m9q5R1l1l9OJ70P6k96K56k34n4J99o1J05k22J77k7j83
5464a57J13M6j72J86oj12J20NR3o0j4O3j04j21K09p0Lr5J21j58R1Q1l4k8L1k45
5490b14O6R6j06K91j86N3j80P0O2J44q1Q6j30P6j58MR5j53L11n4q8Q0j27J1j4
5515d6q1J56j41J91r8M6j44J64K9k8J5r1J6L5j65J19O9r7P8q0O9Q2j37o1M2J19
$$ plain form
5541 61 23 49 3 -69 -3 162 -79 -10 49 12 -13 142 26 -32 40 -49 81 113 -57 -95 -96 92 53 -76 21 51 -25
5568 -25 112 -164 -35 45 16 -22 -41 42 -33 -77 -64 192 137 -17 -136 51 -7 91 -61 -54 -71 16 -60 61 -97 63
5594 63 86 -10 -9 -20 76 -29 -21 -32 -4 14 76 13 182 101 -97 -128 32 63 10 -43 -93 -35 -48 -40 -100 154 -56 15 72
5623 72 103 -38 -33 66 6 -36 43 98 65 -61 133 62 -46 -78 -83 -189 -126 137 162 -25 22 -89 -104 69 74 5 -102
5650 -102 69 -105 92 -19 -15 -31 -7 118 -51 -34 -52 -56 49 146 70 64 -48 -214 -19 -89 -115 -109 34 -19 -43 35
5676 35 106 -23 -146 -19 51 41 97 148 -113 -85 -85 -41 -133 -110 58 -113 114 52 -46 94 94 81 9 96 -11 -3 25
5703 25 -106 -69 -47 -35 101 39 76 -70 -96 24 -32 84 -63 148 -6 -88 21 86 -77 -44 -73 -19 11 -192 95
5728 95 -68 -102 37 -80 -77 10 -52 -73 2 2 24 -26 92 -1 -41 82 122 -74 -85 -68 94 3 -43 105 -101 -188 -127
$$ packed form
5541F1l8K6m6p2O6J65k41O9N9l7k5J55j16n8P2q9J30L2j70l8jJ88l9j29R7L0p6
5568b5J37k76J29Q0k9l8j9Q3p5m4J3K56n5j54j19J87n8R8j52Pj7Q7p6J21j58J60
5594F3K3r6Jj1R6j05Qj1K8J8O2o3J69q1j98l1J60L1n3n3n0N8j3Qo0K54k10P1N7
5623G2L1j41NR9o0m2P9N5l3j26J94p1j08l2nj06O3K63K5j87M7j11j5J73No9j07
5650a02J71j74J97j11Mj6K4J25j69J7j8mJ05R7p6oj12j66J95p0k6OJ43n3k4P8
5676C5P1j29j23J27P0j0N6N1k61K8%M4r2K3J68j71K27o2r8J40%j3p2Q7j07QK8
5703B5j31L7K2J2J36o2L7j46k6J20n6J16j47K11j54q2J09O5j63L3k9N4L0k03K87
5728I5j63l4J39j17LQ7o2k1P5%K2n0J18r3m0J23M0j96j1J7J62r1m6J48k06q7O1
$$ plain form
5755 -127 131 38 169 13 60 74 -128 -127 -32 -109 -43 -126 -22 39 104 50 -31 0 25 123 25 -3 26 -82 8 10 1 160
5783 160 -81 -49 9 28 167 -24 10 -171 13 -15 -18 -94 -107 34 -102 -139 -6 120 -84 18 65 22 -29 -3 33
5808 33 2 -158 -185 -33 -14 -167 -80 -83 79 64 -93 -7 113 -14 -14 -23 -10 -87 -37 9 129 30 -54 -40 20 -5 68 18
5836 18 122 -45 116 -83 -34 -53 -18 15 -32 -69 -49 -28 -87 -11 -161 -225 70 103 170 -56 -32 101 93 108 140 55 -160
5863 -160 -76 -126 22 78 -13 48 -17 -9 -42 96 -141 -70 111 -114 -31 59 74 11 75 -127 -136 3 -55 113 112 -107 67
5890 67 -13 -99 -4 25 200 19 18 36 -24 170 94 -121 -66 -28 5 -84 66 -3 -10 -20 158 -113 -30 70 -14 -133 59
5917 59 184 -88 110 -236 -34 -49 -1 -48 21 65 75 -26 13 -33 -32 10 -46 -124 139 -158 94 4 0 16 64 18 -51
5944 -51 -38 28 154 -15 66 -124 144 148 91 -127 105 62 231 -72 92 -80 -27 -9 25 95 -132 -38 -101 -114 -80
$$ packed form
5755a27K58r3J31j56M7J4k02JR5p7O6q3J04O1O5n4q1L1K5R8r8k8K9j08R0KrJ59
5783A60k41L2N8J9J39j91L4j81J84k8lp6j3J41j36l7J33J26k04J02M7m3n1K6L6
5808C3l1j60k7J52J9j53Q7lJ62j5j57Q6J20j27%rJ3p7N0M6J20r9q4J4O0k5P3n0
5836A8J04j67J61j99M9j9L5L3m7l7K0K1n9P6j50o4K95L3O7k26K4J33qJ5L2q5k15
5863a60Q4n0J48N6r1O1o5Ql3J38k37P1J81k25Q3R0J5o3O4k02rJ39n8J68jk19J74
5890F7q0q6R5K9J75j81jJ8o0J94p6k15N5L8L3q9J50o9pj0J78k71Q3J00q4j19J92
5917E9J25k72J98l46K02j5M8m7O9M4J0j01L9m6JM2n6p8K63k97K52r0mJ6M8m6o9
5944e1J3O6J26j69Q1j90K68Mn7k18K32m3J69l03J64j72N3J8L4P0k27R4o3j3L4
$$ plain form
5969 -80 16 110 109 28 -69 116 -71 -43 25 56 -4 -35 102 23 32 71 148 32 -155 -154 96 -7 -81 -23 -42 132 -74
5996 -74 44 16 -15 -88 10 13 50 43 -15 9 84 162 245 27 45 20 105 -51 41 200 -63 9 161 190 0 -77 37
6023 37 88 92 -14 -17 -135 -78 6 -134 64 -127 -64 -34 53 156 -88 -72 6 -22 -2 74 159 -38 61 60 39 -146 -20
6050 -20 57 117 -7 -33 -25 -10 -86 -32 48 243 130 21 85 -127 86 21 -113 45 13 73 137 133 -43 -80 55 17
6076 17 -86 7 129 -62 150 24 -124 -58 127 -24 112 82 1 46 -13 82 -3 99 -20 67 1 104 108 -31
6100 -31 54 70 -36 -59 -16 -25 -107 -48 76 -68 -172 -129 29 15 81 85 -32 41 48 11 -84 -23 -47 -37 73 -7 54 -82
6128 -82 -16 42 94 19 184 -22 -51 19 91 -102 -66 47 79 -2 -199 -105 69 71 -126 -162 -17 -96 46 -69 -60 22
6154 22 37 -33 102 122 47 -166 -109 38 36 -97 51 123 19 54 35 -9 137 -39 -74 25 -53 -55 80 35 -60 -54 -112
$$ packed form
5969h0R6R4jq1r7J85j87K8O8L1o0l1J37p9RL9P7j16j87JK50j03p4N8j9J74k06
5996g4J18k8l1p3R8LL7pn8K4P5P8Q3k18J8k5Q5j56R2J59k63P2J52K9j90p7J14
6023C7N1Mj06lj18N7Q4j40J98j91O3L0Q7J03k44J6P8k8K0P6Q5j97R9jk1j85J26
6050b0P7O0j24k6QJ5p6N4Q0J95j13j09O4k12K13o5j34J58l2O0O4mj76l7J35l8
6076A7j03R3J22j91K12j26j48O6J85j51J36l0q1M5n9R5q5J02j19Q7o6J03Mj39
6100c1Q5J6j06k3M3rq2N9J24j44j04M3J58j4O6Mj17P3Pl7r5O1k4J0J10q0O1j36
6128h2O6N8N2p5J65k06k9P0P2j93L6J13L2q1j97R4J74Kj97l6J45p9J42j15RQ2
6154B2J5p0J35K0p5k13N7J47kj33J48P2j04L5j9m4J46j76l5R9p8kJ35m5r5On8
$$ plain form
6181 -112 107 16 136 -146 62 21 -87 -68 93 -37 -43 73 -139 -109 30 57 91 128 -200 1 46 -13 -5 -109
6205 -109 -54 170 -134 -95 -60 -80 40 60 -38 -65 -65 46 -69 20 -91 42 -112 -124 -4 36 22 -110 64 47 6
6230 6 -151 89 128 -13 -97 17 -27 63 -78 -31 -5 -11 -14 -51 82 91 69 61 -90 -11 56 43 -108 74 -35 45 -87
6257 -87 -56 -36 -80 3 -8 -32 154 128 -18 52 -4 54 44 -11 -111 56 -108 64 8 -200 56 -34 -18 114 14
6282 14 -166 -77 -18 39 -54 76 -21 148 131 -24 110 127 89 48 16 91 -134 -21 -5 106 -122 -10 34 65 -5
6307 -5 -4 1 -1 -35 -51 -17 -49 128 -17 -21 -129 -308 1 19 185 -134 -20 88 24 -34 -129 -134 77 166 13 -24 -53 3
6335 3 -81 -5 24 185 62 -11 8 -99 -45 -103 -16 -112 55 -76 -6 -38 -44 113 49 40 74 37 -152 -62 118 -20 -149
6362 -149 -75 28 210 20 6 -53 63 0 54 53 141 67 107 -32 -66 65 65 111 102 -6 -58 63 -68 -111 199 36
$$ packed form
6181a12K19r1J20k82K08m1j08J9J61j30oJ16k12L0J39K7L4L7l28K01M5n9Qj04
6205a09N5K24l04L9L5k0J20K0r8k7%J11j15Q9j11J33j54j2J20M0j4j32J74j7m1
6230Fj57K40L9j41q4J14m4R0j41M7K6oll7J33Rk2qj51P9O7j3j51J82j09Q0j32
6257h7L1K0m4Q3j1k4J86k6j46P0n6N8j0n5j00J67j64J72n6k08K56r0J6J32j00
6282A4j80Q9N9N7r3J30r7J69j7j55J34J7l8m1l2P5k25J13J6J11k28J12M4L1p0
6307eJNkl4j6L4l2J77j45mj08j79L09J8J66l19J14J08o4n8r5nK11Q9j53l7k9N6
6335Cq4P6K9J61j23p3J9j07N4n8Q7r6J67j31P0l2oJ57o4rL4l7j89R0J80j38j29
6362a49P4J03J82j90j4n9J16o3N4jQ8p4M0j39l4J31%M6rj08n2J21j31m3L10j63
$$ plain form
6388 36 21 -55 49 -14 -28 -45 -48 -109 -244 29 -62 -115 78 -174 -98 92 60 -72 42 -37 73 -120 12 -15 -45
6413 -45 -112 79 49 -25 -10 -26 -94 15 -1 122 -28 38 33 106 -52 26 -14 -7 86 -119 -142 -51 -19 135 -110 -98 24
6440 24 -87 -12 -124 -10 63 -7 -8 -51 -68 33 -31 -106 -47 -6 6 100 146 88 -84 -152 93 76 -103 74 4 -78 55
6467 55 -58 -37 -55 72 13 11 31 -104 -164 218 11 117 229 116 -93 16 -80 84 -129 -11 2 110 -1
6490 -1 89 -144 -36 62 9 54 -42 94 -106 63 -86 69 76 36 45 -87 126 -11 68 47 83 -150 95 82 86 31
6516 31 113 -10 31 99 49 129 2 89 -38 -98 -162 -2 -14 -142 -143 -8 -75 -68 -45 127 12 62 119 13 29 42 -113
6543 -113 -24 -187 56 -100 -24 90 31 -126 35 -9 -140 -57 3 52 -118 51 24 5 14 53 -31 42 -43 -113 80
6568 80 42 -11 21 60 99 -154 84 130 -163 -6 20 -176 -102 -83 98 -53 92 -44 43 17 111 98 20 171 98
$$ packed form
6388C6j5p6J04o3j4j7lo1j35K73r1n3J93k52P6J90l2j32J14p9J10j93J32k7l0
6413d5o7J91l0p4J5j6o8J09j6J23j50O6nP3j58P8m0PR3k05k3R1L2J54k45J2J22
6440B4j11P5j12J14P3p0jm3j7J01o4p5N9M1J2R4M6n8j72o8K45j7j79J77p0q2J33
6467E5j13K1j8J27n9kK0j35o0L82k07J06J12j13k09J09r6J64k13J18J3J08j11
6490aR0k33J08R8n3M5r6J36k00J69j49J55Pm0Rj32K13j37P9k1L6k33K45j3Mn5
6516C1Q2j23M1O8n0Q0j27Q7j27o0o4J60j2j28jJ35o7PK3J72j15N0N7j06J6J3j55
6543a13Q9j63K43j56P6J14n9j57J61m4j31Q3O0M9j70J69k7j9RL9q4P3q5p0J93
6568H0l8n3L2L9L9k53K38M6k93J57K6j96P4J9J81j51J45j36Q7k6R4j3p8J51p3
$$ plain form
6593 98 14 -30 12 -75 -11 107 -79 -39 -113 -23 53 10 45 5 128 -54 2 109 -62 74 159 -62 22 -11 -69 -112
6619 -112 39 139 -36 17 -70 -7 -46 23 56 24 -117 -2 34 62 -70 -7 39 -86 35 86 10 -33 -20 93 92 32
6645 32 190 -85 52 -83 22 47 12 -66 151 12 19 96 -63 -170 -20 -68 18 -90 -35 -177 -73 121 85 3
6669 3 47 120 -80 -50 50 -18 -65 -15 -45 -103 -71 -138 58 -185 61 -62 105 58 143 111 10 -179 -129 65 89 -22
6695 -22 56 130 13 -71 79 96 52 12 -129 -165 70 -20 -158 -68 -59 56 -69 -9 82 -31 -97 162 8 -30 -102 22
6721 22 -34 -46 -82 -79 51 234 -60 -74 -21 24 107 -43 -54 -28 81 -56 -15 -43 84 -2 24 68 -190 14 -47 -54 -78
6748 -78 122 63 -66 33 29 78 88 -36 45 36 65 64 53 22 -20 -11 72 -1 139 69 93 -23 -25 129 -26 96 5 -101
6776 -101 -30 -34 79 6 -6 -79 -92 -125 -109 -20 -33 -75 -68 -122 -118 -103 90 85 -46 37 21 -153 -36 -55 5 -4 -164 24 -57
$$ packed form
6593I8q4m4M2q7O4J18j86M0p4R0P6m3L5m0J23j82N6J07j71J36Q5k21Q4l3n8m3
6619a12J51J00j75N3q7O3l9O9L3l2j41J15L6K8j32O3M6j25J21N1p6m3J3J13jo0
6645C2J58k75J37j35J05K5l5p8K17j39PP7j59j07J50m8Q6j08N5j42J04J94l6q2
6669CM4P3k00L0J00o8m7N0l0n8L2o7J96k43K46j23J67m7Q5l2j01j89N0J94K4j11
6695b2P8P4j17q4J50J7m4m0j41l6K35r0j38R0RJ15j25O0R1j13o6K59j54l8p2J24
6721B2n6j2l6LJ30J83k94j4N3M5Q3j50j1K6J09j37M1k8J27q6K6M4k58K04o1pk4
6748g8K00n9j29R9mM9J0j24Q1rK9jj1l1m2RQ3p3J40p0K4j16kJ54j55J22r1j06
6776a01P1mJ13p3j2p3j3l3J6Q9j3m2Pn4MJ5J93nj31Q3j6j74J17j9O0rj60J88q1
$$ plain form
6805 -57 6 23 10 110 -34 71 65 61 -17 -10 174 -130 -116 -65 66 23 -126 -170 -49 -72 40 -10 7 -105 -13 83 -60
6832 -60 151 -26 43 92 -6 -6 85 96 -1 115 30 -91 166 126 -52 -17 63 -21 -18 14 73 -139 39 16 -125 -2
6858 -2 11 -219 -56 -15 67 66 81 -88 64 60 17 -131 -21 62 -96 -68 34 -4 -24 83 72 -28 42 -3 -86 90
6884 90 -5 -48 -48 -63 68 -62 46 93 -87 15 128 -103 -53 -23 106 -9 41 -106 -23 71 -143 -52 24 93 -111
6909 -111 -17 -104 147 -18 -103 -87 60 -23 -34 23 12 -132 60 -6 -29 1 33 -39 -122 -62 123 36 -116 -36 93 -31
6935 -31 61 26 80 13 19 87 -117 40 33 11 19 -52 -100 21 123 -76 -69 92 -78 51 111 -110 41 77 -47 160
6961 160 17 19 -50 -17 32 161 -33 -18 -79 -2 76 123 59 27 -52 24 -57 -9 128 -199 70 -217 -30 -15 -33 18
6987 18 14 41 83 -53 42 38 -96 130 -47 -117 7 163 -17 51 -108 -19 78 -67 31 -99 115 -100 16 25 -10
$$ packed form
6805e7O3J7j3J00j44J05omp8PJ84l04J4N1J31m3j49m4J21k3J12n0J7j12R2R6j43
6832f0K11j77O9M9r8%R1J1r7J16q5j21K57m0j78L5Q0q4LL2N9k12J78k3j41J23
6858bJ3k30J63M1Q2jJ5j69J52mm3j48J10Q3j58K8J02l8k0J07j1j00P0m5q3J76
6884I0r5m3%j5J31j30J08M7j80J02J13k31N0L0J29j15N0j47Q3R4k14R1P6O9k04
6909a11R4q7K51j65q5J6J47q3j1N7j1j44J92o6k3L0L2p2q3O0J85q7j52Q0J29j24
6935c1R2l5N4o7OO8k04J57pk2Qp1m8J21J02j99PJ61j70J29O0k21J51L6j24K07
6961A60j43Ko9L3M9J29j94J5o1P7P8M7o4l2p9P6q1M8J37l27K69k87J87J5j8N1
6987A8mK7M2j36R5mj34K26j77p0J24J56j80O8j59Q9R7j45R8j30K14k15J16Rl5
$$ plain form
7012 -10 -41 69 43 -89 72 24 109 -72 171 -30 -80 -200 5 88 -128 -204 -20 -5 -79 16 -41 -120 116 -38
7036 -38 15 129 -22 41 25 115 -154 -28 20 -1 -53 -90 26 100 -31 2 129 110 109 -51 102 70 167 150 150 -130
7062 -130 158 -57 31 108 -139 53 -81 8 183 56 4 -103 40 -70 -85 -7 -57 192 5 -86 -28 201 161
7085 161 80 -16 -14 -194 7 85 -225 -57 -64 -50 -346 -53 74 -165 -50 -5 46 -60 76 39 -216 -69 -17 -126
7109 -126 -19 6 -19 -10 52 1 -99 -32 67 -65 -164 50 124 -85 -23 115 3 -8 72 -128 123 97 175 -104 13
7134 13 71 54 -78 -137 32 88 -60 -13 154 -15 -55 -113 -13 -60 -54 -63 15 -41 -46 -8 61 37 169 53 -49 -42 4 -57
7162 -57 -24 -55 -73 30 -94 -195 39 1 100 59 -110 -85 -2 15 -78 125 53 29 50 164 -20 -82 105 26 -20 -41
7188 -41 55 -102 11 142 -96 -10 -67 -119 -91 -32 7 -135 108 105 14 40 -38 9 54 -30 47 150 -14 44 114 11
$$ packed form
7012a0l1J10k6j32J61m8Q5j81K43k01n0j20K05Q3k16p6J84J5p4R5n7p9K36j54
7036c8N3J14j51O3j6R0k69J26M8k1n2l7J16P4j31L3J27j9jj60J53l2R7j7%k80
7062a30K88k15Q8P7k47J92j34Q9J75j27n2j07J43j10j5P8n0K49j87r1N8K29m0
7085A61q1r6Kj80K01P8l10J68pJ4k96K93J27k39J15M5N1j06J36l7k55J47N2j09
7109a26J07K5k5RO2n1j00O7R9j32r9K14P4k09O2J38j12j1Q0k00K51k6P8k79J17
7134A3N8j7j32n9J69N6j48M7J67j69m0n8J00m7OrP8n6nL8O9k4J32j16j02PM6o1
7162e7L3l1j8J03j24j01K34l8R9m1j69K5Q3J7r3K03p2k4K1J14j84o2J87p9m6k1
7188d1R6j57J13J31k38Q6n7n2K8N9L9j42K43lr1K6p8M7M5q4P7J03j64N8P0j03
$$ plain form
7214 11 34 -39 -1 101 -99 79 94 166 24 72 90 68 -23 -22 133 36 113 6 262 39 126 13 -79 21 -17 24
7240 24 39 -127 -87 -97 -115 32 104 42 -11 -45 -91 -154 86 -19 1 -126 -164 -68 -106 -81 -5 -7 -3 -34 62 -50 -19 75
7268 75 -34 -48 -154 -62 42 -30 55 -133 150 30 144 78 -13 -41 -166 -150 -40 -191 103 28 -11 -95 21 91
7292 91 16 -88 47 57 18 -41 -90 87 7 -85 58 35 72 79 -14 -5 -37 6 165 -150 -38 -12 49 98 -95 -72 -109
7319 -109 44 -59 -80 -16 -56 -64 94 2 -21 -32 76 -54 -80 -113 46 29 -61 -101 36 3 -15 -147 -19 80 -68
7344 -68 -122 -16 35 -141 34 20 -50 -177 -125 -50 -77 -39 59 27 17 54 96 9 -22 -60 66 47 57 -6 -76 25 -10
7371 -10 28 -69 -88 51 20 20 22 67 134 86 -45 164 -23 -95 136 -54 134 22 -137 8 67 8 -14 91 -43
7396 -43 1 46 38 -37 -32 -70 26 44 -43 55 27 -68 -104 29 16 -93 -111 14 19 -4 -3 -118 55 -89 138 35 32 47 -48
$$ packed form
7214A1K3p3L8J02k00J78J5P2j42M8J8k2r1JJ55r7P7j07K56k23Q7j13r2J00l8M1
7240B4J5j66M0j0j8J47P2o2n3l4m6o3K40j05K0j27l8R6l8K5P6kMl1R6j12L1R4
7268G5j09j4j06R2J04p2Q5j88K83j20J14o6r1k8j25J6J10j51K94p5l9q4J16P0
7292I1p5j04J35J0l9n9m9J77q0r2J43k3L7Pr3Rl2M3J59l15J12K6O1M9j93K3l7
7319a09J53j03k1O4m0qJ58r2k3j1J08j30k6l3J59j7r0m0J37l3j8j32J28R9j48
7344f8n4J06N1j76J75j4p0j27N2P5k7L8R8l2j0L7M2q7l1l8J26j9J0o3p0J01l5
7371a0L8r7j9J39l1%KM5O7m8j31K09j87p2K31j90J88j12j59J45N9n9k2J05j34
7396d3M4M5qp5Nl8R6J8q7R8k8r5l6J33j3j09j8J25Nk3Jj15J73j44K27j03lJ5r5
$$ plain form
7425 -48 20 -51 -73 -42 -87 -34 3 101 15 -51 161 -56 183 -48 -79 -134 99 69 91 120 -103 31 -38 -22 5 -61 65
7452 65 139 -124 52 22 -187 -63 99 -22 -82 -132 -98 3 -175 -92 -8 180 -59 84 -72 76 51 -243 -71
7475 -71 -26 -112 -33 -62 76 -27 -122 -54 -30 -94 19 -106 -59 -12 94 38 -76 54 -150 -30 18 -15 -50 44 82 95
7501 95 69 -16 -1 23 -6 34 -46 -11 80 -32 -5 -85 -55 -159 65 0 -55 -213 43 -26 28 -21 -39 -189 -109 42 123
7528 123 -68 -71 -62 -241 125 47 -57 -45 4 117 18 -21 117 38 -38 -75 56 14 -98 99 54 33 -94 -59 -7 -151
7554 -151 -45 -124 21 103 99 91 -31 18 98 -16 96 77 -64 -131 -89 105 -12 -16 -78 107 -49 -5 -53 -96 -77 -209
7580 -209 111 55 41 115 23 34 -11 3 25 -2 30 -27 -142 -94 -47 -46 117 42 86 30 -126 -153 44 8 15 54 -76 -41
7608 -41 -36 -62 66 -108 -94 55 -13 62 88 53 -23 -18 -84 -23 157 44 13 -23 9 -14 122 -42 67 -17 -46 -55 -19 -1
$$ packed form
7425d8O8p1k2L1m5N3L7R8q6o6K12k17K39k31l1n5K33l0K2K9k23J34o9J6K7o6J26
7452F5P4k63J76l0k09J24J62j21o0n0L4J01j78Q3Q4J88k39J43j56J48k5k94J72
7475g1M5q6P9k9J38j03r5O8K4o4J13j25M7M7J06n6j14J30k04J20M8l3l5R4L8J3
7501I5k6q5J5K4k9M0q0L5R1j12K7q0L0j04K24o5n5j58K56o9N4m9j8j50Q0J51Q1
7528A23j91lRj79L66p8j04J2M9J13r9l9J38p9p6l7J31m2j12J97m5k1j27L5N2j44
7554a51J06p9J45Q2mqj22M9Q0j14J12j9j41o7M2J94j17mo2J85j56M4m8m3J9j32
7580b09L20n6j4P4r2J1m5J4K2k7L2n7j15M8M7JJ63p5M4n6j56k7J97l6PL9j30L5
7608d1Nk6J28j74J4J49o8P5K6l5p6No6O1J80j13l1l6L2k3J36j64J09q4k9rL6J8
$$ plain form
7636 -1 57 -9 46 51 -110 -10 64 122 174 -62 -94 43 3 -32 -60 116 5 51 -80 69 12 -133 -12 52 112 146
7662 146 172 3 156 -161 14 149 -119 15 53 1 176 35 -137 116 -59 38 55 -49 4 -88 113 -2
7684 -2 -24 -11 24 82 -89 -134 17 93 -217 15 -84 -43 29 -17 0 -24 -12 -22 139 41 157 -96 -161 83 15 21 51
7711 51 -8 7 65 119 78 108 -55 -9 -44 -55 82 -35 -11 -139 71 -73 -15 60 2 1 -4 103 -72 55 -52 20
7737 20 51 22 -20 68 55 125 66 -86 -7 -36 -22 -201 72 120 -69 -18 9 120 -81 -99 -39 -61 -171 -38 52 59 5
7764 5 16 26 153 -100 20 -62 -106 114 -69 -32 154 108 -30 231 101 -100 51 -75 11 49 61 22 -108 65
7788 65 -50 21 -91 -61 47 -100 -84 118 -98 139 -37 59 60 -91 150 -79 -53 118 20 117 -129 -53 71 -68
7812 -68 79 -133 -28 252 -63 90 -58 -82 32 107 53 124 165 -112 -94 -77 272 22 10 62 143 -103 141 54
$$ packed form
7636aN8o6N5Nj61J00P4N8N2k36l2J37m0l5k8J76j11M6j31J49n7j45J21O4O0L4
7662A46K6j69J53l17J75J35k68J34L8n2J75j41j72K53j75R7J7j04N3r2K01j15
7684bk2J3L5N8j71m5J51P6l10K32r9M1P2m6J7k4J2j0J61r8J16k53o5K44o8OL0
7711E1n9J5N8N4m1L0j63M6l5j1J37j17K4j28K10j44N8P5n8jnJ07j75J27j07P2
7737B0L1k9m2Q8j3P0n9j52P9k9J4j79K73M8j89N1K7J11k01j8O0k2j10J33R0Pn4
7764EJ1J0J27k53J20q2m4K20j83L7J86m6j38K61j30k01J51j26Q6L8J2l9j30J73
7788F5j15P1j12L0J08j47J6K02k16K37j76R6Jj51K41k29K6J71r8R7k46P6J24j39
7812f8J47k12J05K80l15J53j48k4J14P5n4P1M1k77J8J7L49k50j2N2Q1k46K44q7
$$ plain form
7836 54 54 -157 -142 52 51 62 40 21 -46 -75 47 -128 -71 -44 126 -43 73 -134 27 131 -39 -61 35 -21 -73 84
7862 84 -59 82 101 68 -12 -40 35 -33 18 53 -75 41 -56 -105 69 21 -16 -92 63 27 -94 7 -135 47 -208
7887 -208 57 22 -109 233 -50 137 7 11 -59 -73 -14 -82 72 -58 120 -93 -4 -43 1 -70 -50 -23 -42 55 97
7912 97 -105 -9 44 90 103 113 48 66 -44 30 17 60 -147 99 -147 -101 14 73 17 -82 25 -52 39 -50 -45 182 26
7939 26 132 -7 19 -60 -67 -188 -130 -46 -39 109 -101 63 56 39 67 -15 123 80 37 1 -12 -110 -64 48 -140 19 -60
7966 -60 175 33 -7 -45 63 27 -8 174 130 -88 76 131 -84 87 109 -61 -38 45 90 -26 -33 65 -52 50 21
7991 21 3 -152 -39 -112 85 74 78 53 48 -8 -32 2 43 92 -2 -68 -34 34 80 -67 66 -100 1 0 7 11 79 -147 125
8020 125 -1 35 -39 -48 108 -137 -65 13 -94 146 -63 -54 -115 -134 -24 -70 -106 43 7 53 22 -14 143 -84 -108 -82
$$ packed form
7836E4%k11J5J94jJ1k2j9o7k9J22j75N7K7J70j69J16k07J61J04j70k2R6n6n2J57
7862H4j43J41J9l3q0k8P5o8N1L5j28J16r7m9J74m8l7p6J55l6j21J01j42J82k55
7887b08K65l5j31L42k83J87j30Mp0j4N9o8J54j30J78k13Q9l9M4p1K0K7j9R7M2
7912I7k02R6N3M6J3J0o5J8j10P4j3M3k07K46k46M6J15N9n6r9J07p7R1q9NK27j56
7939B6J06j39K6p9pj21N8Q4PJ48k10J64pj7K8q2J38m3m3l6j3r8M6J12j88J59p9
7966f0K35j42m0l8J08l6l5J82m4k18J64N5k15J71K2j70K3Q3M5j16pR8j17J02k9
7991B1j8j55J13p3J97j1Mk5nn6k4L4M1M9r4o6L4O8M6j47J33j66J01jPMO8k26K72
8020A25j26L6p4rJ56k45P2P8j07K40k09Ro1j9J10m6l6J49l6M6l1l6J57k27k4K6
$$ plain form
8046 -82 141 -132 -30 1 74 127 51 -18 43 36 55 -161 -68 -11 16 -4 -39 126 216 99 -152 42 50 -173 12 -174
8072 -174 141 8 62 -81 -56 -73 -47 -124 187 -27 -36 -99 -48 13 134 -170 68 -23 -44 -201 -124 151 -53 36 -65
8097 -65 125 11 -103 -96 4 -37 1 49 83 44 41 128 160 -39 2 -121 3 -1 42 -35 154 -160 -113 2 -113 82
8123 82 -68 -26 12 -180 -47 -151 -29 4 -172 59 -90 -29 57 137 2 113 30 22 -76 -26 -176 141 52 19 -53
8148 -53 -2 86 5 -119 -71 76 22 -12 -119 -11 -20 -35 -69 -72 96 -75 -116 7 55 33 -16 50 1 52 49 40 73 -49
8176 -49 32 123 -32 -2 -93 -4 -118 150 10 91 40 48 23 -34 31
$$ packed form
8046h2K23k73J02L1P3N3p6o9O1pJ9k16R3N7K7k0l5J65R0j17k51J94Qk23J85j86
8072a74L15j33N4j43K5j7K6p7L11k14ro3N1O1J21l04K38r1k1j57P7K75k04Q9j01
8097f5J90j14j14PJ00m1L8M8L4l9lQ7L2j99M1j23J24mM3p7J89l14M7J15j15J95
8123H2j50M2L8j92J33j04J22L3j76K31j49O1Q6Q0j35J11q3qr8N0j50L17q9l3p2
8148e3N1Q8q1j24M8J47n4l4j07J08rj5l4lJ68j71m1J23M8k2m9O6m9N1lrL3j22
8176d9Q1R1j55L0r1Q9j14K68j40Q1n1Qk5n7O5
8191C1
$$ Imaginary data points
##PAGE= N=2
##DATA TABLE= (X++(I..I)), XYDATA
$$ plain form
0 0 0 0 0 0 0 0 0 8 -8 8 -8 16 -24 24 -32 40 -56 68 -80 98 -120 144 -170 202 -236 279 -324 376 -434 501
30 501 -574 654 -742 842 -953 1076 -1207 1353 -1515 1693 -1886 2096 -2326 2580 -2854 3155
46 3155 -3483 3842 -4235 4664 -5138 5661 -6239 6880 -7597 8401 -9312 10354 -11557
59 -11557 12966 -14641 16674 -19200 22435 -26748 32815 -42042 57909 -92782 339878 -450811
71 -450811 -288726 953094 -23930 -415832 295265 354251 -289817 -206133 322762 264616
81 264616 -422586 -146125 488458 -19899 -448856 251331 244116 -387172 -84603 345583
91 345583 -109049 -333836 60804 194602 -167923 -236417 120879 81522 -284523 -40264
101 -40264 221170 -170731 -241165 164504 65778 -208104 -58193 96937 -29397 -128722 13456
$$ packed form
0@%%%%%%%Qj6J6j6K4m0M8n6P2r6J24j48J78k18K64l14L72m38N15o03P00q10R35
30E01j075J228j396J584j795K029k283K560k868L208l579L982m422M906n434O009
46C155o638P325q077Q899r802J0799j1900J3119j4477J5998j7713J9666k1911
59a1557K4523k7607L1315l5874M1635m9183N9563p4857R9951j50691M32660p90689
71d50811J62085J241820r77024l91902P11097N8986o44068Q3684N28895n8146
81B64616o87202K76461O34583n08357m28957P00187p215o31288L02569M30186
91C45583m54632k24787L94640J33798l62525o8494L57296l9357l66045K44259
101d0264K61434l91901p0434M05669r8726k73882J49911J55130j26334r9325J42178
$$ plain form
112 13456 104956 -103313 -123636 155171 63996 -181176 37588 161237 -84441 -44439 138368
123 138368 12322 -68426 48302 84823 6032 -56906 26564 96800 -46023 -63436 103282
134 103282 6134 -122301 50358 76299 -102216 -49826 68516 -17126 -81451 1823 35125
145 35125 -54950 -67121 41461 18288 -92764 -20292 60774 -43894 -60013 45150 3986
156 3986 -62477 4968 37072 -15839 -34524 8112 33657 -14564 -24195 37715 11803 -37460
168 -37460 25754 45303 -24751 -11447 39932 14613 -7787 14647 18730 157 2332 23998
180 23998 16266 -13728 -339 25231 3163 -8921 7257 -3633 -9504 9620 -625 -17469
192 -17469 -8204 -5899 -5442 -3772 -14908 -17514 -9690 -4885 -4019 -15577 -17734 -3046 -4569 -8299 -346
$$ packed form
112A3456R1500k08269k0323K78807r1175k45172K18764J23649k45678M0002J82807
123A38368j26046q0748J16728L6521p8791o2938Q3470P0236j42823j7413J66718
134A03282r7148j28435J72659K5941j78515N2390J18342q5642o4325Q3274L3302
145C5125r0075j2171J08582k3173j11052P2472Q1066j04668j6119J05163m1164
156C986o6463O7445L2104n2911j8685M2636K5545m8221r631O1910k5912m9263
168c7460O3214J9549p0054J3304N1379k5319k2400K2434M083j8573K175K1666
180B3998p732k9994J3389K5570k2068j2084J6178j0890n871J9124j0245j6844
192a7469R265K305M57J670j1136k606P824M805Q66j1558k157J4688j523l730P953
$$ plain form
207 -346 -8514 -15002 5941 11500 -7546 -6772 6198 6796 5544 6851 5413 2981 3460 15591 17923
222 17923 -2768 -1682 20485 13435 -615 10290 10693 -1678 5878 17737 5309 -10913 2534
235 2534 17390 -325 -10054 6379 2824 -12194 1435 10202 -11959 -17212 6123 5831 -15239
248 -15239 -11376 4093 -4998 -14608 1331 5004 -17132 -12312 12901 1055 -18461 -1057 10602
261 10602 -6842 -8190 10585 4620 -13466 772 18627 -1638 -12877 11282 13222 -8690 -342
274 -342 16623 490 -10207 10873 14784 -7984 -6221 14506 5970 -11021 2947 13269 -6652
287 -6652 -9757 12218 5795 -14731 -2238 12025 -4738 -12432 4891 5694 -12443 -6782 10918
300 10918 -1963 -15803 2398 9731 -10278 -8870 9673 1233 -12980 1550 11249 -6286 -9308
$$ packed form
207c46q168o488K0943N559j9046P74J2970N98j252J307j438k432M79J2131K332
222A7923k0691J086K2167p050j4050J0905M03j2371P556J1859j2428j6222J3447
235B534J4856j7715r729J6433l555j5018J3629Q767k2161n253K3335k92k1070
248a5239L863J5469r091r610J5939L673k2136M820K5213j1846j9516J7404J1659
261A0602j7444j348J8775n965j8086J4238J7855k0265j1239K4159J940k1912Q348
274c42J6965j6133j0697K1080L911k2768J763K0727q536j6991J3968J0322j9921
287f652l105K1975o423k0526J2493J4263j6763p694J7323Q03j8137N661J7700
300A0918j2881j3840J8201P333k0009J408J8543q440j4213J4530R699j7535l022
$$ plain form
313 -9308 9421 6916 -9548 -886 12145 -1348 -8539 8827 9252 -8206 -2085 12230 1768
326 1768 -7808 4698 9001 -4805 -4084 9506 2668 -9211 1694 9182 -4508 -6821 5855 2591
340 2591 -8166 -1008 6269 -4144 -8249 3456 3549 -8036 -4511 5212 -1565 -8237 1655 3873 -7238
355 -7238 -4271 5989 -36 -7241 768 5414 -3112 -4081 4938 2512 -5478 1005 7230 -1462 -4320
370 -4320 5106 5078 -3426 -340 6567 479 -3508 4318 4983 -3133 -1684 5898 2024 -4034 1211 4618
386 4618 -2155 -2593 3915 1229 -4653 -331 3875 -1491 -4471 1404 1694 -4007 -1863 2730 -1604 -4735
402 -4735 741 2041 -3326 -2747 2061 -149 -3377 101 1587 -2070 -1941 1789 865 -2294 -328 2136
418 2136 -481 -1508 1496 1120 -1432 107 2208 88 -1135 1300 1380 -922 122 1541 1 -485
$$ packed form
313i308J8729k505j6464Q662J3031j3493p191J7366M25j7458O121J4315j0462
326A768r576J2506M303j3806P21J3590o838j1879J0905P488j3690k313J2676l264
340B591j0757P158P277j0413m105J1705R3j1585L525R723o777o672R892K218j1111
355g238K967J0260o025p205Q009M646q526r69R019k426p990O483O225q692k858
370d320R426k8q504L086O907o088l987P826O65q116J449P582l874o058N245L407
386D618o773m38O508k686n882M322M206n366k980N875K90n701K144M593m334l131
402d735N476J300n367N79M808k210l228L478J486l657J29L730r24l159J966K464
418B136k617j027L004l76k552J539K101k120j223K435Q0k302J044J419j540m86
$$ plain form
434 -485 1059 717 -673 -221 643 102 -552 88 419 -506 -660 537 133 -1073 -130 594 -755 -689 601
453 601 -5 -1077 274 551 -629 -349 290 17 -212 246 314 50 22 210 422 430 -10 328 759 31 141
474 141 1023 20 -147 731 709 -110 356 294 75 131 185 -251 338 -94 -631 323 -76 -874 -186 289 -485
495 -485 -656 -298 -415 -272 -442 -376 61 -577 -757 285 -69 -1195 -127 670 -619 -1010 589 163 -892
514 -892 -123 874 -201 -736 711 764 -651 -159 1128 452 -662 492 1024 -50 -618 1033 850 -621
532 -621 -43 1341 118 -1157 885 877 -705 -188 1234 -207 -765 418 649 -488 -535 593 344 -849
550 -849 -358 534 -388 -928 416 294 -936 -266 523 -272 -873 142 212 -628 -294 577 140 -720 150 455
570 455 -464 -313 469 149 -427 123 456 -215 -263 285 312 -380 -188 625 2 -594 369 461 -602 -258 664
$$ packed form
434d85J544l42j390M52Q64n41o54O40L31r25j54J197m04j206R43P24j349O6J290
453F01o06j072J351K77j180K80O39k73k29M58O8k64k8J88K12Qm40L38M31p28J10
474A41Q82j003j67Q78k2q19M66o2k19N6N4m36N89m32n37R54l99p98O88M75p74
495d85j71L58j17J43j70O6M37o38j80J042l54j126J068P97j289l91J599m26j055
514h92P69R97j075n35J447N3j415M92J287o76j114J154N32j074n68J651j83j471
532f21N78J384j223j275K042qj582N17J422j441n58J183K31j137m7J128k49j193
550h49M91Q92r22n40J344j22j230O70P89p95o01J015P0q40L34Q71m37q60Q70L05
570D55r19J51P82l20n76N50L33o71m8N48K7o92J92Q13o23n96R63R2j063L44R22
$$ plain form
591 664 -149 -625 458 365 -337 -108 578 -50 -521 -113 514 -180 -383 407 442 -501 21 583 -303 -405 531
612 531 266 -366 -96 435 -28 -350 307 519 -219 -138 288 68 -364 168 350 -89 -220 288 155 -293 -20
633 -20 336 -122 -312 290 267 -343 -228 151 -210 -428 69 177 -455 -127 115 -168 -449 13 54 -208 -110 178
655 178 -21 -404 -205 47 -182 -213 150 49 -349 108 66 -191 -177 141 268 -92 -20 239 44 -95 121 45
677 45 -4 11 257 189 -34 182 96 23 -199 183 112 -85 74 124 -55 -58 33 74 -54 291 265 -21 -13 90 25 -208
703 -208 29 -86 -83 -151 -9 6 -35 -133 33 -48 -65 34 211 -168 -80 68 -9 -91 0 145 -78 -71 61 65 130 -62
729 -62 -141 -93 85 14 -144 -73 -66 140 -88 6 -118 -39 -14 10 48 -64 -156 -79 30 22 -11 149 -84 -33 133 113 -83
756 -83 179 240 -92 32 -23 9 57 5 90 38 30 282 5 -43 67 5 -58 129 174 3 13 86 125 -135 -46 60
$$ packed form
591F64q13m76J083r3p02K29O86o28m71M08O27o94k03P90L5r43N22N62q86j02R36
612E31k65o32K70N31m63l22O57K12p38Q1M26k20m32N32J82m39j31N08j33m48K73
633b0L56m58j90O02k3o10J15L79l61k18M97J08o32L28K42k83k81M62M1k62R8K88
655A78j99l83J99K52k29l1L63j01l98M57m2k57J4L18J27l60P2K59j95j39K16p6
677D5m9J5K46o8k23K16q6p3k22L82p1j97J59N0j79lR1M1j28L45k6k86QJ03o5k33
703b08K37j15Lo8J42J5m1r8J66q1j7R9J77l79Q8J48p7q2R1J45k23PJ32MO5j92
729f2p9M8J78p1j58P1PK06k28R4j24P9K5K4L8j12r2P7J09ql3J60k33N1J66k0j96
756h3K62O1l32J24n5L2M8n2Q5n2qK52k77m8J10o2o3J87M5j71J0P3L9k60Q9J06
$$ plain form
782 60 5 -192 -88 112 -137 -73 83 3 -34 -113 74 45 49 20 -178 -48 -59 -27 -93 -143 -20 154 -42 27 144
807 144 17 -34 79 -135 5 -49 -142 -47 -83 -133 20 -14 103 44 -75 -74 -5 17 -157 -13 -99 -157 -161 104 126 -33
833 -33 37 166 110 -46 17 148 269 -11 104 169 -69 -30 79 24 -54 85 112 10 68 -1 105 -110 88 -12
857 -12 -64 -63 -48 -133 -74 -89 -73 60 122 93 39 -132 -6 -17 97 174 54 19 -189 -88 -29 -89 -162 92 49 2 1 -171
885 -171 -76 -23 -131 -130 119 -86 7 -94 49 71 25 22 -78 -128 -20 -155 -33 78 111 -103 5 -50 -124 3 -3
910 -3 -46 -34 -20 16 -79 -76 72 -65 -91 -91 -88 207 90 55 118 -40 -48 29 76 118 -28 63 -95 -174 74 104 143 19 -74
939 -74 -88 -70 155 -63 56 -160 55 -26 22 -71 86 26 -160 34 -65 48 115 277 -43 -116 82 -3 -60 50
963 50 70 6 -5 -100 -65 -93 -148 -10 -6 -82 -69 -55 8 123 11 -123 171 40 -25 -90 -97 21 -51 58 31 -11 7 -42
$$ packed form
782F0n5j97J04K00k49O4J56q0l7p9J87k9Mk9j98J30j1L2o6n0J23J74j96O9J17
807A44j27n1J13k14J40n4r3R5l6n0J53l4J17n9j19JO9K2j74J44q6n8mK65K2j59
833c3P0J29n6j56O3J31J21k80J15O5k38L9J09n5p8J39K7j02N8o9J06k15J98j00
857a2n2JJ5q5N9j5J6J33O2k9n4j71J26j1J14P7j20l5k08J01N9o0p3K54m3m7jj72
885a71R5N3j08JK49k05R3j01J43K2m6lj00n0J08j35J22J11L3k14J08n5p4J27o
910cm3J2J4L6r5LJ48j37k6%LK95j17l5O3j58qP7M7M2j46R1j58p9K48L0L9j24r3
939g4j4J8K25k18J19k16K15q1M8r3J57o0j86J94r9J13O7J62l20p3J98q5n7J10
963E0K0o4j1r5L5k8n5J38Mp6J3J4O3J15j12j34K94j31o5o5pJ18p2J09k7m2J8m9
$$ plain form
991 -42 66 62 166 98 54 37 -94 98 12 -48 80 -24 52 118 32 -15 -37 -92 -2 19 10 -65 -42 5 -93 -76 -50 -29 167
1020 167 61 83 98 8 43 -108 -76 12 -9 86 -72 23 11 -52 -141 -9 -17 110 6 -23 -91 -103 27 -78 -14 -96
1046 -96 43 -77 -91 45 -88 100 -16 -40 -62 -49 -93 159 76 4 -139 -8 64 58 -47 36 108 -7 -136 -15
1070 -15 116 49 89 47 -20 99 99 64 -32 73 77 38 51 57 31 -47 -39 -80 27 49 -106 -46 32 18 49 10 -63 -83 -108 64
1100 64 64 133 -79 3 40 -71 39 -125 91 -53 21 147 -114 -85 -68 -105 129 -57 -108 63 -87 2 25 -72 -38
1125 -38 -81 -48 -184 -3 1 89 19 -42 3 -64 32 61 34 102 103 -67 -82 -25 159 -6 166 69 6 -94 -113 0 40
1152 40 28 60 -56 -33 59 -135 7 -68 -166 54 -38 -160 167 -120 34 -37 -1 18 129 76 188 -133 -132 -6 120
1177 120 -29 -48 94 -24 98 -74 166 -97 -12 100 -29 -48 46 7 -1 5 77 20 69 26 92 46 -15 93 -76
$$ packed form
991d2J08mJ04o8m4j7j31J92q6o0J28j04P6O6q6m7k2n5R0K1rp5K3M7r8J7K6K1J96
1020A67j06K2J5r0L5j51L2Q8k1R5j58R5j2o3q9J32qJ27j04k9o8j2J30j05O4q2
1046i6J39j20j4J36j33J88j16k4k2J3m4K52q3p2j43J31P2oj05Q3P2j15j29J21
1070a5J31o7M0m2o7J19%l5r6J05Ml9J3Ok6p8Qm1J07K2j55O0P8j4L1l9p3k0k5J72
1100F4%O9k12Q2L7j11J10j64K16j44P4J26k61K9J7l7K34j86n1J71j50Q9K3r7L4
1125c8m3L3j36J81MQ8p0o1M5o7R6K9k7O8Jj70j5N7J84j65J72r7o3j00j9J13M0
1152D0j2L2j16K3R2j94J42p5r8K20r2j22L27k87J54p1L6J9J11n3J12l21JJ26J26
1177A20j49j9J42j18J22j72K40k63Q5J12j29j9R4l9qOP2n7M9m3O6m6o1J08j69
$$ plain form
1202 -76 100 2 19 84 -17 -43 21 25 100 -132 -16 -122 -204 -54 -125 189 -35 21 -116 55 -85 -118 -116 143 65
1227 65 -1 -38 -285 -49 3 128 -151 -27 25 12 -37 133 -56 45 -21 62 -56 -70 -36 9 -20 10 -58 53 -29
1252 -29 62 102 -131 38 -192 107 22 71 9 -41 28 92 -174 -163 31 0 -16 -24 -100 65 -84 -189 11 -12 0 0
1278 0 66 27 -15 -16 14 10 28 -40 30 9 38 8 29 43 -99 182 124 -16 -45 0 -68 -67 8 -28 -50 13 -3 -49 90 67
1308 67 -117 128 15 -208 112 35 135 -135 9 32 -56 -28 155 84 6 -100 -109 -108 26 -54 -71 -166 25 -183 6
1333 6 -15 12 139 -61 57 69 -43 -77 20 -135 41 -102 -37 112 -73 -11 -59 -126 -43 -46 33 40 -58 -6 -85 63 21
1360 21 -46 -159 -199 7 -8 -177 -7 91 -26 -15 -28 5 3 48 10 83 83 -206 30 35 -24 -13 -44 -93 -123 -55 -78 -25
1388 -25 23 -18 9 9 3 6 20 -11 -21 -73 -58 -42 -38 7 89 60 -66 0 16 -93 -169 -109 15 -37 106 45 -72 37 1
$$ packed form
1202g6J76r8J7O5j01k6O4MP5k32J16j06q2J50p1L14k24N6j37J71j40l3KK59p8
1227F5o6l7k47K36N2J25k79J24N2j3m9J70j89J01o6Q3j18j4L4M5k9L0o8J11q2
1252b9R1M0k33J69k30K99q5M9o2n0O9O4k66J1J94l1j6qp6J65j49j05K00k3J2%
1278@O6l9m2jL0mJ8o8P0k1K9l0K1J4j42K81n8j40k9M5o8JP5l6k2O3j6m6J39k3
1308F7j84K45j13k23L20p7J00k70J44K3q8K8J83p1p8j06rJJ34q0j7r5J91k08J89
1333Fk1K7J27k00J18J2j12l4R7j55J76j43O5J49j85O2m8o7Q3lP9Pr8N2p9J48m2
1360B1o7j13m0K06j5j69J70R8j17J1j3L3kM5l8P3%k89K36Nn9J1l1m9l0O8k3N3
1388b5M8m1K7%oLJ4l1j0n2J5J6MM5Q2k9j26O6J6j09p6O0J24n2J43o1j17J09l6
$$ plain form
1417 1 174 65 79 126 -98 -71 96 -10 -56 -105 59 -52 50 -1 71 -83 -14 27 -97 -49 -42 76 33 45 -98
1442 -98 25 -9 151 114 -102 9 16 -3 -99 3 76 -43 35 -44 -2 -29 82 62 120 -92 27 -31 -31 -22 26 -31 -24 -9
1470 -9 -23 33 -96 -15 -22 107 18 -99 -105 19 122 -51 28 -12 137 44 -37 79 -51 -51 88 20 3 0 -3 34 137 -73
1498 -73 -74 8 -2 19 84 125 -117 -41 92 -53 73 25 -91 -46 -103 66 -64 -9 113 -109 177 -3 51 -217 -57
1523 -57 -185 28 -118 77 -26 -55 18 -73 11 158 18 -22 48 -61 102 -42 148 43 -102 111 37 -5 25
1546 25 8 35 49 -29 14 -114 -9 -18 -42 -68 -24 33 57 -102 -129 48 -80 7 -102 -70 -146 173 -65 88 -172 26
1572 26 -3 -31 73 -72 30 -98 116 -34 -48 12 -8 50 -15 -60 18 -133 -21 5 -154 1 126 87 31 -113
1596 -113 109 73 -41 2 -5 -41 -35 -39 60 76 -145 18 71 -79 66 -53 90 -108 -50 -58 67 -41 38 66 -6 -85
$$ packed form
1417AJ73j09J4M7k24K7J67j06m6m9J64j11J02n1P2j54O9M1j24M8PJ18m3J2j43
1442i8J23l4J60l7k16J11Pj9r6J02P3j19P8p9M2k7J11k0N8k12J19n8%RM8n7PJ5
1470ij4N6j29Q1pJ29q9j17oJ24J03j73P9m0J49r3q1J16j30%J39o8j7llL7J03k10
1498g3jQ2j0K1O5M1k42P6J33j45J26m8j16M5n7J69j30N5J22k22K86j80N4k68J60
1523e7j28K13j46J95j03k9P3r1Q4J47j40m0P0j09J63j44J90j05j45K13p4m2L0
1546B5j7K7J4p8M3j28J05rk4k6M4N7K4j59k7J77j28Q7j09L2p6L19k38J53k60J98
1572B6k9k8J04j45J02j28K14j50j4O0k0N8o5m5P8j51J12K6j59J55J25l9n6j44
1596a13K22l6j14M3pl6OmR9J6k21J63N3j50J45j19J43j98N8qJ25j08P9K8p2p9
$$ plain form
1622 -85 -40 75 -68 27 -95 21 -56 -80 24 -50 11 44 -123 -74 76 -28 20 -63 -52 1 -81 -102 -2 -15 -159
1647 -159 95 -57 -45 25 -30 107 -13 147 56 150 -76 -40 -28 8 -18 47 31 -92 -31 -6 49 22 18 -6 61 -92
1673 -92 -2 -45 142 -122 27 -6 40 60 129 -20 21 48 106 75 -14 135 -61 117 -30 66 -4 -168 195 7 102
1698 102 -83 -31 -78 -2 -16 27 34 -26 -43 58 -113 58 32 68 21 105 -103 -10 -81 62 -64 -17 -138 148 -82
1723 -82 -124 36 -185 67 179 96 96 -185 -14 53 80 115 -76 19 37 -197 -61 73 -141 -8 -92 -3 -89 -38 -135
1748 -135 -2 -52 -136 5 103 -21 -25 37 -54 78 -22 71 38 -56 199 85 60 -123 -33 -47 49 105 57 99 91 -27
1774 -27 -31 -91 -104 32 61 134 27 -86 -27 31 -37 42 -108 99 49 -25 83 63 -15 12 -29 -126 105 -58 -209 39
1800 39 -203 -52 -83 19 75 -117 58 -42 -84 19 -22 70 79 -150 36 -1 -109 -23 18 18 -65 32 -65 29 -115 -115
$$ packed form
1622h5M5J15j43R5j22J16p7k4J04p4O1L3j67M9J50j04M8q3J1N3q2k1J00j3j44
1647a59K54j52J2P0n5J37j20J60r1R4k26L6J2L6k6O5j6j23O1K5N5k7mk4O7j53
1673i2R0m3J87k64J49l3M6K0O9j49M1K7N8l1q9J49j96J78j47R6p0j64L63j88R5
1698A02j85N2m7P6j4M3Po0j7J01j71J71k6L6m7Q4k08R3p1J43j26M7j21K86k30
1723h2m2J60k21K52J12q3%k81J71O7K7L5j91R5J8k34J36J34k14J33q4Q9q6N1r7
1748a35J33n0q4J41R8j24mO2r1J32j00R3l3r4K55j14k5j83R0j4R6N6m8M2qj18
1774b7mo0j3J36K9P3j07j13N9N8o8P9j50K07n0p4J08k0p8K7m1r7K31j63j51K48
1800C9k42J51l1J02N6j92J75j00m2J03m1R2Rk29J86l7j08Q6M1%q3R7r7R4j44%
$$ plain form
1826 -115 217 -178 119 -59 -21 -59 -70 186 163 -13 -71 37 174 68 115 37 -64 -119 140 -99 81 -6 -23
1849 -23 11 -7 -62 90 9 46 62 -62 170 135 -19 -50 -89 -202 79 155 57 -20 165 32 -61 -125 -140 -131 -106 -47 -30
1876 -30 -92 -29 45 9 70 16 -7 -174 -51 -93 11 -32 41 5 -59 -53 180 51 157 18 -79 -2 21 47 99 36 -95
1903 -95 -3 -72 -57 -169 74 45 54 45 -17 27 -159 15 19 138 12 74 -137 -45 -38 -38 -89 208 -72 102 -30 -1 -42
1930 -42 -27 -28 -13 48 69 122 -82 139 45 -98 -126 37 59 101 -44 29 17 -227 161 76 152 44 67 -17 179 58
1956 58 1 -66 -17 4 -97 42 -84 -8 -140 -17 40 -88 -135 -64 169 58 194 82 57 63 -134 -90 -116 -4 6
1981 6 -4 30 -70 25 7 -22 175 -1 -99 85 54 109 -112 -63 -61 38 -100 -52 45 95 -12 5 15 -9 -37 -40 -128 32
2009 32 12 -18 -67 103 -48 -119 -153 22 -184 3 20 43 -231 16 -32 52 -3 67 -11 -63 28 -70 51 -103 103
$$ packed form
1826a15L32l95K97j78L8l8j1K56k3j76n8J08J37j06M7p8j01n5K59k39J80q7j7
1849b3L4j8n5J52q1L7J6j24K32l5j54l1l9j13K81P6r8p7J85j33r3o4j5RK5N9J7
1876c0o2O3P4l6O1n4k3j67J23m2J04m3P3l6o4OK33j29J06j39r7P7K3K6N2o3j31
1903i5R2o9J5j12K43k9Rro2M4j86J74MJ19j26O2k11R2P%n1K97k80J74j32K9m1
1930d2J5jJ5O1K1N3k04K21r4j43k8J63K2M2j45P3j2k44L88q5P6j08K3q4J96j21
1956E8n7o7M9K1j01J39j26P6j32J23N7j28m7P1K33j11J36j12k5Oj97M4k6J12J0
1981Fj0L4j00R5j8k9J97j76r8J84l1N5k21M9KR9j38M8R7N0j07J7J0k4k8lq8J60
2009C2k0l0m9J70j51p1l4J75k06J87J7K3k74K47m8Q4n5P0p8n2R1r8J21j54K06
$$ plain form
2034 103 -101 48 -61 86 36 5 82 62 34 -102 -41 -54 -25 97 -71 81 -73 67 50 1 -123 -95 -17 22
2058 22 103 106 104 54 -143 19 78 -26 72 34 52 -105 -84 -41 175 -34 78 -49 -202 36 129 -92 56 153 89
2083 89 124 -24 125 78 126 60 74 85 125 -12 46 -162 -3 -14 130 44 -96 134 101 88 18 -92 -100 37 -45 -54
2109 -54 54 -123 -148 -32 89 -13 -41 -28 84 35 -152 78 -102 -18 331 -104 79 67 -71 23 -100 -39 -36 0
2133 0 -44 -17 121 -57 -114 -21 -13 -20 9 -15 182 -114 -44 17 21 -43 42 47 -98 -80 7 -2 11 94 163 -49 -148 10 59 83
2163 83 -57 12 73 54 45 -123 -13 -107 -44 -11 23 187 26 56 -45 129 -63 1 65 110 82 32 110 -204 92 -3
2189 -3 -107 -29 -108 60 49 202 -52 165 -95 56 73 -45 76 -7 16 181 109 39 189 -1 -106 -31 -10 45
2213 45 -112 -70 157 52 -131 -92 -8 -83 53 -47 97 -28 21 -160 81 6 -117 122 47 20 42 -28 -28 -85 -43
$$ packed form
2034A03k04J49j09J47n0l1P7k0k8j36O1j3K9J22j68J52j54J40j7m9j24K8P8L9
2058B2Q1Lkn0j97J62N9j04R8l8J8j57K1M3K16k09J12j27j53K38R3k21J48R7o4
2083H9L5j48J49m7M8o6J4J1M0j37N8k08J59j1J44q6j40K30l3j3p0j10qJ37q2r
2109e4J08j77k5J16J21j02k8J3J12m9j87K30j80Q4L49m35J83j2j38R4j23O1LL6
2133@m4K7J38j78n7R3QpK9k4J97k96P0O1Mo4Q5Nj45J8Q7rJ3Q3O9k12r9J58M9K4
2163H3j40O9O1j9rj68J10r4O3L3L4J64j61L0j01J74j92O4O4M5k8n0P8l14K96r5
2189cj04P8p9J68j1J53k54K17k60J51J7j18J21q3K3J65p2p0J50j90j05P5K1N5
2213D5j57M2K27j05j83L9Q4p5J36j00J44j25M9j81K41p5j23K39p5k7K2p0%n7M2
$$ plain form
2238 -43 240 -90 6 26 -129 80 -16 51 -32 120 86 71 -56 -7 26 -145 43 219 4 -69 25 153 -119 -21
2262 -21 95 -19 40 -19 91 83 49 -121 103 -58 54 93 8 94 99 -15 14 -89 -19 -102 -126 105 63 -54 -80 -156
2288 -156 -30 63 10 -116 -1 4 -127 73 -95 -76 -57 -28 63 -5 145 30 -115 -117 -73 -123 102 -76 85 -52
2312 -52 57 -101 0 33 -127 94 -98 35 76 67 20 48 62 -94 118 145 2 40 -68 -87 -62 12 21 72 170 51
2338 51 -59 169 -17 187 -70 -65 -7 155 0 -5 -77 125 110 -17 37 -85 -38 -164 105 8 46 -174 114 -54
2362 -54 39 -123 -6 -1 23 -69 75 22 -133 24 -26 -20 -7 -38 85 128 -177 1 -47 53 -66 -85 35 -193 -70
2387 -70 191 39 -77 -97 57 61 -34 -109 -56 25 15 -48 -33 -5 -88 194 -140 -203 -90 125 -37 7 73 1 -7 97
2413 97 9 -39 51 -37 -63 -33 87 -32 -5 -21 -5 -123 23 -83 6 -133 68 66 -121 -108 78 134 -122 40 -78
$$ packed form
2238d3K83l30R6K0j55K09r6O7q3J52l4j5j27M9L3j71J88J76k15p3R4J28k72R8
2262b1J16j14N9n9J10ql4j70K24j61J12L9q5Q6Nj14K9j03P0q3k4K31m2j17k6p6
2288a56J26R3n3j26J15Nj31K00j68J9J9K9R1o8J50j15j45kM4n0K25j78J61j37
2312e2J09j58J01L3j60K21j92J33M1rm7K8J4j56K12K7j43L8j08j9K5P4RN1R8j19
2338E1j10K28j86K04k57NN8J62j55np2K02j5j27N4j22M7j26K69r7L8k20K88j68
2362e4R3j62J17NK4r2J44n3j55J57n0OJ3l1J23M3l05J78m8J00j19j9J20k28J23
2387g0K61j52j16k0J54Mr5p5N3Q1j0o3J5K8q3K82l34o3J13K15j62M4O6p2qJ04
2413I7q8m8R0q8k6L0J20j19K7j6J6j18J46j06Q9j39K01kj87J3J86N6k56J62j18
$$ plain form
2438 -78 29 84 -43 135 114 -93 -119 100 174 17 -12 -4 47 22 -71 -19 -244 -21 115 -48 59 -106 -48 52
2462 52 -28 -15 -238 137 58 39 23 -78 13 -131 89 81 -84 26 -50 110 -74 -55 -36 -40 120 136 22 44 73 -62
2488 -62 64 -53 70 -109 -44 -106 -65 -128 148 -48 -27 -11 80 39 50 10 -126 12 -66 22 146 -94 8 50 -82
2513 -82 159 -55 -127 143 53 -37 -154 17 51 65 -30 -89 133 37 -181 -68 -82 -78 39 0 -36 -17 148 -78 117
2538 117 50 31 61 48 -141 -116 -111 -44 -29 -181 -60 1 -48 23 -6 76 -125 31 17 -85 19 25 -69 -2 26 -56 34
2565 34 74 1 112 16 116 -93 -108 125 -20 -23 -59 -2 -130 -22 61 33 60 49 84 -160 -95 12 -33 -48 156 -120
2591 -120 14 -133 28 65 -69 55 112 -91 -25 6 65 54 -72 -110 -54 -28 45 46 100 -87 127 194 -48 -62 172
2616 172 -103 -14 -35 -33 28 -14 54 -71 35 -68 7 -62 3 91 -68 -57 -6 26 78 111 83 26 31 157 -16 -185 -9
$$ packed form
2438g8J07N5j27J78k1k07k6K19P4j57k9QN1k5r3N2k25K23J36j63J07j65N8J00
2462E2q0J3k23L75p9j9j6j01R1j44K20qj65J10p6J60j84J9J9mJ60J6j14K2K9j35
2488f2J26j17J23j79O5o2M1o3K76j96K1J6R1m1J1m0j36J38p8Q8J24k40J02M2j32
2513h2K41k14p2K70r0r0j17J71L4J4r5n9K22r6k18J13j4MJ17l9l6J9J65k26J95
2538A17o7j9L0j3j89K5NO7J5j52J21O1m9P1k9Q2k01J56j4j02J04Or4O7K8q2R0
2565C4M0p3J11r6J00k09j5K33j45ll6N7j28J08Q3k8K7j1L5k44O5J07m5j5K04k76
2591a20J34j47J61L7j34J24N7k03O6L1N9j1j26l8N6K6P3JN4j87K14O7k42j4K34
2616A72k75Q9k1KO1m2O8j25J06j03P5o9O5Q8j59J1N1L2N2L3k8n7NJ26j73j69J76
$$ plain form
2643 -9 -23 -86 31 24 -100 107 59 -100 -98 -5 37 165 -151 205 130 24 60 -49 -101 -69 -164 -21 -25 -84 76 -71
2669 -71 -46 35 144 -12 -114 -13 -80 52 -76 43 -8 109 -84 -8 145 42 -52 38 -73 -141 -24 83 121
2692 121 -55 -91 45 77 71 -47 -8 52 -77 -58 -88 104 5 -141 -58 26 -46 -16 -34 224 -13 -53 124 56 -6 -68
2718 -68 -197 74 -32 -26 39 1 9 -38 -52 107 29 -80 -51 -183 48 81 8 51 -42 34 23 -76 -101 -61 48 33 -60
2745 -60 33 2 -35 25 53 -2 110 135 -49 -86 -101 166 34 -13 25 149 -7 -1 108 26 74 -82 33 58 139 41
2771 41 -23 58 -57 -47 61 101 116 27 26 -131 123 60 25 -115 123 -228 1 136 147 36 -25 54 34 58 179
2796 179 19 36 48 -15 14 -28 108 -38 -86 -82 -96 -43 -85 43 41 -25 5 57 -87 64 -59 37 -46 -38 -5 -14 -4 45
2824 45 27 -48 -100 -130 44 -107 -45 -63 18 2 -43 -9 -27 -15 115 -56 97 -36 0 -148 12 4 38 39 59 27 59
$$ packed form
2643ij4o3J17pj24K07m8j59KR3M2J28l16L56p5j06L6j09n2L2r5J43mn9J60j47
2669g1K5Q1J09j56j02J01o7J32j28J19n1J17j93P6J53j03r4R0j11o8J17J07L8
2692A21j76l6J36L2oj18L9O0j29J9l0J92r9j46Q3Q4p2L0j8K58k37m0J77o8o2o2
2718f8j29K71j06OO5l8Qm7j4J59p8j09K9j32K31L3p3M3r3P6j1r9k5M0J09j5r3
2745f0R3l1l7O0K8n5J12K5j84l7j5K67j32m7L8J24j56OJ09q2M8j56J15K5Q1r8
2771D1o4Q1j15J0J08M0J5q9jj57K54o3l5j40K38l51K29J35J1j11o1P9k0K4J21
2796A79j60J7J2o3K9m2J36j46m8Mj4N3m2J28ko6L0N2j44J51j23R6q3QL3rJ0M9
2824D5j8p5n2l0J74j51O2j8Q1j6m5L4j8J2J30j71J53j33L6j48J60qL4JK0l2L2
$$ plain form
2851 59 -21 -26 69 5 20 -24 -9 55 186 -67 36 -141 77 -46 97 -68 38 11 16 -99 15 133 116 6 50
2876 50 22 -69 81 -147 -50 145 -79 14 -28 -94 -31 -8 34 88 -89 -14 -7 90 50 -17 111 80 48 131 92 91 -23 40
2904 40 -14 33 -36 -17 -169 41 -32 189 50 -30 -27 28 -7 -43 -123 -27 -83 -9 -39 48 -72 -141 -53 249 60 -109 137
2931 137 -79 104 -26 -18 119 -61 -132 -16 -97 99 -164 -15 33 -51 -7 -16 41 113 -79 94 4 100 27 -110 -41
2956 -41 -164 -23 -90 -54 99 -32 36 120 -28 141 43 -20 13 -79 122 -30 -138 154 25 19 -61 -79 -50 72 -61
2981 -61 57 33 18 -49 133 -214 -100 -65 -26 -15 -77 31 -17 -28 112 -20 23 67 113 -12 -206 -40 -194 -33
3005 -33 13 -22 -98 -131 87 25 14 54 73 -55 15 -55 39 -85 -56 43 -1 -130 113 -40 -90 -58 74 222 49 -78
3031 -78 -227 151 137 61 -18 -102 -4 223 54 -14 63 -22 -2 -26 27 141 -102 21 -51 16 27 143 -39 -6 36 55
$$ packed form
2851E9q0nR5o4J5m4J5O4J31k53J03j77K18j23J43j65J06k7Nj15J14J18j7j10M4
2876E0k8r1J50k28R7J95k24R3m2o6O3K3M2N4j77P5PR7m0o7J28l1l2Q3l9jj14O3
2904D0n4M7o9J9j52K10p3K21j39q0LN5l5l6q0R6n6P4l0Q7j20o9Q8L02j89j69K46
2931A37k16J83j30QJ37j80p1J16q1J96k63J49M8q4M4rN7P2j92J73r0R6p3j37O9
2956d1j23J41o7L6J53j31O8Q4j48J69r8o3L3r2K01j52j08K92j29oq0j8K9J22j33
2981f1J18k4j5o7J82l47J14L5L9J1o2J08m8j1J40j32M3M4M6j25j94J66j54J61
3005c3M6l5p6l3K18o2j1M0J9j28P0p0R4j24K9R9m4j29K43j53n0L2J32J48j73j27
3031g8j49L78j4p6p9q4R8K27j69o8P7q5K0k4N3J14k43J23p2O7J1J16j82L3M2J9
$$ plain form
3057 55 59 -50 76 19 39 144 88 46 -2 -137 188 194 -30 -56 -75 -6 -84 -47 12 14 17 31 153 -109 -2 127 -43
3084 -43 16 112 -91 -9 -124 -16 -52 -51 -122 -46 23 91 3 28 -70 15 -100 -113 -24 -226 -100 117 -26 50 46 22 8
3111 8 -147 266 16 -50 78 -68 226 -67 174 -89 -123 64 27 -39 -69 97 87 144 -86 8 38 28 -44 -42 -28
3136 -28 -108 -31 -31 -71 67 -113 -130 -30 -78 -74 -99 37 2 -70 -39 -119 87 124 94 -93 -61 -37 -18 -44 -143 -113 6 120
3164 120 -185 12 23 78 -21 9 9 -46 -208 -34 150 21 50 -2 33 62 88 2 40 14 109 -54 -134 72 -29 32
3190 32 89 -156 56 -4 -75 29 73 14 152 222 20 67 -1 76 -32 33 99 81 144 59 -17 -51 -19 57 -57 165
3216 165 -41 27 -62 74 35 -2 83 206 62 82 36 -47 -25 19 44 -113 -59 12 -49 53 22 63 -21 65 63 -135 144
3243 144 84 -30 16 -13 -26 -138 -77 78 -80 -68 -103 139 -9 33 -49 -28 -191 -29 151 49 290 7 186
$$ packed form
3057E5Mj09J26n7K0J05n6m2m8j35L25Ok24k6j9O9p8L7N9KLJ4J22k62J07J29j70
3084d3N9R6k03Q2j15J08l6Jp1P6O9O8q8K5r8Q5j15j3Q9k02J26K17j43P6mk4j4
3111Hj55M13k50o6J28j46K94k93K41k63l4J87l7o6l0J66j0N7k30R4L0j0p2KJ4
3136b8q0P7%m0J38j80j7J00m8Mk5J36l5p2L1q0K06L7l0j87L2K4J9k6r9L0J19J14
3164A20l05J97J1N5r9L0%n5j62J74J84j29K9n2L5K9K6q6L8k6R5j63q0K06j01O1
3190C2N7k45K12o0p1J04M4n9J38P0k02M7o8P7j08O5O6j8O3q5p6l4L2P6j14K22
3216A65k06O8q9J36l9l7Q5J23j44K0m6q3K2M4K5j57N4P1o1J02l1M1q4Q6kj98K79
3243A44o0j14M6k9j3j12O1J55j58J2l5K42j48M2q2K1j63J62J80j02K41k83J79
$$ plain form
3266 186 6 146 47 -78 113 3 90 150 87 89 -79 -185 68 -10 10 38 -15 -100 -78 118 -37 -89 -135 -64 92
3291 92 95 -25 -99 109 102 10 26 51 87 -20 -23 -44 74 57 12 72 51 -31 62 50 -27 -51 15 57 119 29 88 95 -6 -115
3321 -115 109 28 76 46 -21 28 118 -94 -100 -72 22 -104 -245 139 98 63 -36 68 99 46 -13 130 128 62 72 31 74
3348 74 -52 58 48 29 116 49 -39 -117 -8 -141 -14 -36 -38 -3 56 -9 -62 55 13 94 32 -45 33 29 133 60 57 46
3376 46 -59 -193 27 61 -68 4 36 148 -74 -50 0 107 63 80 -97 12 -49 -83 -40 -53 -24 -63 30 -83 -98
3401 -98 -95 61 64 -40 -22 109 -86 -3 -91 -108 77 42 28 16 81 86 74 151 -151 7 86 25 -112 90 -53 167
3427 167 21 48 47 58 -48 -16 66 -165 42 7 142 -71 20 92 68 46 46 21 -10 -178 69 -21 -13 -106 -70 -5 -113
3454 -113 16 -92 -150 145 -98 55 116 43 -108 -48 73 -143 42 40 13 46 -18 58 16 149 2 24 -14 58 -60
$$ packed form
3266A86j80J40r9j25J91j10Q7O0o3Kj68j06K53p8K0K8n3q5K2J96j55n2m6P1J56
3291I2Lj20p4K08pr2J6K5L6j07lk1J18j7m5O0k1q2R3j2p7k4O6M2O2r0N9Pj01j09
3321a15K24q1M8l0o7M9R0k12oK8R4j26j41L84m1l5r9J04L1n3n9J43ko6J0m1M3
3348G4j26J10j0j9Q7o7q8p8J09j33J27k2kL5N9o5n3J17m2Q1o2p7P8mJ04p3lj1
3376D6j05j34K20L4j29P2L2J12k22K4N0J07m4J7j77J09o1l4M3j3K9l9R3j13j5
3401i8LJ56Lj04J8J31j95Q3q8j7J85l5j4j2O5Nj2P7l02J58P9o1j37K02j43K20
3427A67j46K7jJ1j06L2Q2k31K07l5J35k13R1P2k4k2%k5l1j68K47r0Qr3L6O5j08
3454a13J29j08n8K95k43J53O1p3j51O0J21k16J85kk7L3o4P6m2J33j47K2l8P2j18
$$ plain form
3479 -60 -85 35 -35 -152 -58 -31 -66 -52 -278 -46 34 -40 43 -69 -16 51 -32 -116 77 -48 -16 133 -37 -92 -132 -103
3505 -103 -24 54 -94 -3 -2 -27 -83 -102 44 26 138 53 -11 29 -60 -88 -51 -84 88 -120 -11 -86 -193 12 -61 94
3531 94 -28 184 42 -219 44 -87 167 156 -89 73 69 137 -35 -40 -94 -16 -31 -18 -112 13 111 129 -75 -27 21
3556 21 53 93 90 -51 68 5 2 -48 -44 108 -85 43 -173 78 -150 -147 55 -5 -32 -116 -63 29 72 50 11 52 -12 198
3584 198 -52 -5 -68 45 81 191 80 -95 -95 112 2 70 3 73 -86 51 -15 4 -62 -35 -73 -17 -212 0 -52
3609 -52 -18 163 -91 1 -66 13 47 96 163 -79 71 -207 12 -52 -80 -94 -142 58 58 -17 14 86 -94 25 53 -60
3635 -60 -55 -43 -123 -97 -98 -32 -87 -51 81 -66 25 -26 -115 41 32 -18 95 47 26 80 98 -17 -71 -33 -52 117 -85 34
3663 34 33 -155 -86 73 52 -21 -226 -14 39 45 19 26 5 -37 -35 -44 0 59 -88 22 96 -141 92 -76 -36 -73 95 99
$$ packed form
3479f0k5J20p0j17R4K7l5J4k26K32Q0p4Q3j12N3O7q3q4J93j25L2J49j70n5m0K9
3505a03P9P8j48R1Jk5n6j9J46j8J12q5o4M0q9k8L7l3J72k08J09p5j07K05p3J55
3531I4j22K12j42k61K63j31K54j1k45J62mO8j72nn4P8j5J3r4J25R8J8k04M8M8
3556B1L2M0lj41J19o3ln0MJ52j93J28k16K51k28LK02o0k7q4N3R2M3k2l9M1o4K10
3584A98k50M7o3J13L6J10j11j75%K07j10O8o7P0j59J37o6J9o6K7l8N6j95K12n2
3609e2L4J81k54R2o7P9L4M9O7k42J50k78K19o4k8j4m8K00%p5L1P2j80J19K8j13
3635f0NJ2q0K6jO6n5L6J32j47R1n1q9J56rn0J13m8k1N4J8j15n4L8j9J69k02J19
3663C4jj88O9J59k1p3k05K12N3Ok6Pk1m2KrM4N9j47J10P4k37K33j68M0l7J68M
$$ plain form
3691 99 -17 47 15 66 -32 -13 2 -66 -98 8 -9 6 -7 -149 -61 14 89 71 113 -62 18 -151 -128 105 56 -58 -3
3718 -3 -157 -62 -180 104 -42 24 -106 24 44 13 -26 -113 59 -66 34 70 -17 -97 -83 21 -98 120 39 -206
3742 -206 -87 -1 -27 92 29 -58 -24 225 26 37 -209 -27 87 -1 84 118 2 -115 35 -38 -127 52 39 57
3766 57 119 163 9 -27 6 19 -25 96 42 50 28 -112 69 136 -123 127 42 -81 88 126 44 21 1 -105 158 -73
3792 -73 41 43 86 -199 9 -156 -40 113 -38 59 -5 9 -20 -3 47 93 64 50 -13 -5 73 18 -55 13 -24 33 -29 71
3820 71 -17 40 13 -56 0 -118 -6 -12 120 -43 -100 -78 21 -156 -8 65 -62 186 -28 62 -66 -113 -7 -50 158
3845 158 -8 -41 27 -58 14 -67 -28 112 -81 -111 53 37 -73 96 159 34 -45 4 -13 -53 121 -40 4 -14 -80
3870 -80 -34 76 -50 81 43 85 64 61 -9 -24 15 105 55 -143 -158 -100 38 109 -23 1 64 4 54 27 -29 -28 28 3
$$ packed form
3691I9j16O4l2N1r8J9J5o8l2J06j7J5j3j42Q8P5P5j8M2j75Q0j69K3K33m9j14N5
3718cj54R5j18K84j46O6j30J30K0l1l9q7J72j25J00L6q7q0J4J04j19K18q1k45
3742b06J19Q6k6J19o3q7L4K49j99J1k46J82J14q8Q5L4j16j17J50p3q9J79j3J8
3766E7O2M4j54l6L3J3m4J21n4Qk2j40J81O7k59K50q5j23J69L8q2k3k0j06K63k31
3792g3J14KM3k85K08j65J16J53j51R7o4J4k9J7N0M6k9j4o3QP8n5p3O8l7N7o2J00
3820G1q8N7k7o9N6j18J12oJ32j63n7K2R9j77J48P3j27K48k14R0j28m7J06m3K08
3845A58j66l3O8q5P2q1L9J40j93l0J64j6j10J69O3j25p9M9j7m0J74j61M4j8o6
3870h0M6J10j26J31l8M2k1lp0j5L9R0n0j98j5N8J38P1j32K4O3o0N0k7n6JN6k5
$$ plain form
3898 3 184 30 112 179 -84 -145 13 33 -82 -66 -66 53 -78 -52 14 134 2 104 -1 25 46 -89 -58 71 -44
3923 -44 -58 -24 -165 57 -145 8 143 4 -14 -54 19 31 -68 -26 -67 -11 101 -50 -53 46 4 -65 7 87 46 45 -37
3950 -37 -35 50 106 -11 56 -112 -55 0 -106 -13 68 -50 -88 -167 -89 153 78 -203 69 -104 61 -100 -20 37 -91
3975 -91 -74 -135 -81 74 -43 -106 -75 88 -2 -74 191 -76 -2 59 -93 30 -4 -55 -83 160 61 -7 91 2 -12 10
4001 10 5 8 50 88 -35 79 -126 55 17 -31 38 -39 108 34 31 -35 23 -5 59 -11 24 -71 20 -21 -101 4 71 -23 4
4030 4 -87 -4 -37 -6 -30 4 97 -25 29 -187 167 27 158 -95 8 -115 -52 49 -11 88 17 41 58 80 -105 49
4056 49 66 55 124 -37 -3 146 -37 43 38 -124 -3 -53 9 84 112 -17 112 -35 19 -58 -57 45 -13 -16 -89 -80 16 19
4084 19 -23 32 80 0 -32 -51 -82 -23 -59 -57 -17 -18 66 -81 6 76 60 15 -11 1 52 -142 -1 16 105 58 87 -165 -24
$$ packed form
3898CJ81j54Q2O7k63o1J58K0j15J6%J19j31K6O6J20j32J02j05K6K1j35L1J29j15
3923d4j4L4j41K22k02J53J35j39j8m0P3J2r9M2m1N6J12j51lR9m2o9P2Q0m1jq2
3950c7KQ5N6j17O7j68N7N5j06R3Q1j18l8p9P8K42p5k81K72j73J65j61Q0N7j28
3975i1J7o1N4J55j17o3L1J63r0p2K65k67P4O1j52J23l4n1k8K43r9o8R8q9j4K2
4001A0nLM2L8j23J14k05J81l8m8O9p7J47p4lo6N8k8O4p0L5r5R1m1q0J05O7r4K7
4030Dr1Q3l3L1k4L4R3j22N4k16L54j40J31k53J03j23O3J01o0R9p1K4J7K2j85J54
4056D9J7j1O9j61L4J49j83Q0nj62J21n0O2P5K8j29J29j47N4p7JJ02n8lp3RR6L
4084A9m2N5M8q0l2j9l1N9l6KM0jQ4j47Q7P0j6m5k6J2N1j94J41J7Q9m7K9k52J41
$$ plain form
4113 -24 25 115 -40 -21 -75 -19 44 -124 69 -51 4 -168 34 -172 -52 90 74 3 121 18 -120 -51 22 -12
4137 -12 -27 5 45 112 -53 4 -52 20 -134 99 -88 -78 -66 49 -183 -75 99 -68 28 21 133 87 -88 -8 -41
4162 -41 -7 -11 -57 -96 -75 -26 108 -70 109 103 -117 26 81 13 51 -73 73 77 -70 -102 58 49 -81 -39 77 -1 79
4189 79 -84 96 -16 154 111 112 87 16 7 -108 -2 -106 -11 100 -62 33 78 -13 28 102 70 -89 -108 -64 -44 17
4215 17 74 -48 31 -13 37 203 101 -124 -131 -25 -154 3 -1 57 19 44 29 -15 -62 -2 -58 92 -43 -10 -188 15
4241 15 31 -94 145 -33 105 -132 129 100 14 68 -57 -39 3 51 111 31 -71 8 -88 -47 -57 -27 -117 -41 19 178
4267 178 -76 -147 -4 -42 -140 -65 -35 -14 53 -45 -48 -145 -2 -82 40 -107 34 38 29 -46 25 -22 -54 -161 35 67 -26
4294 -26 89 3 36 -11 68 19 4 120 36 -85 29 -72 20 12 23 117 -175 90 -19 -11 -19 44 -100 -24 109 -28
$$ packed form
4113b4M9R0j55J9n4N6O3j68J93j20N5j72K02k06J20J42j6p1J18j03j38O9P3l4
4137a2j5L2M0O7j65N7n6P2j54K33j87J0J2J15k32J08J74j67R6pJ12m6j75Q0l3
4162d1L4mm6l9K1M9J34j78J79ok20J43N5o8L8j24J46Mj47l2J60rj30M2J16p8Q0
4189G9j63J80j12J70m3Jk5p1rj15J06j04R5J11j62R5M5r1M1P4l2j59j9M4K0O1
4215A7N7j22P9m4N0J66j02k25pJ06j29J57mN8l8K5j5m4m7O0n6J50j35L3j78K03
4241A5J6j25K39j78J38k37K61k9q6N4j25J8M2M8O0q0j02P9r6M1j0L0r0P6O0J59
4267A78k54p1J43l8r8P5L0K1O7r8lr7J43q0J22j47J41Mrp5P1m7l2j07J96L2r3
4294b6J15q6L3m7P9m9j5J16q4j21J14j01R2qJ1R4k92K65j09QqO3j44P6J33j37
$$ plain form
4320 -28 -195 172 88 -58 144 25 26 -103 -5 -49 -45 75 66 108 67 -60 209 -50 103 -28 18 -11 -17 -9 -176 -29
4346 -29 121 -70 -175 42 137 156 -57 20 -90 -80 78 -74 13 -81 63 167 -101 -92 -99 -45 102 6 126 -118
4370 -118 13 -235 -118 -2 15 -40 -5 60 -73 101 68 19 81 71 12 84 -6 51 2 -95 -18 -38 50 86 -39 167
4396 167 -82 31 121 2 -84 68 -73 115 -10 -25 128 13 110 -49 55 159 101 84 -98 90 -63 39
4418 39 90 79 -44 -60 -28 -41 37 -57 49 4 14 -18 112 -100 37 -115 -38 47 -160 52 -12 -90 183 115 -2
4443 -2 8 -64 83 -72 -62 63 -48 -33 8 -23 -146 114 -62 -41 -89 92 -6 -69 24 -69 -73 -26 -82 -133 -12 99
4469 99 -94 -52 36 59 -37 -87 12 89 74 187 57 -144 43 -137 -96 49 125 60 49 2 -79 -54 -55 -26 90 -77
4495 -77 110 54 -52 -52 -53 81 -70 -89 -160 16 -156 31 62 30 -27 146 15 -48 -88 111 16 -85 157 29 -21
$$ packed form
4320b8j67L67q4j46K02j19Jj29R8m4MJ20rM2m1j27K69k59J53j31M6k9oQj67J47
4346b9J50j91j05K17R5J9k13P7j10J0J58j52Q7r4J44J04k68RpN4J47r6J20k44
4370a18J31k48J17J16J7n5L5O5j33J74l3m9O2j0n9P2r0N7m9r7P7k0Q8L6j25K06
4396A67k49J13R0j19q6J52j41J88j25j5J53j15R7j59J04J04n8j7j82J88j53J02
4418C9N1j1j23j6L2j3P8r4J06m5J0l2J30k12J37j52P7Q5k07K12o4p8K73o8j17
4443bJ0p2J47j55J0J25j11J5M1l1j23K60j76K1m8J81r8o3R3r3mM7n6n1J21J11
4469I9j93M2Q8K3r6n0R9P7j5J13j30k01J87j80M1J45P6o5j1m7q1K5jK9J16j67
4495g7J87n6j06%jJ34j51j9p1J76j72J87L1l2n7J73j31o3m0J99r5j01K42j28n0
$$ plain form
4520 -21 -27 38 168 9 26 -35 86 77 114 -93 31 -58 -44 41 64 -95 -82 -169 62 100 10 -41 -7 2 128 96 -67
4547 -67 -83 42 -49 4 -68 -36 196 -20 21 -22 97 87 44 49 -73 -43 29 3 9 7 -54 56 -28 -46 -63 -102 4 54
4575 54 94 -49 -50 -220 -134 66 -107 -49 218 138 -24 61 -49 -18 31 -84 -27 49 -68 108 40 -106 -91 141 -81
4600 -81 30 -31 96 68 0 82 87 -47 -29 30 188 -116 -37 -37 -158 -11 -32 11 -171 165 30 -155 -19 97 -18
4625 -18 -26 -7 -54 122 -39 -215 29 7 3 77 113 -44 -48 192 -109 -151 -173 66 302 -93 -55 89 -18 124 -111
4650 -111 10 80 -77 117 -2 50 37 -30 -192 -44 -77 -18 21 -6 14 151 54 -4 116 -129 -12 -53 -98 -49 -102
4675 -102 93 15 -13 44 -11 8 -15 112 123 50 56 -3 97 -54 -56 115 -117 22 -110 9 4 67 -110 68 167 95
4701 95 164 -37 71 -32 173 -99 -2 -37 -4 49 -145 47 55 8 287 -41 -82 -39 -27 -43 -92 -29 48 -32 -47 8
$$ packed form
4520b1oO5J30j59J7o1J21rL7k07J24q9J4Q5K3j59J3q7K31L8r0n1L4RJ26l2j63
4547f7j6J25r1N3p2L2K32k16M1m3J19j0m3Nj22L0P2k6Oko1J10q4j8j7l9J06N0
4575E4M0j43jj70Q6K00j73N8K67q0j62Q5j10L1M9j15N7P6j17J76o8j46J5K32k22
4600h1J11o1J27k8o8Q2Nj34J8N9J58l04P9%j21J47k1M3j82L36j35j85J36J16j15
4625a8qJ9m7J76j61j76K44k2mP4L6j57mK40l01m2k2K39K36l95L8J44j07J42k35
4650a11J21P0j57J94j19N2j3o7j62J48l3N9L9k7K0J37r7n8J20k45J17m1m5M9n3
4675a02J95p8k8N7n5J9k3J27J1p3On9J00j51kJ71k32J39j32J19nO3j77J78R9p2
4701I5O9k01J08j03K05k72R7l5L3N3j94J92Qm7K79l28m1M3J2j6m9O3P7q0j5N5
$$ plain form
4727 8 92 -29 61 55 23 -5 146 -90 98 63 68 -123 10 -46 103 -141 -9 -137 -35 98 74 8 123 80 -53
4752 -53 136 82 -2 33 -8 8 118 54 35 -112 53 -111 98 -75 160 -129 88 163 66 -68 1 -19 74 -206
4776 -206 69 147 5 -313 -14 70 -26 -5 -78 173 -28 -88 59 -69 -52 85 7 -41 -23 60 29 261 82 -169
4800 -169 -103 56 113 -10 -79 -49 -41 101 10 -51 46 90 -66 166 -17 -12 37 -131 -1 -40 -12 -32 -70 32 -73 -9
4826 -9 -9 55 219 150 148 54 -108 133 207 -114 238 -75 8 46 -134 -75 -66 -15 -7 48 -18 65 48 60 -98 -69 -39 66
4854 66 53 96 -26 78 -58 -207 82 -214 56 66 -85 58 -26 35 78 -136 -68 10 95 -101 178 21 66 190
4878 190 -64 -34 -46 -62 17 -5 -58 -237 -48 7 -96 -32 -102 20 86 -167 -62 -76 -89 101 -156 74 -6 -71 75
4903 75 181 142 1 109 149 157 -25 -127 -98 -5 150 -7 93 -108 10 41 5 76 -22 -56 -44 2 -14 -6 -40 -47 49
$$ packed form
4727HQ4j21R0ol2k8J51k36J88l5Nj91J33n6J49k44J32j28J02J33k4o6J15m3j33
4752e3J89n4q4L5m1J6J10o4j9j47J65j64K09j73K35k89K17P5r7j34O9k0R3k80
4776b06K75P8j42l18K99Q4r6K1p3K51k01o0J47j28J7J37p8m8J8Q3l1K32j79k51
4800a69O6J59N7j23o9L0QJ42r1o1R7M4j56K32j83NM9j68J30l9K8k0l8J02j05O4
4826i%O4J64o9kr4j62K41P4l21L52l13Q3L8j80N9RN1QN5o6Q3j7J2j58K9L0J05
4854F6j3M3j22J04j36j49K89k96K70J0j51J43q4O1M3k14O8P8Q5j96K79j57M5J24
4878A90k54L0j2j6P9k2n3j79J89N5j03O4p0J22O6k53J05j4j3J90k57K30q0o5J46
4903G5J06l9j41J08M0Qj82j02K9R3J55j57J00k01J18L1l6P1r8l4J2M6j6Ql4pR6
$$ plain form
4930 49 52 35 -65 140 -61 -80 2 -73 -104 -33 -143 -108 -93 27 -49 -12 -69 10 -37 7 -50 -16 -99 143 -14 -130 -122
4957 -122 -74 72 -42 -39 22 183 -93 -56 -65 -75 -135 -36 90 -10 -11 104 -61 198 -73 11 -58 12 -103 63 -24
4982 -24 -166 147 8 82 61 54 13 49 32 -2 -81 -82 -41 48 21 -40 19 223 -9 -34 67 -77 85 83 83 22 167 69
5010 69 -20 40 -16 14 56 202 -88 -139 -124 -71 -9 22 201 55 -161 67 68 -70 -69 131 -123 53 -30 132 33 -183
5036 -183 19 59 -30 -38 53 -167 158 136 -33 -58 6 81 -50 137 -1 -4 104 -60 94 -55 -21 2 -114 -124 -38
5061 -38 -52 -43 2 -82 11 54 -89 7 8 81 -122 1 14 23 35 -59 -13 119 85 42 121 -14 25 -107 -53 43 -77 103
5089 103 -35 -10 104 -76 -31 47 -14 83 101 62 29 71 -109 -66 -212 -82 1 -51 -8 46 121 112 60 10 -31 121 -53
5116 -53 -8 86 -10 -85 -10 0 -53 -28 85 -155 31 167 -36 -46 -36 32 -89 22 12 63 17 -196 -60 63 -119
$$ packed form
4930D9Lj7j00K05k01j9Q2p5l1P1j10L5J5J20p6L7n7P9m7M4n7L4q3K42j57j16Q
4957a22M8J46j14LO1J61k76L7rj0o0R9J26j00jJ15j65K59k71Q4o9P0j15J66q7
4982b4j42L13j39P4k1pm1L6j7l4p9jM1Q9k7o1N9K04k32k5J01j44J62k%o1J45r8
5010F9q9O0n6L0M2J46k90n1J5N3O2L1J79j46k16K28Jj38JK00k54J76q3J62r9k16
5036a83K02M0q9qR1k20L25k2j69k5O4P5j31J87j38lJ08j64J54j49L4K3j16j0Q6
5061c8j4RM5q4R3M3j43R6JP3k03J23J3RJ2r4M6J32l4m3P9j35L9j32N4R6j20J80
5089A03j38K5J14j80M5P8o1R7J8l9l3M2j80M3j46J30Q3n2M3N4P5rn2n0m1J52j74
5116e3M5R4r6p5P5J0n3K5J13k40J86J36k03j0J0O8j21J11j0N1m6k13J36J23j82
$$ plain form
5141 -119 -113 8 138 -1 -63 31 68 -84 15 -76 43 96 -66 126 -65 79 145 -72 -56 -88 -77 -142 20 143
5165 143 65 -96 81 71 25 3 -18 -108 16 -28 177 -31 62 19 -180 -102 -3 24 -113 -184 -157 149 -184 132 -107
5190 -107 87 -6 -12 -65 -5 31 49 93 93 78 34 109 -84 53 -15 -125 -55 -40 -19 99 76 -25 67 113 -4 -9 74 3
5218 3 -10 197 110 -123 72 -113 -166 2 -1 -124 77 70 -80 -55 -55 -26 51 -64 120 4 14 15 -31 45 39 26 132
5245 132 64 81 31 -79 -47 78 38 -8 73 -11 -38 23 -30 122 -82 53 65 -14 -136 3 -18 26 -10 164 15
5270 15 1 -84 -125 -26 59 -65 -184 28 -138 -49 79 30 -47 87 -62 -60 125 -22 -75 6 -86 -20 59 -21 -9 -43
5296 -43 -121 -116 -45 26 13 76 114 -38 -62 -103 -26 142 55 91 -65 -12 -122 6 -157 -14 -46 294 -58 -36 71 -56
$$ packed form
5141a19OJ21J30j39o2R4L7j52R9r1J19N3j62J92j91J44O6k17J6l2J1o5J62J23
5165A43p8j61J77j0m6k2k1r0J24m4K05k08R3m3j99P8R9K7j37p1K7L06l33L16k39
5190a07J94r3on3O0L6J8M4%j5m4P5j93J37o8j10P0J5K1J18k3j01R2M6j17nQ3p1
5218Cj3K07q7k33J95j85n3J68lj23K01pj50K5%K9P7j15J84j16J0Jm6P6oj3J06
5245A32o8J7n0j10L2J25m0m6Q1q4k7O1n3J52k04J35J2p9j22J39k1M4l6J74j49
5270A5j4q5m1R9Q5j24j19K12j66Q9J28m9p7J34j49KJ85j47n3Q1r2O6P9q0J2l4
5296d3p8NP1P1j3O3L8j52k4m1P7J68q7L6j56N3j10J28j63J43l2L40l52K2J07j27
$$ [...]
8191h
##END NTUPLES=NMR FID
##END=
