##TITLE=1H_Pr Am-Bu
 CDCl3
 8 sc, 
 13.3.2023
##JCAMPDX= 6.0         $$ Bruker NMR JCAMP-DX V2.0
##DATA TYPE= NMR FID
##DATA CLASS= NTUPLES
##ORIGIN= UXNMR, Bruker Analytische Messtechnik GmbH
##OWNER= root
$$ XWIN-NMR		Version 3.5
$$ Mon Mar 13 16:00:14 2023 Russian Standard Time (UT+4h)  she@DPX200
##.OBSERVE FREQUENCY= 200.13135
##.OBSERVE NUCLEUS= ^1H
##.DELAY= (6, 6)
##.ACQUISITION MODE= SIMULTANEOUS
##.ACQUISITION SCHEME= undefined
##.AVERAGES= 8
##.DIGITISER RES= 18
##SPECTROMETER/DATA SYSTEM= spect
##.PULSE SEQUENCE= zg30
##.SOLVENT NAME= CDCl3
##.SHIFT REFERENCE= (INTERNAL, CDCl3, 0, 15.7039)
##AUDIT TRAIL= $$ (NUMBER, WHEN, WHO, WHERE, WHAT)
$$ ##TITLE= Audit trail, XWIN-NMR		Version 3.5
$$ ##JCAMPDX= 5.01
$$ ##ORIGIN= Bruker BioSpin GmbH
$$ ##OWNER= she
$$ F:/spectra/data/she/nmr/H-F/1/audita.txt
$$ ##AUDIT TRAIL=  $$ (NUMBER, WHEN, WHO, WHERE, WHAT)
(   1,<2023-03-13 15:58:54.70 +0400>,<she>,<DPX200>,
      <created by zg, POWCHK disabled, PULCHK disabled
       configuration hash MD5:
       00 E9 B6 7A A2 85 ED C7 34 08 36 98 17 FE 4E 26
       data hash MD5: 16K
       CF 78 91 51 9D 5D 8D 20 C6 B2 09 C5 4C 4F A2 B7>)
$$ ##END=
$$ 
$$ hash MD5
$$ 65 C2 07 B8 E8 95 98 DC 79 EC F7 36 81 A1 4F 1C
##$RELAX= 
##$RELAX= 
##$RELAX= 
##$RELAX= 
##$RELAX= 
##$RELAX= 
$$ Bruker specific parameters
$$ --------------------------
##$DU= <F:/spectra>
##$EXPNO= 1
##$NAME= <H-F>
##$PROCNO= 1
##$TYPE= <nmr>
##$USER= <she>
##$AMP= (0..31)
100 100 100 100 100 100 100 100 100 100 100 100 100 100 100 100 100 100 
100 100 100 100 100 100 100 100 100 100 100 100 100 100 
##$AQSEQ= 0
##$AQ_mod= 1
##$AUNM= <au_zg>
##$AUTOPOS= <>
##$BF1= 200.13
##$BF2= 200.13
##$BF3= 200.13
##$BF4= 200.13
##$BF5= 200.13
##$BF6= 200.13
##$BF7= 200.13
##$BF8= 200.13
##$BYTORDA= 1
##$CFDGTYP= 0
##$CFRGTYP= 5
##$CHEMSTR= <none>
##$CNST= (0..31)
1 1 145 1 1 1 1 1 1 1 1 1 1 1 1 1 1 1 1 1 1 1 1 1 1 1 1 1 1 1 1 1 
##$CPDPRG= <>
##$CPDPRG1= <>
##$CPDPRG2= <>
##$CPDPRG3= <>
##$CPDPRG4= <mlev>
##$CPDPRG5= <mlev>
##$CPDPRG6= <mlev>
##$CPDPRG7= <mlev>
##$CPDPRG8= <mlev>
##$CPDPRGB= <>
##$CPDPRGT= <>
##$D= (0..31)
0 1.2 0 0 0 0 0 0 0 0.06 0 0.03 0 0 0 0 0.0002 0 0 0 0 0 0 0 0 0 0 0 0 
0 0 0 
##$DATE= 1678708734
##$DBL= (0..7)
120 120 120 120 120 120 120 120 
##$DBP= (0..7)
150 150 150 150 150 150 150 150 
##$DBP07= 0
##$DBPNAM0= <>
##$DBPNAM1= <>
##$DBPNAM2= <>
##$DBPNAM3= <>
##$DBPNAM4= <>
##$DBPNAM5= <>
##$DBPNAM6= <>
##$DBPNAM7= <>
##$DBPOAL= (0..7)
0.5 0.5 0.5 0.5 0.5 0.5 0.5 0.5 
##$DBPOFFS= (0..7)
0 0 0 0 0 0 0 0 
##$DE= 6
##$DECBNUC= <off>
##$DECIM= 32
##$DECNUC= <off>
##$DECSTAT= 4
##$DIGMOD= 1
##$DIGTYP= 9
##$DL= (0..7)
0 120 120 120 120 120 120 120 
##$DP= (0..7)
150 150 150 150 150 150 150 150 
##$DP07= 0
##$DPNAME0= <>
##$DPNAME1= <>
##$DPNAME2= <>
##$DPNAME3= <>
##$DPNAME4= <>
##$DPNAME5= <>
##$DPNAME6= <>
##$DPNAME7= <>
##$DPOAL= (0..7)
0.5 0.5 0.5 0.5 0.5 0.5 0.5 0.5 
##$DPOFFS= (0..7)
0 0 0 0 0 0 0 0 
##$DQDMODE= 0
##$DR= 18
##$DS= 0
##$DSLIST= <SSSSSSSSSSSSSSS>
$$ [...]
##$SUBNAM2= <"">
##$SUBNAM3= <"">
##$SUBNAM4= <"">
##$SUBNAM5= <"">
##$SUBNAM6= <"">
##$SUBNAM7= <"">
##$SUBNAM8= <"">
##$SUBNAM9= <"">
##$SW= 18.05172834244
##$SWIBOX= (0..15)
0 0 2 0 0 0 0 0 0 0 0 0 0 0 0 0 
##$SW_h= 3612.71676300578
##$TD= 16384
##$TD0= 1
##$TE= 0
##$TE2= 300
##$TE3= 300
##$TEG= 300
##$TL= (0..7)
0 120 120 120 120 120 120 120 
##$TP= (0..7)
150 150 150 150 150 150 150 150 
##$TP07= 0
##$TPNAME0= <>
##$TPNAME1= <>
##$TPNAME2= <>
##$TPNAME3= <>
##$TPNAME4= <>
##$TPNAME5= <>
##$TPNAME6= <>
##$TPNAME7= <>
##$TPOAL= (0..7)
0.5 0.5 0.5 0.5 0.5 0.5 0.5 0.5 
##$TPOFFS= (0..7)
0 0 0 0 0 0 0 0 
##$TUNHIN= 0
##$TUNHOUT= 0
##$TUNXOUT= 0
##$USERA1= <user>
##$USERA2= <user>
##$USERA3= <user>
##$USERA4= <user>
##$USERA5= <user>
##$V9= 5
##$VALIST= <valist>
##$VCLIST= <CCCCCCCCCCCCCCC>
##$VD= 0
##$VDLIST= <DDDDDDDDDDDDDDD>
##$VPLIST= <PPPPPPPPPPPPPPP>
##$VTLIST= <TTTTTTTTTTTTTTT>
##$WBST= 1024
##$WBSW= 4
##$XGAIN= (0..3)
0 0 0 0 
##$XL= 0
##$YL= 0
##$YMAX_a= 301366
##$YMIN_a= -399391
##$ZGOPTNS= <>
##$ZL1= 120
##$ZL2= 120
##$ZL3= 120
##$ZL4= 120
##$ABSF1= 10
##$ABSF2= 0
##$ABSG= 5
##$ABSL= 3
##$ALPHA= 0
##$AQORDER= 0
##$ASSFAC= 0
##$ASSFACI= 0
##$ASSFACX= 0
##$ASSWID= 0
##$AUNMP= <proc_1d>
##$AZFE= 0.1
##$AZFW= 0.1
##$BCFW= 1
##$BC_mod= 2
##$BYTORDP= 1
##$COROFFS= 0
##$CY= 11.3945322036743
##$DATMOD= 1
##$DC= 2
##$DFILT= <>
##$DTYPP= 0
##$F1P= 2.36226072786647
##$F2P= -0.459571619588291
##$FCOR= 0.5
##$FTSIZE= 0
##$FT_mod= 4
##$GAMMA= 1
##$GB= 0.15
##$INTBC= 1
##$INTSCL= 1
##$ISEN= 128
##$LB= 0.24
##$LEV0= 0
##$LPBIN= 0
##$MAXI= 10000
##$MC2= 0
##$MEAN= 0
##$ME_mod= 0
##$MI= 1.114404
##$NCOEF= 0
##$NC_proc= 0
##$NLEV= 6
##$NOISF1= 3.799351
##$NOISF2= 2.8
##$NSP= 1
##$NTH_PI= 0
##$NZP= 0
##$OFFSET= 15.70392
##$PC= 1
##$PHC0= -19102.96
##$PHC1= 7.800739
##$PH_mod= 1
##$PKNL= yes
##$PPARMOD= 0
##$PSCAL= 0
##$PSIGN= 0
##$REVERSE= no
##$SF= 200.130013532006
##$SI= 16384
##$SIGF1= 3
##$SIGF2= 2
##$SINO= 400
##$SIOLD= 16384
##$SREGLST= <1H.CDCl3>
##$SSB= 0
##$STSI= 0
##$STSR= 0
##$SW_p= 3612.71676300578
##$SYMM= 0
##$S_DEV= 0
##$TDeff= 0
##$TDoff= 0
##$TI= <>
##$TILT= no
##$TM1= 0
##$TM2= 0
##$TOPLEV= 0
##$USERP1= <user>
##$USERP2= <user>
##$USERP3= <user>
##$USERP4= <user>
##$USERP5= <user>
##$WDW= 1
##$XDIM= 8192
##$YMAX_p= 0
##$YMIN_p= 0
$$ End of Bruker specific parameters
$$ ---------------------------------
##NTUPLES= NMR FID
##VAR_NAME=  TIME,          FID/REAL,        FID/IMAG
##SYMBOL=    X,             R,               I
##VAR_TYPE=  INDEPENDENT,   DEPENDENT,       DEPENDENT
##VAR_FORM=  AFFN,          ASDF,            ASDF
##VAR_DIM=   8192,          8192,            8192
##UNITS=     SECONDS,       ARBITRARY UNITS, ARBITRARY UNITS
##FACTOR=    0.0002768,     1,               1
##FIRST=     0,             0,               0
##LAST=      2.2672688,     0,               0
##MIN=       0,             -399391,         0
##MAX=       2.2672688,     301366,          0
$$ Real data points
##PAGE= N=1
##DATA TABLE= (X++(R..R)), XYDATA
$$ [...]
$$ plain form
1952 -305 -1061 -1103 -761 -1078 -843 -754 -1188 -1042 -211 -610 -800 264 606 68 51 869 917 389 1281 1058 933
1973 933 1004 854 207 498 1282 299 -37 55 -607 -653 -264 -345 -970 -564 -738 -1733 -1420 -375 -762 -624 -146
1994 -146 -74 -686 -142 90 223 969 1437 347 387 1281 601 316 1095 1719 331 70 554 -28 101 366
2014 366 -442 -728 -201 -651 -1610 -792 -278 -1142 -1338 -328 -872 -1063 -184 288 -519 240 473 -97 599 1253
2034 1253 532 110 1034 947 172 997 789 160 50 351 -739 -322 639 -143 -1012 -448 -555 -1848 -697
2053 -697 44 -933 -532 -220 -1179 -1293 -64 135 -298 1169 1044 -181 -219 1034 976 912 1845 1115 -71
2072 -71 479 322 -308 474 1563 -163 -1075 -352 -888 -1221 -116 -149 -884 -723 -732 -1536 -1017 234 -150 -748
2092 -748 313 258 -808 319 1073 752 469 1019 199 322 1117 829 -22 1063 690 -196 -174 293 -467
$$ packed form
1952c05p56m2L42l17K35Q9m34J46Q31l99j90J064L42n38j7Q18M8n28Q92k23j25
1973I33P1j50o47K91P84r83l36R2o62m6L89q1o25M06j74r95L13J045l87J38M78
1994a46P2o12N44K32J33P46M68j090M0Q94o80k85P79O24j388k61M84n82J29K65
2014C66q08k86N27m50r59Q18N14q64j96J010n44j91Q79M72q07P59K33n70O96O54
2034A253p21m22R24q7p75Q25k08o29j10L01j090M17R61p82q69N64j07j293J151
2053f97P41r77M01L12r59j14J229J99m33J467j25j225l8J253n8o4R33p30j186
2072g1N50j57o30P82J089j726r12P23n36l33J105l3p35J61rq04N19J251l84n98
2092g48J061n5j066J127P54l21k83N50q20J23P95k88q51J085l73q86K2M67p60
$$ plain form
2111 -467 -734 169 -789 -950 -244 -606 -1535 -876 -377 -1308 -777 408 -270 -534 242 103 -225 325 991 767
2131 767 1000 1425 533 -34 1046 904 242 962 1157 -294 -660 -83 -350 -278 377 -436 -1185 -706 -1372 -1292
2151 -1292 -287 199 -417 -1010 -193 -805 -964 317 874 401 806 755 -118 220 1165 1096 952 1362 380 -388
2171 -388 310 474 -343 27 393 -607 -684 -463 -996 -950 -251 3 -966 -598 -488 -1110 -481 -53 -205 -58
2191 -58 579 93 -58 678 827 327 484 1191 1110 499 595 103 203 336 628 -270 -87 59 -486 -808 -259
2212 -259 -683 -1158 -423 -116 -1035 -542 -730 -464 -2 754 228 -51 194 237 152 1085 1257 495 318 574 588
2233 588 164 541 419 144 211 65 -536 -289 -315 -429 -317 -187 -619 -1101 -1094 -681 -567 -174 -155 -518 -67 177
2255 177 274 48 420 699 592 880 580 629 288 571 840 828 602 278 -517 -204 296 -309 -408 -403 -539 -697
$$ packed form
2111d67k67R03r58j61P06l62r29O59M99r31N31J185o78k64P76j39l28N50O66k24
2131G67K33M25q92n67J080j42o62P20J95j451l66N77k67P2O55q13p49M79o66Q0
2151a292J005M86o16n93Q17o12j59J281N57m73M05n1q73L38R45o9j44M10r82p68
2171c88O98J64q17L70L66j000p7K21n33M6O99K54r69L68J10o22O29M28j52J47
2191e8O37m86j51P36J49n00J57P07q1o11R6m92J00J33K92q98J83J46n45l22N49
2212b59m24m75P35L07r19M93j88K66M62P56n26k79K45M3q5R33J72p62j77K56J4
2233E88m24L77j22k75O7j46o01K47k6j14J12J30m32m82PM13J14L93J9l63M51K44
2255A77R7k26L72K79j07K88l00M9l41K83K69j2k26l24p95L13N00o05r9Nj36j58
$$ plain form
2277 -697 -482 -310 -631 -811 -543 -127 -204 -25 -888 -305 206 156 205 329 432 237 662 854 812 270 583
2298 583 594 195 438 452 78 -114 -422 -246 66 -866 -697 -846 -685 -501 -503 -469 -536 -804 -546 -200 -157 34
2320 34 44 468 494 432 441 459 977 777 413 389 485 554 347 267 -104 -171 -257 -283 -458 -352 -746 -611 -566 -343 -441
2345 -441 -790 -541 -141 -159 -309 -69 -59 -103 322 496 473 309 251 586 669 681 513 266 38 220 471 105
2367 105 -203 -303 -140 -176 -250 -526 -502 -617 -374 -425 -484 -356 -425 -397 -272 108 218 169 -112 203 461 827 629
2390 629 383 692 711 543 345 697 232 -117 -105 203 107 -268 -495 -337 -349 -267 -341 -698 -478 -443 -345 -568 -507
2413 -507 -337 -349 184 162 202 278 305 267 571 484 626 447 583 676 358 -8 388 131 52 40 -204 -111 -348 -535
2437 -535 -531 -539 -443 -705 -465 -347 -667 -579 -111 -169 -28 -37 303 184 141 302 338 589 704 474 311 365 328 531
$$ packed form
2277f97K15J72l21j80K68M16p7J79q63N83N11n0M9J24J03j95M25J92m2n42L13
2298E83J1l99K43J4l74j92l08J76L12r32J69j49J61J84kL4o7k68K58L46M3J91
2320C4J0M24K6o2RJ8N18k00l64k4R6O9k07q0l71o7q6k6j75J06l94J35M5K23r8
2345d41l49K49M00j8j50K40J0m4M25J74k3j64n8L35Q3J2j68k47k28J82K51l66
2367A05l08j00J63l6p4k76K4j15K43n1n9J28o9K8J25L80J10m9k81L15K58L66j98
2390F29k46L09J9j68j98L52m65l49J2L08r6l75k27J58j2Q2p4l57K20L5R8k23O1
2413e07J70j2N33k2M0P6K7l8L04q7J42j79J36R3l18l66L96k57p9j2k44R3k37j87
2437e35MqR6k62K40J18l20Q8M68n8J41rL40j19m3J61L6K51J15k30j63N4l7K03
$$ plain form
2461 531 89 260 251 -161 274 -457 -637 -151 -218 -249 -562 -347 -756 -755 -353 -16 -489 75 -146 -92 408 355 39
2484 39 38 531 594 347 214 627 337 375 516 41 274 259 -204 -440 283 -166 -561 -372 -337 -190 -517 -139
2506 -139 -535 -672 -164 -210 -536 214 58 -481 128 404 487 316 725 454 257 271 370 168 471 796 351
2527 351 -222 184 -439 -262 -11 -5 -511 -429 -475 -808 -466 -263 -299 -290 33 -52 -450 -127 338 206 288 445 112
2550 112 162 585 211 534 515 636 -359 61 416 134 201 517 -10 -524 -87 -338 -702 -395 -112 -832 -748
2571 -748 -130 -318 -402 -254 -32 -85 188 99 17 387 397 -103 65 888 676 259 480 485 -330 235 418 -331
2593 -331 438 163 -150 -437 -428 -517 -900 -159 -37 -592 -569 -204 -650 -241 110 174 -20 225 22 -544 4 764
2615 764 589 562 785 255 -216 464 513 123 282 363 -134 -192 -72 -364 -325 -47 -175 -608 -399 -506 -938 -589
$$ packed form
2461E31m42J71rm12M35p31j80M86o7l1l13K15m09JM02L37m73N64k21N4N00n3l16
2484C9jM93O3k47j33M13k90L8J41m75K33j5m63k36P23m49l95J89L5J47l27L78
2506a39l96j37N08m6l26P50j56n39O09K76Q3j71M09k71j97J4R9k02L03L25m45
2527C51n73M06o23J77K51On06Q2m6l33L42K03l6RL23q5l98L23M65j32Q2J57l33
2550A12N0M23l74L23j9J21r95M20L55k82O7L16n27n14M37k51l64L07K83p20Q4
2571g48O18j88q4J48K22n3K73q9q2L70J0n00J68Q23k12m17K21Nq15N65J83p49
2593c31P69k75l13k87Rq9l83P41J22n55K3L65m46M09L51O4j94K45k03n66N48P60
2615G64j75k7K23n30m71O80M9l90J59Q1m97n8J20k92L9K78j28m33K09j07m32L49
$$ plain form
2637 -589 151 -165 -594 32 26 -190 215 450 73 -47 714 283 451 428 317 274 638 309 -60 35 214 -138
2659 -138 -389 15 -382 -211 -158 -265 -676 -366 -509 -530 -264 64 -32 -263 -147 176 -294 441 613 302 171
2680 171 566 133 82 752 88 554 403 333 -262 113 242 -103 20 304 -159 -779 -363 -263 -47 -198 -245
2701 -245 -414 -279 -368 -382 41 482 312 225 115 718 186 414 281 493 572 631 170 149 368 144 -141 134
2723 134 62 -190 -279 -342 -442 -241 -472 -299 -272 -307 -407 -457 -408 182 171 -85 -12 196 210 505 205 250 405 446
2747 446 461 455 458 249 -62 189 473 143 -231 -272 -178 -110 -111 -109 -510 -45 -341 -403 -441 -303 -376 19 180 -113 -39
2772 -39 60 250 162 417 354 134 441 422 494 215 232 257 259 350 228 -60 -234 -34 -64 -89 -168 -321 -474 -315 -224
2797 -224 -237 -261 78 -417 -188 10 34 37 49 125 462 355 271 284 154 322 421 424 -93 17 -11 55 59 90 -10 -443
$$ packed form
2637e89P40l16m29O26ok16M05K35l77j20P61m31J68k3j11m3L64l29l69R5J79l52
2659a38k51M04l97J71N3j07m11L10j43k1K66L28r6k31J16L23m70P35J72l11j31
2680A71L95m33n1O70o64M66j51p0n95L75J29l45J23K84m63o20M16J00K16j51m7
2701b45j69J35q9j4M23M41j70q7j10O03n32K28j33K12P9N9m61k1K19k24k85K75
2723A34p2k52q9o3j00K01k31J73K7l5j00n0M9N90j1k56P3K08J4K95l00M5J55M1
2747D46J5oLk09l11K51K84l30l74m1R4O8jKm01M65k96o2l8J38p3L95J61k93P4
2772c9R9J90q8K55o3k20L07j9P2k79J7K5KR1j22k88j74K00l0k5p9j53j53J59R1
2797b24j3k4L39m95K29J98K4LJ2P6L37j07q4J3j30J68R9Ln17J10k8O6ML1j00m33
$$ plain form
2823 -443 -180 -229 -145 -472 -425 -494 -486 -144 -197 -44 -227 -42 -18 169 183 401 266 -84 243 82 548 287 303
2846 303 -18 102 194 -20 191 -35 -17 -48 -143 -420 -467 -271 40 -190 -188 -499 -25 -316 -22 -236 -121 21
2868 21 -23 112 52 237 348 140 507 407 260 97 295 492 321 -39 217 -63 -5 -84 -143 -132 -287 -473
2890 -473 -224 -436 -278 -349 -459 -258 -41 108 -56 -143 -73 345 -30 37 343 226 169 436 244 242 45 75 -6
2913 -6 426 174 -249 -86 -20 102 66 -250 -451 -532 -353 -249 -182 -459 -334 -542 -233 30 84 -135 19 385
2935 385 289 316 466 212 198 266 213 269 216 106 -84 51 312 350 -438 -291 -222 -359 -149 -270 -401 -308 17
2958 17 -464 -52 -58 -306 -13 -147 149 99 155 199 214 153 261 224 170 420 237 -100 160 410 98 -40 198
2981 198 98 -28 -186 -354 -342 -170 -153 -381 -401 -6 57 -468 -321 178 -223 81 109 77 -141 345 166 305
$$ packed form
2823d43K63m9Q4l27M7o9QL42n3J53j83J85K4J87J4K18j35l50L27j61M66k61J6
2846C03l21J20R2k14K11k26J8l1r5k77m7J96L11k30Kl11M74k91K94k14J15J42
2868B1m4J35o0J85J11k08L67j00j47j63J98J97j71l60K56k80N8p9n9J1j55j86
2890d73K49k12J58p1j10K01K17J49j64q7P0M18l75O7L06j17n7K67j92kj97L0q1
2913fM32k52m23J63O6J22l6l16k01q1J79J04O7k77J25k08L09K63N4k19J54L66
2935C85r6K7J50k54j4O8n3N6n3j10j90J35K61L8p88J47O9j37K10j21j31R3L25
2958A7m81M12ok48K93j34K96n0N6M4J5o1J08l7n4K50j83l37K60K50l12j38K38
2981A98j00j26j58j68J2J72J7k28k0L95O3n25J47M99m01L04K8l2k18M86j79J39
$$ plain form
3003 305 570 251 128 127 403 172 87 290 107 1 -103 218 -59 -25 150 -608 -329 -125 -380 -424 73 -90
3025 -90 -151 162 -158 -216 172 100 225 115 561 -57 -108 312 391 131 540 409 279 -94 -198 -58 -204 -36
3047 -36 -88 -424 -7 -102 -330 -263 -132 -349 -482 -34 -69 -233 50 -174 -518 174 467 148 239 517 225 -111
3069 -111 -1 402 112 193 193 -10 -139 234 -31 -149 21 -167 -423 -444 -131 -560 -214 -70 -160 -307 -137 -188
3091 -188 -222 -46 246 -107 211 354 -195 50 478 147 134 383 255 -291 337 210 -170 -13 133 11 -277
3112 -277 -240 -156 -191 -74 -41 -205 -291 -97 -363 -206 -72 -43 -331 221 396 -163 150 193 40 -27 384 -31 105
3135 105 410 5 -375 209 -74 121 -167 196 -160 -301 -86 -499 -202 84 33 -288 -174 -302 -285 -306 108
3156 108 -220 -301 92 110 -135 252 436 222 374 176 25 84 212 331 294 354 -117 -233 -149 242 -86 -59
$$ packed form
3003C05K65l19j23jK76k31q5K03j83j06j04L21k77L4J75p58K79K04k55m4M97j63
3025i0o1L13l20n8L88p2J25j10M46o18n1M20P9k60M09j31j30l73j04J40j46J68
3047c6n2l36M17r5k28O7J31k17j33M48l5j64K83k24l44O92K93l19R1K78k92l36
3069a11J10M03k90Q1%k03j29L73k65j18J70j88k56k1L13m29L46J44r0j47J70n1
3091a88l4J76K92l53L18J43n49K45M28l31j3K49j28n46O28j27l80J57J46j22k88
3112b77L7Q4l5J17L3j64q6J94k66J57J34K9k88N52J75n59L13M3j53o7M11m15J36
3135A05L05m05l80N84k83J95k88L63l56j41K15m13K97K86n1l21J14j28J7k1M14
3156A08l28q1L93J8k45L87J84k14J52j98j51N9J28J19l7O0m71j16Q4L91l28K7
$$ plain form
3178 -59 -83 -151 -434 -386 -156 -429 -197 41 -158 -273 26 -62 -201 55 145 20 340 210 195 -9 408 167
3200 167 116 76 284 172 162 -8 -388 -82 -49 -322 -224 29 -163 -441 -358 -235 -312 -82 213 -263 -156 -50
3222 -50 -241 27 4 344 130 198 83 -219 92 350 225 250 378 -104 -43 183 -143 67 -112 -91 -256 -336
3244 -336 -262 -303 -191 -152 -160 -217 -90 33 -209 -113 215 106 75 -20 97 -19 73 322 303 236 286 100 -98 340
3268 340 -58 168 250 33 -68 9 -507 -241 -186 -29 -134 -118 -266 -250 -100 -252 67 72 163 86 -47 25 186
3291 186 184 231 78 47 344 9 -82 144 202 173 171 -76 -193 -61 -32 -186 176 -99 -224 -241 -122 -446 -169 -55
3315 -55 -147 -228 -231 -46 -19 52 276 125 269 232 190 200 14 267 132 137 289 57 68 37 -113 -22 -74 -133 -304 -164
3341 -164 -338 -171 -188 -362 14 -46 -239 -58 -116 176 -19 37 54 184 184 131 384 -38 216 370 93 -23 125
$$ packed form
3178e9k4o8k83M8K30k73K32K38j99j15K99q8j39K56R0j25L20j30j5k04M17k41
3200A67n1m0K08j12j0j70l80L06L3k73R8K53j92k78Q3J23p7K30K95m76J07J06
3222e0j91K68k3L40k14O8j15l02L11K58j25K5J28m82O1K26l26K10j79K1j65q0
3244c36P4m1J12L9qn7J27J23k42R6L28j09l1r5J17j16R2K49j9o7N0j86j98M38
3268C40l98K26Q2k17j01P7n16K66N5J57j05J6j48J6J50j52L19NR1p7j33P2J61
3291A86kM7j53l1K97l35r1K26N8k9kk47j17J32K9j54L62k75j25j7J19l24K77J14
3315e5r2q1lJ85K7P1K24j51J44l7m2J0j86K53j35NJ52k32J1l1j50R1n2n9j71J40
3341a64j74J67j7j74L76o0j93J81n8K92j95N6J7J30%n3K53m22K54J54k77j16J48
$$ plain form
3364 125 1 78 72 -148 -34 -211 -158 -337 -215 -536 -42 -324 -371 -328 -110 77 29 -24 -216 -12 23 28 244 159
3388 159 167 90 -138 -124 333 244 243 278 -35 176 -14 -64 -47 67 -322 -255 -79 -250 -226 -263 -146 91 -136 -167 -304
3413 -304 -114 -140 -32 78 324 284 -9 71 297 -39 188 108 65 542 83 -17 203 184 112 23 -76 -95 -101 -297
3437 -297 -50 -2 -129 -14 -312 -183 -142 -163 -75 -167 9 -96 108 -6 40 -64 178 95 131 76 134 111 -47 240
3461 240 285 -165 -62 -111 1 250 28 18 -379 -359 98 199 159 -237 -226 -167 32 93 -19 -116 -111 274 259 176
3485 176 323 116 77 204 291 184 103 -154 -1 -109 86 -15 5 -116 224 -311 -62 -154 -361 -114 -158 -47
3507 -47 -200 -102 -47 79 86 151 28 264 293 38 115 295 266 -43 188 503 180 -16 173 89 112 81 -154 -343
3531 -343 -132 -241 -251 -294 -38 -138 -133 -227 -20 116 -148 -186 -99 -21 58 -315 -38 -55 41 176 52 241 22 33
$$ packed form
3364A25j24P7ok20J14j77N3j79J22l21M94k82m7M3K18J87m8n3j92K04L5NK16q5
3388A59Qp7k28J4M57q9jL5l13K11j90n0J7J14l89O7J76j71K4l7J17K37k27l1j37
3413c04J90k6J08J10K46m0k93Q0K26l36K27q0m3M77m59j00K20j9p2q9r9j9oj96
3437b97K47M8j27J15k98J29M1k1Q8r2J76j05K04j14M6j04K42q3L6n5N8k3j58K87
3461B40M5m50J03m9J12K49k22j0l97K0M57J01m0l96J1N9J99O1j12r7NL85j5q3
3485A76J47k07l9J27Q7j07q1k57J53j08J95j01K0j21L40n35K49r2k07K47m4J11
3507d7j53R8N5J26PO5j23K36K9k55P7J80k9l09K31L15l23j96J89q4K3l1k35j89
3531c43K11j09j0m3K56j00Nr4K07J36k64l8Q7P8P9l73K77j7R6J35j24J89k19J1
$$ plain form
3555 33 423 38 197 321 -40 -238 -10 11 -44 -71 -102 -114 -186 -134 -398 -48 -46 -49 -208 127 -81 -36 -54 194 -53
3580 -53 62 297 142 93 183 0 -292 185 382 30 -97 148 -268 -272 104 106 -292 -14 210 -285 -27 -64 -367
3603 -367 -156 74 84 -303 -188 -79 -359 -100 146 466 315 220 -43 74 148 262 -7 275 225 174 -12 -88
3625 -88 -157 -94 -57 92 -195 -136 85 -229 -379 97 -293 -243 -68 -220 -42 134 154 -100 -99 338 -67 106 268
3648 268 315 -63 271 -37 214 361 299 140 86 41 -265 73 -171 -129 -532 135 -123 -222 -110 110 -71 -222
3670 -222 120 -152 -123 109 -146 1 233 339 122 379 313 454 226 102 -18 -18 243 44 -155 -1 164
3691 164 -56 -94 -157 -96 -253 102 -250 -230 -162 -114 57 -237 -36 -44 -241 117 70 -94 112 276 134 205 212 160
3715 160 -15 31 95 90 -209 25 -125 -280 155 -101 -208 -24 -27 -184 78 -157 -93 -142 234 -36 -155 -55 12
$$ packed form
3555C3L90l85J59J24l61j98K28K1n5k7l1j2p2N2k64L50Klj59L35k08M5j8K48k47
3580e3J15K35j55m9R0j83k92M77J97l52j27K45m16mL76Kl98K78K24m95K58l7l03
3603c67K11K30J0l87J15J09k80K59K46L20j51r5k63J17P4J14k69K82n0n1j86p6
3625h8o9O3L7J49k87N9K21l14j50M76l90N0J75j52J78J76K0k54JM37m05J73J62
3648B68M7l78L34l08K51J47o2j59n4m5l06L38k44M2m03O67k58r9J12K20j81j51
3670b22L42k72K9K32k55J47K32J06k17K57o6J41k28j24j20%K61j99j99J54J65
3691A64k20l8o3O1j57L55l52K0O8M8J71k94K01qj97L58m7j64K06J64j42P1Pn2
3715A60j75M6O4nk99K34j50j55M35k56j07J84lj57K62k35O4m9L76k70j19J00O7
$$ plain form
3738 12 138 -223 -270 29 214 331 -166 -39 328 276 -127 123 76 138 -151 286 -250 -21 100 -326 103 -308
3760 -308 -16 -13 -65 -131 -52 -9 -10 -105 -91 -208 89 -66 76 109 243 207 179 -50 161 185 144 251 95 -54 212
3785 212 -110 -59 -268 34 -52 -144 -241 -351 -192 -206 -301 -100 -16 -259 -189 -125 -111 -83 -55 -18 319 246 -81 174 40
3810 40 172 285 41 153 116 319 -38 88 154 -239 -142 9 -173 -191 -341 -153 -200 -5 -64 -37 30 -35 -170
3833 -170 183 -167 -57 3 76 5 -153 275 185 2 81 149 197 -68 114 193 245 118 -94 -111 -146 -82 56 -100
3857 -100 -133 -3 -18 -125 -208 -66 -186 47 39 -8 -110 73 -28 4 179 34 100 16 114 432 155 196 131 19
3881 19 -71 35 6 -256 -42 -274 165 -146 -6 -344 55 -266 -240 7 -42 60 -402 -106 21 80 90 131 60
3904 60 169 56 8 206 214 -133 247 334 26 -120 199 64 -14 -206 -85 135 -219 -145 -121 -162 -267 -67 -111
$$ packed form
3738A2J26l61m7K99J85J17m97J27L67n2m03K50m7O2k89M37n36K29J21m26M29m11
3760c08K92Ln2o6P9M3jr5J4j17K97j55J42L3J34l6k8k29K11K4m1J07j56j49K66
3785B12l22N1k09L02q6r2r7j10J59j4r5K01Q4k43P0O4J4K8K8L7L37p3l27K55j34
3810D0J32J13k44J12l7K03l57J26O6l93R7J51j82j8j50J88m7J95n9K7O7o5j35
3833a70L53l50J10O0P3p1j58M28r0j83P9O8M8k65J82P9N2j27k12j7l5O4J38j56
3857a00l3J30j5j07q3J42j20K33qm7j02J83j01L2J75j45O6q4R8L18k77M1o5j12
3881A9r0J06k9k62K14k32M39l11J40l38L99l21K6K47m9J02m62K96J27N9J0M1p1
3904F0J09j13m8J98Ql47L80Q7l08j46L19j35p8j92J21K20l54P4K4m1j05K00m4
$$ plain form
3927 -111 -326 3 71 -126 -23 285 -30 -72 21 240 121 80 64 -14 35 199 157 217 -101 132 -198 -176 28
3950 28 85 -84 -242 -430 63 -135 -105 96 -162 -260 26 -64 -203 -117 68 -110 -176 109 495 -48 -24 308 339
3973 339 84 250 208 269 -59 -108 -167 221 -27 -197 -215 -100 -29 -223 -43 -171 -145 -33 -300 132 -119 287
3995 287 -199 277 -4 136 55 30 239 -60 51 360 237 213 116 -30 6 78 72 -210 98 46 -509 -134 -63
4018 -63 -301 -436 -259 -85 -152 -5 24 132 -21 110 -154 -174 49 157 265 109 214 123 214 88 195 184
4040 184 97 -183 -217 131 204 -199 138 145 -83 74 -11 4 -151 41 24 -103 -31 119 -120 -252 392 -71 41
4063 41 174 101 -122 333 65 152 491 175 -105 177 74 189 -51 54 107 -484 -306 -180 -225 46 154 -73
4085 -73 -299 -237 -150 -68 15 72 -227 11 -14 131 66 135 251 231 3 265 -234 39 396 -51 17 279 -159 -74
$$ packed form
3927a11k15L29O8j97J03L08l15m2R3K19j19m1j6p8M9J64m2O0l18K33l30K2K04
3950B8N7j69j58j88M93j98L0K01k58r8K86r0j39Q6J85j78o6K85L86n43K4L32L1
3973C39k55J66m2O1l28m9n9L88k48j70j8J15P1j94J80j28K6J12k67M32k51M06
3995B87m86M76k81J40q1k5K09k99J11L09j23k4r7j46L6P2ok82L08n2n55L75P1
4018f3k38j35J77J74o7J47K9J08j53J31k64k0K23J08J08j56J05r1R1j26J07j1
4040A84q7k80l4L48P3m03L37Pk28J57q5J5j55J92j7j27P2J50k39j32O44m63J12
4063D1J33p3k23M55k68Q7L39l16k80K82j03J15k40J05N3n91J78J26m5K71J08k27
4085g3k26O2Q7Q2Q3N7k99K38k5J45o5O9J16k0k28K62m99K73L57m47O8K62m38Q5
$$ plain form
4109 -74 159 197 -56 -213 134 -81 51 -197 -440 -237 -183 -48 -143 38 86 -201 116 -71 151 -137 290 126
4131 126 -48 430 192 -127 -36 359 16 15 -4 27 156 -71 -108 -337 -124 85 -195 -185 -146 -127 -3 111 -26
4154 -26 40 159 -30 -176 113 129 -204 23 205 -147 -67 199 36 19 156 218 -330 4 124 -8 53 -112
4176 -112 -148 -302 -124 73 -47 -275 48 -309 -387 -14 -78 -299 213 148 -154 166 132 -34 144 71 -33 150
4198 150 268 88 80 165 -9 -13 111 160 -108 -169 -129 -42 -325 -16 26 -143 -141 -50 -64 -305 -163 -169 45 125 182 120
4224 120 -85 -260 135 19 194 91 -74 4 228 0 309 248 126 -116 -7 21 -133 83 116 -181 -66
4245 -66 -165 86 -225 -258 119 -189 168 -188 -238 -120 5 246 210 309 57 337 178 -10 -57 249 466 166
4267 166 168 209 145 -113 -17 -62 -19 151 -52 -286 -305 -153 -189 -291 -112 -39 114 112 -182 182 -78 383 -135 20
$$ packed form
4109g4K33L8k53j57L47k15J32k48k43K03N4J35r5J81M8k87L17j87K22k88M27j64
4131A26j74M78k38l19R1L95l43jj9L1J29k27l7k29K13K09k80J0L9J9J24J14j37
4154b6O6J19j89j46K89J6l33K27J82l52Q0K66j63j7J37O2n48L34J20j32O1j65
4176a12l6j54J78J97j20k28L23l57p8L73o4k21N12o5l02L20l4j66J78p3j04J83
4198A50J18j80qQ5j74mJ24M9k68o1M0Q7k83L09M2j69KR1j4k41J42oK14Q0N7o2
4224A20k05j75L95j16J75j03j65P8K24k28L09o1j22k42J09K8j54K16L3k97J15
4245f6r9K51l11l3L77l08L57l56n0J18J25K41l6R9k52K80j59j88m7L06K17l00
4267A66KM1o4k58R6m5M3J70k03k34j9J52l6j02J79P3J53kk94L64k60M61n18J55
$$ plain form
4291 20 -59 70 200 184 277 190 77 -26 117 -75 165 -258 -264 148 -153 88 -309 -65 -221 -243 117 -103 155
4314 155 -23 -23 52 -203 -150 100 59 202 -62 186 96 144 278 214 43 293 72 58 -4 151 52 194 -59 -134
4338 -134 15 -269 -82 -81 -72 -44 -115 -131 -148 30 -175 51 116 54 236 115 76 -27 175 309 157 13 134 120
4362 120 161 -72 95 294 -16 -241 201 119 -83 103 -128 169 -138 -203 31 -122 -174 -239 -156 -170 -201 -142 108
4385 108 -61 68 68 172 214 145 104 84 -5 246 212 280 -19 85 73 -57 -210 0 -32 -463 -130 -347 -70 -257
4409 -257 -103 -258 -152 -263 48 -10 -186 189 -7 74 115 69 266 290 198 74 -23 258 -196 121 5 -81 -160
4432 -160 -3 220 -159 -226 -209 -150 -219 -271 -311 -157 49 7 -53 -6 275 -160 -39 305 52 16 -119 -39 289 31
4456 31 -20 90 144 -41 15 2 81 -169 -212 49 -30 -18 -124 -334 -313 -37 -24 -277 -104 -148 -83 -154 -215 -64 98
$$ packed form
4291B0p9J29J30j6R3q7j13j03J43j92K40m23oM12l01K41l97K44j56k2L60k20K58
4314A55j78%P5k55N3K50m1J43k64K48r0M8J34o4j71K50k21j4o2J55r9J42k53p5
4338a34J49k84J87JRK8p1j6j7J78k05K26O5o2J82j21l9j03K02J34j52j44J21j4
4362A20M1k33J67J99l10k25M42q2k02J86k31K97l07o5K34j53n2o5Q3j4l1N9K50
4385A08j69J29%J04M2o9m1k0q9K51l4O8k99J04j2j30j53K10l2m31L33k17K77j87
4409b57J54j55J06j11L11n8j76L75j96Q1M1m6J97K4r2j24r7K81m54L17j16q6p9
4432a60J57K23l79o7J7N9o9n2m0J54K06m2o0M7K81m35J21L44k53l6j35Q0L28k58
4456C1n1J10N4j85N6j3P9k50m3K61p9J2j06k10K1K76J3k53J73m4O5p1o1J51J62
$$ plain form
4481 98 215 118 198 -234 -124 -72 131 -7 280 117 215 165 314 0 -81 43 -72 -205 -117 21 -237 -35 -319
4504 -319 149 -134 -27 -217 -196 -220 -177 161 96 333 29 115 381 110 235 163 210 236 348 104 45 205 201 33
4528 33 125 13 -110 48 -38 -91 -213 -143 -288 -302 -60 -48 40 -40 -208 -147 -195 180 -165 -122 109 -18 -128 63
4552 63 326 113 190 10 99 367 238 -137 109 34 88 -252 -354 -157 -252 340 -380 179 -238 -85 -283 -355
4574 -355 44 -176 -1 166 194 185 -10 104 202 144 -164 107 51 194 72 66 -189 -45 97 -2 -25 47 6 101
4598 101 37 -74 -165 -156 -112 -170 -161 -24 -186 167 191 41 -40 89 94 197 195 143 87 -221 222 330 177 42 41 113
4624 113 127 -163 -331 28 -45 -253 -71 -11 -271 -167 119 -235 -10 -98 60 -161 66 -29 -184 113 358 8
4646 8 -54 265 269 167 342 -84 18 494 147 97 66 256 -125 -74 59 1 -202 -231 27 -79 -274 -203 -59 -67
$$ packed form
4481I8J17r7Q0m32J10N2K03j38K87j63R8n0J49l14q1J24j15j33Q8J38k58K02k84
4504c19M68k83J07j90K1k4M3L38o5K37l04Q6K66k71J25p2M7K6J12k44n9J60mj68
4528C3R2j12j23J58q6n3j22P0j45j4K42J2Q8q0j68O1m8L75l45M3K31j27j10J91
4552F3K63k13P7j80Q9K68j29l75K46p5N4l40j02J97r5N92p20N59m17J53j98p2
4574c55L99k20J75J67K8rj95J14R8n8l08K71n6J43j22ok55J44J42r9k3P2m1R5
4598A01o4j11r1RM4n8RJ37j62L53K4j50q1J29NJ03kn2n6l08M43J08j53j35jP2
4624A13J4k90j68L59p3k08J82O0k60J04K86l54K25q8J58k21K27r5j55K97K45l50
4646Ho2L19Mj02J75m26J02M76l47n0l1J90l81N1J33n8k03k9K58j06j95P1J44q
$$ plain form
4670 -67 34 -222 -7 -171 -7 379 315 174 186 118 167 74 11 179 163 70 3 -108 -3 -34 116 168 -86 -303
4694 -303 -94 -30 -181 -135 -230 -272 -118 -175 -543 -119 -339 -52 -18 106 -11 30 -1 49 137 196 118 100 187 46 152
4719 152 -71 262 27 26 16 -120 -163 -60 -360 -159 51 -1 -247 -129 -64 -41 -14 212 -94 142 97 -7 -8 89
4743 89 124 52 19 228 218 -238 -53 -26 134 -59 123 102 46 -312 -173 -361 -102 118 -64 -106 -250 -253 -212 -92
4767 -92 -19 -200 1 -72 138 201 258 457 -57 200 -132 188 357 194 -135 200 -69 217 8 119 153 59
4789 59 -55 148 -127 -108 -301 -107 -130 -330 -106 -27 -70 -207 -25 117 11 -44 44 266 276 106 -63 283 185
4812 185 74 81 28 181 167 28 -100 73 53 -164 -114 -182 62 -102 -308 -183 -2 -141 -146 -229 -140 -119 -224 169
4836 169 171 278 -227 -31 116 11 222 64 -91 96 -2 78 -186 104 115 26 -188 -78 245 -253 -218 -114
$$ packed form
4670f7J01k56K15j64J64L86o4j41J2o8M9r3o3J68j6r3o7j11J05l1J50N2k54k17
4694c03K09O4j51M6r5m2J54n7l68M24k20K87L4J24j17M1l1N0Q8N9p8j8Q7j41J06
4719A52k23L33k35jj0j36m3J03l00K01K10n2k46J18O5K3K7K26l06K36m5j04jR7
4743H9L5p2l3K09j0m56J85K7J60j93J82k1n6l58J39j88K59K20j82m2j44lM1J20
4767i2P3j81K01p3K10O3N7J99n14K57l32L20J69j63l29L35k69K86k09J11L4r4
4789E9j14K03k75J9j93J94k3k00K24P9m3j37J82J42j06n5Q8K22J0j70j69L46r8
4812A85j11Pn3J53j4j39j28J73k0k17N0o8K44j64k06J25J81j39nq3Q9K1j05L93
4836A69KJ07n05J96J47j05K11j58j55J87r8Q0k64K90J1q9k14J10L23m98L5J04
$$ plain form
4858 -114 -220 -468 -444 -638 -108 -240 -447 -31 -100 -42 150 23 304 182 -292 1 266 50 242 74 33
4879 33 106 -23 149 -212 85 19 126 -38 -151 -133 -240 -102 -3 -84 -148 -218 13 -140 29 -119 -124 202 -76
4902 -76 -3 315 -33 98 80 -19 -23 243 293 135 99 117 -38 33 -117 -198 -63 -450 -270 -243 67 -170 -75 152
4926 152 -126 -202 0 184 -15 5 6 185 244 57 241 -8 229 16 187 114 112 115 211 85 122 1 -52 -214
4950 -214 -72 -180 -48 163 -202 -49 8 52 30 -17 -101 120 51 -251 227 -25 -92 113 239 186 146 121 24 287
4974 287 202 55 61 54 -171 76 -13 -233 -40 -233 -108 -118 -239 -222 -182 -281 -431 -132 23 -45 -120 -227 -324 -13
4998 -13 42 -9 175 229 21 67 131 236 123 -7 263 26 268 68 -178 -79 80 -294 -50 134 -232 -178 14
5021 14 -73 -143 -212 189 -180 -133 74 -66 188 51 38 -38 131 415 185 -78 266 162 130 424 22 22 20 -114
$$ packed form
4858a14j06k48K4j94N30j32k07M16o9N8J92j27K81j22m74K93K65k16J92j68m1
4879C3P3j29J72l61K97o6J07j64j13J8j07J38R9q1o4p0K31j53J69j48nL26k78
4902g6P3L18l48J31j8r9mK66N0j58l6J8j55P1j50q1J35l87J80K7L10k37R5K27
4926A52k78p6K02J84j99K0JJ79N9j87J84k49K37k13J71p3kLR6j26L7j21n3j62
4950b14J42j08J32K11l65J53N7M4k2m7q4K21o9l02M78k52o7K05J26n3m0k5r7K63
4974B87q5j47Opk25K47q9k20J93j93J25j0j21J7M0r9j50K99J55o8p5j07r7L11
4998a3N5n1J84N4k08M6O4J05j13j30K70k37K42k00k46R9J59l74K44J84l66N4J92
5021A4q7p0o9M01l69M7K07j40K54j37j3p6J69K84k30k63L44j04l2K94m02%kj34
$$ plain form
5045 -114 -189 13 -26 -258 -97 52 -291 -42 60 -321 -116 92 211 -104 19 -79 258 58 41 108 172 157
5067 157 202 201 291 35 -79 318 155 12 -118 50 -157 -248 -143 -191 -53 -330 -138 11 158 -121 -103 97
5089 97 -264 -116 -126 -81 130 36 13 439 149 169 23 280 -65 226 403 218 97 153 -219 52 67 -34 91
5112 91 -169 27 -88 76 -78 -108 -84 128 -84 -67 206 34 16 132 93 69 -21 66 137 204 186 248 29 178
5136 178 439 247 260 378 -130 100 210 -124 14 -354 -135 -216 -161 -301 -349 -212 -83 -163 -185 23 50 -290
5158 -290 181 -9 45 325 122 56 103 118 184 98 220 357 156 25 103 157 -280 -38 -205 -222 -275 -6 -188
5181 -188 -7 -192 -197 -58 -176 39 -203 43 -49 -248 193 294 -44 87 286 187 154 258 190 -60 312 209
5203 209 36 -137 122 -295 -165 -160 -264 -298 -148 43 -360 -66 -126 -121 -283 -273 -251 -124 109 248 -148 -123 210
$$ packed form
5045a14p5K02l9k32J61J49l43K49J02l81K05K08J19l15J23r8L37k00j7O7O4j5
5067A57M5jR0k56j14L97j63j43j30J68k07r1J05m8J38k77J92J49J47k79J8K00
5089I7l61J48j0M5K11r4k3M26k90K0j46K57l45K91J77j85j21N6l72K71J5j01J25
5112I1k60J96j15J64j54l0K4K12k12J7K73j72j8J16l9k4r0Q7P1O7j8O2k19J49
5136A78K61j92J3J18n08K30J10l34J38l68K19q1N5j40m8J37J29q0k2K08K7l40
5158b90M71j90N4K80k03o6M7J5O6q6J22J37k01j31P8N4m37K42j67j7n3K69j82
5181a88J81j85nJ39j18K15k42K46r2j99M41J01l38J31J99r9l3J04o8k50L72j03
5203B09j73j73K59m17J30Nj04l4J50J91m03K94o0Nj62J0K2J27K33J39l96K5L33
$$ plain form
5226 210 -95 50 108 125 142 39 223 30 107 -137 -194 100 -417 5 -11 87 29 -1 -179 -190 71 -19 -138 -8
5250 -8 -161 -26 25 191 -2 19 -93 -243 316 201 -93 259 84 72 195 -22 161 49 -29 -72 98 43 -25
5273 -25 -194 -78 -292 -56 -25 -76 -9 7 -56 66 205 95 -70 42 104 -189 5 42 125 371 -54 226 65
5296 65 -39 151 -15 233 -11 40 -206 -276 -279 -228 41 -274 -78 -97 -211 -71 -83 -120 -59 40 -17 9 -45 93 47
5321 47 -91 99 279 97 19 109 -125 -83 -33 308 -4 24 135 -152 24 -160 4 -320 -136 -71 -370 -204
5343 -204 -155 106 -100 121 3 -139 196 -3 136 240 105 202 139 -37 -108 341 53 47 227 51 114 -221
5365 -221 -189 68 77 95 -251 -151 29 -82 -206 -5 13 -544 -113 -228 -201 154 148 -7 -84 -35 10 88 -69 -89
5389 -89 -27 90 94 130 70 406 144 214 257 50 -8 -84 -106 -81 -81 -282 -48 -447 -262 -11 -242 -367 -104 -36 -109
$$ packed form
5226B10l05J45N8J7J7j03J84j93P7k44n7K94n17M22j6R8n8l0j78j1K61r0j19J30
5250hj53J35N1J66j93K1j12j50N59j15k94L52j75j2J23k17J83j12p8m3J70n5o8
5273b5j69J16k14K36L1n1O7J6o3J22J39j10j65J12O2k93J94L7Q3K46m25K80j61
5296F5j04J90j66K48k44N1k46p0lN1K69l15J96j9j14J40j2l7O1R9n7K6n4J38m6
5321D7j38J90J80j82p8R0k34M2N0L41l12K8J11k87J76j84J64l24J84O5k99J66
5343b04M9K61k06K21j18j42L35j99J39J04j35R7o3j76p1M49k88oJ80j76O3l35
5365b21L2K57RJ8l46J00J80j11j24K01J8n57M31j15K7L55oj55p7M9M5P8j57k0
5389h9O2J17ML6o0L36k62P0M3k07n8p6k2K5%k01K34l99J85K51k31j25K63O8p3
$$ plain form
5414 -109 -86 -128 380 48 72 132 221 42 -73 66 73 -96 210 143 158 146 -71 54 151 12 -129 -206 69 -209
5438 -209 -67 -322 -199 63 -61 -250 -130 54 6 191 63 111 45 86 -97 282 43 -83 235 410 107
5459 107 35 -10 97 47 -118 -139 -237 -87 -235 -77 -170 -111 78 -183 -202 33 -36 102 12 -272 -110 206 -211
5482 -211 9 -84 261 120 272 172 214 307 110 144 -109 211 159 -336 239 73 194 231 -427 -208 145 -114
5504 -114 -257 -181 -101 -55 -10 -190 -136 76 213 -95 -67 -28 220 185 123 -67 296 37 -82 412 54 -46 -208
5527 -208 -71 -35 -19 139 -137 -161 -43 11 159 -214 -176 -220 -150 37 -131 -20 65 -234 15 -78 301 139 131 194
5551 194 119 118 163 97 158 78 199 153 73 -23 -20 -307 180 -263 -177 -39 -360 -270 -315 -49 -16 -73 -52 -21 -34 -144 -191
5578 -191 28 266 46 355 302 38 46 312 53 -12 220 226 245 79 17 -63 -44 26 -66 -311 40 -177 -306 -108
$$ packed form
5414a09K3m2N08l32K4O0Q9j79j15J39Pj69L06o7J5j2k17J25R7j39j41p7K75k78
5438b09J42k55J23K62j24j89J20J84m8J85j28M8o6M1j83L79k39j26L18J75l03
5459A07p2m5J07n0j65k1r8J50j48J58r3N9J89k61j9K35o9J38r0k84J62L16m17
5482b11K20r3L45j41J52j00M2R3j97L4k53L20n2m95N75j66J21L7o58K19L53k59
5504a14j43P6Q0M6M5j80N4K12J37l08K8L9K48l5o2j90L63k59j19M94l58j00j62
5527b08J37L6J6J58k76k4J18N4J48l73L8m4P0J87j68J11Q5k99K49r3L79j62qO3
5551A94p5jM5o6O1q0J21m6q0r6Lk87M87m43Q6J38l21R0m5K66L3n7K1L1j3j10m7
5578a91K19K38k20L09n3k64QK66k59o5K32OJ9j66o2q0J9P0r2k45L51k17j29J98
$$ plain form
5602 -108 -64 -327 34 2 44 -80 41 100 114 -42 -69 12 235 52 61 -17 273 -34 24 124 134 -144 173 -149
5626 -149 -122 85 -304 -163 -249 -230 -147 -18 -1 -193 -300 22 -199 -194 -48 370 -74 -35 -197 120 156 235 46
5649 46 -307 284 12 -18 131 379 -144 -215 158 -19 -244 -121 -41 -171 -242 29 -192 -135 84 -565 -82 -69
5671 -69 53 201 -113 -139 -11 172 254 44 55 221 23 -77 239 386 22 150 -129 126 -144 -39 126
5692 126 -45 -90 10 -297 -177 111 -337 -135 56 11 -344 16 -171 -262 160 -159 95 221 327 22 292
5713 292 -13 -13 118 226 184 168 130 -6 -80 83 -178 -48 -104 -223 -479 29 26 -170 62 -155 -83 -238 185
5736 185 -113 34 -17 -75 -24 36 346 -21 -41 279 67 238 71 321 -115 49 -246 -135 35 15 1 -100
5758 -100 -283 -488 -250 -95 220 25 -163 -244 -166 32 -15 -104 137 -1 -60 128 194 87 -61 -93 138 121 185
$$ packed form
5602a08M4k63L61l2M2j24J21N9J4j56k7Q1K23j83Rp8K90l07N8J00J0k78L17l22
5626a49K7K07l89J41q6J9Q3J29J7j92j07L22k21NJ46M18m44L9j62L17L6P9j89
5649D6l53N91k72l0J49K48n23p1L73j77k25J23Q0j30p1K71k21N7K19o49M83J3
5671f9J22J48l14k6J28J83Q2k10J1J66j98j00L16J47l64J28k79K55k70J05J65
5692A26j71m5J00l07J20K88m48K02J91m5l55L60j87r1M22l19K54J26J06l05K70
5713B92l05%J31J08m2j6l8j36p4J63k61J30n6j19k56N08lj96K32k17P2j55M23
5736A85k98J47n1n8N1O0L10l67k0L20k12J71j67K50m36J64k95J11J70k0j4j01
5758a00j83k05K38J55L15j95j88q1P8J98m7q9K41j38n9J88O6j07j48l2K31j7O4
$$ plain form
5781 185 0 127 45 206 -34 314 -120 -45 35 71 -142 -292 -136 -404 -1 -12 -51 88 -192 -91 58 -100
5803 -100 228 124 24 -79 67 -106 141 -146 -184 120 29 200 282 135 26 67 -58 -68 -79 -135 -244 -141
5825 -141 -198 -183 -84 -125 -29 -189 -46 -85 233 -77 139 384 -31 -95 56 224 236 -82 -30 316 -207 -6 82
5848 82 -43 -206 -49 78 -203 -244 231 -72 -132 -446 -121 -373 -76 -23 22 -85 -22 -160 41 41 113 32 107 182
5872 182 64 191 235 265 -60 -59 -65 162 219 -166 232 -208 -345 46 -34 27 -231 -285 -148 42 140 111 -193 -52
5896 -52 -76 29 -87 -92 269 -43 153 49 249 49 -44 265 -7 108 17 -116 -164 -95 176 -6 -16 -100 -86 289
5920 289 89 10 78 116 215 -60 59 -154 -74 -184 15 106 113 -69 186 53 71 -24 -83 -20 55 -30 210 -88 106
5945 106 -76 -61 6 140 -1 -36 -310 -90 -201 -140 -275 -146 -31 92 -92 -186 -38 -62 222 225 179 -118 -1
$$ packed form
5781A85j85J27q2J61k40L48m34P5Q0L6k13j50J56k68M03j1l9J39k80J01J49j58
5803a00L28j04j00j03J46j73K47k87l8L04r1J71Q2j47j09M1j25j0j1n6j09J03
5825a41n7J5R9m1R6j60J43l9L18l10K16K45m15o4J51J68J2l18N2L46n23K01Q8
5848H2j25j63J57J27k81m1M75l03o0l14L25k52K97N3M5j07O3j38K01%P2q1P5P5
5872A82j18J27M4L0l25JoK27N7l85L98m40j37L91q0O1k58n4J37J90R8k9l04J41
5896e2k4J05j16nL61l12J96j04K00k00r3L09k72J15r1j33m8O9K71j82j0q4J4L75
5920B89k00p9O8L8R9k75J19k13Q0j10J99R1Pj82K55j33J8r5n9O3P5q5K40k98J94
5945A06j82J5O7J34j41l5k74K20j11O1j35J29J15J23j84r4J48k4K84Lm6k97J17
$$ plain form
5968 -1 22 318 239 190 76 235 -118 29 -47 175 -63 -91 -88 81 -63 -382 -206 -420 -190 -82 -120 -29 -21 -138
5992 -138 -56 103 202 -41 86 39 102 88 75 -39 -132 395 -1 322 103 138 166 -50 39 -95 -18 -61 78 -248
6016 -248 -112 -81 -62 -243 17 -280 -179 -183 -232 -165 -66 -80 68 218 9 181 367 246 -68 146 -17 129 128
6039 128 135 -149 -119 106 68 30 21 -116 -183 -139 -127 -78 -89 30 12 1 -47 -186 -182 -21 -183 112 174 20 -75 39
6065 39 -56 -64 249 -58 -105 324 -125 30 -46 -86 -153 -174 13 -215 -139 -30 -109 -34 -98 45 -96 -274 -197 -181 130
6090 130 244 -17 103 50 103 -89 -122 -47 158 79 -150 156 -110 268 146 81 136 -215 -86 -173 -54 -122 -15
6113 -15 160 -396 -333 -80 -104 1 9 -115 155 44 -124 -39 -91 34 72 302 183 114 -57 38 -52 -19 195 229
6137 229 10 37 25 278 20 -189 -121 -39 -398 -182 -429 -67 -171 -31 -7 -58 -70 -18 -101 68 -98 252 181
$$ packed form
5968aK3K96p9m9j14J59l53J47p6K22k38k8LJ69j44l19J76k14K30J08l8R1Qj17
5992a38Q2J59R9k43J27m7O3j4j3j14r3N27l96L23k19L5K8k16Q9j34P7m3J39l26
6016b48J36L1J9j81K60k97J01mm9O7R9j4J48J50k09J72J86j21l14K14j63J46j
6039A28Pk84L0K25l8l8rj37o7M4J2M9j1J19j8j1m8j39MJ61j62K95O2j54r5J14
6065C9r5qL13l07m7M29m49J55p6m0o7k1J87k28P6J09p9P5o4J43j41j78P7J6L11
6090A30J14k61J20n3N3j92l3P5K05p9k29L06k66L78j22o5N5l51J29q7J19o8J07
6113a5J75n56O3K53k4J05Qj24K70j11j68Q5n2J25L8K30j19o9j71R5r0L3K14L4
6137B29k19K7j2K53k58k09O8Q2l59K16k47L62j04J40K4n1j2N2q3J69j66L50p1
$$ plain form
6160 181 -16 97 207 154 75 165 -184 49 202 55 -16 -131 1 -121 -109 -95 -343 -295 -74 69 177 -67
6182 -67 43 -15 -288 -226 -28 -84 -145 108 21 -152 296 197 71 198 213 145 92 84 -60 56 -126 173 86 24 -26
6207 -26 -353 -83 -157 -241 -198 -231 27 -11 -260 -52 -383 -284 261 110 -84 115 188 105 325 15 70 131 214 100
6231 100 -267 193 -197 52 131 17 -120 -339 94 -136 86 -342 -63 2 -72 94 -323 -183 -62 -141 -161 7
6253 7 22 260 134 100 -147 -138 44 -25 78 203 -65 -23 117 36 334 -170 46 47 -142 192 -2 -20 -92 -73 -148
6278 -148 -283 -25 -256 -135 131 128 109 -176 -69 21 128 -32 -27 133 55 150 186 -91 135 67 -311 -303 -48 51
6302 51 -27 -41 -84 -147 -132 2 -246 -194 -8 -55 -92 -331 65 -55 -135 38 179 58 -3 109 -13 49 230 27
6326 27 31 86 99 -69 68 197 175 108 109 112 -223 -176 -171 -13 -335 81 -194 27 103 -89 38 -68 33 78 6 54
$$ packed form
6160A81j97J13J10n3p9R0l49K33J53j47p1j15J32j22J2J4k48M8K21J43J08k44
6182f7J10n8k73O2J98n6o1K53q7j73M48r9j26J27J5o8n3qj44J16j82K99q7o2n0
6207b6l27K70p4q4M3l3K58l8k49K08l31R9N45j51j94J99P3q3K20l10N5O1Q3j14
6231A00l67M60l90K49P9j14j37k19M33k30K22m28K79O5p4J66m17J40J21p9k0J68
6253GJ5K38j26l4k47RJ82o9J03J25k68M2J40q1K98n04K16Jj89L34j94j8p2J9p5
6278a48j35K58k31J21K66lj9k85J07R0J07j60NJ60p8R5L6k77K26o8l78QK55R9
6302E1p8j4m3o3J5J34k48N2J86m7l7k39L96j20q0J73J41j21o1J12j22O2J81k03
6326B7MN5J3j68J37J29k2o7JLl35M7NJ58l22M16k75K21P6j92J27j06J01M5p2M8
$$ plain form
6352 54 -31 -89 25 -181 100 235 367 49 94 -92 -107 14 -37 191 -135 -136 35 -18 -87 -219 -140 -12 12 -46
6376 -46 -14 -16 -120 -233 12 147 -34 -118 -1 173 258 3 62 280 165 70 71 140 322 83 14 27 -164 172
6400 172 -26 72 -49 -28 -99 -158 -94 -182 -125 -215 113 8 172 -129 -2 -95 55 -1 -217 74 177 110 198 153
6424 153 -74 46 60 44 112 -102 148 -82 -6 -50 -153 43 -99 -203 -210 -87 -14 -44 -114 -106 -164 -53 -140 85 -42
6449 -42 261 220 -22 200 91 324 -128 242 -41 47 -34 48 -60 -88 -48 153 -61 31 -228 -236 -114 -151 -313 -238
6473 -238 180 -410 -41 -299 -33 93 82 233 107 -19 231 267 354 74 -176 71 186 144 30 380 66
6494 66 -37 -100 -236 -251 -183 -181 5 -209 202 -334 -125 186 17 -103 73 179 -140 90 30 -41 -75 202 -139
6517 -139 221 176 1 121 266 126 26 -197 -1 -12 4 5 -147 58 -100 118 67 -185 -46 73 10 -67 -39
$$ packed form
6352E4q5n8J14k06K81J35J32l18M5j86j5J21n1K28l26jJ71n3o9j32P9J28K4n8
6376d6L2kj04j13K45J35j81q4J17J74Q5k55N9K18j15r5JO9J82k39o9J3j91L36
6400A72j98R8j21K1p1n9O4q8N7r0L28j05J64l01J27r3J50n6k16K91J03o7Q8m5
6424A53k27J20J4j6O8k14K50k30P6m4j03J96j42j04pJ23P3l0p0Qn8J11q7K25j27
6449d2L03m1k42K22j09K33m52L70k83Q8q1Q2j08k8M0K01k14R2k59qJ22l7j62P5
6473b38M18n90L69k58K66J26j1J51j26j26K50L6Q7k80k50K47J15m2j14L50l14
6494F6j03o3j36j5O8KJ86k14M11n36K09L11j69j20J76J06l19K30o0p1l4K77l41
6517a39L60m5j75J20J45j40j00k23J96j1J6Jj52K05j58K18n1k52J39J19o3p7K8
$$ plain form
6540 -39 46 -95 134 -52 -72 174 154 82 271 113 -74 47 -124 215 146 152 235 -172 44 -4 210 -31 -175
6563 -175 -213 -238 40 -202 -107 -150 -83 -179 -315 51 -166 -157 -26 0 -221 258 120 45 150 137 290 288 127 84 -219
6588 -219 245 -16 -230 123 56 -145 -226 183 -292 -226 -205 -50 248 185 -4 -59 -168 -327 -2 -9 164 221 -28
6611 -28 59 -128 136 -6 -51 -181 12 112 -214 32 185 30 -1 -4 9 14 -77 -28 94 94 -83 -114 -275 11 -85
6636 -85 -234 42 160 216 87 46 69 -107 65 314 30 133 -27 178 89 23 180 42 266 199 -55 -167
6658 -167 26 -149 66 64 -197 93 126 -112 -172 -42 54 114 -112 84 -37 70 304 10 67 100 291 -124 140
6681 140 -147 212 74 -96 49 -7 188 -314 -250 35 105 106 63 -197 -233 -177 -338 -61 19 32 -66 -15 78 -114
6705 -114 198 2 -53 94 1 -88 201 -52 -1 126 -35 199 59 -57 149 -67 -235 196 44 -192 -86
$$ packed form
6540c9Q5j41K29j86k0K46k0p2J89j58j87J21j71L39o9OQ3m07K16m8K14k41j44
6563a75l8k5K78k42R5m3O7r6j36L66k17RJ31K6k21M79j38p5J05j3J53kj61m3l03
6588b19M64k61k14L53o7k01q1M09m75O6K1J55K98o3j89n5j09j59L25pJ73N7k49
6611b8Q7j87K64j42m5j30J93J00l26K46J53j55l1lJ3Nr1M9J22%j77l1j61K86r6
6636h5j49K76J18N6j29m1K3j76J72K49k84J03j60K05q9o6J57j38K24o7k54j12
6658a67J93j75K15kk61K90L3k38o0J30R6O0k26J96j21J07K34k94N7L3J91m15K64
6681A40k87L59j38j70J45n6J95n02O4K85P0Jm3k60l6N6j61K77Q0J3r8N1R3j92
6705a14L12j96n5J47r3q9K89k53N1J27j61K34j40j16K06k16j68M31j52k36J06
$$ plain form
6726 -86 -357 -156 112 2 -31 -174 -160 128 -114 27 -35 -66 -9 97 -317 -23 42 138 111 91 -65 75 -66
6749 -66 5 -9 -237 -216 49 131 118 -76 147 -164 117 -115 -338 -17 -274 -128 -90 -78 -66 72 62 269 116
6772 116 149 -130 26 139 20 15 -6 236 111 -23 -86 -81 -28 -174 43 -19 -190 -199 -165 214 46 -143 -187 29
6796 29 -55 -210 -337 -226 19 -181 192 -154 -19 -20 12 213 366 209 248 90 172 -167 -59 125 127 -88 -233
6819 -233 -326 -83 -1 -105 44 -297 27 -122 -271 -60 94 114 -154 111 57 39 -87 -111 238 66 442 174
6841 174 56 46 -2 218 137 40 97 -217 171 129 115 62 -120 -152 58 56 43 -49 -77 9 -105 96 120 96 -9 1
6867 1 -212 19 178 134 169 102 163 280 23 156 356 174 -136 -62 -40 155 -120 -17 -45 -218 166 -92 44
6890 44 -171 -347 -80 -90 19 177 -101 327 92 -84 124 74 153 41 141 -135 47 216 -127 -43 72 -127
$$ packed form
6726h6k71K01K68j10l3j43J4K88k42J41o2l1N7J06m14K94O5R6k7k0j56J40j41
6749f6P1j4k28K1K65Q2j3j94K23l11K81k32k23L21k57J46L8J2J2J38j0K07j53
6772A16L3k79J56J13j19nk1K42j25j34o3NN3j46K17o2j71rL4L79j68j89m4K16
6796B9q4j55j27J11K45k00L73l46J35jL2K01J53j57L9j58Q2l39J08J84Kk15j45
6819b33r3K43Q2j04J49l41L24j49j49K11J54K0k68K65n4j8j26k4L49j72L76k68
6841A74j18j0m8K20q1r7N7l14L88m2j4n3j82l2K10kj3r2k8Q6j14K01K4k4j05J0
6867Ak13K31J59m4L5o7O1J17k57J33K00j82l10P4K2J95k75J03k8j73L84k58J36
6890D4k15j76K67j0J09J58k78M28k35j76K08n0P9j12J00k76J82J69l43Q4J15j99
$$ plain form
6912 -127 174 -172 92 95 157 -101 -117 126 -34 -113 -100 -177 -89 -117 -170 30 -195 70 72 48 93 -376 116 -119 198
6937 198 -133 45 -21 -131 -10 13 6 -129 -187 -186 -142 -90 -32 -14 3 -269 -61 -16 -212 -262 -31 -352 51 -69 -24
6962 -24 111 170 93 143 -76 21 -3 31 39 174 49 14 173 265 -268 111 152 -1 -55 114 95 -49 151 47 60
6987 60 -72 -7 -239 -112 -184 14 -265 100 73 95 8 46 286 -11 21 94 120 129 150 91 124 -62 16 -94 195
7012 195 -69 -57 -125 64 -10 49 -78 -320 -27 180 -85 -149 -57 149 -51 -14 -50 52 57 -103 75 -28 327
7035 327 229 172 339 -17 161 -145 -106 70 227 63 -209 -228 100 81 -202 -77 20 -88 -293 100 -275 63
7057 63 32 -108 152 -134 -6 -71 -83 379 -107 62 260 184 185 -67 289 138 -289 -13 -24 -3 -112 61 129
7080 129 -126 75 -194 -198 29 -101 -32 65 22 12 157 77 -4 -63 -57 517 177 130 -44 29 -67 -238 219 113 -208
$$ packed form
6912a27L01l46K64LO2k58j6K43j60p9J3p7Q8k8n3K00k25K65Kk4M5m69M92k35L17
6937A98l31J78o6j10J21K3pj35n8JM4N2N8J8J7k72K08M5j96n0K31l21M03j20M5
6962b4J35N9p7N0k19R7k4L4QJ35j25l5J59R2n33L79M1j53n4J69j9j44K00j04J3
6987F0j32O5k32J27p2J98k79L65k7K2q7L8K40k97L2P3K6RK1n9L3j86P8j10K89
7012A95k64J2o8J89p4N9j27k42K93K07k65o4R2K06k00L7l6J02Nj60J78j03L55
7035C27r8n7J67l56J78l06L9J76J57j64k72j9L28j9k83J25R7j08k05L93l75L38
7057F3l1j40K60k86J28o5j2M62m86J69J98p6Jk52L56j51m27K76j1K1j09J73O8
7080A29k55K01k69mK27j30O9R7m3j0J45q0q1n9ON74l40m7j74P3r6j71M57j06l21
$$ plain form
7105 -208 -290 84 -22 -170 -118 -54 -7 76 -59 67 -46 63 57 89 -94 -19 25 6 -372 21 61 94 -147 -57 290
7130 290 -1 68 163 153 -149 -346 -165 -57 -40 -132 -52 -188 33 70 -218 -153 83 -128 -312 22 -15 -314 -96
7153 -96 13 211 189 -132 171 29 194 5 62 139 193 344 231 -197 -106 -18 3 64 -42 -261 -91 -113 110
7176 110 -45 -158 -45 -228 2 143 -19 188 -41 -67 116 -25 117 31 194 32 198 305 -85 266 254
7197 254 -8 83 34 156 39 69 -85 -337 -102 38 197 -137 33 -229 38 -48 -53 -38 -104 90 -123 104 34
7220 34 51 -27 45 43 -125 -108 -25 290 87 9 -5 56 32 81 66 -94 -21 -138 -150 -109 46 56 80 237 -1 -166
7246 -166 45 -278 -78 -141 -182 -10 -59 224 140 93 243 -11 214 40 -17 -149 138 287 -11 220 -122 -220
7268 -220 -58 -234 133 -18 -13 -146 -279 -212 27 86 -187 -39 -71 27 -152 -13 173 26 250 92 172 -22
$$ packed form
7105b08q2L74j06j48N2O4M7Q3j35J26j13J09oL2j83P5M4j9l78L93M0L3k41R0L47
7130B90k91O9R5j0l02j97J81J08J7r2Q0j36K21L7k88O5K36k11j84L34l7k99K18
7153i6J09J98k2l21L03j42J65j89N7P7N4J51j13m28R1Q8K1O1j06k19J70k2K23
7176A10j55j13J13j83K30J41j62K07k29k6J83j41J42q6J63j62J66J07l90L51j2
7197B54k62R1m9J22j17L0j54k52K35J40J59l34J70k62K67q6nJ5o6J94k13K27p0
7220C4J7p8P2kj68J7Q3L15k03p8j4O1k4M9j5j60P3j17j2M1J55J0K4J57k38j65
7246a66K11l23K00o3m1J72m9K83q4m7J50k54K25j74n7j32K87J49k98K31l42r8
7268b20J62j76L67j51Nj33j33O7K39N9k73J48l2R8j79J39J86j47K24j58Q0j94
$$ plain form
7290 -22 -92 138 58 86 198 144 -8 -3 -171 -33 42 -319 78 152 -104 -40 -177 63 152 102 -33 92 -118 -84
7314 -84 -7 -45 -66 -125 46 142 182 19 171 111 -165 144 -73 116 -80 92 103 -17 -42 -105 -99 -90 17 -143 -293
7339 -293 10 -51 -310 -14 -90 -39 201 -14 24 -16 61 139 283 320 66 125 95 219 -125 99 -130 184 104 -116
7363 -116 307 -120 183 -76 -132 11 18 -5 -98 -31 63 -87 54 -139 20 211 14 220 -53 75 46 -152 334
7386 334 193 24 -3 122 -49 -54 -127 13 14 39 -9 -30 -160 -140 -39 21 -193 -192 326 13 -72 0 -121 -116 118 -189
7412 -189 59 173 37 228 89 43 -111 28 -96 136 104 -45 43 191 -10 -138 -178 -108 -34 -12 -201 47
7434 47 -204 -16 -334 -73 49 -174 8 90 -132 -27 94 275 10 365 86 -28 262 125 296 170 39
7455 39 -119 80 36 209 56 47 161 28 -27 -11 29 -130 -214 -13 -105 -166 -52 -71 -188 120 -192 23 -27 200
$$ packed form
7290b2p0K30q0K8J12n4j52Nj68J38P5l61L97P4k56O4j37K40Q9n0j35J25k10L4
7314h4P7l8k1n9J71R6M0j63J52o0k76L09k17J89j96J72J1j20k5o3ORJ07j60j50
7339b93L03o1k59K96p6N1K40k15L8m0P7P8J44L7k54N9l0J24l44K24k29L14q0k20
7363a16M23m27L03k59n6J43Pk3r3O7R4j50J41j93J59J91j97K06k73J28k9j98M86
7386C34j41j69k7J25j71np3J40JK5m8k1j30K0J01O0k14JN18l13q5P2j21NK34l07
7412a89K48J14j36J91j39m6j54J39j24K32l2j49Q8J48k01j28m0P0P4K2j89K48
7434D7k51J88l18K61J22k23J82Q2k22J05J21J81k65L55k79j14K90j37J71j26j31
7455C9j58J99m4J73j53rJ14j33n5J6M0j59q4K01r2o1J14j9j17L08l12K15n0K27
$$ plain form
7479 200 -71 51 16 278 -24 59 134 281 221 169 -266 78 -126 -303 -118 -98 -104 -32 66 -289 41 65 -271 -215
7503 -215 333 102 5 343 -11 41 103 -43 14 284 134 104 94 184 33 22 -35 -87 -157 -68 148 -402 -67 -51
7527 -51 -117 -249 29 203 -204 -312 -54 -304 -205 -3 79 199 21 56 -4 13 88 180 174 179 -103 195 148 123 -211
7552 -211 275 113 114 -322 -72 113 -40 -108 -336 -50 -175 79 -18 140 -137 -175 -135 -30 34 83 50 15 -2 24
7576 24 39 68 -71 124 118 -68 219 16 55 239 134 64 14 50 -125 -80 31 -1 21 -169 -8 14 -31 -46 -58
7601 -58 192 74 -32 100 80 204 -169 144 109 94 -19 257 -26 -83 56 5 7 254 60 -273 -283 119 -157
7624 -157 -23 -248 -86 -338 118 132 -89 57 -62 -204 -32 320 107 345 112 113 -68 16 119 10 125
7645 125 15 -129 -223 -11 184 -78 -99 -233 -153 -101 -200 -271 159 -97 167 -84 122 80 61 -4 104 255 55
$$ packed form
7479B00k71J22l5K62l02Q3P5J47o0n2m35L44k04j77J85K0oP2R8l55L30K4l36N6
7503b15N48k31r7L38l54N2O2j46N7K70j50l0j0R0j51j1n7n2p0Q9K16n50L35J6
7527e1o6j32K78J74m07j08K58k50R9K02Q2J20j78L5o0J7P5R2oNk82K98m7k5l34
7552b11M86j62Jm36K50J85j53o8k28K86j25K54r7J58k77l8M0J05O4M9l3l5j7K6
7576B4J5K9j39J95oj86K87k03L9J84j05p0n0L6j75M5J11l2K2j90J61K2m5j5j2
7601e8K50j18j06J32k0J24l73L13l5j5j13K76k83n7J39n1KK47j94l33j0M02k76
7624a57J34k25J62k52M56J4k21J46j19j42J72L52k13K38k33Jj81Q4J03j09J15
7645A25j10j44r4K12J95k62k1j34Q0N2r9p1M30k56K64k51K06m2j9o5J08J51k00
$$ plain form
7668 55 28 -96 -151 54 -143 150 197 179 78 195 107 62 137 31 -334 42 151 -47 111 -25 -80 -207 -23
7691 -23 -85 -102 -17 -3 -253 133 48 -243 41 40 252 223 -145 -23 -204 -139 -132 -27 80 129 266 -78 19 38 -112
7716 -112 79 9 -29 2 -95 -78 -59 -182 92 270 12 30 -188 -217 -218 78 -67 257 -1 -134 -256 91 -252
7739 -252 -12 41 214 10 204 124 -326 -36 87 -47 -18 81 39 -12 -103 -92 -234 -38 63 34 -131 154 -10
7762 -10 -32 140 249 34 -18 -31 128 2 11 -3 -265 18 95 -39 81 -39 -88 -142 39 -112 -207 -127 -45 138
7786 138 -107 -188 -94 -165 -34 16 -38 141 -53 -117 -40 51 -27 200 284 180 -48 127 -10 97 112 225 133 -88
7810 -88 -221 -76 -254 152 -172 -13 -98 -109 229 -289 -101 -179 49 -115 146 -160 93 -20 37 -41 280 7
7832 7 160 26 155 -73 10 213 47 -2 115 228 54 -224 213 283 -202 164 121 -24 -88 70 -51 -97 -304
$$ packed form
7668E5k7j24n5K05j97K93M7j8j01J17q8m5P5j06l65L76J09j98J58j36n5j27J84
7691b3o2j7Q5J4k50L86q5k91K84jK12k9l68J22j81O5PJ05J07M9J37l44R7J9j50
7716a12J91p0l8L1r7J7J9j23K74J78k58J8k18k9jK96j45L24k58j33j22L47l43
7739b52K40N3J73k04J94q0m50K90J23j34K9R9m2n1r1J1j42J96J01k9j65K85j64
7762a0k2J72J09k15n2j3J59j26Rj4k62K83P7j34J20j20m9n4J81j51r5Q0Q2J83
7786A38k45q1R4p1J31N0n4J79j94o4P7R1p8K27Q4j04k28J75j37J07J5J13r2k21
7810h8j33J45j78M06l24J59q5j1L38n18J88p8K28j64K61l06K53j13N7p8L21k73
7832GJ53j34J29k28Q3K03j66m9J17J13j74k78M37P0m85L66m3j45o4J58j21m6k07
$$ plain form
7855 -304 130 -16 10 41 -191 30 37 116 -185 -128 47 42 -158 -79 -99 -86 116 -27 142 -41 106 -9 -165 11
7879 11 -213 -271 -143 -21 348 118 -50 -97 -231 -18 -204 -147 -99 169 -88 21 140 82 121 -135 53 -79
7901 -79 -65 -30 27 161 -138 -168 102 -87 -44 172 -45 -152 -97 -81 140 -88 -184 -2 -73 -126 -31 -1 -106 -83 130
7926 130 61 102 -56 124 -73 42 -115 226 143 -69 315 -316 221 -166 -42 -65 -53 -72 -38 -198 3 31 -258
7949 -258 -132 240 66 -87 -12 -355 -39 -131 -56 164 82 173 140 41 -145 -76 427 36 14 -64 -82 33 65 213
7973 213 128 68 162 150 -14 -131 -104 -51 -77 -33 -51 96 -239 88 -74 83 -194 31 -82 68 -190 -28 168
7996 168 20 65 -100 -81 -207 67 -87 139 -245 46 54 -98 -171 -12 75 62 -261 -143 102 -196 -50 14 143
8019 143 -8 34 -203 -46 -254 194 -73 -68 -7 86 159 402 70 92 193 -29 39 -103 250 117 175 5 269
$$ packed form
7855c04M34j46K6L1k32K21PP9l01N7J75nk00P9k0J3K02j43J69j83J47j15j56J76
7879A1k24n8J28J22L69k30j68m7j34K13j86N7M8K68k57J09J19n8L9k56J88j32
7901g9J4L5N7J34k99l0K70j89M3K16k17j07N5J6K21k28r6J82p1n3R5L0j05K3K13
7926A30o9M1j58J80j97J15j57L41q3k12L84o31N37l87J24k3J2j9L4j60K01K8k89
7949b58J26L72j74j53P5l43L16r2P5K20q2R1l3r9j86O9N03l91k2p8j8J15L2J48
7973B13q5o0R4j2j64j17K7N3k6M4j8J47l35L27j62J57k77K25j13J50k58J62J96
7996A68j48M5j65J9j26K74j54K26l84K91Qj52p3J59Q7j3l23J18K45k98J46O4J29
8019A43j51M2k37J57k08M48k67NO1R3P3K43l32K2J01k22O8j42L53j33N8j70K64
$$ plain form
8042 269 112 15 13 -18 56 4 -190 -18 7 78 -61 141 -93 37 41 -23 171 82 53 -22 -57 -195 242 156 72 266
8068 266 47 -234 115 15 -35 -144 134 49 -102 -64 -237 -32 -38 -39 -132 -80 66 -42 95 236 254 124 -36
8091 -36 154 -116 77 175 -135 116 20 -127 52 37 221 -248 76 124 -242 -409 230 -209 -227 290 34 -77
8113 -77 51 32 -129 148 275 28 15 72 332 176 350 211 -123 -210 -65 -183 -121 98 41 257 24 76 -198
8136 -198 -73 128 -170 -47 -20 61 40 -127 -364 133 -17 -18 -89 -88 25 38 77 74 -38 -231 104 260 5 -196
8160 -196 12 202 -112 264 141 -108 15 -15 99 -126 -86 160 -124 -40 131 -14 -282 -69 45 142 -147
8181 -147 -279 -75 17 69 159 143 -62 -115 229 17
$$ packed form
8042B69j57r7kl1P4n2j94J72K5P1j39K02k34J30Mo4J94q9k9p5l5j38M37q6q4J94
8068B66k19k81L49j00n0j09K78q5j51L8j73K05ojr3N2J46j08J37J41J8j30j60
8091c6J90k70J93R8l10K51r6j47J79j5J84m69L24M8l66j67O39m39j8N17k56j11
8113g7J28j9j61K77J27k47j3N7K60j56J74j39l34q7J45j18O2K19n7K16k33N2k74
8136a98J25K01k98J23K7Q1k1j67k37M97j50jp1JJ13J3L9lj12j93L35J56k55k01
8160a96K08J90l14L76j23k49J23l0J14k25M0K46k84Q4J71j45k68K13J14R7k89
8181a47j32K04R2N2R0j6k05n3L44k12
8191A7
$$ Imaginary data points
##PAGE= N=2
##DATA TABLE= (X++(I..I)), XYDATA
$$ plain form
0 0 0 0 0 0 0 0 0 0 0 0 0 0 0 -1 8 -8 8 -8 8 -15 16 -16 20 -24 28 -32 40 -43 49 -56 64 -73 83 -92 105 -117
36 -117 132 -148 165 -181 202 -224 248 -274 303 -334 367 -406 445 -491 540 -595 658 -727 806
55 806 -894 996 -1116 1256 -1425 1632 -1893 2233 -2695 3357 -4382 6147 -9783 20166 -108937
70 -108937 -399391 3558 301366 32503 -189736 354 143020 50125 -25150 6484 26275
81 26275 43921 58199 13509 -56538 -41205 25633 20392 -53206 -46678 43203 55609 -30802 -61728
94 -61728 -20284 1310 12198 18252 -47443 -97534 -17053 52592 -7729 -33997 38625 43974 -9002
107 -9002 24764 60244 -5525 -35973 26433 34942 -22583 -14012 37833 23358 -20075 2185 51267
120 51267 21012 -48724 -22780 45921 -13558 -111029 -40996 65211 -3645 -82931 3699 63548
$$ packed form
0@%%%%%%%%%%%%%jRj6J6j6J6k3L1l2L6m4N2o0P2q3R2j05J20j37J56j75J97k22
36a17K49k80L13l46L83m26M72n22N77o37P01p73Q51r36J031j135J253j385J533
55H06j700J890k112K372k681L057l525M126m928O052p739J0529j5930K9949j29103
70a08937k90454M02949K97808k68863k22239J90090J42666r2895p5275L1634J9791
81B6275J7646J4278m4690p0047J5333O6838n241p3598O528Q9881J2406q6411l0926
94f1728M1444K1594J0888O054o5695n0091Q0481O9645o0321k6268P2622N349n2976
107i002L3766L5480o5769l0448O2406Q509n7525Q571N1845j4475m3433K2260M9082
120E1267l0255o9736K5944O8701n9479r7471P0033J06207o8856p9286Q6630N9849
$$ plain form
132 63548 -17584 -48566 16022 21573 -8927 12030 9003 -32001 -7229 39236 14643 2070
144 2070 49352 45931 -15535 -16264 28851 18760 -20148 -7513 22959 -1804 -53159 -40817 23551
157 23551 34149 -20278 -37014 -1154 7478 -17194 -27345 -23403 -7880 18491 8059 -29231
169 -29231 -14953 30883 24776 3347 29416 39231 -2192 -16118 16794 23973 -2876 -12704 4268
182 4268 20403 9071 -19333 -13530 25982 20234 -31749 -37663 2974 3662 -30305 -37113 -18293
195 -18293 2750 15761 446 -23860 -2834 33486 16735 -17666 -8143 15365 14157 9111 6388
208 6388 -1450 7678 29786 25373 658 -877 14731 9409 -13182 -21183 -8540 752 -7422 -17690
222 -17690 -14529 -7256 -4018 -2702 -7971 -12971 -2126 6341 -11829 -25009 -1507 18066 3705
$$ packed form
132F3548q1132l0982O4588N551l0500K0957l027m1004K4772M6465k4593j2573
144B070M7282l421o1466p29M5115j0091l8908J2635L0472k4763n1355J2342O4368
157B3551J0598n4427j6736L5860Q632k4672j0151L942J5523K6371j0432l7290
169b9231J4278M5836o107k1429K6069R815m1423j3926L2912P179k6849r828J6972
182D268J6135j1332k8404N803L9512n748n1983n914M0637O88l3967o808J8820
195a8293K1043J3011j5315k4306K1026L6320j6751l4401R523K3508j208n046k723
208F388p838R128K2108m413k4715j535J5608n322k2591q001J2643R292q174j0268
222a7690L161P273L238J316n269n000J0845Q467j8170j3180K3502J9573j4361
$$ plain form
235 3705 -3540 13678 18288 9466 11988 17235 12695 10202 8203 -699 -1709 4788 -902 -8779 133
250 133 6861 -3682 -11705 -6910 -4410 -8929 -13746 -14731 -11614 -9197 -12707 -11703 1106 8063 1155
265 1155 320 12188 14544 4365 1824 8662 10220 5773 5268 7715 8225 9589 10493 6502 2089 2915
281 2915 2525 -6583 -13413 -9678 -8323 -14885 -14097 -5889 -6470 -10510 -4446 1118 -5223 -7040 1944 2406
297 2406 -5703 -2803 7575 8009 4476 8241 13746 13314 12163 11468 7864 5205 5757 3433 -2945 -4745
313 -4745 -2028 -2380 -6385 -7303 -4059 -4417 -8415 -9742 -7159 -7744 -10817 -9676 -6533 -4901 -4422 -622
329 -622 4599 5952 5380 8142 11781 9982 6116 6672 9083 7235 3678 4206 5564 4432 4041 2815
345 2815 -410 -2320 -960 -4504 -11279 -11988 -7872 -9714 -13936 -9851 -3632 -5421 -6242 146 2199 -1762
$$ packed form
235C705p245J7218M610q822K522N247m540k493j999q902j010O497n690p877Q912
250A33O728j0543q023M795K500m519m817r85L117K417l510J004J2809O957o908
265A155q35J1868K356j0179k541O838J558m447n05K447N10J364R04l991m413Q26
281B915l90r108o830L735J355o562P88Q208n81m040O064N564o341j817Q984M62
297B406q109K900J0378M34l533L765N505m32j151o95l604k659N52k324o378j800
313d745K717l52m005r18L244l58l998j327K583n85l073J141L143J632M79L800
329f22N221J353n72K762L639j799l866N56K411j848l557N28J358j132l91j226
345B815l225j910J360l544o775p09M116j842m222M085O219j789q21O388K053l961
$$ plain form
361 -1762 -266 4863 4225 1535 4392 7322 7248 7977 9898 9532 9317 9712 6799 2344 620 643 -1769
378 -1769 -5419 -6135 -5213 -6145 -8970 -7594 -3971 -5551 -9006 -6655 -3050 -6741 -8973 -3433 471 -34
394 -34 1561 3680 5169 9030 10498 6369 6076 11677 10139 3071 2652 5438 3536 1438 916 -1289
410 -1289 -558 888 -3727 -8465 -6127 -6668 -11592 -8187 -3669 -10245 -12323 -2957 538 -4671 -2686 4922
426 4922 6673 4441 1508 -228 4884 11364 7907 3668 8300 10153 3721 1247 5516 8266 7011
441 7011 -572 -8686 -5989 -1105 -8440 -13092 -2445 1401 -9978 -14098 -6841 -2644 -2516 -3512 -4708
456 -4708 681 5697 -5946 -11997 8240 20879 5252 -2244 10485 11309 2058 6016 10236 4135
470 4135 2864 4681 -892 -3846 -2063 -3409 -570 3816 -7404 -16705 -3912 3240 -11886 -17252
$$ packed form
361a762J496N129o38k690K857K930p4P29J921l66k15L95k913m455j724K3k412
378a769l650p16R22r32k825J376L623j580l455K351L605l691k232N540L904n05
394c4J595K119J489L861J468m129k93N601j538p068m19K786j902k098n22k205
410a289P31J446m615m738K338n41m924L405M518o576k078R366L495n209J985P608
426D922J751k232k933j736N112O480l457m239M632J853o432k474M269K750j255
441G011p583q114K697M884p335m652J0647L846j1379m120P257M197J28r96j196
456d708N389N016j1643o051K0237J2639j5627p496J2729Q24r251L958M220o101
470D135j271J817n573k954J783j346K839M386j1220r301J2793P152j5126n366
$$ plain form
484 -17252 -3218 1177 -5537 -7025 -4253 1082 7541 3501 -3697 4831 14831 8531 1096 2409
498 2409 3490 7320 11527 3706 -1588 8977 9457 -7261 -9088 2999 1612 -4432 -2427 -6321 -14047
513 -14047 -11841 -8384 -4667 6086 3497 -16005 -13510 7453 2764 -11418 3692 18629 5602
526 5602 -6031 -1197 5082 12055 15294 5369 3068 12819 3652 -14018 -2997 14304 5658 -5473
540 -5473 -2618 -7770 -14659 -5614 2623 -511 -4097 -8924 -13402 -4468 972 -9594 -8823 9674 10331
555 10331 -6429 -8002 4097 11900 12340 4183 -1255 9740 14622 -1962 -5692 13182 11623 -7207
569 -7207 -3744 8433 1283 -6310 -3970 -6588 -6555 -1266 -6915 -11776 -1443 -2070 -13995 -5970 6371
584 6371 -4697 -7860 9350 9291 -6128 -3408 4581 2124 8472 18289 8242 -4708 -2015 4260
$$ packed form
484a7252J4034M395o714j488K772N335O459m040p198Q528J0000o300p435J313
498B409J081L830M207p821n294J0565M80j6718j827J2087j387o044K005l894p726
513a4047K206L457L717J0753k589j9502K495K0963m689j4182J5110J4937j3027
526E602j1633M834O279O973L239r925k301R751r167j7670J1021J7301q646j1131
540e473K855n152o889R045Q237l134l586m827m478Q934N440j0566P71J8497O57
555A0331j6760j573J2099P803M40q157n438J0995M882j6584l730J8874j559j8830
569g207L463J2177p150p593K340k618L3N289n649m861J0333o27j1925Q025J2341
584F371j1068l163J7210n9j5419K720P989k457O348R817j0047j2950K693O275
$$ plain form
598 4260 8912 13488 6069 -5490 -3337 -909 -6710 -3928 2024 -6069 -8724 2283 -1619 -19055
612 -19055 -14642 3073 5221 -1510 -4281 -4216 -3130 -4038 -4510 9832 24215 6928 -16659 -2981
626 -2981 19977 12445 -191 4051 6554 2310 2610 -413 -3353 1770 1251 -5515 -626 3333 -11549
641 -11549 -17308 -1242 2887 -8087 -6510 -2055 -8488 -6980 4098 3442 -2000 1400 2948 1630
655 1630 7331 8723 933 1129 7759 6735 5154 7421 4071 -993 657 1017 -1152 1220 1019 -6232
671 -6232 -7659 -3521 -5477 -8317 -4218 -1342 -1985 -3348 -7950 -8435 1116 5643 -2000 -1417 7334 4179
687 4179 -2580 2353 8464 6783 7536 8474 3404 248 1974 721 2769 7845 1864 -8226 -5167
702 -5167 201 -4658 -6264 -36 -2458 -9106 -6737 -3060 -4986 -4702 -1787 -1754 -702 2506 1289 -1596
$$ packed form
598D260M652M576p419j1559K153K428n801K782N952q093k655J1007l902j7436
612a9055M413J7715K148o731k771O5J086r08m72J4342J4383j7287k3587J3678
626b981K2958p532j2636M242K503m244L00l023k940N123n19o766M889L959j4882
641a1549n759J6066M129j0974J577M455o433J508J1078o56n442L400J548j318
655A630N701J392p790J96O630j024j581K267l350n064J650L60k169K372k01p251
671f232j427M138j956k840M099K876o43j363m602m85R551M527p643N83Q751l155
687D179o759M933O111j681P53R38n070l156J726j253K048N076n981j0090L059
702e167N368m859j606O228k422o648K369L677j926K84K915L3J052L208j217k885
$$ plain form
718 -1596 760 5313 7674 6816 3616 1425 4091 6461 4361 3516 3987 1977 -459 551 890 -2281
734 -2281 -4447 -4695 -3614 -2130 -3996 -8131 -6714 -2827 -3525 -4462 -895 -278 -3278 -1931 2719 2487
750 2487 1281 2819 4242 4970 6168 4218 1830 4820 6913 3707 2392 3673 698 -3032 -554
765 -554 1139 -2652 -5032 -3018 -3221 -5561 -5185 -3849 -4538 -4748 -2830 -2444 -2957 -2256 0 535 1574
782 1574 3785 3799 1971 3046 5742 5672 3579 3497 4785 3490 2249 2368 1943 -360 -660 -269 -1572 -3353
800 -3353 -3949 -4668 -4664 -3957 -4004 -5369 -5062 -2792 -2049 -3010 -1492 383 687 596 1958 3350 3367 3665 3389 4397
820 4397 5262 5100 2781 2608 3999 3393 762 91 205 -1264 -2720 -2719 -2481 -4423 -4447 -3391 -4051 -4653 -3787
839 -3787 -3174 -3407 -2024 -692 -866 -802 1266 2338 1732 3047 5068 3999 2538 4202 5885 4315 2048
$$ packed form
718a596K356M553K361q58l200k191K666K370k100q45M71k010k436J010L39l171
734b281k166k48J081J484j866m135J417L887o98r37L567O17l000J347M650k32
750B487j206J538J423P28J198j950k388K990K093l206j315J281k975l730K478
765e54J693l791k380K014k03k340L76J336o89k10J918L86n13P01K256N35J039
782A574K211J4j828J075K696p0k093q2J288j295j241J19m25k303l00L91j303j781
800c353n96p19MP07m7j365L07K270P43r61J518J875L04r1J362J392J7K98k76J008
820D397Q65j62k319j73J391o06k631o71J14j469j456JK38j942k4J056o60o02Q66
839c787O13k33J383J332j74O4K068J072o06J315K021j069j461J664J683j570k267
$$ plain form
856 2048 2381 3310 1943 270 -346 -1361 -1160 -1236 -2928 -4760 -3970 -2997 -4706 -5086 -3169 -2607 -3886 -2650
874 -2650 -867 -739 -256 806 1201 2297 3563 3058 2747 4431 4892 3130 2669 4330 3866 2007 1181
891 1181 1243 860 -591 -1900 -2649 -2135 -2556 -4055 -4546 -4228 -3629 -3188 -3365 -3139 -1755 -1490 -2501 -1031
909 -1031 2104 2276 219 2550 5037 2763 1576 4314 5570 3699 3411 2574 937 2186 2583 -675
925 -675 -1177 860 -1438 -4803 -3293 -2470 -4585 -3711 -1463 -4109 -5715 -2894 -1158 -2363 -1494 35
941 35 -31 1529 2766 568 1713 5043 4850 2284 2799 4299 3393 3664 2553 -278 414 2418 629
958 629 -1902 -1253 -1959 -3171 -3433 -3966 -4648 -1657 -997 -5029 -4663 -1828 -2413 -1802 2524 1505 -1921 1734
976 1734 3423 -489 1224 6973 5490 2251 3582 2028 -800 3149 6177 1292 -263 1386 -2557
$$ packed form
856B048L33R29j367j673o16j015K01p6j692j832P90R73j709l80J917N62j279J236
874b650J783J28M83J062L95J096J266n05l11J684M61j762m61J661m64j859q26
891A181O2l83j451j309p49N14m21j499m91L18N99M41j77K26J384K65j011J470
909a031L135J72k057K331K487k274j187K738J256j871k88q37j637J249L97l258
925f75n02K037k298l365J510Q23k115Q74K248k646j606K821J736j205Q69J529
941C5o6J560J237k198J145L330j93k566N15J500r06K71j111k831O92K004j789
958F29k531O49p06j212k62n33o82K991O60m032L66K835n85O11M326j019l426L655
976A734J689l912J713N749j483l239J331j554k828L949L028m885j555J649l943
$$ plain form
991 -2557 -4822 -883 -527 -3189 -1296 -1787 -6438 -6230 -2409 -2579 -2093 1376 -1143 -4027 -769 1304
1007 1304 23 2762 5710 3165 1892 2701 1480 2709 6772 4004 -449 1835 3529 -911 -1583
1022 -1583 1135 -894 -2425 -1030 -2917 -4485 -1853 -2721 -6024 -2439 -183 -5513 -3919 3351 159
1037 159 -5187 -98 3290 512 2178 5580 2560 1861 3533 628 1339 7785 5227 -1889 1257 2978
1053 2978 -3538 -3850 3013 2153 -2773 -2422 -4193 -6650 -3744 -849 -1669 -457 -187 -5676 -6286 -258
1069 -258 1539 1402 4165 1917 -2103 1322 4183 898 2584 8103 4975 -1 975 483 -1271 3391
1085 3391 5036 -486 -1587 -1326 -5374 -4633 1223 -680 -5108 -2428 -2165 -6276 -3459 944 -2123 -1935
1101 -1935 1864 315 -1863 2582 2691 -941 3118 7503 1751 -1011 4461 4795 1251 1997 1184 -512
$$ packed form
991b557k265L939L56k662J893m91m651K08L821j70M86L469k519k884L258K073
1007A304j281K739K948k545j273Q09j221J229M063k768m453K284J694m440o72
1022a583K718k029j531J395j887j568K632q68l303L585K256n330J594P270l192
1037A59n346N089L388k778J666L402l020o99J672k905P11O446k558p116L146J721
1053B978o516l12O863q60m926L51j771k457K906K895q20J212K70n489o10O028
1069b58J797j37K763k248m020L425K861l285J686N519l128m976R76m92j754M662
1085C391J645n522j101K61m048P41N856j903m428K680K63m111K817M403l067J88
1101a935L799j549k178M445J09l632M059M385n752k762N472L34l544P46q13j696
$$ plain form
1117 -512 1737 2317 -2218 -2323 -566 -4494 -5323 1171 1209 -5253 -5485 -2593 -2426 -2106 -1313 -1272 974 2388
1135 2388 -1244 -2263 2977 2912 525 5378 7985 965 -2719 1327 3706 3911 5832 2266 -3548 -2590
1151 -2590 -418 -1458 -86 1289 -3148 -4708 -1658 -2778 -5766 -2858 -556 -1645 42 1028 -4252
1166 -4252 -4871 1754 4619 2785 3075 2325 -1059 304 5186 4981 3472 2525 339 192 3255 2292 -2383
1183 -2383 -1977 825 -237 -1987 -1506 -3397 -4704 -2552 -1559 -1402 -1353 -2829 -4205 -1202 1481 -469
1199 -469 -861 1861 1321 936 3771 3078 171 1890 4711 3361 2438 3247 1187 -1288 594 1911 458
1216 458 -530 -1006 -2737 -2670 -2077 -3372 -2855 -113 -1645 -4468 -2862 -1328 -2226 -1128 1133 1485 -140
1233 -140 298 1351 1890 2428 2486 2381 3704 3779 895 7 1908 2560 1356 1043 561 -1635 -2639 -1720
$$ packed form
1117e12K249N80m535j05J757l928q29O494L8o462k32K892J67L20P93M1K246J414
1135B388l632j019N240o5k387M853K607p020l684M046K379K05J921l566n814R58
1151b590K172j040J372J375m437j560L050j120k988K908K302j089J687R86n280
1166d252o19O625K865j834K90p50l384J363M882k05j509r47k186j47L063r63m675
1183b383M06K802j062j750M81j891j307K152R93J57M9j476j376L003K683j950
1199d69l92K722n40l85K835o93k907J719K821j350r23Q09k060k475J882J317j453
1216D58r88m76j731O7N93j295N17K742j532k823J606J534q98J098K261L52j625
1233a40M38J053N39N38N8j05J323P5k884q88J901O52j204l13m82k196j004R19
$$ plain form
1251 -1720 -911 -956 -2320 -3769 -3027 -1637 -2312 -2662 -1423 -922 -1108 71 1337 -209 -534 1193 2720
1268 2720 3114 3378 2160 774 1805 3587 2925 1546 1156 658 49 244 400 -1189 -2216 -1484 -1384
1285 -1384 -1753 -2316 -2773 -3134 -2517 -1161 -879 -848 -1595 -1731 -131 1086 1345 986 1691 1881 2456 2695 2494
1304 2494 1892 1812 2263 2195 1595 616 37 -100 36 -228 -1233 -1748 -1995 -2538 -2124 -2060 -2180 -2480 -2130 -1466
1324 -1466 -1404 -742 -757 -371 835 1031 1157 1147 1731 1781 1910 2655 2955 1820 1473 1719 1961 1031 307 356 -102
1345 -102 -646 -1084 -1398 -2177 -2162 -1711 -1882 -2267 -2294 -1879 -1754 -1469 -813 -320 -607 171 766 1102 813 1708 2204
1366 2204 1935 2095 2445 2021 1508 1663 1614 1085 639 524 -406 -1272 -620 -1040 -1620 -2033 -2329 -2182 -2256 -1754
1386 -1754 -2229 -1843 -1116 -687 -1077 -451 313 248 938 2022 1827 1397 1911 2143 1991 1980 1941 1773 1692 1156 420
$$ packed form
1251a720Q09m5j364j449P42J390o75l50J239N01j86J179J266j546l25J727J527
1268B720L94K64j218j386J031J782o62j379l90m98o09J95J56j589j027P32J00
1285a384l69n63m57l61O17J356K82L1p47j36J600J217K59l59P05J90N75K39k01
1304B494o02q0M51o8o00r79n79j37J36k64j005n15k47n43M14O4j20l00L50O64
1324a466O2O62j5L86J206J96J26j0N84N0J29P45L00j135l47K46K42r30p24M9m58
1345a02n44m38l14p79J5M51j71l85k7M15J25K85O56M93k87P78N95L36k89Q95M96
1366B204k69J60L50m24n13J55m9n29m46j15r30q66O52m20n80m13k96J47p4N02
1386a754m75L86P27M29l90O26P64o5O90J084j95m30N14K32j52j1l9j68q1n36p36
$$ plain form
1407 420 -26 273 -395 -1234 -1167 -1407 -1950 -2045 -2029 -2544 -1814 -1477 -1878 -2060 -647 -796 -557 362 597 -71 1236
1428 1236 2553 1566 1204 2351 2046 1177 1798 2345 927 1138 1162 -129 -636 -5 -388 -1561 -678 -1222
1446 -1222 -2860 -2312 -1253 -2185 -2427 -679 -1095 -2338 -1156 -101 -208 577 1511 960 950 1630 1025 1275
1464 1275 3069 2554 1150 1597 1842 344 265 1403 -36 -463 -53 -1507 -1978 -1033 -1401 -2475 -1493 -975
1482 -975 -2743 -2327 -440 -1285 -1669 290 445 -1290 639 2206 864 1069 2470 1282 967 3080 2504
1499 2504 792 1616 1778 -457 -107 1597 166 -1001 -181 -1628 -3153 -1347 -767 -1992 -1126 -839 -3018
1516 -3018 -2920 -565 -303 -1133 1361 1366 -1166 -709 1168 917 2152 3392 1770 987 1686 494 240 2634
1534 2634 3041 -154 -397 484 -2140 -2078 745 257 -1532 -1140 -2044 -3482 -1947 -202 -1930 -1161 1071
$$ packed form
1407D20m46K99o68q39O7k40n43r5J6n15P30L37m01j82J413j49K39R19K35o68J307
1428A236J317r87l62J147l05q69O21N47j418K11K4j291n07O31l83j173Q83n44
1446a222j638N48J059r32k42J748m16j243J182J055j07P85R34n51j0O80o05K50
1464A275J794n15j404M47K45j498p9J138j439m27M10j454m71R45l68j074R82N18
1482i75j768M16J887q45l84J959J55j735J929J567j342K05J401j188l15K113n76
1499B504j712Q24J62k235L50J704j431j167Q20j447j525J806N80j225Q66K87k179
1516c018R8K355K62q30K494Nk532M57J877k51J235J240j622p83O99j192k54K394
1534B634M07l195k43Q81k624O2K823m88j789L92r04j438J535J745j728P69K232
$$ plain form
1551 1071 -1228 -2686 360 1305 -279 1269 3052 589 204 2349 1689 1006 2740 1802 95 1126
1567 1126 1955 -609 -588 839 -1221 -1826 -184 -797 -2515 -1304 -1015 -2954 -1985 -199 -1101 -1256 496
1584 496 -433 -1543 364 1104 648 2503 2798 -141 -96 2256 1506 1519 3194 2307 -628 -234 -72 -1287
1602 -1287 381 1756 -958 -1900 -614 -2723 -4005 -605 1043 -1282 -1510 -1173 -2717 -2430 979 1004
1618 1004 540 1641 903 -1358 582 3091 1539 1467 3247 1767 -442 478 1004 97 1504 1567 -850
1635 -850 -1004 -550 -2482 -1827 539 -617 -2875 -1747 -1004 -2050 -1425 -289 -1022 -732 1126 107 -535
1652 -535 1018 1129 -103 1687 2937 1261 786 2230 1183 451 1519 862 -578 969 1409 -1355
1668 -1355 -1865 -882 -1489 -1448 525 -846 -2714 -1884 -1637 -2161 -202 1081 -836 -1547 387 630 -762
$$ packed form
1551A071k299j458L046R45j584J548J783k463l85K145o60o83J734r38j707J031
1567A126Q29k564K1J427k060o05J642o13j718J211K89j939R69J786r02j55J752
1584D96r29j110J907P40m56J855K95k939M5K352p50J3J675q87k935L94J62j215
1602a287J668J375k714r42J286k109j282L400J648k325k28L37j544K87L409K5
1618A004m64J101p38k261J940K509j552p2J780j480k209R20N26r07J407O3k417
1635h50j54M54j932O55K366j156k258J128P43j046O25J136p33K90J858j019o42
1652e35J553J11j232J790J250j676m75J444j047p32J068o57j440J547M40k764
1668a355n10R83o07M1J973j371j868Q30K47n24J959J283j917p11J934K43j392
$$ plain form
1685 -762 633 1985 1692 1748 2258 533 157 1367 1489 1763 2011 536 -1518 -1153 200 353 -137 -617
1703 -617 -1977 -2198 -1077 -1236 -2193 -998 -746 -915 -304 73 -1422 -1109 736 1454 1266 1266 283 -255 1281
1722 1281 2528 1787 1027 1390 702 244 1254 714 -598 -659 -344 -619 -612 -877 -2175 -2132 -847 -388 -1087
1741 -1087 -1117 -1091 -1358 -718 233 464 76 430 691 961 1168 1186 846 1225 1941 1528 1203 961 369 117 600
1762 600 380 -93 -300 -625 -1355 -1171 -1146 -1169 -1089 -849 -1536 -1717 -1229 -731 -515 -64 397 -36 -69 441 1266
1783 1266 1035 1253 1315 1421 1513 1235 820 625 673 1002 677 305 -259 -1024 -845 -489 -475 -1244 -1676 -1722 -1314
1804 -1314 -1014 -518 -914 -1038 -797 -48 327 303 315 389 66 1191 1458 1242 866 683 1062 1576 1507 644 394
1825 394 -114 9 415 -70 -653 -988 -1123 -879 -863 -1067 -1185 -1575 -1063 -711 -466 -670 -442 -399 19 666 684
$$ packed form
1685g62J395J352k93N6N10j725l76J210J22K74K48j475k054L65J353J53m90m80
1703f17j360k21J121j59r57J195K52j69O11L77j495L13J845P18j88%r83n38J536
1722A281J247p41p60L63o88m58J010n40j312o1L15k75Pk65j298M3J285M59o99
1741a087l0K6k67O40R51K31l88L54K61K70K07J8l40L79P16m13l25k42n92k52M83
1762F00k20m73k07l25p30J84K5k3Q0K40o87j81M88M98K16M51M61m33l3N10Q25
1783A266k31K18O2J06R2k78m15j95M8L29l25l72n64p65J79L56J4p69m32m6M08
1804a314L00M96l96j24K41P49L75k4J2P4l23J125K67k16l76j83L79N14o9q63k50
1825C94n08J23M06m85n83l35j35K44J6k04j18l90N12L52K45k04K28M3M18O47J8
$$ plain form
1846 684 542 628 929 1092 1220 1515 845 533 861 913 712 290 -88 -128 -14 -519 -907 -826 -1058 -1128 -1066 -1195
1868 -1195 -1243 -1112 -914 -772 -410 -506 -573 -343 284 734 539 810 910 1433 1131 988 1093 882 991 787 455
1889 455 463 603 -93 -455 -410 -451 -478 -1300 -811 -1051 -1003 -977 -1273 -1120 -515 -230 -689 -505 235 388 244 655
1911 655 896 591 1046 1028 1161 1514 897 423 1011 910 733 33 43 -188 -562 -234 -540 -846 -882 -682 -1366
1932 -1366 -1100 -850 -972 -989 -376 -155 -409 -20 -145 122 790 1379 311 386 1122 1040 388 1372 1398 348
1952 348 427 753 305 91 50 -556 -625 -248 -429 -1324 -638 -264 -1229 -1248 -671 -698 -998 -114 -2 -450 4 461
1974 461 17 763 1347 806 724 1029 858 488 1297 1358 361 487 523 -405 -191 372 -243 -783 -443 -703 -1400
1995 -1400 -1106 -555 -823 -498 15 -1495 -1304 -330 -99 -251 445 1232 -138 42 820 702 860 1211 934
$$ packed form
1846F84j42Q6L01J63J28K95o70l12L28N2k01m22l78m0J14n05l88Q1k32p0O2j29
1868a195m8J31J98J42L62r6o7K30O27M50j95K71J00N23l02j43J05k11J09k04l32
1889D55QJ40o96l62M5m1k7q22M89k40M8K6k96J53O05K85m59J84P40J53j44M11
1911F55K41l05M55j8J33L53o17m74N88j01j77p00J0k31l74L28l06l06l6K00o84
1932a366K66K50j22j7O13K21k54L89j25K67O68N89j068P5P36q2o52R84K6j050
1952C48P9L26m48k14m1o06o9L77j81q95O86L74r65j9N77k7l00Q84J12m48M54M57
1974D61m44P46N84n41q2L05j71l70Q09O1r97J26L6r28K14N63o15n40L40k60o97
1995a400K94N51k68L25N13j510J91R74K31j52O96P87j370J80P78j18J58L51k77
$$ plain form
2014 934 364 1092 830 -42 267 1139 -370 -1120 191 -171 -1039 -658 -587 -1321 -813 -690 -1602 -991 332
2033 332 -617 -992 428 229 -299 509 817 61 158 794 507 753 1764 1331 287 657 823 -285 502
2052 502 1129 -188 -575 -239 -1113 -1381 93 -259 -1207 -372 -380 -1726 -1662 252 325 -77 328 90 -734 255
2072 255 820 593 1239 1842 603 -461 1033 938 323 929 1342 142 -291 -157 -676 -639 332 -355 -1220
2091 -1220 -735 -741 -1811 -1052 -13 -519 -723 -130 -492 -770 535 400 -238 760 958 -72 442 1295 625
2110 625 106 1069 1107 124 849 684 -521 -359 228 -586 -546 296 -451 -1362 -856 -614 -1142 -764 -276 -505
2130 -505 -592 83 -725 -708 537 951 355 930 1222 -98 -149 984 1197 954 1268 455 -516 155 527 -165
2150 -165 127 512 -492 -1269 -440 -934 -1239 -111 123 -831 -681 -674 -1061 -531 755 298 14 615 205 -434
$$ packed form
2014I34n70P28k62q72L09Q72j509p50J311l62q68L81P1p34N08J23r12O11J323
2033C32r49l75J420j99n28Q08L08p56R7O36k87K46J011m33j044L70J66j108P87
2052E02O27j317l87L36q74k68J474l52r48Q35qj346O4J914P3m02M05k38q24R89
2072B55N65k27O46O03j239j064J494r5o15O06M13j200m33J34n19L7R71o87q65
2091a220M85oj070P59J039n06k04N93l62k78J305j35o38R98J98j030N14Q53o70
2110F25n19R63L8r83P25j65j205J62N87q14M0Q42p47r11N06K42n28L78M88k29
2130e05q7O75q08J7J245M14n96N75K92j320n1J133K13k43L14q13r71O71L72o92
2150a65K92L85j004p77Q29m94l05J128K34r54J50Pl87N30J286m57k84O01m10o39
$$ plain form
2170 -434 792 1119 593 935 1230 422 300 998 554 80 462 686 -286 -643 -225 -798 -676 -220 -555 -1149
2190 -1149 -687 -462 -1237 -572 -85 -553 -607 566 349 37 99 251 541 507 1124 677 374 723 231 350
2210 350 886 452 -44 312 141 -455 -591 -381 -508 -234 -241 -774 -1152 -973 -786 -575 -92 -36 -455 -548 -27
2231 -27 172 285 251 675 375 524 736 243 301 794 641 457 953 250 -460 -203 117 -88 -304 -435 -687
2252 -687 -1035 -457 -608 -774 -818 -229 -414 -506 8 -394 11 -52 461 561 476 -15 51 916 1094 910 766 355
2274 355 460 448 513 420 13 -134 -301 -115 -393 -560 -1105 -978 -249 -356 -633 -639 -571 -372 -469 -51 113 -8
2296 -8 132 210 622 433 601 405 568 760 649 658 278 386 305 183 90 6 -5 -292 -333 -645 -415 -548 -657
2319 -657 -737 -856 -707 -579 -564 -183 34 -53 -98 153 328 344 609 265 424 672 508 516 528 473 140 152 458
$$ packed form
2170d34J226L27n26L42K95q08j22O98m44m74L82K24r72l57M18n73J22M56l35n94
2190a149M62K25p75O65M87m68n4J173k17l12O2J52K90l4O17m47l03L49m92J19
2210C50N36m34m96L56j71n96j36K10j27K74pn33l78J79J87K11M83N6m19r3N21
2231b7J99J13l4M24l00J49K12m93N8M93j53j84M96p03p10K57L20k05k16j31k52
2252f87l48N78j51j66m4N89j85r2N14m02M05o3N13J00q5m91O6Q65J78j84j44m11
2274C55J05j2O5r3m07j47j67J86k78j67n45J27P29j07k77oO8J99r7M18J64j21
2296hJ40P8M12j89J68j96J63J92j11Rl80J08q1j22r3q4j1k87m1l12K30j33j09
2319f57q0j19J49J28J5L81K17q7m5K51J75J6K65l44J59K48j64QJ2n5l33J2L06
$$ plain form
2342 458 308 -131 -434 -199 -96 -314 -412 -768 -784 -284 -395 -667 -161 -419 -198 -237 140 126 109 84 175 612
2364 612 856 448 390 187 505 735 756 379 32 263 145 139 -30 -132 -505 -396 -411 -330 -496 -687 -786 -591
2386 -591 -278 -340 -121 -247 -316 320 526 -197 146 374 381 658 747 608 365 402 469 373 193 5 -62 141 -19
2409 -19 -102 -501 -413 -217 -525 -579 -351 -412 -621 -621 -377 -250 -426 -221 -241 43 290 309 250 576 419 438 525 631
2433 631 593 492 563 234 235 97 -179 -308 -81 -160 -543 -372 -90 -313 -421 -410 -480 -631 -205 -104 -362 -49
2455 -49 114 -68 117 330 260 88 623 159 409 498 393 246 464 626 200 -237 361 -10 -343 -150 -199
2476 -199 -444 -670 -690 -643 -499 -39 -497 -436 -367 -295 -307 -64 53 106 -91 86 -3 405 795 660 690 623 622 116
2500 116 266 579 329 -141 -38 -632 -450 244 -219 -638 -153 -536 -690 -901 -261 -254 -541 -8 -112 -490 15
$$ packed form
2342D58j50m39l03K35J03k18r8l56j6N00j11k72N06k58K21l9L77j4j7k5R1M37
2364F12K44m08n8k03L18K30K1l77l47K31j18oj69j02l73J09j5Q1j66j91r9J95
2386e91L13o2K19j26o9O36K06p23L43K28PK77Q9j39k43L7O7r6j80j88o7K03j60
2409a9q3l99Q8J96l08n4K28o1k09%K44J27j76K05k0K84K47J9n9L26j57J9Q7J06
2433F31l8j01P1l29Jj38k76j29K27p9l83J71K82k23j08J1p0j51M26J01k58L13
2455d9J63j82J85K13p0j72N35m64K50Q9j05j47K18J62m26m37N98l71l33J93m9
2476a99k45k26k0M7J44M60m58O1O9P2j2K43J17N3j97J77q9M08L90j35L0o7jn06
2500A16J50L13k50m70J03n94J82O94m63m19M85l83j54k11O40Pk87N33j04l78N05
$$ plain form
2521 15 318 21 358 723 -68 -11 662 562 301 664 934 131 191 -29 -251 169 586 -185 -455 -371 -169
2542 -169 -975 -246 115 -225 -455 -442 -450 -978 176 -183 -91 310 309 -60 76 516 549 356 766 434 246 513
2564 513 302 205 593 509 -91 -132 -46 -288 -838 -174 -482 -597 -513 -419 -453 -353 -26 -534 -597 31 420 -166 195
2587 195 438 -104 37 446 386 371 1006 348 -44 447 456 228 475 651 -261 -352 54 -477 -440 -120 -68 -573
2609 -573 -411 -490 -863 -408 135 -113 -386 246 -245 -419 243 609 491 115 863 108 -43 751 249 69
2629 69 563 449 -219 -296 302 -374 -179 258 108 -686 114 -346 -760 -440 -218 -517 -404 -189 -275 -479 38
2650 38 308 -383 543 568 -137 167 658 215 154 578 485 102 408 268 167 81 -78 -326 -469 268 -73 -647
2672 -647 -455 -462 -560 -221 -123 -462 -271 6 -69 -379 252 229 234 230 160 -27 214 759 288 535 511 157 -10 316
$$ packed form
2521A5L03k97L37L65p91N7O73j00k61L63K70q03O0k20k22M20M17p71k70Q4K02
2542a69q06P29L61l40k30J3qn28J154l59R2M01jl69J36M40L3j93M10l32j88K67
2564E13k11r7L88q4o00m1Q6k42n50O64l08j15Q4R4l4J00L27n08o3O28L89n86L61
2587A95K43n42J41M09o0j5O35o58l92M91Rk28K47J76r12r1M06n31L7L20N2n05
2609e73J62p9l73M55N43k48k73O32m91j74O62L66j18l76P48p55j51P94n02j80
2629F9M94j14o68p7N98o76J95M37j50p94Q00m60m14L20K22k99J13K15q6k04N17
2650C8K70o91R26K5p05L04M91m43o1M24r3l83L06j40j01q6j59k48j43P37l41n74
2672f47J92pr8L39R8l39J91K77p5l10O31k3Nmp0j87K41N45m71K47k4l54j67L26
$$ plain form
2696 316 111 -186 -134 -79 -305 -324 -299 -388 -585 40 -413 -523 -432 -192 -496 -341 217 -134 54 -110 100 130
2718 130 -91 175 255 376 673 298 359 223 470 123 459 314 -408 -81 -172 -309 -322 -150 -154 -560 -357 -617
2740 -617 -352 -174 -191 -272 24 -25 -16 -218 264 414 367 552 701 485 190 140 65 302 475 81 127 159 -166
2763 -166 -92 -174 -106 -575 -143 -20 -191 -545 -225 -506 -540 36 -279 -86 -54 -191 184 -45 168 -21 183 248
2785 248 588 353 190 468 338 467 213 178 -153 -12 252 34 -36 -71 -346 -162 -395 -432 -340 -253 -115 -171
2807 -171 -28 67 -65 -242 1 276 75 265 168 115 454 376 415 325 20 154 202 221 219 -29 114 -135 -368
2830 -368 -309 -643 -130 -428 -116 -180 -190 -305 -392 -310 -181 -110 -303 -40 -41 -29 130 202 263 146 331 265 147 475
2854 475 326 130 267 -30 296 31 -50 -246 -269 -113 -510 -295 -424 -276 -155 -427 -512 -338 -23 -93 72
$$ packed form
2696C16k05k97N2N5k26j9K5q9j97O25m53j10R1K40l04J55N58l51J88j64K10L0
2718A30k21K66Q0J21K97l75O1j36K47l47L36j45p22L27r1j37j3J72mm06K03k60
2740f17K65J78j7q1K96m9Rk02M82J50m7J85J49k16k95n0p5K37J73l94M6L2l25
2763a66P4q2O8m69M32J23j71l54L20k81l4N76l15J93L2j37L75k29K13j89K04O5
2785B48L40k35j63K78j30J29k54l5l31J41K64k18p0l5k75J84k33l7R2Q7J38n6
2807a71J43R5j32j77K43K75k01J90r7n3L39p8L9r0l05J34M8J9kk48J43k49k33
2830c68N9l34N13k98L12o4j0j15q7Q2J29P1j93K63jJ2J59P2O1j17J85o6j18L28
2854D75j49j96J37k97L26k65q1j96k3J56l97K15j29J48J21k72q5J74L15p0J65
$$ plain form
2875 72 50 -31 276 257 -106 353 242 171 376 332 164 141 141 181 44 6 -70 -87 -135 53 449 -136 -358 -181 -377
2900 -377 -202 -104 -437 -229 -188 -134 49 55 155 135 351 316 731 414 50 94 244 390 231 237 -113 53 243
2923 243 180 -61 51 -283 -453 -131 -51 -287 -600 -420 -215 -250 -143 -267 -319 45 85 220 -115 110 -65 278
2945 278 255 289 510 13 192 299 451 224 42 -38 283 444 -32 -79 -102 -129 -196 -322 -219 -459 -352 10
2967 10 158 -317 -28 39 -96 51 143 -73 201 278 107 162 310 394 -112 205 220 241 309 184 -131 70 -24
2990 -24 -123 -409 -478 193 -204 -239 -86 -94 -362 -37 -351 -249 -87 87 -501 27 63 163 47 141 121 -7 325
3013 325 -8 231 295 280 -104 61 125 163 -536 100 -12 -415 -167 -238 -301 -311 -183 -590 -173 -89 -52 -412 80
3036 80 -172 -148 87 262 397 68 198 388 232 295 100 -147 334 106 163 -68 214 -255 -126 -9 35 -169
$$ packed form
2875G2k2q1L07j9l63M59j11p1K05m4j68k3%M0j37l8p6j7m8J88L96n85k22J77j96
2900c77J75R8l33K08M1N4J83OJ00k0K16l5M15l17l64M4J50J46j59Ol50J66J90
2923B43o3k41J12l34j70L22Q0k36l13J80K05l5J07j24n2L64M0J35l35K25j75L43
2945B78k3L4K21m97J79J07J52k27j82q0L21J61m76m7k3k7o7j26J03k40J07L62
2967A0J48m75K89O7j35J47R2k16K74P7j71N5J48Q4n06L17J5K1O8j25l15K01r4
2990b4r9k86o9O71l97l5J53qk68L25l14J02J62J74n88N28L6J00j16R4k0j28L32
3013C25l33K39O4j5l84J65O4L8o99O36j12m03K48p1o3j0J28m07M17Q4L7l60M92
3036H0k52K4K35J75J35l29J30J90j56O3j95k47M81k28N7k31K82m69J29J17M4k04
$$ plain form
3058 -169 -189 -344 -310 -311 -124 -428 -310 -8 -124 -345 11 426 89 63 413 97 -92 373 201 77 474 437
3080 437 -199 -48 77 123 -97 293 298 -417 -39 -276 -231 3 48 -563 -224 -199 -437 -421 110 -27 -154 20
3102 20 -82 -44 -48 174 138 -95 546 292 104 209 445 236 104 140 52 63 160 -212 -291 50 -74 -270 -99
3125 -99 -117 -272 -288 -191 -258 -396 57 266 -109 341 161 168 101 517 400 143 473 41 -167 237 289 -214 404
3148 404 313 -322 -54 -88 -357 -49 -7 -86 -731 -92 22 -410 -123 -71 -95 -289 90 11 31 178 326 32 45
3171 45 317 96 -46 159 318 144 520 -253 -314 44 131 -156 -150 108 -61 -276 -44 -233 -337 -384 187 -231
3193 -231 -128 12 -149 -94 154 93 2 388 214 -109 -137 136 7 187 386 175 494 249 309 -114 -94 114
3215 114 180 -49 -10 -330 -502 -18 -309 -269 -253 -143 -263 -517 -5 118 60 185 132 121 192 120 10 429 346
$$ packed form
3058a69k0j55L4jJ87l04J18L02j16k21L56M15l37k6L50l16j89M65j72j24L97l7
3080D37o36J51J25M6k20L90Np15L78k37M5K34M5o11L39K5k38J6N31j37j27J74
3102B0j02L8mK22l6k33O41k54j88J05K36k09j32L6q8J1R7l72p9L41j24j96J71
3125i9j8j55j6R7o7j38M53K09l75M50j80Po7M16j17k57L30m32k08M04N2n03O18
3148D04r1o35K68l4k69L08M2p9o45O39J14m32K87N2k4j94L79p9K0J47J48k94J3
3171D5K72k21j42K05J59j74L76p73o1L58Q7k87OK58j69k15K32j89j04m7N71m18
3193b31J03J40j61N5K48o1r1L86j74l23k8K73j29J80J99k11L19k45O0m23K0K08
3215A14O6k29L9l20j72M84k91M0J6J10j20k54N12J23n8J25n3j1P1p2j10M19q3
$$ plain form
3238 346 350 368 127 357 119 95 362 66 116 174 -391 -288 47 136 -257 -188 -348 -513 17 -168 -279 -8 -77
3261 -77 -219 -252 224 -248 -110 399 400 -99 165 502 -74 -81 246 46 -32 82 -135 -75 -27 129 -172 26 -9
3284 -9 -36 -302 -30 -269 -335 -389 -120 45 10 37 7 -78 -27 246 154 282 409 202 321 237 332 53 -42 123 210
3309 210 198 272 -58 -332 -251 -353 -320 -192 -259 -136 -93 -470 53 -195 -78 -335 -61 59 42 -82 331 64
3331 64 91 380 45 -177 142 -82 36 91 265 130 -319 -1 -96 -114 -46 -131 -314 -352 -317 -120 -99 -119 -460 -301
3355 -301 -238 -67 -200 28 140 37 164 -10 147 231 125 415 259 229 268 29 1 159 189 58 -283 -262
3377 -262 -267 -143 -63 -330 -177 -99 -140 -83 -80 134 16 -165 -98 -2 -81 125 106 291 40 96 227 440 68 254
3401 254 -31 279 -17 27 181 -113 -9 -125 -148 -40 101 2 -158 -492 36 -2 -93 -239 -70 -252 -159 12
$$ packed form
3238C46MJ8k41K30k38k4K67k96N0N8n65J03L35Q9l93O9j60j65N30j85j11K71o9
3261g7j42l3M76m72J38N09Jm99K64L37n76pL27k00p8J14k17O0M8J56l01J98l5
3284ik7k66K72k39o6n4K69J65l5K7l0q5N1K73r2J28J27k07J19q4R5k79r5J65Q7
3309B10j2P4l30k74Q1j02L3J28o7J23M3l77N23k48J17k57K74J20j7j24M13k67
3331F4K7K89l35k22L19k24J18N5J74j35m49L18r5j8O8q5j83l8L5J97K1k0l41J59
3355c01O3J71j33K28J12j03J27j74J57Q4j06K90j56l0L9k39k8J58L0j31l41K1
3377b62nJ24Q0k67J53P8m1N7LK14j18j81O7R6p9K06j9J85k51N6J31K13l72J86
3401B54k85L10k96M4J54k94J04j16k3J08J41r9j60l34N28l8r1j46J69j82R3J71
$$ plain form
3423 12 -43 133 90 218 288 212 71 148 187 355 155 159 141 78 128 -187 241 -88 33 49 29 -121 -195 -67 -253
3448 -253 -123 -92 -123 -155 -205 -187 -221 34 -153 -141 153 174 244 67 147 110 259 186 115 40 -157 351 3 -79 8
3473 8 -267 -246 4 -119 -245 -244 -233 -100 -245 287 -377 -127 -199 -164 67 157 81 69 -130 372 229 226 180 147 154 223
3499 223 286 139 311 59 37 224 89 7 -154 -324 -97 -284 -227 -105 -122 35 -10 -333 57 75 -91 -87 216
3522 216 -14 31 65 287 225 331 121 260 148 52 -7 -25 196 52 95 62 -133 -404 -246 -150 -454 -304 -89
3545 -89 -677 -472 -260 -84 -170 -158 -128 -13 231 348 24 198 322 156 26 161 35 82 183 440 23 -36
3567 -36 -5 -144 -215 -44 -169 -354 -105 -111 -366 -283 -145 -137 -352 163 -58 -242 -74 109 81 -47 271 -23 110
3590 110 191 -9 121 320 294 11 243 393 44 -6 261 -110 -106 363 59 -90 -47 -293 -352 -237 114 -108
$$ packed form
3423A2n5J76m3J28P0p6j41P7L9J68k00Mj8o3N0l15M28l29J21J6k0j50p4J28j86
3448b53J30L1l1l2n0J8l4K55j87J2K94K1P0j77Q0l7J49p3p1p5j97N08l48q2Q7
3473Hk75K1K50j23j26JJ1J33j45N32o64K50p2L5K31R0p6j2j99N02j43lm6l3PO9
3499B23O3j47J72k52k2J87j35q2j61j70K27j87N7J22j7J57m5l23L90J8j66ML03
3522B16k30M5L4K22o2J06k10J39j12r6n9j8K21j44M3l3j95k71J58R6l04J50K15
3545h9n88K05K12J76q6J2L0J15K44J17l24J74J24j66j30J35j26M7J01K57m17n9
3567c6L1j39p1J71j25j85K49ok55Q3J38Qk15N15k21j84J68J83k8j28L18k94J33
3590A10Q1k00J30J99k6k83K32J50l49n0K67l71MM69l04j49M3k46n9J15L51k22
$$ plain form
3612 -108 20 -216 8 -95 178 158 17 -1 331 58 56 209 341 275 81 159 -137 111 204 186 284 52 -110
3635 -110 -100 -195 -222 -467 -83 69 -365 -88 -79 -214 -473 123 82 -52 117 157 4 350 364 125 191 466 274
3658 274 -87 225 172 -104 258 132 -73 251 -40 -254 -209 -25 -229 34 -64 -105 -42 -271 -414 -160 -255 -175
3680 -175 92 -29 107 214 236 89 316 178 -82 355 -89 -73 325 -30 187 96 -19 -65 -3 -32 67 102 -83
3703 -83 -460 -319 -310 -302 -78 -118 101 -17 -133 -27 -130 -283 316 326 57 -168 125 43 215 393 141 68 95
3726 95 63 103 18 68 -83 -72 -102 -206 -121 -81 -227 -330 -277 -60 -184 -103 -11 -96 64 54 -52 -52 163 -8 294
3751 294 -38 240 128 221 130 94 207 -28 -96 16 76 211 -176 -25 -32 -314 -163 -122 -174 -328 -225 291 -191
3774 -191 -169 -286 -102 -181 -44 435 193 117 66 198 359 348 -133 66 187 -74 -236 194 191 107 -4 -25 6
$$ packed form
3612a08J28k36K24j03K73k0j41j8L32k73kJ53J32o6j94P8k96K48R3j8R8k32j62
3635a10J0r5k7k45L84J52m34K77Rj35k59N96m1j34J69M0j53L46J4k39O6K75j92
3658B74l61L12n3k76L62j26k05L24k91k14M5J84k04K63r8m1O3k29j43K54r5Q0
3680a75K67j21J36J07K2j47K27j38k60M37m44J6L98l55K17r1j15m6O2k9R9L5j85
3703h3l77J41RQK24m0K19j18j16J06j03j53N99J0k69k25K93q2J72J78k52p3K7
3726I5l2M0q5N0j51J1l0j04Q5M0j46j03N3K17j24Q1R2q5J60j0j06%K15j71L02
3751B94l32K78j12R3r1l6J13k35o8J12O0J35l87J51pk82J51M1n2j54J03N16m82
3774a91K2j17J84p9J37M79k42p6n1J32J61j1m81J99J21k61j62M30lq4j11k1L1
$$ plain form
3797 6 -219 70 -35 -144 -6 -67 -3 -29 -253 -255 -167 -69 -250 -66 0 137 -74 185 -15 165 143 -48 25 -168
3821 -168 151 -66 33 138 23 -42 65 -20 19 -39 -35 -190 -276 -361 -85 -230 -315 -155 -273 -187 -37 44 -54 31 303
3846 303 58 364 181 174 100 50 157 231 35 57 116 204 30 -201 -150 -193 -188 -118 -137 -120 -350 -388 -96 -16 -230 -157
3872 -157 -80 64 75 101 189 -63 265 -100 58 257 260 253 -126 222 14 -46 128 -103 155 -13 169 -44 -23
3895 -23 -126 42 -156 -46 -231 -226 -44 68 -166 -134 -38 -137 37 168 66 256 -16 166 31 143 97 281
3917 281 336 -90 31 124 238 15 -104 -230 -74 63 -325 -193 -144 -273 -146 -99 -35 -103 19 -108 63 115
3939 115 -117 167 -61 36 68 203 301 380 21 -109 -56 209 -127 -6 299 124 -175 3 22 48 -41 57 -183
3962 -183 -65 -63 -95 -139 -116 -130 -472 -91 142 -168 -303 222 88 134 189 129 169 -59 282 215 200 229 337 3
$$ packed form
3797Fk25K89j05j09J38o1O4k6k24kQ8R8j81J84O6J37k11K59k00J80k2j91P3j93
3821a68L19k17R9J05j15o5J07q5L9n8Mj55q6q5K76j45q5J60j18Q6J50Q1r8Q5K72
3846C03k45L06j83pp4n0J07P4j96K2N9Q8j74k31N1m3NP0j9J7k30l8K92Q0k14P3
3872a57P7J44J1K6Q8k52L28l65J58J99Lpl79L48k08o0J74k31K58j68J82k13K1
3895b3j03J68j98J10j85NJ82J12k34L2R6r9J74J31j02J90k72J82j35J12m6J84
3917B81N5m26J21R3J14k23j19j26J56J37l88J32M9j29J27M7O4o8J22j27J71N2
3939A15k32K84k28R7L2J35R8P9l59j30N3K65l36J21L05j75k99J78J9K6q9R8k40
3962a83J18Kl2m4K3j4l42L81K33l10j35N25j34M6N5o0M0k28L41o7j5K9J08l34
$$ plain form
3986 3 3 133 -33 -77 -132 -8 -121 -172 -285 -395 98 -434 -223 -84 -338 -171 51 225 -62 61 105 38 1
4009 1 138 314 -207 199 -19 -29 -255 145 -34 107 -100 -71 -152 -110 -130 -222 -211 29 -273 -336 45 -274 104
4032 104 41 378 -187 151 11 147 263 81 55 -35 178 383 -67 273 303 330 89 -145 -87 72 -59 301
4054 301 -189 -251 -234 -305 -143 40 -275 -151 131 -99 -367 -199 -50 83 213 44 237 -22 209 217 -139 325
4076 325 118 126 143 101 -44 145 336 -61 -148 20 -43 -165 167 62 -451 -256 -75 -371 23 -37 -36 -144 36
4099 36 68 87 -171 22 -67 -193 176 201 170 376 429 173 78 318 -281 96 0 59 203 242 -154 -292 -36 -215
4123 -215 -325 3 -81 -74 61 -19 -94 -215 -208 293 -157 -5 36 317 -5 204 -214 -91 128 371 -27 -46 111
4146 111 69 -70 -47 -20 -102 251 157 -303 -211 -155 -128 -191 -96 -132 -238 61 -278 -147 -41 -135 -41 196 84 203
$$ packed form
3986C%J30j66m4n5J24j13n1j13j10M93n32K11J39k54J67K22J74k87J23M4o7l7
4009AJ37J76n21M06k18j0k26M00j79J41k07K9q1M2k0r2J1K40l02o3L81l19L78
4032A04o3L37n65L38j40J36J16j82k6r0K13K05m50L40L0K7k41k34N8J59j31L60
4054C01m90o2J7p1J62J83l15J24K82k30k68J68J49J33J30j69J93k59K31Ql56M64
4076C25k07QJ7m2j45J89J91l97q7J68o3j22L32j05n13J95J81k96L94o0Jj08J80
4099C6L2J9k58J93q9j26L69K5l1K06N3k56r5K40n99L77r6N9J44L9l96j38K56j79
4123b15j10L28q4PJ35q0p5j21PN01m50J52M1K81l22K09m18J23K19K43l98j9J57
4146A11m2j39K3K7q2L53r4m60R2N6K7o3R5l6j06K99l39J31J06r4R4K37j12J19
$$ plain form
4170 203 132 449 85 249 380 -51 22 217 69 35 -8 116 -311 -124 -75 -14 -69 -163 -171 -148 59 -91 -255 -50
4194 -50 -90 9 -67 -43 76 -36 23 132 108 157 175 43 355 -45 251 -76 150 79 -12 142 121 -161 -59 67
4218 67 -252 -493 36 24 -198 -153 -118 -25 -2 -27 -116 78 -236 -66 128 500 422 185 181 385 81 -48 215 305
4242 305 201 -132 -119 -146 -79 -60 -244 -207 -59 -249 -192 -312 71 -121 5 -85 -212 -222 136 141 202 173 143 206 110
4267 110 167 -13 -66 44 286 -13 120 -21 28 117 99 -152 -336 15 -114 -77 -326 -249 -106 -42 -322 -47 82
4290 82 96 20 -34 80 58 -155 -104 215 173 -130 60 267 176 -16 84 -135 20 135 -84 133 59 -112 -121 -169
4314 -169 -294 -277 -294 -45 -120 -43 -281 -177 -210 -33 -93 -206 117 -180 -89 -9 149 260 354 -64 219 87 35
4337 35 378 186 163 -54 132 -160 -170 51 -34 36 74 -47 -62 -92 -167 -121 -206 -241 24 -115 -35 27 193 368 -29
$$ packed form
4170B03p1L17l64J64J31m31P3J95j48l4m3J24m27J87M9O1n5r4qK3K07j50j64K05
4194e0m0R9p6K4J19j12N9J09k4M9J8j32L12m00K96l27K26p1r1J54k1k82J02J26
4218F7l19k41N29j2k22M5L5R3K3k5q9J94l14J70J94L72p8k37mK04l04j29K63R0
4242C05j04l33J3k7O7J9j84L7J48j90N7j20L83j92J26r0j27j0L58NO1k9l0O3r6
4267A10N7j80n3J10K42k99J33j41M9Q9j8k51j84L51j29L7k49P7J43O4k80K75J29
4290H2J4p6n4J14k2k13N1L19m2l03J90K07r1j92J00k19J55J15k19K17p4j71rm8
4314a69j25J7j7K49p5P7k38J04l3J77o0j13L23k97R1Q0J58J11R4m18K83j32n2
4337C5L43j92k3k17J86k92j0K21q5P0L8j21j5l0p5M6q5l5K65j39Q0O2J66J75l97
$$ plain form
4362 -29 -12 437 125 154 33 62 105 159 -95 109 159 -190 190 171 -41 -61 -125 -71 -14 -271 -24 -22 -223 -63 -141
4387 -141 58 208 16 106 73 191 -6 -24 169 4 91 265 96 43 -32 43 -60 -91 243 259 122 -57 30
4410 30 -239 -160 -308 -510 -55 103 -100 -201 61 -53 40 -442 -56 119 241 139 137 281 52 -51 -39 300
4432 300 365 289 172 84 72 -11 121 231 -121 79 2 181 -155 33 -129 -135 -168 -37 -62 -101 26 43 -22 26 -179
4457 -179 413 102 316 -36 354 45 288 94 184 215 140 25 140 152 -40 120 -5 -282 -88 116 -167
4478 -167 49 -135 -58 21 -116 -165 -116 -84 -36 -60 139 43 157 287 62 121 28 265 286 150 212 -159 -97 164
4502 164 -175 -30 15 -97 138 -248 -230 -218 -25 -27 -57 -134 -236 -147 -123 114 -54 -196 -74 146 -101 280 288 109
4526 109 -31 41 119 157 133 256 -2 64 43 -90 84 -44 126 -247 11 91 -141 145 -241 -190 -59 2 55
$$ packed form
4362b9J7M49l12K9j21K9M3N4k54K04N0l49L80j9k12k0o4N4N7k57K47Kk01J60p8
4387a41J99J50j92R0l3J18j97j8J93j65Q7J74j69n3p5P5j03l1L34J6j37j79Q7
4410C0k69P9j48k02M55J58k03j01K62j14R3m82L86J75J22j02kJ44k29j03J2L39
4432C00O5p6j17q8j2q3J32J10l52K00p7J79l36J88j62ol3J31k5l9J27J7o5M8k05
4457a79N92l11K14l52L90l09K43j94R0L1p5j15J15J2j92J60j25k77J94K04k83
4478a67K16j84P7P9j37m9M9L2M8k4J99r6J14J30k25N9r3K37K1j36O2l71O2K61
4502A64l39J45M5j12K35l86J8J2J93kl0p7j02Q9K4K37j68j42J22K20k47L81Qj79
4526A09j40P2P8L8k4J23k58O6k1j33J74j28J70l73K58Q0k32K86l86N1J31O1N3
$$ plain form
4549 55 -154 161 -101 -10 88 -35 83 163 275 355 -129 164 282 64 -30 -99 -49 245 -72 102 -91 12 69
4572 69 -192 62 -134 -156 -413 -4 44 -280 -16 -92 46 86 -75 113 -103 -19 176 -161 255 259 107 240 287
4595 287 -50 114 209 37 -163 496 -220 60 -118 -292 -306 -181 -228 -73 -160 -37 -264 -314 44 -132 -228 216
4617 216 69 -100 -1 81 194 0 48 -26 -69 146 263 -185 -10 167 52 -132 62 -23 -164 -233 16 -296
4639 -296 -121 -105 -418 -312 132 -193 -302 -207 67 -296 201 294 7 215 190 79 -16 250 -146 345 55 178
4661 178 -145 4 148 23 62 38 -323 -79 -183 -53 -122 -116 12 -137 1 -126 -129 -115 -216 -147 124 50 151
4684 151 63 32 203 -56 68 398 -72 239 218 100 -97 2 64 63 -26 117 -64 -221 -147 -306 -260 -389 -104
4707 -104 -184 -37 -114 -35 -44 -20 77 -29 -384 160 47 167 245 209 60 15 23 139 -32 -121 -148 -20 117 -340 123
$$ packed form
4549E5k09L15k62R1R8j23J18Q0J12Q0m84K93J18k18r4o9N0K94l17J74j93J03N7
4572F9k61K54j96k2k57M09M8l24K64p6J38M0j61J88k16Q4J95l37M16Mj52J33M7
4595B87l37J64R5j72k00O59p16K80j78j74j4J25m7J55q7J23k27n0L58j76r6M44
4617B16j47j69R9Q2J13j94M8p4m3K15J17m48J75J77j15j84J94q5j41o9K49l12
4639b96J75J6l13J06M44l25j09R5K74l63M97R3k87K08k5j11r5K66l96M91k90J23
4661A78l23J49J44j25L9k4l61K44j04J30o9OJ28j49J38j27lJ4j01O9K71p4J01
4684A51q8l1J71k59J24L30m70L11k1j18j97R9O2jq9J43j81j57P4j59M6j29K85
4707a04q0J47p7P9rK4R7j06l55N44j13J20P8l6j49m5QJ16j71q9k7J28J37m57M63
$$ plain form
4732 123 78 144 -224 -106 -202 -119 -283 110 -366 -4 -133 45 -11 -138 -7 -16 127 23 73 -80 3 206 -211
4755 -211 195 262 147 36 36 71 -126 -167 -137 -372 -155 -132 -76 -122 -236 -402 -402 -132 -58 23 -266 -232 -43 146 77
4780 77 138 317 101 335 159 -111 -30 19 75 377 126 184 26 -7 -81 87 252 42 -93 -158 -13 -57 -145 -423
4804 -423 -39 -104 -226 -306 -27 18 12 24 151 266 102 264 237 -52 -8 246 319 -24 -74 211 83 -160 -72 245
4828 245 -150 -67 28 -123 32 -344 -106 -165 -21 -269 -85 -23 9 -66 -98 87 -109 171 224 122 12 253 114
4851 114 200 85 231 220 221 157 13 252 89 -9 -130 -156 34 12 -93 -11 -199 -263 15 57 -112 -110 -56 52 234
4876 234 -210 -226 163 -4 116 327 36 247 222 48 198 139 60 154 -121 -159 -74 36 -222 -211 -58 -133 -107
4899 -107 -117 -323 -94 85 -53 -207 31 -36 128 48 -191 88 41 -88 152 343 263 49 355 98 198 250
$$ packed form
4732A23m5O6l68J18r6Q3j64L93m76L62j29J78n6j27J31rJ43j04N0j53Q3K03m17
4755b11M06O7j15j11%L5j97m1L0k35K17K3N6m6j14j66%K70P4Q1k89L4J89J89o9
4780G7O1J79k16K34j76k70Q1M9N6L02k51N8j58l3p4J68J65k10j35o5J45m4q8k78
4804d23L84o5j22q0K79M5oJ2J27J15j64J62k7k89M4K54P3l43n0K85j28k43Q8L17
4828B45l95Q3R5j51J55l76K38n9J44k48J84O2L2p5l2J85j96K80N3j02j10K41j39
4851A14Q6j15J46j1Jo4j44K39j63r8j21k6J90k2j05Q2j88o4K78M2j69KN4J08J82
4876B34m44j6L89j67J20K11k91K11k5j74J50n9p9R4k75l8Q5J10k58J1J53p5K6
4899a07j0k06K29J79j38j54K38o7J64q0k39K79m7j29K40J91q0k14L06k57J00N2
$$ plain form
4921 250 127 -2 241 -62 -132 11 15 -10 -214 -42 -210 -298 85 -292 173 -192 -68 202 42 -113 35 191
4943 191 75 296 -84 382 283 51 119 223 130 11 -154 271 220 196 62 -138 -98 46 -193 -267 35 -143
4965 -143 11 -166 -249 -272 -156 165 -276 51 195 -154 167 -143 -39 119 218 37 -96 5 98 50 -30 200
4987 200 80 136 40 51 -144 -48 26 76 -117 -86 -103 -286 -125 60 -81 -223 24 2 58 4 30 -31 8 271 1
5012 1 111 145 64 44 -9 162 -88 -176 53 -179 -256 98 -175 -234 -111 -88 -178 -34 -134 -201 27 -117 -294 -88
5036 -88 49 -31 -10 96 96 135 150 297 160 46 63 81 240 196 67 -106 259 -63 -63 -69 -230 -112 -154 64 -227
5061 -227 -215 -64 -43 -261 -119 -34 -244 3 -43 134 145 154 -76 216 213 289 89 231 34 -230 81 71 96 -283
5085 -283 -150 -40 -165 -232 -233 -281 16 5 -12 -212 -91 -162 -257 -43 308 16 -81 263 213 86 232 -191 213
$$ packed form
4921B50j23j29K43l03p0J43Mk5k04J72j68q8L83l77M65l65J24K70j60j55J48J56
4943A91j16K21l80M66r9k32O8J04r3j19j65M25n1k4j34k00M0J44k39p4L02j78
4965a43J54j77q3k3J16L21m41L27J44l49L21l10J04J58R9j81j33J01R3m8q0K30
4987B00j20N6r6J1j95R6P4N0j93L1j7j83J61J85j41j42K47k2N6n4K6o1L9K63k70
5012AJ10L4q1k0n3J71k50q8K29k32p7L54k73n9J23K3r0J44j00o7K28j44j77K06
5036h8J37q0K1J06%L9J5J47j37j14J7J8J59m4j29j73L65l22%oj61J18m2K18k91
5061b27J2J51K1k18J42Q5k10K47m6J77J1Rk30K92lP6k00J42j97k64L11j0K5l79
5085b83J33J10j25o7jm8K97j1j7k00J21p1r5K14L51k92r7L44n0j27J46m23M04
$$ plain form
5108 213 172 34 74 281 148 -30 -45 -29 166 -70 5 -95 -146 -61 -46 -286 113 -68 34 -126 2 -73 -110
5131 -110 82 129 159 78 206 8 52 247 6 74 165 178 26 200 276 -109 -31 -179 -79 -165 147 -44 174
5154 174 -94 -154 -147 -387 39 -169 -337 10 -303 -447 26 -166 -287 178 235 86 134 9 -47 24 -4 426 -11
5177 -11 -26 84 61 -141 -96 179 -154 39 -72 -49 -195 -420 -315 53 19 -80 -302 -165 -12 31 241 -30 3
5200 3 56 252 -71 102 127 326 -84 187 331 132 -68 -28 -56 288 99 -184 -306 -125 -208 -245 46 -10 -63
5223 -63 121 -115 -231 -256 12 -138 138 -101 136 -174 113 313 103 96 111 302 -56 73 162 91 -3 -13 53
5246 53 -50 27 -249 -52 163 77 -175 -43 -89 -168 19 -24 36 76 -169 127 -147 218 -14 -94 -85 -102 245 143
5270 143 299 146 263 171 153 41 54 -13 -11 -146 -40 -63 39 -131 -61 -12 -194 -43 -338 -2 58 -439 32
$$ packed form
5108B13m1j38M0K07j33j78j5J6J95k36P5j00n1Q5J5k40L99j81J02j60J28p5l7
5131a10J92M7L0q1J28j98M4J95k41O8R1J3j52J74P6l85P8j48J00q6L12j91K18
5154A74k68o0Pk40M26k08j68L47l13j44M73j92j21M65N7j49M8j25n6P1k8M30m37
5177a1j5J10k3k02M5K75l33J93j11K3j46k25J05L68l4r9k22J37J53M3K10k71L3
5200CN3J96l23J73K5J99m10K71J44j99k00M0k8L44j89k83j22J81q3l7K91n6n3
5223f3J84k36j16k5K68j50K76k39K37l10K87K00k10pJ5J91l58J29Q9p1r4j0O6
5246E3j03P7k76J97K15q6k52J32m6p9J87m3O0M0k45K96k74L65k32q0Rj7L47j02
5270A43J56j53J17r2j8j12J3o7Kj35J06k3J02j70P0M9j82J51k95L36O0m97M71
$$ plain form
5293 32 18 180 -190 56 210 206 40 212 85 203 -104 -15 -138 -106 216 132 -10 -88 -62 -7 -317 -87 73
5316 73 -259 -146 -367 -114 -3 -207 -83 -40 -227 -251 301 125 82 -128 404 91 10 107 379 245 -57 175
5338 175 -132 134 344 -102 -135 63 147 -78 -81 -270 -337 3 -132 -191 19 -221 -128 14 25 17 -15 -133 65 234
5362 234 149 252 65 118 358 15 185 240 199 77 295 -142 147 -180 82 179 -150 -242 -279 -113 -146 -211 -56
5385 -56 -23 -143 -58 91 -32 62 -54 65 -3 65 137 269 53 162 165 104 148 -54 -63 -84 6 -20 103 12 -180 -213
5411 -213 -343 -113 -212 -122 61 250 88 -286 34 68 185 -409 177 160 100 66 39 127 230 83 -174 249 239
5434 239 -62 -171 88 27 9 -210 -88 -124 -322 158 95 -127 41 -281 -127 -28 -105 -32 -148 43 -26 135 173
5457 173 26 -21 22 -168 128 302 171 359 47 269 -103 197 50 -142 -70 47 -69 27 -56 -13 -175 -212
$$ packed form
5293C2j4J62l70K46J54mj66J72j27J18l07Q9j23L2L22q4j42p8K6N5l10K30J60
5316G3l32J13k21K53J11k04J24M3j87k4N52j76m3k10N32l13q1R7K72j34l02K32
5338A75l07K66K10m46l3J98Q4k25lj89o7L40j35n9K10k40R3J42J1ql2j18J98J69
5362B34q5J03j87N3K40l43J70N5m1j22K18m37K89l27K62R7l29r2l7J66l3o5J55
5385e6L3j20Q5J49j23R4j16J19o8O8P2J32k16J09Lo1M4k02rk1R0k6J23r1j92l3
5411b13j30K30r9R0J83J89j62l74L20L4J17n94N86j7o0l4k7Q8J03j47k57M23j0
5434B39l01j09K59o1j8k19J22l6j98M80o3k22J68l22J54R9p7P3j16J91o9J61L8
5457A73j47m7M3j90K96J74j31J88l12K22l72L00j47j92P2J17j16R6q3M3j62l7
$$ plain form
5479 -212 -26 -404 -42 -42 -12 -285 216 42 -195 232 131 206 359 -11 78 -165 -103 281 100 166 35 236
5501 236 -65 182 -45 -103 176 -110 -131 38 -173 -56 -110 -501 -96 42 -125 -63 -15 108 -41 -62 50 -59
5523 -59 226 30 125 -151 -158 125 451 396 14 111 136 -81 65 -43 50 182 -29 62 56 23 -111 67 -218 -265
5547 -265 -120 -57 23 194 -135 -223 190 248 149 78 43 247 388 475 271 9 -13 -40 173 -7 19 138 -274 -107
5571 -107 -97 -329 -147 86 -60 -339 -234 282 -237 -129 -131 -298 179 58 -65 32 125 121 258 133 -115 -65 92
5594 92 242 -21 -52 131 157 -110 -238 -1 91 178 -176 -119 -85 -207 -233 -310 -187 -225 -159 -85 9 -76 29 182 -73
5619 -73 -32 250 48 182 55 154 91 23 144 -77 173 360 102 148 130 -73 53 -26 -160 -232 -23 -81 -196
5642 -196 -371 39 -45 -42 77 122 -153 -40 167 -108 199 141 20 226 142 270 19 29 50 202 7 -82 59
$$ packed form
5479b12J86l78L62%L0k73N01j74k37M27j01P5J53l70Q9k43O2L84j81O6j31K01
5501B36l01K47k27n8K79k86k1J69k11J17n4l91M05J38j67O2M8J23j49k1J12j09
5523e9K85j96R5k76pK83L26n5l82R7K5k17J46j08R3J32k11R1ol3j34J78k85m7
5547b65J45O3Q0J71l29q8M13N8r9p1l5K04J41Q7k04k62k2k7K13j80K6J19m12J67
5571a07J0k32J82K33j46k79J05N16n19J08kj67M77j21j23R7R3mJ37j25k48N0J57
5594I2J50k63l1J83K6k67j28K37R2Q7l54N7L4j22k6p7J23l8O6P4R4q5J05J53k55
5619g3M1K82k02J34j27R9o3o8J21k21K50J87k58M6j8k03J26p9j34p2K09n8j15
5642a96j75M10q4LJ19M5k75J13K07k75L07n8j21K06q4J28k51J0K1J52j95q9J41
$$ plain form
5665 59 -264 -175 71 78 -71 -85 -253 -313 -51 -118 27 5 -1 72 -147 -114 -150 -46 80 154 129 125 148 77 126 -10 123
5692 123 119 15 -31 -242 24 341 57 175 -163 -6 -18 -173 -333 13 -136 -112 -160 71 -17 -63 161 63 -97
$$ packed form
5665E9l23Q9K46Pj49j4j68o0K62o7J45k2oP3k19L3l6J04J26P4k5mK3p1M9j36J33
5692A23mj04m6k11K66L17k84J18l38J57j2j55j60L46j49K4m8K31q8m6K24r8j60
$$ [...]
8191A85
##END NTUPLES=NMR FID
##END=
