##TITLE=1H_Pr Am-All
 CDCl3, 8 sc, 
 2.08.2021
##JCAMPDX= 6.0         $$ Bruker NMR JCAMP-DX V2.0
##DATA TYPE= NMR FID
##DATA CLASS= NTUPLES
##ORIGIN= UXNMR, Bruker Analytische Messtechnik GmbH
##OWNER= root
$$ XWIN-NMR		Version 3.5
$$ Mon Aug  2 13:44:04 2021 Russian Standard Time (UT+4h)  she@DPX200
##.OBSERVE FREQUENCY= 200.131506
##.OBSERVE NUCLEUS= ^1H
##.DELAY= (6, 6)
##.ACQUISITION MODE= SIMULTANEOUS
##.ACQUISITION SCHEME= undefined
##.AVERAGES= 8
##.DIGITISER RES= 18
##SPECTROMETER/DATA SYSTEM= spect
##.PULSE SEQUENCE= zg30
##.SOLVENT NAME= CDCl3
##.SHIFT REFERENCE= (INTERNAL, CDCl3, 0, 15.7039)
##AUDIT TRAIL= $$ (NUMBER, WHEN, WHO, WHERE, WHAT)
$$ ##TITLE= Audit trail, XWIN-NMR		Version 3.5
$$ ##JCAMPDX= 5.01
$$ ##ORIGIN= Bruker BioSpin GmbH
$$ ##OWNER= she
$$ F:/spectra/data/she/nmr/H-F/1/audita.txt
$$ ##AUDIT TRAIL=  $$ (NUMBER, WHEN, WHO, WHERE, WHAT)
(   1,<2021-08-02 13:42:25.62 +0400>,<she>,<DPX200>,
      <created by zg, POWCHK disabled, PULCHK disabled
       configuration hash MD5:
       00 E9 B6 7A A2 85 ED C7 34 08 36 98 17 FE 4E 26
       data hash MD5: 16K
       CD 1C 11 3D 29 C9 BE 32 BA 23 E8 14 FB 2C 3C 05>)
$$ ##END=
$$ 
$$ hash MD5
$$ 14 B2 A6 BF D1 91 5F FA B1 95 CD 0E 29 D1 E4 ED
##$RELAX= 
##$RELAX= 
##$RELAX= 
##$RELAX= 
##$RELAX= 
##$RELAX= 
$$ Bruker specific parameters
$$ --------------------------
##$DU= <F:/spectra>
##$EXPNO= 1
##$NAME= <H-F>
##$PROCNO= 1
##$TYPE= <nmr>
##$USER= <she>
##$AMP= (0..31)
100 100 100 100 100 100 100 100 100 100 100 100 100 100 100 100 100 100 
100 100 100 100 100 100 100 100 100 100 100 100 100 100 
##$AQSEQ= 0
##$AQ_mod= 1
##$AUNM= <au_zg>
##$AUTOPOS= <>
##$BF1= 200.13
##$BF2= 200.13
##$BF3= 200.13
##$BF4= 200.13
##$BF5= 200.13
##$BF6= 200.13
##$BF7= 200.13
##$BF8= 200.13
##$BYTORDA= 1
##$CFDGTYP= 0
##$CFRGTYP= 5
##$CHEMSTR= <none>
##$CNST= (0..31)
1 1 145 1 1 1 1 1 1 1 1 1 1 1 1 1 1 1 1 1 1 1 1 1 1 1 1 1 1 1 1 1 
##$CPDPRG= <>
##$CPDPRG1= <>
##$CPDPRG2= <>
##$CPDPRG3= <>
##$CPDPRG4= <mlev>
##$CPDPRG5= <mlev>
##$CPDPRG6= <mlev>
##$CPDPRG7= <mlev>
##$CPDPRG8= <mlev>
##$CPDPRGB= <>
##$CPDPRGT= <>
##$D= (0..31)
0 1.2 0 0 0 0 0 0 0 0.06 0 0.03 0 0 0 0 0.0002 0 0 0 0 0 0 0 0 0 0 0 0 
0 0 0 
##$DATE= 1627897345
##$DBL= (0..7)
120 120 120 120 120 120 120 120 
##$DBP= (0..7)
150 150 150 150 150 150 150 150 
##$DBP07= 0
##$DBPNAM0= <>
##$DBPNAM1= <>
##$DBPNAM2= <>
##$DBPNAM3= <>
##$DBPNAM4= <>
##$DBPNAM5= <>
##$DBPNAM6= <>
##$DBPNAM7= <>
##$DBPOAL= (0..7)
0.5 0.5 0.5 0.5 0.5 0.5 0.5 0.5 
##$DBPOFFS= (0..7)
0 0 0 0 0 0 0 0 
##$DE= 6
##$DECBNUC= <off>
##$DECIM= 32
##$DECNUC= <off>
##$DECSTAT= 4
##$DIGMOD= 1
##$DIGTYP= 9
##$DL= (0..7)
0 120 120 120 120 120 120 120 
##$DP= (0..7)
150 150 150 150 150 150 150 150 
##$DP07= 0
##$DPNAME0= <>
##$DPNAME1= <>
##$DPNAME2= <>
##$DPNAME3= <>
##$DPNAME4= <>
##$DPNAME5= <>
##$DPNAME6= <>
##$DPNAME7= <>
##$DPOAL= (0..7)
0.5 0.5 0.5 0.5 0.5 0.5 0.5 0.5 
##$DPOFFS= (0..7)
0 0 0 0 0 0 0 0 
##$DQDMODE= 0
##$DR= 18
##$DS= 0
##$DSLIST= <SSSSSSSSSSSSSSS>
$$ [...]
##$SUBNAM2= <"">
##$SUBNAM3= <"">
##$SUBNAM4= <"">
##$SUBNAM5= <"">
##$SUBNAM6= <"">
##$SUBNAM7= <"">
##$SUBNAM8= <"">
##$SUBNAM9= <"">
##$SW= 20.0188882624521
##$SWIBOX= (0..15)
0 0 2 0 0 0 0 0 0 0 0 0 0 0 0 0 
##$SW_h= 4006.41025641026
##$TD= 16384
##$TD0= 1
##$TE= 0
##$TE2= 300
##$TE3= 300
##$TEG= 300
##$TL= (0..7)
0 120 120 120 120 120 120 120 
##$TP= (0..7)
150 150 150 150 150 150 150 150 
##$TP07= 0
##$TPNAME0= <>
##$TPNAME1= <>
##$TPNAME2= <>
##$TPNAME3= <>
##$TPNAME4= <>
##$TPNAME5= <>
##$TPNAME6= <>
##$TPNAME7= <>
##$TPOAL= (0..7)
0.5 0.5 0.5 0.5 0.5 0.5 0.5 0.5 
##$TPOFFS= (0..7)
0 0 0 0 0 0 0 0 
##$TUNHIN= 0
##$TUNHOUT= 0
##$TUNXOUT= 0
##$USERA1= <user>
##$USERA2= <user>
##$USERA3= <user>
##$USERA4= <user>
##$USERA5= <user>
##$V9= 5
##$VALIST= <valist>
##$VCLIST= <CCCCCCCCCCCCCCC>
##$VD= 0
##$VDLIST= <DDDDDDDDDDDDDDD>
##$VPLIST= <PPPPPPPPPPPPPPP>
##$VTLIST= <TTTTTTTTTTTTTTT>
##$WBST= 1024
##$WBSW= 4
##$XGAIN= (0..3)
0 0 0 0 
##$XL= 0
##$YL= 0
##$YMAX_a= 251849
##$YMIN_a= -329288
##$ZGOPTNS= <>
##$ZL1= 120
##$ZL2= 120
##$ZL3= 120
##$ZL4= 120
##$ABSF1= 10
##$ABSF2= 0
##$ABSG= 5
##$ABSL= 3
##$ALPHA= 0
##$AQORDER= 0
##$ASSFAC= 0
##$ASSFACI= 0
##$ASSFACX= 0
##$ASSWID= 0
##$AUNMP= <proc_1d>
##$AZFE= 0.1
##$AZFW= 0.1
##$BCFW= 1
##$BC_mod= 2
##$BYTORDP= 1
##$COROFFS= 0
##$CY= 11.3945322036743
##$DATMOD= 1
##$DC= 2
##$DFILT= <>
##$DTYPP= 0
##$F1P= 2.36226072786647
##$F2P= -0.459571619588291
##$FCOR= 0.5
##$FTSIZE= 0
##$FT_mod= 4
##$GAMMA= 1
##$GB= 0.15
##$INTBC= 1
##$INTSCL= 1
##$ISEN= 128
##$LB= 0.24
##$LEV0= 0
##$LPBIN= 0
##$MAXI= 10000
##$MC2= 0
##$MEAN= 0
##$ME_mod= 0
##$MI= 1.114404
##$NCOEF= 0
##$NC_proc= 0
##$NLEV= 6
##$NOISF1= 3.799351
##$NOISF2= 2.8
##$NSP= 1
##$NTH_PI= 0
##$NZP= 0
##$OFFSET= 15.70392
##$PC= 1
##$PHC0= -13378.35
##$PHC1= 40.60099
##$PH_mod= 1
##$PKNL= yes
##$PPARMOD= 0
##$PSCAL= 0
##$PSIGN= 0
##$REVERSE= no
##$SF= 200.130013532006
##$SI= 16384
##$SIGF1= 3
##$SIGF2= 2
##$SINO= 400
##$SIOLD= 16384
##$SREGLST= <1H.CDCl3>
##$SSB= 0
##$STSI= 0
##$STSR= 0
##$SW_p= 3612.71676300578
##$SYMM= 0
##$S_DEV= 0
##$TDeff= 0
##$TDoff= 0
##$TI= <>
##$TILT= no
##$TM1= 0
##$TM2= 0
##$TOPLEV= 0
##$USERP1= <user>
##$USERP2= <user>
##$USERP3= <user>
##$USERP4= <user>
##$USERP5= <user>
##$WDW= 1
##$XDIM= 8192
##$YMAX_p= 0
##$YMIN_p= 0
$$ End of Bruker specific parameters
$$ ---------------------------------
##NTUPLES= NMR FID
##VAR_NAME=  TIME,          FID/REAL,        FID/IMAG
##SYMBOL=    X,             R,               I
##VAR_TYPE=  INDEPENDENT,   DEPENDENT,       DEPENDENT
##VAR_FORM=  AFFN,          ASDF,            ASDF
##VAR_DIM=   8192,          8192,            8192
##UNITS=     SECONDS,       ARBITRARY UNITS, ARBITRARY UNITS
##FACTOR=    0.0002496,     1,               1
##FIRST=     0,             0,               0
##LAST=      2.0444736,     0,               0
##MIN=       0,             -329288,         0
##MAX=       2.0444736,     251849,          0
$$ Real data points
##PAGE= N=1
##DATA TABLE= (X++(R..R)), XYDATA
0 0 0 0 0 0 0 0 0 0 0 0 0 8 -8 8 -8 16 -16 24 -24 32 -40 47 -56 64 -72 88 -98 113 -133 152 -176 200 -225
33 -225 257 -289 326 -367 410 -458 511 -570 634 -702 779 -862 951 -1050 1158 -1276 1407
50 1407 -1549 1707 -1882 2075 -2292 2538 -2815 3134 -3503 3936 -4453 5090 -5881 6908 -8297
65 -8297 10283 -13385 18920 -31780 127008 -91874 -313242 133794 209186 -92732 -139393
76 -139393 108767 70366 -82277 -52572 52332 41643 21852 -39105 -87543 9094 135693
87 135693 15152 -140446 -34563 118020 13995 -88450 11494 66951 -40015 -61748 31264
98 31264 45975 -9510 -17995 -30933 -33168 47872 71682 -55153 -90935 42192 71986 -45283
110 -45283 -42881 51083 10778 -65793 -3893 55887 7170 -29225 -17247 -16465 12030 52786 -2814
123 -2814 -70707 -1831 62742 -13868 -43967 45443 27437 -77898 -18853 95664 10600 -88660
135 -88660 12631 68339 -45699 -42999 84716 32731 -104223 -25276 105860 20411 -81183
146 -81183 627 56341 -20129 -32679 38161 26140 -32261 -16037 14906 5683 15530 16902 -33908
159 -33908 -30977 42528 36563 -37467 -21982 37811 88 -40065 21798 45719 -29441 -41471
171 -41471 25548 25575 -17344 -523 13654 -23071 -15230 32902 13838 -28041 -6521 13597 -9909
184 -9909 -4616 23295 36 -31584 -2594 22711 -2383 -8953 8989 -8702 -21216 14293 23201
197 23201 -16899 -17533 14972 -3218 -21503 22013 26403 -38629 -32598 41620 26764 -43416 -14172
210 -14172 42493 -4386 -46108 14944 46293 -16925 -42592 8677 29535 -739 -12575 -4596
222 -4596 -2034 7475 7720 -11025 -3631 19595 -1286 -30090 5214 41953 -3046 -42265 2526
235 2526 36334 -1919 -20569 8890 10649 -13035 -909 16737 45 -8166 6590 -947 -10302
248 -10302 13780 19954 -15335 -22006 15233 21839 -8837 -11589 7717 3167 -5182 3422 5493 -1840
262 -1840 -625 -1477 -8179 4321 19718 -4616 -26890 2729 26686 -3431 -22281 6302 14433
275 14433 -14181 -11202 17410 7309 -17685 -7302 9380 1206 -3088 2768 -4720 -10640 4579
288 4579 9618 -6273 -7733 3622 -1090 -7014 4076 7272 -6860 -9050 3587 2940 -2768 3551
302 3551 959 -11521 -3181 14055 3020 -14072 -941 11294 -4714 -9193 10642 8965 -12533
315 -12533 -9024 11323 8698 -5800 -3258 2488 -149 1903 4566 -557 -1944 2590 -50 -2697
329 -2697 5934 8386 -6377 -8951 8045 10340 -4437 -4347 5316 1462 -4636 3449 7909 -3382 -5386
344 -5386 3603 2881 -1241 3081 2634 -5985 -3888 7419 4782 -5661 -2699 2959 -783 -1434 3144
359 3144 1125 -4197 -2712 1928 598 -157 914 -3539 -5283 2385 4968 -3366 -5542 1006 1476 -4176
375 -4176 -206 5069 -2636 -7267 450 4817 -1182 -3452 -364 -883 -2601 1506 2049 -2414 -2497 -48
391 -48 -550 -93 2249 145 -4487 -2111 4060 1779 -2309 -1091 289 -20 132 1964 1021 -1660 -351
408 -351 1003 -38 1936 3158 -1767 -4157 2367 6781 357 -4471 640 4919 430 -1498 1690
423 1690 3536 434 -3047 -321 4920 4225 -2928 -5361 2585 7819 8 -5933 308 6144 379
438 379 -5300 860 6221 -610 -5911 -733 5350 2233 -3960 -3627 1315 2996 829 -2929 -2417 1677
454 1677 1573 -2372 -2303 1735 2263 -3269 -4521 1502 4092 -1566 -5013 -1648 2859 1230 -2326 -1983
470 -1983 -552 -348 107 -246 -1342 -953 736 -240 -2875 -1462 3575 976 -5664 -3173 4817 4511 -4754
487 -4754 -5419 3014 4619 -1471 -3729 252 3740 702 -3094 -1971 2891 4841 -1349 -7082 865
502 865 9801 2670 -10400 -3998 12143 6502 -11231 -5755 11930 7440 -10311 -6823 11159 8674
516 8674 -7930 -7545 6452 8857 -1809 -6790 268 6259 3241 -3213 -4314 3221 7562 -2073 -8321
531 -8321 1503 10681 414 -11849 -1659 12158 2740 -10916 -3956 9102 3250 -8871 -3108
544 -3108 7012 1711 -6345 -1680 3908 738 -2901 -1038 -268 -1817 951 1981 -3563 -4192 2439
559 2439 2780 -3987 -4005 3224 1783 -4674 -1656 3404 -990 -3818 1733 2059 -4500 -1335 6884 -946
575 -946 -10213 1948 11723 -3090 -13148 3839 13594 -4541 -12877 5209 12164 -4649 -10646 3424
589 3424 9856 -1181 -6873 423 4704 2462 -661 -3335 -665 5479 3968 -5827 -4673 8067 7651
604 7651 -8065 -7337 9172 9876 -7343 -9120 6891 10558 -4217 -8933 3440 8736 -1580 -7416
618 -7416 1178 6988 34 -5045 -937 3425 2391 -1135 -3185 -981 3573 2936 -3889 -4844 3920 4760
634 4760 -4504 -5773 4360 5254 -6233 -5432 5687 3114 -6908 -2568 5351 -822 -6369 2156 5257
649 5257 -5431 -6187 6020 3828 -7821 -3799 6914 2154 -7960 -1864 6501 960 -6164 -1847
663 -1847 3583 1863 -1989 -2191 -283 1591 2651 -1670 -4645 1938 5767 -2175 -6051 2373 7168
678 7168 -1263 -6912 1232 7292 860 -6162 -1661 6339 3496 -4735 -3329 4348 4616 -2254 -3818
693 -3818 2624 5052 -97 -3868 -216 4408 2735 -3226 -3433 3371 5072 -1627 -5006 1889 6343
708 6343 -926 -6302 965 7040 -391 -6855 491 6590 -782 -5036 595 3310 -909 -2397 799
723 799 747 -1213 -276 -14 -1129 -360 1008 -915 -1947 -18 1514 -940 -1990 216 571 -705 -874
740 -874 -235 -453 -168 -190 -775 -909 42 237 -1516 -887 1110 115 -1616 -750 1087 44 -1101 -306 538
759 538 -399 -49 137 136 -78 694 321 -348 0 853 68 282 -52 -101 604 856 11 -95 749 951 -275
780 -275 -369 1512 981 -760 -239 2201 849 -1539 -101 1877 554 -1074 402 1281 -88 -850 602
797 602 1418 79 -692 241 782 357 -483 -458 526 472 -683 -569 534 328 -739 -916 654 609 -937
816 -937 -737 274 77 -764 -442 63 -195 -654 70 57 -823 -433 -26 -301 -836 -223 -34 -455 -826 -351
836 -351 72 253 -719 -829 86 329 -797 -592 42 534 -535 -1017 449 761 -607 -493 270 500 -205
855 -205 -193 473 546 -5 -133 159 58 499 555 488 80 826 906 -171 -177 782 782 119 75 529 784 274 103
878 103 150 823 566 -269 -183 949 556 -242 54 563 996 -267 -479 872 605 -668 -581 720 623 -754
898 -754 -675 421 289 -174 -544 102 244 -77 -567 -535 322 24 -892 -462 411 69 -1166 -530 552 12
918 12 -745 -837 100 -48 -889 -138 -300 -276 -119 -578 -190 -112 160 -209 -938 -145 620 -359 -577 -142 366 -118
940 -118 -16 31 24 132 347 -20 -240 369 614 -207 -441 575 570 -93 103 836 267 12 467 82 -326 604
962 604 563 -216 -375 994 971 -762 47 1477 505 -744 -158 1057 219 -347 69 217 371 423 -231 -438
982 -438 445 641 -498 -961 732 981 -513 -1242 148 620 -551 -478 98 -50 -216 -301 -466 -353 340
1001 340 62 -1225 -440 967 -417 -1426 -413 646 -432 -991 264 -109 -841 46 459 -1052 -930
1018 -930 706 150 -1505 -514 1618 141 -1972 -110 1403 -56 -1232 90 555 -239 -270 -102 -395
1035 -395 166 1143 -742 -884 641 1650 -406 -1630 1280 2022 -602 -1445 562 2031 243 -967
1051 -967 156 1521 845 -712 -750 984 1486 -352 -1270 723 1316 -204 -700 728 962 71 171 -316
1069 -316 186 990 359 -1099 -645 1741 1038 -1809 -742 2275 304 -2527 -412 2449 -685 -2337
1085 -2337 959 1308 -1689 -838 1424 -434 -1791 555 1298 -1693 -1247 1837 691 -2449 -646 1728
1101 1728 -158 -2036 -11 1034 -781 -1080 721 -94 -1154 437 661 -1129 -1057 1386 480 -1705
1117 -1705 -595 1416 268 -1408 -313 1102 784 -427 -731 692 883 -57 -1319 227 1542 -175
1133 -175 -1058 500 1230 -56 -774 335 695 422 502 238 -577 765 1738 -463 -1623 1484 2354 -1515
1151 -1515 -2099 2446 1862 -2650 -908 2595 525 -2264 473 1910 -716 -1319 1512 858 -1554 43
1167 43 1353 -856 -1424 1159 887 -1688 -800 1775 -426 -2158 209 1252 -1142 -1049 1117 301 -1378
1184 -1378 -93 759 -930 -875 648 -9 -914 -476 174 -112 -358 51 -227 -231 225 -36 -653 214 423 -133
1204 -133 -667 608 797 -627 -364 701 103 -523 304 483 -550 493 957 -699 -556 1241 834 -1829
1222 -1829 -44 2187 252 -1742 517 1833 -548 -1083 1270 949 -873 76 1070 -85 -472 791
1238 791 650 -760 255 1337 -535 -917 1028 863 -1276 -484 1479 271 -1403 474 881 -519
1254 -519 -596 935 165 -814 -102 737 -747 -584 706 -163 -528 257 551 -762 -259 773 387 -1135
1272 -1135 91 589 -890 -877 372 -143 -706 -38 486 -871 -831 419 -5 -802 123 446 -470 -684 906
1291 906 -123 -1106 39 1063 -641 -756 602 507 -1045 -145 1108 -58 -956 382 286 -785 64
1308 64 1174 66 -798 600 456 -689 -8 1167 -217 -869 726 1037 -388 57 977 372 -879
1325 -879 195 1186 -419 -278 1143 95 -893 162 524 -316 -543 846 230 -675 36 598 -360 -294
1343 -294 737 361 -799 -251 779 -381 -564 352 62 -907 121 498 -456 -697 353 -157 -858 -207
1361 -207 373 -387 -606 459 221 -687 64 368 16 -763 80 152 -839 -429 612 -357 -695 123 189 -458
1381 -458 -113 486 -292 -633 -112 443 -278 -459 432 86 -652 541 539 -478 -53 894 175 -774 121 917
1401 917 -332 -273 590 346 -578 350 478 94 -185 494 534 -370 -57 889 42 -433 361 269 -689 171 664
1422 664 53 -521 267 471 -458 -67 588 140 -365 241 543 -483 -34 446 106 -335 83 184 -531 -301
1442 -301 476 21 -390 29 270 -493 -263 183 -76 -176 74 365 -363 -401 111 -166 -570 32 190 -353
1462 -353 -400 53 -43 -396 163 638 -561 -311 401 43 -561 -48 400 -323 -333 235 109 -636 96 271 138
1483 138 -409 -12 322 -337 -67 222 54 -423 17 240 -257 -80 448 275 -264 318 240 348 -100 250
1503 250 301 -232 -12 261 123 -363 324 -2 -70 101 168 -199 122 -13 0 -86 142 -129 -107 -151 161 -3
1525 -3 -365 270 -60 -458 -107 100 -96 -106 38 14 -91 -320 133 -7 -318 -103 116 -195 -317 -329 126 -388
1547 -388 -308 -77 -203 -174 158 129 -261 -122 296 97 -47 -56 18 -78 -499 288 200 50 -125 -36 -21 -58 -55 43 20
1572 20 -161 217 35 17 34 -55 196 255 22 -96 201 -152 10 297 244 -43 -174 -11 138 -362 -115 140
1594 140 72 47 -106 140 256 -73 116 66 142 59 178 -66 62 -142 184 143 -241 216 146 -77 -154 287 256
1617 256 -138 -377 197 -175 -464 -152 -41 -26 -198 -359 386 -88 -369 338 117 -232 -396 270 -94 -370
1637 -370 40 74 -150 -202 -96 85 -315 14 -62 -22 -234 122 25 -55 -273 208 225 -334 -169 178 -68 -197
1659 -197 161 662 -26 -315 -3 454 -301 -141 119 165 -67 280 229 10 -104 3 158 226 -49 25 15 246
1681 246 96 114 72 -271 390 199 265 -226 74 75 209 -204 -71 103 -2 -3 211 22 -233 -64 240 104
1703 104 -382 70 341 -5 -265 72 216 -468 -102 64 -43 -151 74 340 -173 -396 163 0 -298 -250
1723 -250 -141 -65 -448 265 66 -137 -102 -15 -34 -199 -169 -1 60 35 -209 87 -334 -99 -47 174 198 -64 26
1746 26 14 3 -109 86 -20 3 -36 224 335 26 4 94 -157 -138 41 265 89 -185 188 -11 71 -129 235
1769 235 -41 -148 51 112 -74 -165 115 19 -235 -43 504 -94 -125 169 131 17 -115 81 -112 -208 106 202
1791 202 45 -163 141 13 80 -5 184 144 -244 -130 75 -74 29 -216 -170 29 -68 -41 -278 -69 -329 163
1813 163 -356 -286 35 -186 -151 1 -213 80 -342 54 -40 28 154 -23 -90 64 -135 -24 -115 44 -40 10 11
1836 11 -131 -129 32 129 207 -82 170 282 102 -194 66 -13 -300 59 150 91 222 283 125 -97 -7 374 95
1859 95 -131 30 57 107 -3 85 73 -125 -162 192 -342 1 287 100 85 8 86 35 -64 166 -8 23 -106 325
1883 325 94 104 -251 166 -251 9 131 -139 -220 60 47 -174 -106 28 8 -61 166 12 -148 -43 -182 -200
1905 -200 -22 228 74 -250 230 11 -217 -173 -17 119 -42 -14 -61 -64 82 -223 -42 42 8 22 106 -227 140
1928 140 125 -207 -200 236 -265 -246 -59 71 -272 74 -115 -7 35 37 -182 56 191 2 -24 -94 170 -42 27
1951 27 -15 183 273 218 -11 -115 -33 -89 197 33 -33 -25 147 -56 -88 2 49 32 195 62 -71 -62 -191 228 -214
1976 -214 36 41 -152 122 -58 38 27 -138 -239 7 -235 -199 -137 4 -91 -45 91 -149 -25 -130 60 -292 -148
1999 -148 84 -60 -171 87 224 -75 -138 37 104 140 72 -121 -26 195 198 125 74 171 200 112 251 211 -235 96
2023 96 -53 105 6 245 12 -79 -239 21 -42 -28 -15 159 100 149 -138 79 146 136 216 107 -49 263 -33 -209
2047 -209 -136 -18 13 -146 2 120 96 59 91 116 34 201 141 125 -241 166 101 215 -161 193 0 116 -116
2070 -116 -88 248 -145 -179 -109 -260 -25 231 -176 13 124 -26 -151 136 33 -249 214 39 -209 -79 6
2091 6 -169 -149 143 -11 179 -191 141 117 117 -68 -126 -106 -213 -100 89 -143 53 71 46 -32 -35 60 -29 -272 -309
2116 -309 -168 -164 45 121 194 75 -407 19 -25 -176 59 3 -1 175 -91 -20 -39 -154 177 174 29 -50 105 -4
2140 -4 42 34 140 12 116 21 -128 -152 -218 87 -131 188 105 35 25 -214 170 141 -283 113 241 -310 -136 132
2164 132 91 135 4 -21 412 -112 -380 10 -6 92 12 30 -1 -12 -108 -212 160 -74 158 -17 -61 -34 -81 56
2188 56 -13 -104 -157 -210 -127 -171 66 200 67 -8 -47 48 49 32 159 21 78 -29 256 111 175 189 -36 -95 -61 94
2214 94 -170 305 97 267 -86 89 335 -347 -26 -16 91 -66 -189 30 -66 -212 -54 26 156 -18 -378
2235 -378 -42 108 -100 -143 -186 -217 30 -138 -129 -226 88 70 93 49 23 -68 -67 -64 -350 59 21 -151 60 138 -127 93
2261 93 -73 199 -207 -178 291 -17 188 -73 -267 1 90 -14 108 22 219 38 -110 -164 32 92 33 -10 135
2284 135 143 -58 -89 -143 -246 -6 198 151 65 -4 139 -79 -60 -106 -108 -114 112 -101 -40 -61 -8 -29 -28 115 15 20 88
2311 88 108 102 -41 321 -46 -326 -35 -86 -208 -87 -49 308 290 -13 31 55 -64 92 -381 64 -142 -20 154
2334 154 -138 266 295 112 87 -139 16 -238 132 96 -36 16 6 153 142 -12 -53 -40 -128 27 -323 131 141
2357 141 94 -104 215 -185 -135 43 80 -72 -284 -47 78 254 -285 -283 168 -111 -65 98 -32 35 52 166 -222
2380 -222 -190 105 -125 21 155 -81 -79 23 -102 147 -106 24 -1 75 -24 59 9 -131 328 -29 -341 -98 -38
2403 -38 279 23 164 15 133 110 -211 -52 -100 14 -29 -115 169 249 109 -153 269 -40 -139 -1 191 92 -134
2426 -134 -14 -209 -50 16 -23 90 -104 137 -87 -95 -75 -163 -18 -255 -198 143 -223 -479 -258 -117 204 50
2448 50 101 213 -40 -88 -318 -71 -228 108 177 -196 -32 66 23 56 -236 -46 -395 -120 71 18 205 112 201
2471 201 -366 157 -22 142 -267 -2 -127 -148 93 53 8 -77 126 38 -141 215 99 139 93 -57 -40 -124 29
2494 29 81 155 -65 -30 123 -98 -228 -49 -42 -99 85 78 -17 -265 38 -120 -116 351 -159 -205 -126 -71 -9 34 14 12 -289
2521 -289 -24 70 229 -203 -72 -77 -61 29 244 46 15 -60 101 39 72 36 -47 -311 42 125 33 -252 152 61 -33
2546 -33 -219 81 70 125 -38 28 -69 -103 -23 305 174 17 -148 -30 87 243 30 -168 -110 -151 -143 94 161 -141
2570 -141 86 -189 141 -59 -208 130 447 29 294 301 -105 102 275 3 -108 -56 84 36 -142 152 -5
2591 -5 -48 -391 -14 16 -133 155 77 -155 -90 80 -236 -295 -117 -47 -123 -114 -29 -48 -17 -176 203 236 -12 -103 -116 11
2617 11 264 -27 38 21 93 96 131 45 29 -111 246 -212 -266 42 223 33 -92 -64 16 -126 -15 66 -62 -144 -196
2642 -196 159 192 -36 -103 155 139 25 257 64 -167 105 138 -11 109 -190 45 101 33 310 -83 -46 353
2664 353 173 67 118 -146 149 129 74 -142 -29 109 89 -21 109 -140 43 28 20 148 -239 181 137 21 -159
2687 -159 -136 -23 -243 -222 315 183 -23 -63 -90 -70 -209 298 53 -73 -114 103 -254 -18 151 143 19 -156 102
2710 102 -421 -284 -50 53 -100 -154 -10 -54 -216 -112 -131 64 64 -123 3 5 55 19 103 2 141 -365 -12
2733 -12 158 191 -120 -85 -205 55 399 -140 -14 -288 87 -261 -93 245 -27 -204 162 184 -51 228 135 5
2755 5 61 -240 112 -28 -219 -61 -100 72 131 66 158 29 -159 -142 -70 69 -196 110 184 50 -42 80 -27 164
2779 164 68 -128 -223 68 -24 173 27 -70 -167 -28 -47 162 -31 -161 -104 -162 -149 105 -110 -124 16 13 -163 -108
2803 -108 -40 149 264 -59 -6 -57 43 -145 279 -354 -246 13 -67 -9 95 -86 28 -132 -230 -221 66 20 137
2826 137 109 -214 94 -64 -105 -152 121 155 22 -17 -225 63 153 116 118 137 -58 -83 117 -169 -182 -6 388 -26
2850 -26 -78 136 39 329 128 79 105 276 34 77 -117 4 270 101 -36 -1 -80 -60 -70 84 94 -1 8 -106 169
2875 169 -101 -163 -112 -16 203 -44 -31 -158 -31 236 187 -120 135 17 -112 268 149 26 -273 57 -211 -98
2897 -98 198 -47 161 -79 13 145 -43 -26 149 -219 72 -121 -58 165 -114 296 -168 -103 49 -96 -196 21
2919 21 -24 75 -100 -23 129 -87 -53 -115 -141 -108 -118 -54 36 123 130 -18 31 -15 -22 -59 -145 10 181 113 -135 114 215
2946 215 -31 -178 107 150 -33 29 115 -101 555 -132 -249 -24 -45 86 -80 -142 -78 -77 -110 76 -7 -119 62
2969 62 -122 52 37 363 186 -86 -29 -220 66 -259 -86 63 65 -64 243 107 -205 -35 201 236 182 85 77
2992 77 13 68 117 -97 -148 364 -71 -67 56 91 -209 -44 -104 166 -33 -79 1 -132 -27 -7 -140 -45 65 -32 -167
3017 -167 162 3 75 -144 -25 269 -37 -194 -74 -2 -110 91 -14 -157 -75 66 -83 -419 -112 52 -142
3038 -142 -113 -99 -25 49 286 130 -255 -259 4 -95 -179 13 -37 60 -128 -137 80 -46 -17 164 -280 -80 -141 167 32
3063 32 -200 35 20 -404 184 308 -55 -171 -124 143 -27 -29 -63 133 -9 208 248 -12 214 259 -51 -100 -17
3086 -17 24 69 -112 -44 38 -93 -73 -49 -113 108 64 149 131 251 49 -24 114 321 -182 -176 60 -122 -36 31 -181
3111 -181 81 -4 -61 136 -61 -411 104 -97 -106 135 -51 201 -247 -69 112 0 41 -185 -110 67 81 206
3133 206 41 -5 25 -60 89 -74 133 -145 15 174 -8 17 -193 35 -85 -162 56 32 -159 -83 -297 -3
3155 -3 89 102 157 37 -36 -27 4 145 14 86 165 189 -82 74 49 -183 91 -127 20 -145 40 -56 338 -186 17
3180 17 -141 -117 17 -136 -45 215 -48 -197 -24 141 -63 185 260 -42 -226 197 94 -77 276 119 151 -9
3202 -9 37 34 -168 -45 92 -193 -8 -144 36 -87 135 324 221 205 225 9 -169 -169 111 -162 17 49 -302
3225 -302 17 -20 53 -25 -42 -150 65 -58 3 -136 -198 -80 -30 -317 274 109 -309 -71 133 49 55 113 252 -33
3249 -33 -395 259 131 -153 -28 302 181 -60 -194 -71 -21 -91 189 -29 -20 -151 129 -7 -124 -140 57 -187
3271 -187 -30 -147 13 17 50 -98 -26 -64 -371 -194 69 179 104 106 -211 68 -18 149 -145 165 117 71 -75 14
3295 14 -69 57 -426 131 140 115 -119 0 142 205 31 -51 162 41 -50 -112 186 12 -103 -122 -42 -133 -40 78
3319 78 204 143 -113 -117 33 175 321 -16 -4 3 29 -63 -218 172 -77 -161 -257 196 -145 11 -17 -32 -164 71
3343 71 -160 -50 11 -137 28 89 -96 59 -45 -76 -4 96 -30 5 125 -56 -124 1 107 -21 -108 -17 72
3366 72 -37 -173 -18 113 206 -55 182 -47 -108 -54 273 317 118 202 112 247 0 -170 30 24 207 139 172 52
3390 52 -119 249 84 102 -87 105 -199 -28 3 32 223 144 247 47 132 -29 -87 -38 -25 -305 -42 131 -133
3413 -133 342 50 -97 293 89 60 65 1 -102 -164 -48 120 -54 -111 -145 14 140 -25 -21 -11 -2 -232 167 56
3437 56 -95 60 -43 108 -97 84 -19 17 -4 -42 43 114 89 91 2 59 -125 9 -38 -154 -28 -135 -119 -90 -67
3462 -67 92 8 -79 123 -210 -222 -85 147 -285 -27 114 255 30 5 240 1 210 -169 -18 -66 120 276
3484 276 -161 -190 99 -47 -107 -1 -172 -65 -314 46 115 -4 -180 -24 -214 97 -33 -147 193 35 43 59
3506 59 310 -4 86 143 -102 173 61 90 30 -14 -109 -354 -14 124 -87 -77 -292 -337 -127 -79 229 38 131 116
3530 116 -265 -199 82 -53 28 -30 108 -110 -165 182 -48 -156 264 -52 167 55 4 -75 133 -79 198 165
3552 165 193 56 124 -163 27 -93 21 -151 -97 205 -93 116 82 126 91 156 -19 85 167 83 -159 216 226
3575 226 180 47 -52 -231 118 -101 31 -166 -222 -12 -128 -107 21 -8 -49 239 164 19 -200 -184 340 347 -42
3598 -42 -84 -46 22 -100 -6 -58 176 68 153 59 -95 37 -5 45 35 -74 164 31 -41 205 106 88 -1 -99 83
3623 83 -254 214 38 52 38 3 -98 96 28 56 -20 -65 62 -212 -266 -87 -230 -97 50 -80 -72 95 133 33
3647 33 146 282 149 76 -195 167 60 -30 -13 -37 -378 -128 15 65 77 -64 -75 -4 -104 -252 -102 221 -118
3670 -118 -243 -169 -79 109 -99 -1 -159 62 -245 -161 -44 145 12 217 166 69 81 56 0 -54 -84 48 -77 -154
3694 -154 -2 133 110 22 353 -31 43 108 -99 -32 -392 -165 24 -107 -66 34 -220 -163 239 212 -133 -21 74
3717 74 92 -62 -137 -26 97 -151 360 -246 -3 34 -260 -60 68 297 -16 -115 316 41 -154 272 99 26
3739 26 372 235 106 142 -261 -243 38 91 92 -74 -87 93 20 -52 176 -13 57 224 -52 36 -151 -134 131 294
3763 294 276 67 -141 -211 -82 -57 -58 -167 -32 83 57 -39 -124 112 -244 -13 201 -145 -233 -55 -108 112 -203
3786 -203 121 -38 -5 -215 -24 -23 90 -50 -185 143 -47 105 138 -162 22 -49 -192 25 159 83 -116 -12
3808 -12 -29 -110 -97 -71 -44 -258 142 352 -17 -68 28 -318 167 143 176 -47 52 50 -47 -84 -167 70 221 24 82 -166
3834 -166 -50 -30 160 7 63 26 -211 -216 -179 163 -202 50 -92 -173 -15 14 -111 139 -213 -161 -9 117 216
3857 216 -139 32 145 -7 124 -21 -193 44 6 -3 -53 -105 -230 109 120 -39 -221 248 -164 144 137 172 -34
3880 -34 9 -74 70 212 -163 131 33 -61 -202 58 -178 -2 -35 -33 188 -37 20 -8 -212 -23 -29 -21 -271 -225 -53
3905 -53 250 97 74 128 -243 249 182 -107 -124 46 187 16 15 -32 59 -68 87 129 123 21 -30 -39 27 -55 -87 -126
3931 -126 248 16 176 -36 71 170 56 -101 -102 -165 -25 148 -66 119 21 -37 21 -251 -6 15 90 -152 -188
3954 -188 -52 119 -120 27 20 -207 225 271 156 -58 -7 111 -139 132 -226 95 -14 188 153 48 -5 211
3976 211 -19 -67 109 220 -29 -48 118 108 -47 -119 -134 24 -131 -55 20 -27 86 84 28 8 111 -256 -327 102
4000 102 -51 -80 -89 -148 -128 146 12 -11 305 -88 87 -139 57 171 145 106 195 -51 246 26 76 120 129 88 307
4025 307 119 212 95 94 150 -127 -287 -131 201 10 -219 -122 -29 168 -87 -84 -55 45 -19 -10 -18 -127 35 22 94
4050 94 292 41 -79 -19 -119 -16 -192 -78 129 113 -55 -243 55 -39 24 -97 -166 -130 172 164 66 54 -258 98
4074 98 16 89 56 -130 -82 150 20 31 -83 -231 -227 269 63 16 -24 6 -156 -13 219 -86 -153 0 62 -90
4098 -90 -154 -86 84 -37 -97 41 -94 -199 -183 181 26 256 195 34 60 -57 -7 -71 152 107 39 37 5 135 106
4123 106 -126 160 -95 -174 77 95 142 23 26 -207 -8 -32 -56 -174 -156 -95 -11 249 -136 63 270 115 -28
4146 -28 30 170 151 -168 -125 -102 166 -125 23 -114 -125 9 -113 -100 -26 7 -152 -13 12 -51 140 -237 -164 18
4170 18 21 333 -135 39 -11 -148 -99 136 2 12 -8 -113 -42 17 -156 6 -53 19 12 27 -63 -62 90 60 -94 82
4196 82 193 374 -170 -227 52 151 25 265 -22 143 -55 12 -12 -116 -169 -59 203 84 -215 161 214 -183
4218 -183 -136 72 -8 -4 115 -61 -201 26 196 -135 -86 55 242 -209 -160 72 -163 151 -108 -82 119 312
4240 312 -54 -39 185 -54 201 -267 78 -106 -182 -134 52 -194 -78 111 -130 13 29 149 -177 -97 -132 -21
4262 -21 -112 -34 114 174 239 150 40 -168 340 452 -178 68 133 -62 -95 -66 16 -36 -68 -184 -210 2 31 152 174
4287 174 -8 -162 -31 235 -181 -168 158 117 162 -125 245 7 -73 -25 -146 -58 211 91 46 -187 352 137
4309 137 42 -39 227 122 -74 59 156 91 -62 -293 30 259 -28 -31 -94 27 -46 -201 274 38 -193 192 -68
4332 -68 -206 -18 144 -78 4 106 110 53 -65 -123 219 -166 -193 21 -154 -75 13 83 -30 -60 141 -21 105 -32
4356 -32 54 46 95 -97 -210 190 -21 -188 251 -34 31 -4 82 5 192 47 204 9 -22 282 150 162 -127 57
4380 57 27 101 -10 295 18 247 84 25 107 18 86 -133 -182 -44 5 -35 28 -209 -30 -144 85 0 -173 88
4404 88 192 4 -77 62 209 -145 140 205 -116 31 64 52 -74 34 -213 132 267 48 109 35 -78 32
4426 32 -247 126 147 55 -140 111 181 -266 13 87 107 -122 -133 -1 -15 118 272 175 -19 -341 16 -70 0 197
4450 197 -42 82 -353 -94 96 -210 -58 66 169 19 -111 221 72 -187 154 111 -39 183 241 122 44
4471 44 -150 -48 -183 204 151 65 24 201 96 12 140 -52 20 97 48 -157 84 202 -107 -143 -62 -269 -80
4494 -80 -26 91 -76 -16 24 -53 -37 -31 8 84 -97 24 -157 -15 143 -193 248 -48 0 334 -102 138 -364 -12
4518 -12 53 -86 -238 -107 1 215 -136 -96 136 -145 128 -135 251 197 142 219 -39 -194 238 97 -76 122
4540 122 239 96 -59 -104 -56 95 -375 -177 -69 -1 8 27 92 55 -86 27 -53 -67 77 -29 70 161 73 -67
4564 -67 -160 50 -53 87 -66 -121 -182 16 223 86 204 49 20 -172 142 -104 -35 -80 236 115 4 -329
4586 -329 112 -41 -108 -194 1 107 230 132 -41 -103 -87 -192 30 -131 41 -19 166 23 29 -50 -117 93 26 81
4610 81 70 181 -143 -85 -223 -100 91 211 -67 307 5 -10 70 136 291 100 96 152 -101 -101 -194 -71 -84 148
4634 148 -192 201 -12 31 116 -43 -103 140 163 175 139 -2 -176 252 286 -163 79 9 -138 19 -25 47 166
4657 166 103 100 -8 -225 -54 -163 152 86 -215 32 83 197 -241 -139 48 -97 182 -89 100 -55 -113 -138
4679 -138 221 244 100 73 357 -140 -1 -105 36 40 -40 82 88 -90 -270 147 -144 6 267 -110 176 36
4701 36 9 90 -162 104 15 87 83 -220 -248 200 -139 -249 199 -30 -1 -143 194 21 25 -54 -116 -232 22 276
4725 276 -101 -54 148 -72 -220 -51 -209 306 164 -184 -111 -77 -93 -4 109 306 2 80 5 -45 -111 132 81
4748 81 -63 -142 -75 364 -219 -37 6 267 101 -51 -186 -66 126 -158 -42 -17 221 185 306 25 102 91 -64
4771 -64 67 41 -35 236 61 -204 -128 -65 -248 138 -2 194 -12 -146 41 43 -11 -92 -255 13 -66 -219 245
4794 245 63 -158 -121 -251 56 80 4 36 70 -234 -62 82 17 315 110 17 -288 69 161 -392 -20 -145 27
4817 27 266 88 227 -16 98 79 -2 -224 179 -34 -194 -67 63 385 -75 156 371 157 64 -191 -80
4838 -80 64 -280 62 -125 -93 -160 38 46 -58 21 114 -32 137 58 -242 -26 25 142 -4 353 -318 230 -176
4861 -176 -149 117 10 156 87 -311 -131 -8 -36 184 -32 250 161 57 -190 40 30 124 25 -275 76 41 -23
4884 -23 -32 23 -296 149 -63 -25 249 61 -98 162 -29 164 161 -2 71 -18 -128 -34 -273 170 -194 -37 -203
4907 -203 -360 -46 -56 7 -201 -137 -169 -181 431 67 75 -58 87 15 -229 -223 -30 111 55 57 -60 95 -62 91
4931 91 81 356 -172 -97 71 -280 185 -113 55 -133 174 1 -80 -186 -74 -69 -74 106 11 -173 45 -58 131
4954 131 -23 130 -173 51 73 -107 -23 61 -71 -245 -288 -138 -55 -72 -101 239 -5 239 221 211 -177 55 -87
4977 -87 -109 223 -107 65 91 136 -206 286 53 22 -154 -164 18 -69 126 192 155 -158 20 381 70 130 242
5000 242 -201 136 -233 -59 171 281 136 -223 -9 46 166 19 30 -72 210 14 -196 -171 -183 -7 -124
5021 -124 148 -317 6 -111 68 27 -348 86 -150 229 -73 -55 249 -59 -37 -180 83 -240 -322 109 -88
5042 -88 -90 -95 45 64 35 152 -237 98 -126 -14 8 -73 312 -66 -31 150 82 -154 33 -293 -142 -99 -70 22 140
5067 140 80 -31 -35 -132 -81 126 -18 -19 -56 151 143 -59 -206 20 52 196 -137 32 -50 116 40 30 -32 12 69 -211
5093 -211 222 -105 3 224 -298 -91 139 223 131 -86 -198 165 90 -27 -119 161 205 -193 -101 -215 144 -272
5115 -272 -94 -80 154 47 -52 -36 239 -1 245 73 37 -43 190 176 -13 19 -17 -7 -40 182 -16 104 -251
5138 -251 -192 43 132 -310 -196 -39 -233 345 -86 -265 -99 -239 -89 111 122 -133 -134 -194 -209 -60 -102 -187 -130
5161 -130 156 -105 -246 37 174 -59 -215 -120 41 -95 -150 214 -103 -100 -106 -106 236 250 -45 132 134 -18 -123 -13
5185 -13 -58 -123 73 -61 140 130 141 10 -192 -12 -126 -62 -108 203 -227 -20 51 88 25 84 -171 -269 -76 -60
5209 -60 -248 -253 93 40 -12 -13 -115 -163 125 260 56 87 140 174 -32 9 40 14 -33 -55 -82 -3 120 93 62 98 -97
5236 -97 -86 -76 -133 -25 104 92 102 112 27 -21 90 116 -163 -27 -6 16 138 96 -69 126 -132 130 131 27 93
5261 93 204 119 -5 112 -118 69 166 -148 -293 -94 -125 135 -33 268 -6 -81 -117 -144 181 -28 116 -21
5283 -21 -188 42 -96 -223 32 1 22 261 -140 27 -161 -151 -122 86 -101 9 -92 -59 189 -37 -153 -63
5305 -63 -65 53 130 26 -98 -20 121 81 215 35 -118 116 -113 96 -80 -185 -56 -59 -35 -134 44 280 96
5328 96 141 -115 -236 -64 65 -235 52 54 -115 -95 -159 118 38 137 -245 66 -147 -289 -23 -109 -55 98 41 -84
5352 -84 130 -55 175 0 -41 46 -106 99 105 -129 86 76 43 -77 68 -73 203 191 146 85 97 198 185 -105
5376 -105 -63 211 -46 106 196 151 -32 197 37 193 7 91 -171 -216 190 157 71 117 -93 1 283 165 106
5399 106 -14 -41 -10 165 23 -27 72 -133 -70 198 26 104 156 -276 208 49 -18 -43 -158 131 220 -130 -369
5422 -369 -69 -178 -141 -10 -116 59 -85 200 71 -61 209 -33 -100 79 -166 73 24 -157 261 -24 -75
5443 -75 -99 12 -76 -243 18 204 73 -247 -31 164 -199 137 -110 31 169 97 -73 -34 55 160 45 -94
5465 -94 73 114 103 -315 21 -61 145 38 58 -161 196 -62 91 -6 5 -208 -134 -13 -154 38 -68 -123 -63
5488 -63 55 -123 -132 -149 125 -11 -25 137 -19 70 226 161 -295 2 -36 -91 248 88 -53 -158 166 -48 140
5511 140 381 86 -10 75 -46 -7 50 298 -103 -55 244 233 63 102 -57 51 266 36 -20 203 38 -156 -164
5534 -164 -184 -82 25 -12 -3 39 189 -34 28 -41 60 13 26 -51 24 406 -107 91 -184 96 45 -219 191 59
5558 59 -27 -85 -192 -27 -11 61 135 -69 -46 25 162 1 -18 -66 -55 13 -15 -175 -65 81 108 225 125 -208 150
5583 150 -33 186 188 -216 -147 40 102 -89 6 36 -32 -173 -111 43 -143 -99 65 -65 -152 18 -63 -4 -55 -32 -136
5608 -136 72 9 -198 39 49 -30 89 -2 -117 -89 126 261 -30 131 -58 -41 -233 77 107 61 -228 -176 -142
5631 -142 -42 76 -45 82 -54 -107 -14 130 25 -196 217 -101 93 125 20 -2 234 61 -121 110 166 77
5653 77 -124 22 -27 -82 141 24 -69 -150 -126 51 -59 134 174 -191 -26 -210 134 43 8 -191 -25 118 34
5676 34 331 76 -70 -28 99 -23 132 -121 -274 106 16 -176 -188 -38 -66 -12 222 123 -124 -96 22 32 31 241
5700 241 120 -156 -59 -95 82 -112 -135 -233 12 -340 -152 49 155 53 -154 -144 -134 106 -6 -283 148 122
5722 122 79 346 192 206 -163 46 -101 -80 -4 76 104 -189 92 -52 233 -84 27 87 99 -216 172 121 -30
5745 -30 -20 15 101 -166 -40 60 86 -47 -235 45 16 -17 -16 98 -13 116 209 28 -225 -217 -117 16 163 -171
5769 -171 205 143 -98 -42 -20 118 173 115 -14 41 20 -67 228 -124 251 45 123 -121 -166 -209 15 76 144 -74
5793 -74 132 -124 93 -3 63 -246 151 -64 -81 131 -194 42 229 75 -98 -32 -216 135 -216 1 -10 -9 72
5816 72 -204 -143 -43 -80 -16 286 28 -362 4 -69 -17 66 31 -29 -65 129 -57 32 12 175 37 79 -74 -125 165
5841 165 148 -206 263 -97 85 131 28 35 425 -132 -187 191 94 156 -53 -181 64 50 124 67 105 -16 -86 22
5865 22 -96 -196 -103 121 28 -43 7 -195 133 -60 -28 92 -181 -299 -45 -10 8 5 29 -133 192 -89 63 -67
5889 -67 18 -27 -105 47 -122 -66 -100 55 -38 -3 10 -189 28 -39 64 80 242 26 1 163 38 190 105 -195
5913 -195 13 186 147 138 -103 80 -130 -308 26 -231 -104 -79 159 224 -71 -103 -136 -32 239 42 83 89 162 -309
5937 -309 -241 -6 -29 71 -255 -63 108 -75 -150 -59 112 -165 52 -40 401 -65 59 82 -116 10 -112 72
5959 72 275 34 -8 204 10 -188 -385 -365 -13 -6 -185 59 166 -5 318 -85 441 -54 -1 -247 -178 272
5981 272 -106 7 -142 28 -91 -146 142 -134 -96 239 -184 168 107 183 -422 -131 98 -158 -126 66 2 152
6003 152 29 80 240 -25 -191 -51 -198 239 67 51 107 120 98 -198 63 115 -41 -114 4 59 45 -47 206
6026 206 128 -78 159 -125 -135 -194 -204 -74 -96 -48 -92 17 -148 316 -23 123 -130 -189 -167 -58 -176 77 195
6049 195 162 -129 -101 112 -47 31 -278 99 50 -16 74 -75 0 -249 -27 56 21 62 176 69 153 -113 63 270
6073 270 275 16 -105 -46 82 -100 35 -30 -17 75 352 -72 165 28 192 -246 189 177 2 -90 116 -14 -77
6096 -77 123 175 -85 -115 -180 205 -96 124 54 78 29 -219 -91 -226 -105 106 -145 -266 -109 -68 272 131 90
6119 90 168 -34 -292 -108 220 -48 -28 96 23 -234 -219 197 148 -174 117 135 156 107 -188 11 145 196 236 -32
6143 -32 -274 -263 -138 52 -217 -207 -264 -201 56 36 75 13 -24 -5 114 162 51 126 52 144 43 64 -79 -97 119
6168 119 -189 -39 98 211 -33 -27 2 -31 -33 -12 137 -280 -17 -50 28 -11 249 -208 -14 277 85 73 137 -191
6192 -191 126 -267 62 -168 236 105 -52 92 -150 -141 13 29 -44 64 -20 -27 -117 -3 -95 -28 -90 104 11 -110
6216 -110 6 158 26 181 -30 106 26 -21 336 11 149 -112 -162 1 -48 -109 -276 -279 -179 19 79 5 79
6239 79 -41 -291 -50 11 -82 37 404 44 -51 -151 153 -129 -91 -55 -84 -241 24 0 -50 -67 10 -99 -114 -182
6263 -182 62 -234 17 -63 231 7 -79 114 -461 -227 229 -103 -12 -132 162 157 -30 -252 189 150 -322 21
6285 21 -118 -231 21 -8 -82 -58 -131 218 -51 103 73 -36 -88 26 -178 127 -331 89 121 140 138 -28 -30 -14 56
6310 56 225 73 53 -106 -92 1 -258 -6 160 131 27 16 134 110 -16 -205 -133 -147 55 -62 2 165 75 41
6334 41 -75 -84 -173 122 -245 -11 16 125 11 65 -137 -113 58 -162 148 115 276 -37 -83 32 -63 -81 47 -37
6358 -37 116 149 -51 -64 38 285 -168 -58 -188 -156 62 -106 22 -64 -71 -110 -89 -89 -114 49 -20 -234 -99 26
6382 26 57 -39 31 241 114 -30 142 41 -56 214 179 -250 75 111 104 -111 188 -12 26 -192 -74 5 -71 22
6406 22 79 134 -123 57 4 5 12 252 106 -200 -35 -95 9 17 27 -237 87 90 197 10 51 -74 -61 -51 198 -101
6432 -101 291 -15 -83 -138 384 -17 136 176 -2 65 21 175 -117 -127 49 10 -22 92 -242 -210 128 65 -294
6455 -294 -89 -111 39 -136 -102 30 -73 -97 301 -165 -49 -41 295 150 42 -99 13 -248 -37 -234 96 226
6477 226 -75 -140 48 -119 163 7 -107 -84 53 -116 -5 -126 186 -4 -218 94 -11 -133 93 -70 332
6498 332 140 -72 54 -83 134 348 -149 -236 167 35 187 -152 -26 -43 43 -71 -56 141 194 -164 146 -1
6520 -1 176 -121 95 94 63 -71 61 -212 -46 40 147 -303 140 -73 -45 -74 -280 -66 64 95 59 27 -29 36
6544 36 57 155 14 128 -55 87 -199 82 121 46 -98 88 1 104 -137 -100 96 20 169 23 -56 336 47
6567 47 -33 131 -84 -35 78 156 -117 -130 -376 58 85 -244 -68 -90 -5 161 -26 231 -31 213 -264 -161 -147
6590 -147 -6 232 187 -68 152 -115 -60 -22 166 67 287 62 -125 119 93 135 266 169 -103 132 26 -153
6612 -153 48 69 -53 -292 131 -19 -51 -46 46 89 13 -103 -237 -17 0 287 -105 383 -133 -93 -47 67 -195
6635 -195 -52 338 54 -156 -27 89 -47 81 -202 94 -226 -89 -25 -300 145 141 193 12 35 -3 130 61
6657 61 227 125 -165 17 -17 21 -28 36 75 75 -123 97 -13 -375 -102 -16 -88 -53 54 -77 -58 118 -43 89
6681 89 64 -121 -92 97 -299 -79 -68 26 152 27 -14 224 -257 -147 2 -8 -59 138 171 -50 -73 12 -6 -65
6705 -65 23 -152 -230 -38 -156 0 137 61 109 -134 193 -221 81 259 -270 31 177 -184 -4 17 294 332
6727 332 324 -126 -29 40 -332 -113 181 114 -40 73 74 -61 71 -315 -117 86 -144 0 36 -47 98 64 -25 229
6751 229 55 373 -147 -263 43 -80 263 10 368 -174 32 116 -171 58 -16 -241 29 122 -59 95 -112
6772 -112 110 -97 -45 22 -51 94 -189 135 79 -142 158 -57 -69 105 43 -243 168 89 -295 -150 -168 51 -54
6795 -54 316 -41 -183 -144 216 -230 131 -194 -104 96 -211 -201 112 47 -151 135 -125 -52 15 -105 38 -34 145
6818 145 9 116 -25 -20 107 -82 -137 -146 -211 178 -105 -270 -83 -33 -300 27 62 -300 12 37 110 -113 195
6841 195 375 -207 -49 149 213 -83 -49 -5 309 152 -160 -25 -148 159 117 -22 -170 -4 -102 322 10 230
6863 230 -276 -23 30 90 175 84 8 124 -23 55 82 -192 -242 -62 84 0 66 134 -76 -35 -43 12 -50 -21 -246 -79
6889 -79 -119 -98 375 -198 -146 -62 59 128 37 -170 -154 -160 46 -150 -11 128 62 -16 70 93 -100 101 -41 161 -158
6914 -158 -17 -177 -77 97 73 -91 -199 105 113 204 45 -12 -338 252 -80 -187 -46 99 3 -98 -16 -193
6936 -193 -104 216 38 -82 -175 -6 46 58 56 25 91 -61 -190 -255 -37 -136 -22 86 245 -53 150 -27 168
6959 168 -3 -98 92 -102 67 -57 254 156 154 -53 -459 61 -193 122 52 73 -61 62 9 3 170 78 154 -134
6983 -134 64 61 233 195 332 -18 -23 161 165 78 -12 -109 -68 -69 31 44 1 238 -68 -84 -43 -2 -100 -49 -87 40 123
7010 123 19 200 12 35 50 -148 20 -107 -32 147 -25 -167 -304 -144 -121 166 120 80 -34 -151 213 -140
7032 -140 -85 105 -55 -107 -316 13 -76 228 144 -11 33 115 152 16 -304 -22 -187 62 -36 36 47 -66 -7 150
7056 150 110 -100 -40 -21 -128 -212 -153 31 -7 34 29 156 -18 -53 -23 -45 -26 29 -73 -123 -77 -76 210 -34 -182 18
7082 18 -26 115 -193 -182 -19 -54 -165 221 -84 -59 108 -113 -94 126 83 28 18 136 45 284 -6 -113 -90 -22
7106 -22 -192 147 5 16 -25 52 -80 32 474 91 209 389 -51 42 75 -141 128 -149 142 -25 87 -93
7128 -93 192 53 73 -126 -42 -110 24 164 -76 236 244 -61 -23 115 -146 68 -8 -5 127 179 -36 -214 -101 -104
7152 -104 191 74 26 -20 92 -55 65 139 207 -214 -46 7 47 -161 -222 93 -200 104 -78 -144 60 -55 -189
7175 -189 -373 43 -18 -64 -47 185 -220 -159 -88 81 -101 -89 245 -61 134 -107 -304 -278 -326 29 -14 233 -244
7198 -244 -266 142 -110 8 161 -18 302 343 -66 87 112 -48 84 -38 -5 138 112 -144 -179 168 94 193 201
7221 201 165 41 -174 75 -94 74 -91 179 118 148 17 -43 108 143 -192 56 200 169 -45 -6 102 45 18
7244 18 -289 -36 185 -80 -72 -35 -130 -24 -109 -144 -51 -45 -159 69 8 -33 -98 27 130 -131 109 87 -240 -127 -22
7269 -22 124 -20 7 -39 -203 -79 221 93 63 104 -20 80 -105 -73 -169 -306 -105 -105 157 -32 156 55 -98
7292 -98 38 -85 180 49 -324 297 -111 -92 151 126 89 -218 -170 158 -66 -123 0 -29 -145 106 -14 279
7314 279 -56 22 69 275 -72 -285 -45 16 12 -245 190 -110 182 28 260 103 -193 93 -213 26 213 97
7336 97 -115 86 -99 -101 -17 58 73 -7 -207 -218 -9 -288 125 75 73 127 -147 -313 94 -201 302 -91 -168 50
7360 50 -67 117 79 -26 -179 -136 89 17 -83 -128 -32 132 -70 12 8 -54 -201 63 -119 -9 174 88 22 67
7384 67 -139 35 151 -53 206 96 63 -144 -70 -204 7 -81 225 140 -77 76 41 -106 119 83 149 132 155
7407 155 38 69 -151 160 -15 -149 -81 -293 -224 217 227 27 -90 -108 139 54 -33 -99 63 -37 121 94 72
7430 72 -222 -18 -219 -137 48 -35 -111 169 -165 224 -69 78 247 223 -4 -160 -82 -79 -20 302 -156 177 319
7453 319 -4 -6 112 38 -16 234 252 -176 -290 74 180 -203 40 125 -3 -21 142 -87 -99 90 -14 -255 98
7476 98 -213 -173 23 64 73 126 -92 147 68 -47 -26 35 -14 -26 -47 22 18 -106 -13 -174 -14 176 -106 126 72 -187
7502 -187 123 -172 -48 -51 60 22 61 135 -18 66 29 285 -206 -77 52 -32 8 -193 -105 51 -189 33 -154
7525 -154 55 38 -13 257 236 -66 -115 -213 -295 29 314 -1 -8 -33 119 52 258 97 -106 -79 -171 322 -200 -158
7549 -158 142 156 -110 -417 64 259 -353 156 128 -9 -75 -150 64 88 -162 -60 124 50 -150 5 -16 -18 119
7572 119 -119 -489 78 -50 -101 346 -127 120 -65 164 -132 -96 82 83 -110 104 -128 25 38 -105 -99 -361
7594 -361 63 -125 77 -27 214 -33 34 -13 -135 82 29 116 -204 -227 -167 92 -188 -24 -15 -90 13 -118 -57
7617 -57 -55 199 266 164 141 -44 21 -7 52 112 29 124 -174 153 -22 -141 -68 -127 43 88 -225 -166 104 1 -52
7642 -52 -115 109 -51 -108 102 50 -41 44 41 -78 -136 56 -72 56 -238 -4 -159 251 -53 -334 -8 -50 4 20
7666 20 58 -38 149 2 -150 68 -22 39 55 -63 -206 -107 186 -197 -113 13 -99 89 52 178 95 -59 216
7689 216 129 248 88 -323 36 -26 -80 -199 -145 -182 -32 -18 -185 -102 -73 268 27 102 -149 137 -93 154 110
7712 110 -27 262 139 -138 133 -106 189 -21 102 -49 203 107 6 -56 161 208 -64 112 84 -76 179
7733 179 95 -29 20 -60 -87 -62 81 20 -158 -80 -90 213 39 138 -41 161 233 -63 -147 62 -16 3 145 -56
7757 -56 99 -108 -101 -63 -3 196 -55 31 190 87 186 14 247 -277 75 -242 -33 11 71 2 -120 -57 -63 -136 282
7782 282 -25 -14 -244 -185 -14 197 132 -1 11 -125 -16 -3 179 -85 -102 29 -45 111 154 8 -226 -514 -115
7805 -115 83 79 -104 179 -40 -297 84 -48 152 137 -83 96 -117 -108 329 -133 -144 148 184 -42 179 138 -173
7828 -173 65 207 6 84 184 -47 -91 -13 54 -18 -90 -280 57 223 -52 122 197 180 -16 -322 144 -95 -144
7851 -144 100 -14 47 -78 0 -284 -198 -96 48 -41 -265 81 -31 -10 53 154 -43 29 -54 -82 -169 -133 -51 -16
7875 -16 130 212 -21 -155 49 -102 71 52 13 212 -37 15 14 -145 26 139 -10 -212 106 40 -62 154 198
7898 198 -166 99 96 -126 446 -193 175 168 181 -8 -36 -81 -90 -239 27 -11 218 162 20 86 -62 -389 13 224
7922 224 -290 28 28 70 94 54 -175 -25 -54 100 66 -289 -12 149 53 31 90 -7 3 -11 76 83 -164 7 -119
7947 -119 -70 140 -85 -42 198 -136 145 67 81 111 173 -223 186 -111 379 24 121 70 -23 -69 -114 115 -145 183
7971 183 -73 235 -142 -29 -149 -129 -18 -131 52 -157 131 -63 -58 86 -491 -144 -23 152 253 -181 -124
7992 -124 255 20 -95 51 -7 209 171 169 34 88 196 -133 244 397 -243 218 -10 151 117 -260 -121 192
8014 192 261 67 -107 61 -11 37 186 164 -139 -109 131 93 164 -108 -187 -91 130 -373 -123 -103 117 50 137 68
8038 68 263 43 -156 152 -48 -177 78 209 -75 -26 -243 -43 6 153 304 -87 91 294 -126 16 -50
8059 -50 204 -69 44 182 80 -203 160 -4 76 -202 -178 -7 -108 -119 87 -116 107 30 -168 -128 201 17
8081 17 208 7 74 29 145 301 -194 284 275 -12 -175 18 199 -161 -138 123 39 386 -115 -322 9 68 45
8104 45 17 56 3 117 -226 144 -72 54 241 64 -224 189 178 -91 21 33 -97 -114 -78 111 -2 -159 -284
8127 -284 -26 215 1 96 104 152 -40 112 36 -129 28 -111 -244 -145 78 22 242 -169 -155 -109 30 123 61 -83
8151 -83 -119 223 -135 -106 -82 121 22 107 -230 150 -96 58 120 -139 147 -205 -157 135 47 -8 -31 -83 183 -69
8175 -69 145 -34 56 69 -184 115 76 27 -256 -47 67 -192 43 73 19 -29
8191b9
$$ Imaginary data points
##PAGE= N=2
##DATA TABLE= (X++(I..I)), XYDATA
0 0 0 0 0 0 0 0 0 0 0 0 0 0 0 -8 8 -8 8 -10 16 -16 23 -24 31 -32 40 -48 55 -63 71 -80 92 -105 119 -135 152
35 152 -169 191 -212 236 -265 293 -325 361 -398 441 -485 536 -592 651 -719 791 -872 961
53 961 -1061 1172 -1302 1448 -1617 1819 -2056 2346 -2709 3174 -3798 4678 -6011 8249 -12693
68 -12693 24791 -124893 -329288 128678 251849 -107703 -180932 102001 94343 -98198 -63028
79 -63028 70616 41417 -18476 -46408 -57445 22139 114706 704 -144465 -31350 130782
90 130782 25255 -103862 -4216 74954 -30098 -64715 37824 55129 -23863 -35396 -11994
101 -11994 -6999 41657 54908 -53809 -85350 48549 85343 -41642 -57721 47614 26045
112 26045 -59215 -3769 64969 5338 -44030 -12235 8000 17572 37986 -6110 -63308 -20
124 -20 70985 -1931 -51973 29818 36507 -61449 -20635 91421 17129 -93211 674 81083
136 81083 -26607 -53166 67517 37409 -95980 -27999 109387 24970 -94805 -10378 69116
147 69116 -10041 -42635 31156 28590 -37693 -21226 25292 11491 -239 4767 -26771 -25682 39266
160 39266 34734 -41401 -32079 36159 10462 -39068 10770 42121 -28766 -46390 27516 33799 -22563
173 -22563 -14736 13526 -13719 -15464 28540 14076 -33224 -12594 19811 -2168 -8919 16347 507
186 507 -29702 -1926 28237 257 -16689 4680 -1024 -15446 12377 23144 -16055 -22143 15595
199 15595 8505 -17451 13044 24330 -30981 -29638 41684 31362 -41715 -20749 43354 5669
211 5669 -43220 12052 47687 -15913 -44417 14590 38403 -3604 -20356 -1247 5317 7235 7484
224 7484 -8017 -5661 15786 1924 -23862 4684 37596 -3416 -42801 3281 41132 -886
236 -886 -27942 5324 15526 -10899 -5209 15998 334 -13671 3217 3704 -8262 7885 14471
249 14471 -15709 -22076 15142 22516 -12756 -18050 6865 6464 -6927 264 4769 -3836 -4800 -779
263 -779 -4343 1994 13244 -5433 -25153 2645 26784 -3690 -25236 3428 17288 -10831 -13339
276 -13339 15351 8335 -19316 -7983 13283 4133 -6506 114 -1684 -7166 4845 10797 -5471
289 -5471 -9016 4763 3425 -4568 3082 7511 -5225 -8114 6228 7150 -2568 1161 2360 -6896 -1031
304 -1031 14349 4434 -13455 -1682 13782 -557 -9179 8908 9797 -11251 -8023 13294 10126
317 10126 -7383 -5643 4593 2404 673 3925 -796 -3179 2057 1661 -1891 3620 5624 -6518
331 -6518 -9248 7381 10218 -6241 -7702 4354 2671 -5204 980 5965 -4320 -7813 3209 3423
345 3423 -3030 -972 606 -5521 -4041 6118 3781 -7730 -4837 3338 203 -2718 1213 499 -4755
360 -4755 -2845 2766 1494 -1657 -457 -2601 -3962 3065 4737 -3287 -6170 1542 3407 -2881 -754
375 -754 4549 -1374 -6205 1937 6549 -437 -4019 584 1630 -660 2015 2969 -1912 -1637 1918 1613
391 1613 864 2085 543 -2600 -498 5366 2974 -2507 -1007 1780 1324 793 1941 912 -1156 -299
407 -299 2066 1034 1341 2153 -1469 -3332 2621 5758 -753 -5387 342 5142 151 -2788 737 2196
423 2196 -715 -3210 -289 4054 2046 -4088 -5243 2224 6376 -1463 -7414 -288 5522 -244 -6094
438 -6094 -328 5236 -1481 -6664 -506 5456 972 -5477 -3757 1980 2817 -996 -3712 -2600 1682
453 1682 1540 -2381 -2356 1554 1486 -2650 -3450 1985 3977 -1843 -4888 -322 3801 1342 -2530 -1693 931
470 931 741 399 231 -469 -10 872 690 -1307 -118 4039 968 -4233 -1528 5878 4192 -4406 -4232
487 -4232 4243 5935 -1485 -3365 1561 4302 858 -2491 -602 3341 3833 -1573 -5656 1653 9416
502 9416 1101 -9854 -3024 11617 5865 -11374 -5851 12082 6948 -11321 -6912 10828 7864 -9955
516 -9955 -8489 7704 7818 -4697 -8136 714 5965 1230 -5390 -4595 2862 5535 -3059 -8522 1258
531 1258 9044 -1215 -12284 -1730 11733 1711 -12299 -3958 9611 3040 -9509 -3770 6863
544 6863 1499 -7146 -2210 4625 936 -3780 -1270 1060 -308 291 1790 -2713 -3226 3309 3576 -3565
560 -3565 -3702 3856 3270 -3866 -1261 4682 462 -3565 1373 3180 -2607 -1091 6219 617 -7848 2010
576 2010 11639 -1963 -11656 3880 13969 -3258 -12640 5899 13257 -4292 -10951 4594 11145
589 11145 -1852 -8066 1307 6016 1334 -2463 -2766 432 4477 2304 -5243 -4218 7169 5969 -8057
604 -8057 -7445 8878 8389 -8426 -9751 6900 9777 -5844 -9949 3547 8544 -2882 -8817 1016
618 1016 6662 -1361 -6404 -744 3820 1300 -3005 -3470 -343 2704 1538 -4057 -4416 3369 4755 -4794
634 -4794 -5904 4413 5167 -5791 -5969 5606 4284 -6249 -3227 6073 721 -6101 1406 5793 -3916
649 -3916 -5366 5953 4774 -6947 -3911 7690 3328 -7168 -1763 7492 2039 -5847 -1172 5038
663 5038 1931 -2141 -1291 1012 2012 2321 -1058 -3132 2455 5557 -1574 -5465 2698 7356 -1504 -6851
679 -6851 1815 7506 170 -6442 -1281 6719 3018 -5378 -3329 4658 3924 -3126 -4292 2427 4688
694 4688 -1327 -4547 -25 4048 1783 -4056 -3296 3479 3901 -2687 -5324 1489 5915 -1621 -6957 683
710 683 6355 -1016 -7276 173 5861 -1091 -6015 325 3940 -1227 -3121 489 1150 -1367 -1013 385
726 385 -670 -433 852 -953 -1558 275 1738 -770 -1779 309 1543 -503 -778 48 171 321 159
743 159 210 -224 547 834 -700 -587 1409 752 -999 -343 1459 1005 -640 206 1052 295 250 849 314
762 314 182 619 566 377 276 700 421 -69 335 563 486 588 -49 -252 569 757 -342 -778 1027 971 -1292
783 -1292 -391 1408 302 -1467 -248 1624 -43 -1928 29 1198 -464 -1349 -95 842 -412 -1400
799 -1400 -143 527 -374 -1049 -733 206 319 -1178 -981 542 218 -707 -1091 541 587 -1038 -972 314 234
818 234 -448 -521 482 -77 -570 -259 247 -284 -198 403 -27 -107 126 298 55 -505 279 650 247 -95 -312
839 -312 697 634 173 -287 530 939 200 -436 846 962 -269 -270 628 1305 241 -92 493 655 -97 113
859 113 427 284 456 589 219 356 476 541 -290 -603 742 494 -387 -537 217 374 43 -486 -172 294
879 294 -394 -257 -472 401 -64 -782 -774 371 280 -1172 -856 532 481 -991 -848 210 169 -809 -726 390
899 390 90 -920 -615 -96 159 -299 -736 -224 248 -79 -792 -487 441 412 -792 -713 734 340 -402 -441
919 -441 453 532 -429 -237 460 136 123 54 5 324 489 168 -328 390 609 107 -356 343 498 80 342 124
941 124 469 139 474 297 -59 792 664 -32 18 733 427 -209 -19 396 309 -271 608 172 -255 369 537
962 537 -218 -359 744 555 -1110 -661 852 262 -827 -591 742 185 -1003 -270 227 82 -43 -386
980 -386 -614 9 389 -731 -1213 -152 833 -919 -1272 292 484 -467 -557 -7 72 -226 -393 -365 -464 325
1000 325 6 -1049 -490 968 192 -1114 -83 855 44 -838 229 444 -318 343 669 -234 -651 939
1018 939 639 -1182 -277 1920 533 -1888 247 2054 259 -909 361 1323 244 -340 405 181 77
1035 77 855 -45 -684 522 1732 -422 -1562 883 1680 -666 -1516 509 1447 47 -1474 186 1111
1052 1111 248 -1130 -1148 757 948 -1008 -1467 384 1431 -851 -1172 247 759 -458 -959 -585 -387
1069 -387 323 -58 -1300 -666 1035 635 -1968 -1042 1994 548 -2677 -421 2241 -81 -2424 470
1085 470 1799 -1462 -1277 1237 174 -1605 129 1391 -1016 -1436 1680 1222 -2021 -552 2328 -15
1101 -15 -2021 59 1587 -263 -736 1036 488 -811 346 1141 -688 -626 1678 770 -1299 -225 1743
1118 1743 487 -1256 -228 1451 815 -886 -659 740 1326 -253 -904 357 1601 224 -1513 181
1134 181 1452 -148 -624 516 675 -43 -245 45 -510 -50 1100 -779 -1691 991 1831 -1750 -2444 2075
1152 2075 1871 -2755 -1568 2613 467 -2735 -376 1839 -859 -1809 930 897 -1363 -372 1053 -832
1168 -832 -1337 924 1135 -2055 -756 1724 19 -2172 133 1663 -608 -1306 954 714 -1226 -106
1184 -106 1071 -631 -1166 910 483 -871 -317 547 102 -123 359 398 -330 335 135 -435 703 850 189
1203 189 -537 659 879 -300 -459 844 427 -332 465 619 -229 -40 808 -114 -691 1106 1034 -1412 -570
1222 -570 1914 337 -1915 107 1996 -479 -1376 1051 992 -957 -398 1059 -136 -1055 569 638 -993
1239 -993 -84 969 -479 -1398 504 816 -1305 -951 1495 276 -1475 -15 996 -948 -1091 802
1255 802 -20 -1261 0 640 -665 -804 470 63 -1009 -24 611 -594 -1038 857 355 -893 94
1272 94 774 -421 -777 638 455 -438 90 673 -347 -408 760 340 -578 197 1146 -247 -572 760 461
1291 461 -668 -33 1250 -192 -620 988 1238 -546 35 866 -49 -639 622 558 -626 -135 1016 -41
1309 -41 -709 409 995 -571 -363 746 83 -1063 435 876 -725 -556 779 85 -845 402 682 -843
1327 -843 -834 749 334 -929 -56 693 -220 -561 196 342 -774 -261 588 -665 -408 345 128 -538 -182
1346 -182 623 -188 -936 275 154 -950 -351 314 -482 -768 -124 233 -792 -283 848 -241 -510 509
1364 509 537 -682 -316 551 306 -805 311 668 -264 78 837 71 -322 -17 569 -393 -370 381 -7 -467
1384 -467 76 586 -325 -401 598 432 -548 33 741 -230 -240 818 258 -495 124 689 -262 -529 578 578 -571
1405 -571 -6 654 -366 -415 473 223 -384 -174 410 -107 -755 401 275 -763 -249 403 -43 -592 84
1424 84 696 -792 -281 519 71 -514 -64 501 -73 -338 238 263 -1012 -12 353 -341 11 400 222 -641
1444 -641 -44 271 -286 -643 187 72 -395 -104 259 -37 -284 540 93 -346 8 417 -459 -350 357 114
1464 114 -159 58 363 -389 -147 421 389 -239 -67 487 196 -64 409 459 -465 30 670 51 -417 177 492
1485 492 67 82 325 164 -201 190 286 -196 -7 351 90 -212 235 411 -208 -465 181 260 -11 3 152
1506 152 -160 -233 -55 -170 -75 -32 233 -185 -546 365 -76 -121 -186 -168 -165 -478 -109 -63 -343 -286 89 -488 -280
1529 -280 -244 -268 -46 16 205 -373 -262 3 -188 -47 -24 -56 -273 32 -8 86 -22 -106 -48 94 -99 -5 229
1552 229 63 -128 -23 643 -147 82 485 117 35 131 146 250 -8 364 209 150 -167 97 -143 13 318
1573 318 182 163 1 231 309 73 -243 350 296 58 -286 197 -288 -115 -62 138 -19 -105 -196 194 341 -47
1595 -47 75 -33 -129 121 -107 107 37 -238 209 -30 -154 47 -13 5 -122 76 157 -368 -249 30 54 -146
1617 -146 -332 191 46 -121 -301 -40 -163 -97 -178 -66 125 -233 133 198 -227 -19 345 202 -391 86 139
1638 139 50 -229 219 509 -178 -103 112 178 -154 -64 546 -80 -437 386 509 -15 -199 322 55 -271 -39
1659 -39 537 -17 -104 96 445 -57 -165 138 361 177 -137 451 228 -164 -6 149 448 79 84 130 -267 19
1681 19 124 109 -87 -238 201 255 -382 -63 -24 -62 -379 -78 157 -229 -479 -381 -241 -223 -144 -269 207 -342 -219
1704 -219 220 -152 -291 16 -256 -343 -210 9 -32 -315 279 450 -51 -430 254 181 -58 -215 193 -216 -106
1725 -106 22 307 -288 -154 247 370 105 25 -9 91 176 7 272 116 56 9 87 41 60 403 42 -68 16
1748 16 -42 152 -77 198 63 78 111 -47 214 -124 -60 273 -148 6 -63 195 88 -291 -65 266 233 -176
1770 -176 -249 241 -106 -260 232 169 -129 -385 9 42 73 -81 -187 48 39 23 101 -336 -45 154 -221 -73 -15
1793 -15 -128 -218 50 -80 -80 -73 21 -4 -315 -450 -207 -25 -200 -322 131 -61 -146 -25 -129 236 -150 -202 3
1816 3 275 -44 17 -150 76 152 58 -78 33 -205 -32 170 116 -26 -32 144 66 39 178 373 77 33 433 239
1840 239 -143 255 118 -203 81 95 -142 162 52 141 -137 202 242 65 200 -262 192 -181 -132 135 -195
1861 -195 -50 252 78 143 -217 -94 -43 -106 -326 66 5 -266 -48 -38 -48 -35 -4 52 -156 3 -5 -191 -93 -60
1885 -60 -245 2 67 -78 -64 -364 6 118 -22 -163 -200 118 -344 73 -85 -130 65 388 -238 -162 -11 133
1907 133 65 -120 -44 11 54 175 10 -253 6 316 66 -196 93 266 -64 -32 6 128 -233 125 390 -7
1929 -7 18 -64 268 -23 126 224 399 5 2 85 192 92 83 163 -37 167 77 9 -163 102 243 -349 190 -21
1953 -21 112 -38 -102 -10 -163 -68 -237 26 -148 -22 -8 -209 13 -77 -86 -86 -81 4 -225 -132 -78 -233 -232 46 208 -44
1979 -44 48 -43 -10 -20 86 -23 -98 -132 121 56 226 -101 -55 54 -49 -130 298 86 268 40 58 -9 142 140 51
2004 51 313 52 124 -216 51 120 210 93 -176 -20 -7 -19 -51 -200 0 -64 -44 -83 154 -27 -173 -57 63
2027 63 -157 -5 83 -77 -104 328 -143 -166 154 -201 -27 -71 179 -345 -132 19 44 35 -172 -173 57 -42 226 -106
2051 -106 -87 -134 -28 -49 -152 -346 105 -177 -83 -66 80 -227 -3 -51 -31 296 -98 -217 -136 86 -121 -34 -42 18
2075 18 -237 -66 -295 105 -91 40 -174 -23 30 39 198 71 -177 -233 51 -128 -125 62 -12 -88 -92 8 180 -98
2099 -98 239 -35 154 22 -26 64 -158 -35 213 103 136 -122 -118 122 35 135 109 -112 -73 -25 62 165 9 -22
2123 -22 -170 -63 87 86 -105 122 116 -107 -28 -64 -37 73 -249 5 66 -84 -130 34 -158 -66 28 27 80 -40 114
2148 114 -295 -176 -247 -212 373 -332 -309 91 60 -128 4 20 132 -173 64 105 -60 38 5 -33 -22 -81 156 13
2172 13 -200 20 -109 -72 57 -136 22 13 -37 -194 81 114 281 111 -101 222 162 -216 34 -64 24 -10 -71 156
2196 156 59 169 -224 -131 152 255 24 19 2 7 179 17 80 219 193 -45 -48 -18 121 248 -37 -19 -215 200
2220 200 110 21 131 -43 -11 98 -242 -60 -49 -29 -101 -127 -169 -258 -66 -309 81 -78 -80 214 -54 52 -90 -52
2244 -52 -126 -43 72 48 206 230 127 -63 -38 138 -22 -137 147 -13 -25 -73 23 -86 232 -18 -4 -92 -138 16
2268 16 -227 -55 -26 118 -97 -297 -65 187 -281 44 -35 210 -19 238 23 97 -57 101 42 224 167 -102
2290 -102 174 -19 -237 87 146 -163 207 -98 -171 -138 -243 217 -46 -119 361 84 43 -113 -124 -317 -160 -124
2312 -124 172 -120 -264 71 307 22 -61 103 244 -14 8 16 285 61 -73 -59 156 -263 -150 -44 44 -179
2334 -179 -182 62 -4 -15 11 -118 -299 5 -140 55 -75 62 -17 208 403 -232 -1 -143 -171 -205 40 -108 129
2357 129 -143 -179 38 -85 120 59 -160 -92 157 -39 292 -100 -155 430 -119 155 39 -50 -95 168 100 214
2379 214 52 199 88 -46 -97 167 -16 -63 -10 -19 -2 42 55 -148 277 -131 162 -148 13 200 -185 103 188
2402 188 -81 100 -34 -29 36 -117 -19 138 36 -72 -223 -179 49 -251 36 79 200 -25 50 -173 186 -186
2424 -186 -224 107 354 -84 -222 -94 230 260 46 262 -211 -196 157 94 44 -92 83 -219 134 60 -9 -85 -42
2447 -42 -9 265 209 -25 -44 -165 37 224 154 -67 -10 50 27 -195 221 97 7 -110 11 -349 127 -57 135
2470 135 99 78 223 -17 -175 378 -33 -25 -243 209 188 -53 2 -131 -174 -24 415 121 -140 -1 169 -43
2492 -43 -99 80 11 -54 395 55 -70 -83 32 15 81 -33 71 -108 189 191 162 -116 234 -107 -62 158 100 86
2516 86 -115 73 274 60 -103 84 167 83 102 -92 -67 13 12 21 -133 44 165 -107 38 78 -141 -151 79 42
2540 42 -178 123 -86 -70 -96 25 -81 -183 -125 44 270 -67 76 -30 -93 142 10 -42 146 -149 210 -1
2562 -1 -220 -12 87 -151 -169 363 -117 -277 -78 187 -38 -94 290 187 -196 4 207 42 77 -67 111 65
2584 65 -114 -60 191 -50 271 -95 -53 -79 4 -47 -218 -243 48 -388 -93 102 49 -95 -31 96 -38 -71 -143 -66
2608 -66 130 35 -235 -322 -83 172 -333 -51 42 24 87 99 185 227 -192 -105 -273 -18 -7 172 65 142 -58 277
2632 277 -67 125 256 -108 60 -180 -41 -117 -150 164 -185 -44 -73 184 249 -14 49 -42 22 -123 -17 -134
2654 -134 -97 -146 6 82 111 -148 -404 133 116 121 -41 -73 211 -40 92 154 222 -274 25 -52 -210 124 -44 -40
2678 -40 -9 46 200 -79 -148 61 -73 67 -243 -194 15 186 -63 -92 88 -115 1 22 231 -47 6 -252 12
2701 12 55 65 -122 82 -20 -231 -233 120 -54 -74 -47 3 -21 -222 322 114 -85 -10 -204 -28 -105 43 88 42
2725 42 93 329 28 -62 70 106 -104 205 -129 35 127 -35 14 172 -140 82 -145 -117 223 -78 -205 254
2747 254 -65 78 -163 -287 267 -206 88 -189 -126 -57 -33 -176 54 -49 -94 45 102 -109 49 -37 117 143
2769 143 219 -263 -54 39 -22 -32 -127 -377 -230 -146 -197 91 62 127 -113 -20 14 -76 -423 -172 -81 24 -228 -495
2793 -495 -47 33 22 168 87 48 -41 -128 91 -117 -196 37 14 101 156 68 19 353 155 -166 -136 -57 -57 146 128 -66
2819 -66 229 -11 97 227 -120 231 68 213 42 79 129 315 375 -133 70 320 -34 -165 -43 -214 5
2840 5 189 -41 -196 53 75 49 -182 -284 -12 30 -25 -337 203 2 -181 272 -53 204 115 -7 85 15 -161
2863 -161 -230 -55 10 -150 -12 83 22 187 -2 -31 103 -48 -176 111 -147 -164 126 48 50 -179 -59 46 -56
2886 -56 45 89 -103 60 -74 -43 -98 358 -66 83 145 193 230 -144 -39 -60 -155 66 -32 282 10 -35 -52 -36
2910 -36 -5 -140 -6 179 116 39 73 -165 447 -231 -79 23 97 -57 -184 35 -9 -234 88 176 44 -46 245
2933 245 75 -265 64 69 208 -145 13 233 143 78 -38 -73 -14 44 154 -199 16 -122 153 47 229 -301
2955 -301 27 -134 -74 73 -27 -36 7 -35 170 126 -51 90 196 237 -117 9 237 -52 -160 -33 -39 -176 -28
2978 -28 138 -137 -79 -83 327 -184 -201 91 197 -40 11 230 -195 -144 -274 237 -4 125 139 46 -74 -61 334
3001 334 -32 -6 -60 207 -35 339 -155 -45 103 -8 -32 4 -16 -6 -29 113 85 -81 60 -52 -69 114 238
3024 238 -113 50 62 179 73 9 25 102 98 -7 131 286 99 -46 104 -109 71 -75 -33 -135 2 40 82
3047 82 -181 13 16 211 29 -75 -10 -289 61 201 178 -406 -240 144 -91 -124 84 -133 132 -116 96 189
3069 189 -197 -96 74 -61 -8 139 -135 -192 -185 21 104 -37 51 143 101 29 118 119 -270 -156 -116 -97 66 47 28
3094 28 -28 -54 121 -9 256 81 -127 -97 268 57 152 122 -13 -299 -120 16 -80 -97 -56 192 25 214 188
3117 188 -46 -77 158 -34 -237 71 10 -64 53 -120 -101 -104 120 263 208 -192 -149 80 -88 -21 -95 -124 377 -130
3141 -130 -62 55 -395 -71 90 49 -76 12 -91 -111 -260 -252 -38 0 -229 129 -180 -34 27 24 13 19 -39 -26 75
3166 75 108 166 25 131 74 41 35 -50 126 -47 -18 131 -255 -112 204 -111 228 -19 -58 -236 101 175 -175 -134
3190 -134 -33 -13 -3 4 83 278 -64 -270 -30 -105 -78 191 -48 -263 -34 237 -291 24 -138 88 -128 259
3212 259 85 40 -36 -258 146 77 -100 -153 -64 -358 -208 352 -241 -43 -37 18 125 -63 -193 291 4 22 -128
3235 -128 -128 89 14 43 -137 102 -66 -31 75 149 -18 -22 -10 -128 290 -42 9 -128 -103 26 -350 -41 24 -11
3259 -11 -249 24 319 -107 -13 41 322 58 210 223 -61 -245 15 381 -47 215 -74 223 -229 241 195 -8
3281 -8 93 -110 137 166 -177 -239 -34 78 -21 76 150 -8 55 78 29 3 199 141 62 112 82 42 -79 -20 -21 27 -257
3308 -257 -64 23 -68 20 52 59 -61 -86 241 -143 -78 -260 -131 -59 -285 34 -19 -120 -40 -109 38 -49 68 -89
3332 -89 36 92 155 141 -4 165 -124 48 -129 -427 72 151 14 155 210 -77 -205 -122 -154 -41 -44 63 21 -40
3356 -40 44 -51 -59 -32 142 67 177 -78 165 286 121 -189 -50 16 174 -172 25 144 -148 92 3 68 157 186
3380 186 -27 -160 162 25 -23 134 19 161 99 77 -102 -239 -30 -58 121 31 96 29 1 97 48 -296 -58
3403 -58 -27 89 200 21 -41 27 197 -124 -37 -32 -106 -193 50 -50 -211 -154 -175 -10 201 166 -155 -103 -165 145 180
3428 180 -72 -85 -148 -69 28 56 -29 7 129 139 -287 100 -64 36 151 86 42 332 14 89 302 -18 203 20
3452 20 -179 163 101 149 -111 106 -220 -128 106 -168 111 116 83 198 81 72 -89 -158 7 -58 95 23 73 45 33
3477 33 106 -171 51 -222 70 96 33 71 206 -122 18 213 53 -51 -74 -188 -91 -180 -152 -149 234 13 52 -15
3501 -15 17 34 67 53 73 3 -233 18 -129 140 24 50 -214 63 92 -197 54 260 -182 -75 -246 99 4
3524 4 241 -170 -256 -65 10 58 -222 -25 -104 278 151 332 77 -106 -27 107 -270 34 27 -15 -147 -78 -12 42
3548 42 -351 96 39 -26 129 -50 -203 -145 202 -272 -47 -125 103 78 46 163 83 -202 91 257 74 111 159
3571 159 204 351 142 10 107 -33 168 -9 -86 172 144 -144 93 67 -15 -110 -1 -30 22 -210 -150 -166 -110 -8
3595 -8 143 64 13 37 -274 -288 -56 -11 -15 21 -166 -137 -156 8 -44 -115 -123 145 219 -218 20 -44 -201 -18 -235 31
3621 31 -35 -238 285 64 -145 220 -116 -152 175 80 197 -179 -9 -168 -102 -24 -99 94 -33 -95 176 -141 -272
3644 -272 -176 141 -47 -139 97 -7 -99 65 -244 -251 -141 -6 -122 -98 75 261 -108 -34 -207 43 -136 143
3666 143 -54 -253 62 326 57 -222 -270 -310 36 -220 167 7 -287 166 -152 -164 -35 -247 53 -33 1 45
3688 45 67 139 -193 254 185 -15 172 58 -92 359 -271 -54 70 185 -96 -88 327 60 66 69 130 90 -198 -372
3712 -372 279 -160 246 4 45 -73 -124 105 103 -161 -87 -88 -158 -42 -82 87 87 -265 -68 -101 273 345 -150 -84 99
3737 99 -266 -39 -258 68 206 -190 131 -183 -143 -36 -94 -128 139 11 -43 82 226 -7 11 157 -51 135
3759 135 -90 -212 -62 -12 -284 -121 -138 -227 -91 -89 -137 23 248 53 34 -129 10 -45 -207 -186 218 -130 178
3782 178 -64 -115 163 386 -231 29 127 -131 62 -148 -78 112 -240 180 -98 124 -36 -58 97 -169 -86 76
3804 76 117 203 126 98 194 30 130 28 -44 -7 81 78 -9 70 -168 -161 165 210 332 25 12 13 10 -262 -53 398 86
3831 86 264 -77 -27 -208 120 144 -46 10 119 -37 87 -135 36 -35 -53 185 211 -142 -93 157 1 -43 -170
3854 -170 -134 -108 -68 -35 -86 -109 48 85 -63 -66 -133 253 -30 -95 -17 283 215 -280 -150 197 -27 198 31 -136
3878 -136 106 -27 -98 2 -166 -109 220 220 -263 -352 -11 29 -1 -204 -17 -106 104 25 134 262 112 258 -152
3901 -152 -71 253 -96 191 38 -92 19 -125 148 -121 78 -187 -98 -184 -52 60 -165 220 296 -113 -33 254
3923 254 -259 -85 -84 81 -16 -144 -51 48 82 217 29 -51 299 -10 -283 -29 262 40 -226 62 155 229 94
3946 94 -284 -62 -22 14 26 -69 81 -215 -64 -144 -274 -63 -82 108 -62 -42 -140 59 60 -201 64 -70 323 281
3970 281 -119 -38 -21 229 236 62 -126 -220 -130 -65 17 -47 -144 -130 59 -25 -85 124 129 198 75 -31 -2 195 -18 -34
3996 -34 250 49 -12 -64 -144 -201 93 114 7 -141 -234 -184 -101 3 -106 -113 66 46 -49 47 -228 486 32 1 65
4021 65 -135 -115 -177 -40 -121 -73 94 -101 -18 -12 -210 216 -62 264 -72 -47 -198 -222 -11 129 67 113 35 -108
4045 -108 -51 -158 43 23 -41 91 -103 120 352 -266 -98 -28 -81 -206 112 -97 1 3 -37 -45 -148 61 88 154
4069 154 -64 -54 -192 255 279 -100 89 38 103 -55 -230 66 -63 -5 191 207 -154 108 -70 -32 -423 -120
4091 -120 -212 162 -154 -176 -282 -259 142 17 68 93 -56 99 7 -19 -32 -268 -167 61 81 78 38 219 44 102
4115 102 -36 58 132 78 46 -79 -113 2 52 -39 253 134 15 3 518 -188 -193 -167 50 -90 4 207 -173 88
4139 88 -102 159 -17 -114 171 223 -338 -113 -13 138 105 -79 -27 -177 -27 36 103 193 -45 -30 168 128 75 143
4163 143 -30 -117 57 -48 -20 302 43 76 59 -18 -4 -130 133 -378 30 138 -246 53 -161 116 -182 170
4185 170 78 -44 138 157 273 218 -26 -137 -220 139 -243 50 20 -293 158 -19 -1 -114 -65 11 78 308 -130
4208 -130 -46 167 -114 159 49 -6 126 8 -169 123 73 2 -47 130 27 -51 86 256 32 -181 78 69 -267
4231 -267 -201 -6 -226 61 131 168 -23 -251 284 84 109 -298 -254 332 -18 132 48 45 -26 -108 16 -93 -5 61
4255 61 28 128 178 17 -133 -58 33 148 21 322 -88 358 -91 -54 -50 36 97 -149 82 -60 241 -46 257
4278 257 125 -1 91 224 6 44 -169 38 -25 57 -23 82 -206 140 71 -282 77 -227 54 -14 -105 -1 108
4301 108 -28 101 -38 -97 -100 -75 304 28 -81 270 -138 38 132 12 -135 0 -89 -34 65 -36 -242 -98 -109
4324 -109 85 161 -188 -274 94 -85 -145 -432 7 -40 -154 -154 79 -5 279 -128 -129 -71 15 -120 -226 6 -7 132
4348 132 365 -178 32 -86 37 -11 100 294 61 187 -178 -104 87 -132 163 -131 67 -31 -40 193 -67 -200
4370 -200 -148 -48 26 3 13 -38 -67 4 -41 85 -123 -181 2 -136 202 46 -82 -429 88 -166 -101 -113 19 55
4394 55 -43 -202 157 21 -54 123 -61 251 232 122 106 -68 109 -142 -2 67 -91 60 51 141 -38 16 -105
4417 -105 -5 -39 57 215 -215 -11 144 30 113 -66 -95 114 140 7 -172 -2 108 337 -124 19 252 306
4439 306 222 109 54 -27 -9 -31 156 119 -104 255 -115 47 380 98 -79 -60 -26 246 -275 -21 -41 141 156
4462 156 67 150 -148 -5 -22 -31 -94 -59 -11 -125 -163 29 -22 -27 34 -90 -260 246 -2 -200 -16 244 -146 -473
4486 -473 -101 275 93 66 96 199 -28 105 -107 -23 -198 77 -149 -45 -52 -167 -108 329 -155 101 75 22 250
4509 250 11 -178 -36 24 -177 -1 -1 166 -8 -151 -27 -50 -189 115 133 -55 62 53 -16 -134 21 -74 62
4532 62 23 -97 216 -111 306 -10 49 -69 252 138 47 -113 63 -136 -325 -145 -30 92 8 -85 -91 8 139
4555 139 107 -85 -79 -105 4 165 309 125 -56 -368 -45 104 66 -130 58 45 -86 -25 -176 -115 -119 26 54 127
4579 127 -141 172 365 56 -206 -14 19 -89 -78 3 31 340 -209 183 -6 44 162 -61 274 -93 -75 -22
4601 -22 -46 38 1 2 -29 -13 20 -68 -111 -226 323 -9 145 -29 148 45 19 75 -286 37 -27 -198 -78 -50 77
4626 77 -102 -235 109 6 -97 -187 39 -79 31 192 11 -39 108 -123 -12 35 115 72 185 -143 -19 -403
4648 -403 146 143 186 -212 -24 91 -48 359 107 -65 -5 157 -43 -328 199 -94 -124 111 -58 189 -151 9
4670 9 -151 53 94 -230 128 -90 -141 -125 -117 -26 -194 74 -81 173 249 -314 -160 -97 -57 22 109 82 44 173 132
4695 132 82 110 173 89 35 68 -79 120 -175 -26 -86 -177 82 156 45 -140 26 23 -73 -108 -110 129 112 -25 -254
4720 -254 2 206 -57 -265 140 38 208 -135 80 208 -188 106 174 -151 -281 -1 -113 -102 213 179 -96
4741 -96 -19 158 -44 100 20 53 296 28 198 118 -80 -65 330 -249 32 216 361 -128 -176 -467 71 77 255
4764 255 172 -151 125 -51 -289 76 -195 35 -133 -133 221 -116 110 81 -45 -219 -259 29 -210 -195 9 45
4786 45 125 -154 -32 132 -189 10 -194 -221 128 -18 17 -155 10 -41 29 -69 -42 36 86 -195 37 59 52 40 0
4811 0 -6 -149 -299 -127 -4 142 91 60 -55 -233 -163 -211 -89 -289 -200 -102 63 -123 7 -111 115 -185 169
4834 169 -77 17 -38 24 52 -167 181 -111 -7 153 -4 -96 -55 -22 -106 64 -257 138 -114 -306 226 -39 -41
4857 -41 -264 -149 202 78 76 255 -9 -205 -128 85 30 -208 49 -67 21 -126 44 -154 102 12 -165 20
4879 20 167 274 -270 6 -92 -37 -65 -191 -164 -182 -47 -186 6 -65 -100 -203 65 -55 -15 282 94 -25 -59
4902 -59 -115 -38 -44 110 36 50 -151 -62 -33 -279 -175 128 51 -149 -130 -36 198 185 119 -397 19 -83 3 215 -105
4927 -105 -208 49 124 49 225 -59 93 -54 -73 -139 -12 -240 -147 -196 8 350 27 131 -152 -139 131 21
4949 21 41 -67 -2 279 42 -184 -44 296 -153 23 35 -162 -37 153 -22 -6 221 315 -61 -155 -235 -111 130
4972 130 177 -116 -75 281 134 -29 26 -143 123 -258 -76 196 -49 3 0 81 76 173 -106 -49 58 103 131 10
4996 10 171 132 118 40 -2 108 -40 -38 80 50 -18 62 11 -173 -129 12 -62 202 95 171 -174 108 -245 71 -111
5021 -111 -202 -47 -57 79 -135 0 83 -211 32 250 141 8 -153 -28 -137 -64 88 -227 -318 22 -185 85
5043 85 -15 -156 -13 -68 -59 -49 -123 -286 -137 115 34 -211 128 30 -151 143 -52 -21 -69 -55 75 243 -408 28
5067 28 -95 291 -241 -163 157 73 58 65 171 29 -44 42 -43 116 96 -50 -27 -185 5 -20 82 -133 -78 102
5091 102 185 -71 63 -112 -259 -194 -187 88 -155 -19 -63 147 -27 40 62 -106 188 -133 -66 -23 112 93 218
5114 218 -46 -19 196 -223 -58 -210 -11 -56 -63 9 102 72 -23 110 139 -120 -237 -278 -341 -84 125 126 110 -41 -130
5139 -130 -30 191 199 19 -264 53 -175 212 -78 -55 -85 31 -255 -183 -16 -154 -282 -31 47 -195 -88 -175
5161 -175 208 166 -75 -21 12 -54 112 -216 56 -261 305 54 189 139 88 344 -120 -35 162 257 6 175 19
5184 19 -222 61 -70 -97 -50 191 24 179 -42 -233 -27 -93 12 -73 2 62 -90 183 213 -251 21 -214 38
5207 38 242 164 98 -155 -64 147 15 109 -288 -200 -38 -227 100 102 21 76 -171 -25 106 44 -98 212 20 157
5231 157 223 93 -154 7 -26 -42 -247 -41 -175 -17 -165 7 180 94 162 -149 12 -181 -174 188 -18 51 230
5254 230 103 57 -146 125 -146 181 149 17 109 291 125 173 -38 -47 196 162 6 120 239 -274 -5 -56 -116
5277 -116 -222 43 289 265 -50 -67 62 -9 -376 -191 -16 44 -100 232 172 80 -46 69 101 -71 128 178 -26
5300 -26 98 -162 151 30 179 36 -243 -118 -135 -241 121 31 -160 -262 -159 -80 -55 82 -114 -329 -23 -139
5322 -139 -156 42 -56 -9 -94 60 28 5 23 7 -49 85 350 7 93 -212 157 75 40 108 -80 -162 -151 -42 -28
5347 -28 -217 4 99 -247 142 68 -8 -18 19 75 -134 -181 -171 43 219 125 236 -86 112 25 138 18 83 -253
5371 -253 -138 -58 65 113 27 128 117 -56 86 170 111 82 239 -166 179 -40 92 -34 -117 72 -39 -132 -165
5394 -165 -27 -27 57 12 -131 151 -4 -276 21 -18 -248 -125 -249 13 8 182 -3 61 12 200 0 106 50
5417 50 -185 35 -231 60 126 -46 95 116 139 135 -166 -9 -4 -255 182 -174 -8 -218 188 -99 -58 -124 -236
5440 -236 -62 -54 13 46 126 64 -111 26 -121 37 211 150 -13 142 -343 32 -245 -139 -81 236 -50 -70 70
5463 70 21 13 -52 52 -206 -241 10 125 29 -109 234 -109 -26 258 -16 164 2 -186 -134 -14 23 71 36 -37
5487 -37 129 291 137 -131 -198 -281 243 -188 -64 91 -21 34 88 82 32 71 27 -151 225 -80 98 115 -144 -212
5511 -212 -200 41 147 -148 108 -22 -104 76 92 67 5 -39 68 109 138 259 49 -111 12 -28 -273 239 267
5534 267 14 81 111 -121 -224 -127 -73 25 -193 -64 21 52 17 -91 -47 -85 -9 325 -6 -222 2 -245 161 242
5558 242 164 -29 -137 -41 -209 207 -232 -12 72 -46 145 -17 -135 261 101 -66 110 94 4 -28 86 106
5580 106 315 -259 66 69 51 60 53 -213 -125 -46 124 282 139 -216 189 -101 -107 -39 -130 47 125 -53 45 -38 26 73
5606 73 9 238 82 295 4 96 -22 78 30 4 209 68 124 -8 -22 200 -192 228 -87 -97 10 89 -114
5629 -114 -173 -78 -332 -22 93 -4 38 -204 -193 107 137 153 10 -210 41 -24 -95 65 -87 33 -13 50 59 144 -23
5654 -23 198 -100 43 -318 163 74 -90 -4 -105 46 117 -77 61 -28 -225 323 -23 -136 -44 -74 178 209 -108
5677 -108 229 317 130 10 -153 -46 -169 83 -154 150 -164 -132 52 0 -93 -22 -87 164 0 5 259 202 -57
5700 -57 -187 111 -214 -73 -115 -262 7 -60 -84 -38 -512 -67 -167 -67 -105 -141 -28 224 161 90 -9 78 -61 124
5724 124 -83 -16 95 23 -131 -217 -102 -92 172 -29 76 84 169 -80 -4 55 -295 -25 132 83 -83 -128 113 -236
5748 -236 172 -239 -135 -117 150 185 -113 70 231 -75 -44 -110 181 117 19 -164 216 239 136 0 -85 -19 -51
5771 -51 17 -148 -112 -80 -145 -103 -184 -8 269 -80 190 -178 8 -38 -124 175 40 168 67 -189 -40 -205 -149
5794 -149 -257 60 216 -42 -18 -185 129 158 -191 -102 50 -88 -119 135 137 20 46 282 60 -265 162 -162
5816 -162 -243 -121 78 -305 266 -7 196 -119 -298 -82 55 59 -132 -68 -29 52 29 -31 -14 -8 49 11 -30 -236 130
5841 130 -76 -110 106 164 106 -1 97 103 -59 9 -26 -93 -154 103 -15 53 317 245 87 -147 -162 54 6 126 305
5866 305 -20 4 -34 47 115 62 45 -221 180 154 39 26 168 -3 -10 112 -46 -49 116 -176 -36 -155 -43 -50 -157
5891 -157 64 -42 60 -145 -55 132 -80 -137 -34 -168 -83 -155 -221 -34 -152 -212 115 -60 -210 -130 -219 25 -180
5914 -180 250 -130 -110 189 -22 -140 66 -49 127 -21 -81 35 -57 -147 41 45 -105 8 -18 -209 24 -74 -17
5937 -17 -31 -184 -22 -238 -216 -56 -98 -116 -88 76 34 -12 230 145 -331 -54 -12 -161 -209 -21 118 56 -85 -401
5961 -401 141 -135 -37 120 -243 -31 -21 -248 -157 73 170 216 3 -110 13 -166 115 -8 71 -179 -113 139
5983 139 88 41 137 -145 147 -32 -202 -28 97 -118 -145 125 30 -97 -149 -143 48 -74 -162 -74 -156 -48 -51 -43 52
6008 52 -34 97 -8 176 131 -25 -59 19 -164 103 228 -40 -103 156 -217 -194 -173 -42 -214 32 -156 7 -31
6031 -31 3 128 235 35 -21 -56 76 -282 -198 108 -94 -207 118 -113 326 -247 67 -170 -248 275 -152 159
6053 159 -10 -59 -162 97 59 -105 113 -45 300 78 111 60 -15 116 -8 -77 101 5 150 -174 -84 -146 -3
6076 -3 -202 -18 -62 -111 -137 -475 203 -5 -26 178 76 134 -80 30 43 42 152 -11 -13 53 -27 162 -219 28 180
6101 180 224 -100 138 294 223 168 1 47 -118 41 32 -79 -229 -112 4 38 95 14 0 140 -104 -21 -105 -115
6125 -115 137 -119 170 103 49 -148 -75 -171 -54 -6 -120 46 -144 56 -120 13 -262 -100 283 105 62 -222
6147 -222 -119 143 -34 -89 -105 168 146 34 284 -13 135 334 -95 -321 86 -127 62 25 -155 -47 -11 -189
6169 -189 165 -68 143 139 -53 52 378 36 -140 -43 -196 38 138 -52 -88 -80 -165 -114 -273 -75 -186 83 5
6192 5 225 94 189 -92 -162 50 -18 168 198 56 -153 -277 74 104 60 -2 78 -48 308 281 -158 17 75 -107
6216 -107 -22 42 -36 15 101 92 62 -170 41 107 -62 -172 -197 270 -11 -48 32 36 18 35 71 65 -88 -200 62 -75
6242 -75 23 -51 290 71 -185 16 303 3 30 238 -40 142 -274 -197 113 55 -66 63 178 151 154 -112 98
6265 98 -259 164 25 -110 -29 29 -47 -96 97 -300 247 -100 232 -8 -108 -15 118 -42 -242 -104 194 -333
6287 -333 -137 -131 -214 -161 41 59 -171 -67 13 161 15 -134 30 86 -27 158 -182 29 2 15 -2 47 255 89
6311 89 -131 80 9 300 -111 -265 24 -38 -153 -193 -204 48 -184 84 -130 29 -1 172 -10 120 -94 3
6333 3 -187 74 39 -84 56 204 -256 54 51 -346 260 -25 121 -151 -85 -335 -79 -104 -295 220 -102 149
6355 149 107 -255 -42 121 12 -65 -73 -108 -182 -44 26 -36 41 107 142 -152 -58 110 -126 -275 81 173 36 213
6379 213 -17 160 -17 77 118 213 73 43 362 -44 -82 -79 198 42 53 362 -179 -15 -115 150 40 14 -107
6402 -107 169 -15 -28 88 88 163 216 -165 101 39 38 -142 21 130 100 34 -31 148 -47 101 -142 161 -119 -139
6426 -139 59 -29 -19 -20 -15 31 -65 21 19 -14 121 -38 208 -26 -126 -32 70 -61 -28 152 -225 -1 -245 299 48
6451 48 -11 145 133 -45 -5 -131 -64 38 29 -65 27 29 -30 -126 -39 -38 -198 9 -157 -223 -17 -99 25 -92 -58 -69 367
6478 367 -60 -317 126 113 -116 -68 393 -1 -181 -1 -121 29 -48 138 -70 -79 -128 121 -143 -104 88 48 -238
6501 -238 -110 -25 19 -150 -415 -218 -2 -12 -50 -47 -380 -44 -26 42 -251 -219 83 -103 35 -16 22 -25 -81 81
6525 81 52 315 -150 -40 267 2 85 -6 -135 -139 -23 94 -96 44 -60 -33 265 -107 7 51 -84 5 111
6548 111 -69 62 -121 -25 -21 -27 -93 -127 184 -44 28 -352 243 -69 125 -191 132 55 74 18 173 -9 -26 -48
6572 -48 -275 16 210 -110 -307 -56 -21 -39 -249 82 67 194 116 274 56 97 -137 -57 29 -397 99 -18 -231
6595 -231 115 -111 348 51 -179 -112 90 118 -8 181 -186 157 -94 157 -41 207 -122 67 -171 157 89
6616 89 272 100 -61 -43 76 179 140 86 -50 179 185 130 -49 243 -112 -101 -48 -261 -244 -4 -79 107 -120 -180
6640 -180 -27 -2 88 34 3 -64 -60 19 -85 -215 -231 -115 87 90 46 -38 153 205 -106 -83 -81 -188 60 -49 79 65
6666 65 11 37 200 -184 -31 -132 155 -309 -56 59 72 25 -197 -173 -192 -77 -141 158 -70 -288 74 -14 -60
6689 -60 -20 108 -84 -88 293 -162 -48 -192 -147 72 54 -76 -242 28 21 72 -115 -110 -263 1 61 -36 10 76 55
6714 55 5 118 195 100 11 -381 -55 -94 8 114 -18 15 15 19 101 -39 -160 -240 -173 -67 22 145 -205 -114 -107 14
6740 14 -39 140 52 -72 -187 46 -16 -71 39 -28 102 15 45 40 23 167 -198 -20 76 249 31 198 192 29 78
6765 78 -169 -225 173 66 -129 -104 239 56 223 102 -75 -36 53 -87 -7 219 -72 3 -265 -35 228 -87
6787 -87 -111 -44 61 139 -56 -42 -146 137 63 6 -30 293 139 -22 -75 122 19 128 15 -23 1 177 35 -189
6811 -189 18 58 74 22 -49 -142 -209 112 -228 -44 110 -30 197 -87 -141 -96 -171 -103 39 -167 176 345 28
6834 28 191 81 -127 18 -155 150 -77 137 -163 49 -151 -116 -62 -96 98 11 -63 -238 174 -67 104 -281
6856 -281 -119 -186 68 96 -79 4 241 -97 -180 59 215 -75 -100 132 -63 61 -154 -191 -79 81 -122 29
6878 29 214 -162 135 57 -68 139 -127 -25 168 -106 34 46 102 35 -99 134 200 62 -43 -4 89 167 -19
6901 -19 145 -75 -238 149 72 -4 -150 -156 -233 -6 78 -67 -149 104 107 129 -84 -63 108 103 142 95 -178 43 64 99
6927 99 -180 320 15 -33 -20 -332 50 179 218 212 43 96 -149 230 -225 32 107 -116 -212 -242 -285 130 99 -2
6951 -2 90 114 -496 -111 119 -92 -40 -176 -189 -32 -109 131 183 83 -37 -49 98 -182 81 -12 106 140 -8 7
6975 7 -11 -46 71 13 93 157 60 134 65 39 -35 -87 -93 -164 31 -20 -153 -125 -4 190 170 -12 104 -19 -143 -4
7001 -4 -103 -100 68 -1 40 -233 -235 52 169 -30 -224 -55 -69 92 44 177 -20 -62 -45 219 -284 -390 130 94 75
7026 75 9 -135 -104 -294 9 55 137 -237 28 -212 -134 -207 142 87 -130 -200 3 109 -318 130 25 -13 -25 -124
7050 -124 61 103 67 155 -89 122 -178 63 192 -203 151 -298 148 -131 -261 11 -204 -35 -121 57 61 174
7072 174 193 246 -3 16 -128 -114 213 -203 -49 181 -158 199 -163 154 -84 70 71 -9 33 -127 -98 -42 -24 15
7096 15 -123 46 -131 -147 496 -257 -125 43 73 243 -44 -100 -5 -94 10 255 -66 -190 -101 -135 -14 453 -156
7119 -156 11 178 -167 -12 100 -14 -69 51 -52 76 36 -200 15 171 -157 -199 124 -20 -113 109 -113
7140 -113 -11 -83 -31 88 51 -100 70 -32 39 -52 -131 103 88 -45 50 73 57 230 -12 -158 23 -319 -155
7163 -155 43 -56 144 27 67 -135 65 152 60 -50 -350 62 51 -233 135 -96 -242 -196 -13 -158 -41 24
7185 24 85 81 -95 -224 14 149 -318 138 -47 107 -11 -366 -16 -170 143 46 100 -40 -95 -167 -139 -134 -38 81
7209 81 173 47 131 54 5 -127 -361 168 -24 -1 -27 106 -76 -17 70 57 217 -30 147 177 -69 227 120 -115
7233 -115 20 391 -258 244 -9 -14 33 -211 -71 -78 41 25 -115 126 -195 144 -32 -111 116 135 73 33 58 28
7257 28 -267 71 2 111 -157 83 233 -33 55 125 66 -274 -36 -94 -32 -132 26 85 -159 241 125 169 -136
7280 -136 -99 -191 49 162 -244 56 232 -43 -183 -161 127 -91 -71 -176 -189 140 -233 92 169 -153 -116 -22 145
7303 145 127 -55 86 40 -67 1 28 -146 -160 192 6 28 46 -92 155 235 -54 218 73 -174 -326 81 2
7326 2 67 -57 118 155 -75 -59 189 214 -157 264 -154 -52 100 49 5 96 -142 -178 -21 -164 -29 -59 187 104
7350 104 93 73 16 -7 29 73 108 371 -242 115 -131 -180 84 225 -220 -303 -12 9 -250 170 -163 135 -310
7373 -310 -58 77 169 34 195 125 174 82 138 12 -119 -106 -277 -13 -1 68 -81 -227 -121 8 107 25 -186
7396 -186 -148 -59 -18 164 -85 -160 19 -49 86 -263 91 122 -1 -71 -122 -3 31 -28 105 20 -109 -38 -63 111
7420 111 172 -140 153 -21 54 254 39 -194 -136 -150 -31 -314 -20 -313 208 58 268 -138 -81 213 231 68
7442 68 47 -14 78 117 -77 -57 -114 287 -151 42 -133 -21 -128 88 90 -62 -114 102 110 -101 -116 -49 4 -30 12 143
7468 143 -86 -188 -87 153 46 -173 -61 47 -311 -47 246 -15 -115 1 -87 -182 57 64 -171 14 -30 -21
7490 -21 170 71 -142 -79 -300 -56 -43 -120 -58 -247 -129 63 257 32 2 285 -9 -178 -227 -107 156 -108 -1
7513 -1 -123 242 -84 25 113 -60 181 75 45 118 159 284 -70 -186 48 -74 -4 -353 -75 54 56 -78 -74 23
7537 23 22 -91 -73 130 19 41 132 106 150 -346 -135 6 228 33 -183 -186 18 161 -3 -18 -133 -127 -49 11 -42
7562 -42 -157 78 -164 267 -154 154 -181 -124 25 -401 -67 -165 -212 40 199 139 59 20 -213 -102 -251 -94
7584 -94 -53 43 124 19 -229 290 -47 -121 -68 308 -13 60 107 -14 3 94 22 -78 -171 -97 -36 -45 -214 46 -64
7609 -64 -19 -32 81 -175 80 13 101 -59 -348 102 208 -4 -45 317 -237 -131 -78 406 -160 -286 228 7
7631 7 -151 -52 81 -261 -125 -138 158 399 21 103 -60 -127 -28 -36 51 -61 166 -63 158 146 230 -299 68 33
7655 33 -99 203 -33 -43 -46 181 5 170 23 -103 -77 -19 -9 119 -33 -3 -197 14 132 -237 -34 -73 -128
7678 -128 276 -80 14 99 -142 -52 55 -89 235 98 321 -233 18 -29 140 87 51 138 20 35 -202 156 -21
7701 -21 -111 -60 188 123 -156 92 -258 197 -35 34 111 89 37 -347 191 5 -127 -134 -267 -284 159 56 -503 148
7725 148 94 146 38 -187 209 40 -69 -125 178 207 -62 53 -321 5 116 -20 105 85 -73 123 76 214
7747 214 -146 118 -126 -93 244 -288 -37 56 -49 108 21 -266 45 -186 -162 -198 -267 -85 -58 23 388 -95 -95
7770 -95 -304 -169 -14 105 207 -28 -151 -35 29 -25 166 -46 137 -122 -77 101 -238 201 200 1 48 -310
7792 -310 -194 98 -108 68 -41 -118 157 -140 -207 -213 16 -207 -246 -14 -55 184 262 136 8 54 -167 140 12
7815 12 105 75 -125 51 -52 253 81 -118 156 17 101 -184 -84 95 -23 -103 -219 199 114 134 71 -23 -26 221
7839 221 -246 -225 -4 40 -301 -32 -51 -76 190 -136 -61 -89 -143 28 -112 -149 89 -207 303 -51 90 209 31
7862 31 -185 122 170 83 157 -72 -61 41 65 207 347 337 109 30 -235 139 118 -160 -121 -51 76 -48 -8 5
7886 5 -198 87 -10 -407 -151 -126 -29 -115 -65 -126 4 -226 24 4 -77 -166 48 311 170 -79 -431 171 -228 -208
7910 -208 67 103 -93 105 233 -198 221 -381 -166 223 -54 -23 2 -95 -9 -135 50 164 -10 33 -194 -80
7932 -80 55 169 10 -153 21 -28 125 21 -79 177 288 -17 -86 -222 -86 -339 -297 124 -72 104 166 63
7954 63 -176 417 -123 45 65 79 -192 -89 29 74 -155 -233 -4 130 147 46 -115 -182 74 -58 60 101 -170
7977 -170 -38 -10 320 -132 152 -202 -92 -176 -145 85 -38 -110 -18 72 -173 -128 -1 -188 -127 -5 -28 -250 19
8000 19 -63 252 139 -82 128 29 191 -109 -8 -63 -148 149 -19 -159 89 -125 45 -46 152 -248 -26 95
8022 95 -40 170 -24 200 8 -153 -162 118 -24 11 247 -83 -106 -205 203 -46 13 89 -32 98 -211 -197 -59
8045 -59 198 65 -53 30 99 131 113 -125 44 233 356 215 224 -17 -46 -203 -80 321 22 -173 -53 198 -17
8068 -17 -308 -141 -53 -80 -152 -28 -80 -258 -1 32 70 -85 87 -68 68 -108 -101 -4 -76 173 47 183 -304 -341
8092 -341 -135 -156 -98 165 52 -80 -19 -43 26 -113 41 168 144 155 -21 -73 89 191 -95 -16 3 212 -56
8115 -56 -19 224 45 18 182 -164 6 170 -154 -180 -63 92 -102 -6 -208 86 -209 -62 163 -188 61 -83
8137 -83 -77 78 15 94 -28 159 -298 -214 -41 -36 0 -12 172 58 -90 40 258 2 -79 -43 -36 53 104 121 285 -34
8163 -34 -19 -95 254 249 -46 -115 -75 -98 58 -70 203 58 -85 -82 -8 41 90 -79 -103 -214 -14 334 -205 -36 -33
8188 -33 38 -172 -166
8191a66
##END NTUPLES=NMR FID
##END=
