##TITLE=1H_Pr Am-Ad
 CDCl3, 8 sc, 
 11.3.2019
##JCAMPDX= 6.0         $$ Bruker NMR JCAMP-DX V2.0
##DATA TYPE= NMR FID
##DATA CLASS= NTUPLES
##ORIGIN= UXNMR, Bruker Analytische Messtechnik GmbH
##OWNER= root
$$ XWIN-NMR		Version 3.5
$$ Mon Mar 11 16:40:51 2019 Russian Standard Time (UT+4h)  she@DPX200
##.OBSERVE FREQUENCY= 200.1314
##.OBSERVE NUCLEUS= ^1H
##.DELAY= (6, 6)
##.ACQUISITION MODE= SIMULTANEOUS
##.ACQUISITION SCHEME= undefined
##.AVERAGES= 8
##.DIGITISER RES= 18
##SPECTROMETER/DATA SYSTEM= spect
##.PULSE SEQUENCE= zg30
##.SOLVENT NAME= CDCl3
##.SHIFT REFERENCE= (INTERNAL, CDCl3, 0, 15.7039)
##AUDIT TRAIL= $$ (NUMBER, WHEN, WHO, WHERE, WHAT)
$$ ##TITLE= Audit trail, XWIN-NMR		Version 3.5
$$ ##JCAMPDX= 5.01
$$ ##ORIGIN= Bruker BioSpin GmbH
$$ ##OWNER= she
$$ F:/spectra/data/she/nmr/H-F/1/audita.txt
$$ ##AUDIT TRAIL=  $$ (NUMBER, WHEN, WHO, WHERE, WHAT)
(   1,<2019-03-11 16:38:19.17 +0400>,<she>,<DPX200>,
      <created by zg, POWCHK disabled, PULCHK disabled
       configuration hash MD5:
       00 E9 B6 7A A2 85 ED C7 34 08 36 98 17 FE 4E 26
       data hash MD5: 16K
       12 95 C0 C0 91 C1 29 2A 0C 84 60 DC 31 E2 89 BE>)
$$ ##END=
$$ 
$$ hash MD5
$$ 12 5B A5 99 CF AB 0D 42 4C 29 C5 78 6B 6B 4E 98
##$RELAX= 
##$RELAX= 
##$RELAX= 
##$RELAX= 
##$RELAX= 
##$RELAX= 
$$ Bruker specific parameters
$$ --------------------------
##$DU= <F:/spectra>
##$EXPNO= 1
##$NAME= <H-F>
##$PROCNO= 1
##$TYPE= <nmr>
##$USER= <she>
##$AMP= (0..31)
100 100 100 100 100 100 100 100 100 100 100 100 100 100 100 100 100 100 
100 100 100 100 100 100 100 100 100 100 100 100 100 100 
##$AQSEQ= 0
##$AQ_mod= 1
##$AUNM= <au_zg>
##$AUTOPOS= <>
##$BF1= 200.13
##$BF2= 200.13
##$BF3= 200.13
##$BF4= 200.13
##$BF5= 200.13
##$BF6= 200.13
##$BF7= 200.13
##$BF8= 200.13
##$BYTORDA= 1
##$CFDGTYP= 0
##$CFRGTYP= 5
##$CHEMSTR= <none>
##$CNST= (0..31)
1 1 145 1 1 1 1 1 1 1 1 1 1 1 1 1 1 1 1 1 1 1 1 1 1 1 1 1 1 1 1 1 
##$CPDPRG= <>
##$CPDPRG1= <>
##$CPDPRG2= <>
##$CPDPRG3= <>
##$CPDPRG4= <mlev>
##$CPDPRG5= <mlev>
##$CPDPRG6= <mlev>
##$CPDPRG7= <mlev>
##$CPDPRG8= <mlev>
##$CPDPRGB= <>
##$CPDPRGT= <>
##$D= (0..31)
0 1.2 0 0 0 0 0 0 0 0 0 0.03 0 0 0 0 0 0 0 0 0 0 0 0 0 0 0 0 0 0 0 0 
##$DATE= 1552307898
##$DBL= (0..7)
120 120 120 120 120 120 120 120 
##$DBP= (0..7)
150 150 150 150 150 150 150 150 
##$DBP07= 0
##$DBPNAM0= <>
##$DBPNAM1= <>
##$DBPNAM2= <>
##$DBPNAM3= <>
##$DBPNAM4= <>
##$DBPNAM5= <>
##$DBPNAM6= <>
##$DBPNAM7= <>
##$DBPOAL= (0..7)
0.5 0.5 0.5 0.5 0.5 0.5 0.5 0.5 
##$DBPOFFS= (0..7)
0 0 0 0 0 0 0 0 
##$DE= 6
##$DECBNUC= <off>
##$DECIM= 24
##$DECNUC= <off>
##$DECSTAT= 4
##$DIGMOD= 1
##$DIGTYP= 9
##$DL= (0..7)
0 120 120 120 120 120 120 120 
##$DP= (0..7)
150 150 150 150 150 150 150 150 
##$DP07= 0
##$DPNAME0= <>
##$DPNAME1= <>
##$DPNAME2= <>
##$DPNAME3= <>
##$DPNAME4= <>
##$DPNAME5= <>
##$DPNAME6= <>
##$DPNAME7= <>
##$DPOAL= (0..7)
0.5 0.5 0.5 0.5 0.5 0.5 0.5 0.5 
##$DPOFFS= (0..7)
0 0 0 0 0 0 0 0 
##$DQDMODE= 0
##$DR= 18
##$DS= 0
##$DSLIST= <SSSSSSSSSSSSSSS>
##$DSPFIRM= 0
$$ [...]
##$SUBNAM2= <"">
##$SUBNAM3= <"">
##$SUBNAM4= <"">
##$SUBNAM5= <"">
##$SUBNAM6= <"">
##$SUBNAM7= <"">
##$SUBNAM8= <"">
##$SUBNAM9= <"">
##$SW= 24.9337183474449
##$SWIBOX= (0..15)
0 0 2 0 0 0 0 0 0 0 0 0 0 0 0 0 
##$SW_h= 4990.01996007984
##$TD= 16384
##$TD0= 1
##$TE= 0
##$TE2= 300
##$TE3= 300
##$TEG= 300
##$TL= (0..7)
0 120 120 120 120 120 120 120 
##$TP= (0..7)
150 150 150 150 150 150 150 150 
##$TP07= 0
##$TPNAME0= <>
##$TPNAME1= <>
##$TPNAME2= <>
##$TPNAME3= <>
##$TPNAME4= <>
##$TPNAME5= <>
##$TPNAME6= <>
##$TPNAME7= <>
##$TPOAL= (0..7)
0.5 0.5 0.5 0.5 0.5 0.5 0.5 0.5 
##$TPOFFS= (0..7)
0 0 0 0 0 0 0 0 
##$TUNHIN= 0
##$TUNHOUT= 0
##$TUNXOUT= 0
##$USERA1= <user>
##$USERA2= <user>
##$USERA3= <user>
##$USERA4= <user>
##$USERA5= <user>
##$V9= 5
##$VALIST= <valist>
##$VCLIST= <CCCCCCCCCCCCCCC>
##$VD= 0
##$VDLIST= <DDDDDDDDDDDDDDD>
##$VPLIST= <PPPPPPPPPPPPPPP>
##$VTLIST= <TTTTTTTTTTTTTTT>
##$WBST= 1024
##$WBSW= 4
##$XGAIN= (0..3)
0 0 0 0 
##$XL= 0
##$YL= 0
##$YMAX_a= 11239
##$YMIN_a= -14266
##$ZGOPTNS= <>
##$ZL1= 120
##$ZL2= 120
##$ZL3= 120
##$ZL4= 120
##$ABSF1= 10
##$ABSF2= 0
##$ABSG= 5
##$ABSL= 3
##$ALPHA= 0
##$AQORDER= 0
##$ASSFAC= 0
##$ASSFACI= 0
##$ASSFACX= 0
##$ASSWID= 0
##$AUNMP= <proc_1d>
##$AZFE= 0.1
##$AZFW= 0.1
##$BCFW= 1
##$BC_mod= 2
##$BYTORDP= 1
##$COROFFS= 0
##$CY= 11.3945322036743
##$DATMOD= 1
##$DC= 2
##$DFILT= <>
##$DTYPP= 0
##$F1P= 18.9103706918063
##$F2P= -1.10871071338519
##$FCOR= 0.5
##$FTSIZE= 0
##$FT_mod= 4
##$GAMMA= 1
##$GB= 0.15
##$INTBC= 1
##$INTSCL= 1
##$ISEN= 128
##$LB= 0.24
##$LEV0= 0
##$LPBIN= 0
##$MAXI= 10000
##$MC2= 0
##$MEAN= 0
##$ME_mod= 0
##$MI= 1.114404
##$NCOEF= 0
##$NC_proc= 0
##$NLEV= 6
##$NOISF1= 3.799351
##$NOISF2= 2.8
##$NSP= 1
##$NTH_PI= 0
##$NZP= 0
##$OFFSET= 15.70392
##$PC= 1
##$PHC0= -8926.88
##$PHC1= 24.80014
##$PH_mod= 1
##$PKNL= yes
##$PPARMOD= 0
##$PSCAL= 0
##$PSIGN= 0
##$REVERSE= no
##$SF= 200.130013532006
##$SI= 16384
##$SIGF1= 3
##$SIGF2= 2
##$SINO= 400
##$SIOLD= 16384
##$SREGLST= <1H.CDCl3>
##$SSB= 0
##$STSI= 0
##$STSR= 0
##$SW_p= 3612.71676300578
##$SYMM= 0
##$S_DEV= 0
##$TDeff= 0
##$TDoff= 0
##$TI= <>
##$TILT= no
##$TM1= 0
##$TM2= 0
##$TOPLEV= 0
##$USERP1= <user>
##$USERP2= <user>
##$USERP3= <user>
##$USERP4= <user>
##$USERP5= <user>
##$WDW= 1
##$XDIM= 8192
##$YMAX_p= 0
##$YMIN_p= 0
$$ End of Bruker specific parameters
$$ ---------------------------------
##NTUPLES= NMR FID
##VAR_NAME=  TIME,          FID/REAL,        FID/IMAG
##SYMBOL=    X,             R,               I
##VAR_TYPE=  INDEPENDENT,   DEPENDENT,       DEPENDENT
##VAR_FORM=  AFFN,          ASDF,            ASDF
##VAR_DIM=   8192,          8192,            8192
##UNITS=     SECONDS,       ARBITRARY UNITS, ARBITRARY UNITS
##FACTOR=    0.0002004,     1,               1
##FIRST=     0,             0,               0
##LAST=      1.6414764,     0,               0
##MIN=       0,             -14266,          0
##MAX=       1.6414764,     11239,           0
$$ Real data points
##PAGE= N=1
##DATA TABLE= (X++(R..R)), XYDATA
$$ [...]
462h38K20J293o79o67J240R7j567N16J652j087j626J383J342j280m98J380k34
479F47j463N79Q92j128q5J927j38k149K05J627p07j061J213O24j291M8J218p75
497A83j063J275O32j816k92K066R0j708K92J108r71p67J194J99j030P15J075j405
515b23j179J547P08j640n3J787k81j608M75Q89q48j52J157n17j290J104J284j370
533b10r84J483L29j630J88J640l09r87P15J10j419K96J731m99j365J018J059j428
551b62p70J377J87j145N27J010j009n36J453N9j764K93J613p19j256J169J024
568A251j131m81Q19n76q56J295R73j421m88J495j82j766N09J628o60j081Q53M01
586E82r80K95R28j062r49J426P45j529k53J610k14j553M33R98q21l40J263k2j287
$$ y = [-838, -618, 675, -4, -671, 569, 666, -901, -385, 1267, 180, -1446, -63, 1279, -1, -499, 881, 647, -816, -237, 655, -473, -558, 1369, 1231, -918, -713, 914, 207, -854, 359, 983, -308, -260, 958, 183, -880, 395, 1027, -789, -1081, 985, 1075, -633, -341, 767, -204, -971, 223, 422, -608, 107, 1182, -223, -1402, 145, 853, -787, -840, 947, 666, -942, -467, 422, -426, -578, 579, 62, -1228, -124, 1160, -210, -1194, 289, 618, -1012, -824, 816, 507, -480, 235, 345, -1074, -778, 953, 454, -911, 107, 1166, -262, -1032, 345, 532, -613, -86, 924, -85, -621, 832, 891, -873, -580, 1033, 314, -942, 227, 1251, 120, -361, 458, -118, -974, 321, 1294, -127, -615, 880, 698, -1068, -559, 1069, 409, -672, 181, 582, -398, -103, 825, -237, -1186, 240, 985, -544, -797, 813, 599, -954, -521, 477, -344, -684, 579, 557, -730]
605g30M78Q85j191p88J651P56j442l32J067m38p76J013N17j355j42J497k22j216
623g68P70R69j356q49J348N86r36K95P75j051p19J263L48j383K70J569n38j343
641g50P96Q15j146m08J271Rr71N80O72j133l43J442j09j689L66J589m67r71Q25
660C78L13j315o5J232k79p81R93M92j510m31J452N2j214M51R25q48n54J145O9
679E05j319L01J162p34q62J129O55j236k46J070m13j031Q19Q98q46k77J028m40
697A63j344O87J282p87p44J073L29j231L8J097m70p73Q45L41j062K53J417n90
715E24j506O22J058p95m28J121O2j065L89P71r62o53J253M39j124J66J014p08
733A78j031R41P22j016k04J094l32j037P82Q58j067o40J005R6r38O36J093r86
$$ y = [-730, -252, 633, -558, -1346, 305, 1061, -381, -713, 354, -84, -860, 153, 670, -685, -827, 670, 448, -768, 2, 971, -385, -1234, 114, 700, -236, 59, 834, -217, -936, 327, 675, -708, -438, 1131, 593, -750, 46, 861, -285, -693, 578, 587, -384, 196, 868, -265, -608, 834, 725, -964, -598, 991, 524, -447, 378, 691, -624, -689, 543, 264, -517, 476, 968, -542, -973, 479, 531, -683, -232, 693, -155, -709, 436, 505, -814, -513, 649, -85, -947, 182, 837, -399, -645, 425, 12, -1019, -200, 698, -148, -425, 603, 163, -1181, -494, 788, 1, -743, 330, 659, -572, -534, 563, 93, -680, 165, 506, -556, -303, 1114, 524, -982, -360, 698, -97, -525, 596, 658, -407, -18, 753, -209, -862, 391, 830, -294, -128, 886, 178, -853, 88, 810, -206, -410, 684, 352, -685, 97, 955, -112, -752, 253, 349, -589, 47, 1140, 154]
751A54j088Q00M93q01K86R83p39r54R33O33j202l23J238l0j031M56P73q10m16
770f45R63j31j119N57J182p32q85R83M62j147j99R74k49o05R06N19j189m20J077
789C02r8r08O75R05r07o25J018J48j041K75R63o56p57R97N38j007q0R42n36j001
809h53Q22Q84p64l06Q78l14j065N55R31p81n10J119J70j231L0J035m22p37P36
828A77L39r53J00J123m81j087O21P29q89l23J117N8j005K82O61q31n18J079L73
847E72r87R6Q79n80q28P61M64q74M3J078l54j073N90Q25p89m75Q41K2q21N39Q98
868H27p53p35P41J84q98L43J121m39r01N98L85r07l1J116k03r88N28P68p60m33
888d37Q68l3r51M02R04o11n80Q93K04j130K2R90l50p15Q03N57r74l23Q11k38p61
$$ y = [154, -934, -134, 359, -442, -156, 827, 88, -866, 67, 700, -502, -825, 413, 383, -648, -192, 581, -229, -645, 318, 187, -932, -375, 807, 75, -810, 173, 635, -512, -711, 263, 14, -591, 315, 834, -355, -775, 302, 204, -704, -29, 876, -31, -656, 362, 510, -531, -256, 707, 51, -706, 291, 829, -178, -258, 684, 148, -853, -31, 853, 89, -217, 661, 347, -718, -163, 768, -13, -523, 596, 766, -465, -435, 600, 178, -559, 177, 516, -437, -337, 786, 305, -782, -161, 568, -321, -644, 473, 531, -474, -192, 469, -362, -880, 199, 572, -415, -319, 560, -20, -848, -87, 377, -497, -454, 624, 270, -803, -213, 612, -177, -652, 189, 211, -610, -71, 827, 74, -661, 80, 264, -634, -291, 830, 391, -510, 88, 473, -434, -465, 651, 448, -540, -12, 756, -4, -437, 431, 398, -553, -151, 753, 142, -438, 455, 659, -471, -449, 541, 191, -524, 279, 836, -138, -461, 350, 112, -649]
909f49O98P49q52m85R16j4j018L25R51n83p17P95L81q61N1Q29n45q40P42O61p50
930b16j43Q69l00r93M21P71o30k92R82K1j094J61R05m75o17P50L23q24P8R02m39
951A60q07O42N32q81k08J058L0q71L00N98p61m34R37K28q15K73P86o69p67P56
971H7M64p92L7Q73l86q02O19N88q54l31R15l5q60M34P80o34n59O87L2q43L69R70
993G59n12p54O69L10r73r0J020j12p75M90M75p91k62Q71p8q91L93P82o29m76Q24
1014B50J85r59M2Q07m03n35Q00M49r13k28P76k63p04O18P19o99l83P46o3q22L84
1035a96P77n96n29P89L01q57O1P98m22p31O48N15o94k8Q07l12q95M68O24o60k43
1056c75R28O6r68J47P16n19m87P84K80q17L0P60m05o42O35L97q63j45R58p5q20
$$ y = [-649, 49, 798, -54, -539, 377, 363, -655, -330, 621, 38, -679, 116, 497, -364, -313, 516, -29, -869, -127, 534, -216, -359, 510, 210, -783, -362, 409, -221, -513, 469, 490, -604, -443, 462, -13, -630, 120, 443, -381, -303, 599, 160, -647, -5, 527, -354, -562, 496, 526, -345, -45, 553, -208, -642, 295, 523, -292, -19, 767, 98, -669, 87, 551, -241, -204, 669, 283, -519, 100, 688, -166, -497, 418, 383, -477, -43, 737, 103, -456, 231, 263, -580, -211, 759, 247, -507, 162, 472, -501, -591, 429, 317, -458, 32, 507, -284, -546, 325, 247, -644, -251, 531, -98, -574, 250, 435, -524, -482, 325, -78, -613, 187, 636, -277, -505, 271, 8, -696, -78, 641, -58, -441, 305, 242, -580, -196, 581, -15, -544, 245, 546, -311, -250, 548, 126, -605, 43, 558, -136, -164, 643, 331, -564, -96, 528, -132, -375, 553, 619, -349, -202, 514, -5, -492, 292, 572, -245, -215, 545, 140, -502, 133, 530, -333, -478, 480, 405, -415]
1077d15L84N44p42m26Q22J66o91L00O57o86o48P34L47p72Q6Q08l31p18N28M30
1097C77p35j32Q19j67p67M72P10o06m96O74N3p59K81P84m06m91O51J51r15J4R29
1118D41j61o56M86M59p17k59P41n2o73L86N82o55l19Q29J00r02J07P30l79n19
1138d31P11L57p55j26O48l23o33O23N80p06k50P24j44q23L42P14n05l99O88R2
1158C84q01J82P24m63o14O11L67o91j1P98k62p59L37M63n84p4Q38p1q54K18O25
1179C63n24m13P35K47p13L0O43l56m99N65K82p58j6Q63j96o91M20N01o55l40P01
1200A89J00n84K95N87n74m94O42J76p06J79P94l23o63M64L32o39n8P29j70o80
1220d04M31N25n70l05O79n5p57K31P46l52m27N43Q5p93P0P53k39n30N55L39p89
$$ y = [-415, -31, 513, -229, -655, 167, 333, -358, -58, 599, -87, -735, -1, 346, -426, -340, 468, 137, -581, -53, 377, -358, -490, 329, 162, -605, -133, 577, -29, -525, 149, 202, -557, -276, 508, 102, -389, 262, 413, -502, -488, 441, 280, -376, 110, 569, -148, -407, 334, 282, -391, -5, 577, -78, -397, 432, 532, -370, -263, 467, 88, -431, 280, 637, -118, -244, 404, 81, -552, 71, 651, -55, -305, 419, 275, -548, -206, 508, 3, -396, 292, 384, -417, -235, 489, 26, -588, 23, 390, -301, -312, 486, 224, -535, -198, 265, -319, -393, 445, 374, -480, -262, 363, -161, -574, 161, 408, -305, -275, 368, 12, -487, 78, 360, -398, -414, 449, 253, -438, -18, 483, -172, -512, 189, 289, -295, 0, 587, 13, -481, 161, 337, -369, -190, 604, 281, -382, 82, 414, -225, -283, 446, 276, -404, 27, 552, -18, -323, 356, 301, -456, -225, 521, 169, -258, 285, 370, -423, -353, 400, 161, -369, 186, 525, -264]
1241b64k19P47k4o34L02M60n19k10O94o0p86K22O68m46m68O50L20o86p4N85k96
1262c8n26N22M32n85j27O82j77p35L19N82m59k45O74K4p71J53O79l40m63N13K03
1283C17o15R5P23k63o72L66M03n45j14P39k4o38K07L90n54k23P81J52p75N8O53
1304D61k83m81M22K04n84R3O59k96o13M90M51o79l10O57O5n51K62M79m97l63N59
1325A45M4o44K28P02l50n48M53K32o49nP33j68o10L40M34n00k02O06r9o44K92
1346b10O03l97l84N98J19o94oN93j99l44N57K21p33j25O99p8o10L35M75m48k24
1367b52N45m5o02K89N24m84l98O66K66o24n5N00k70m45M95L40n43q3N99j70o52
1388c99L07M51m38j77O41k9p08J50N85l57m09N13K03n76O1N58k94m75M45K65o38
$$ y = [-264, -483, 264, 240, -394, -92, 368, -151, -361, 333, 273, -513, -291, 377, -69, -537, 113, 433, -253, -327, 258, -38, -564, -42, 390, -195, -322, 360, 183, -552, -233, 349, -110, -355, 319, 343, -428, -275, 404, 64, -399, 114, 317, -298, -203, 520, 257, -415, -49, 354, -191, -305, 434, 410, -228, -21, 369, -185, -408, 373, 525, -250, -192, 461, 178, -303, 119, 323, -261, -168, 491, 195, -418, 72, 523, -156, -466, 191, 256, -295, -33, 446, -51, -414, 145, 189, -455, -227, 475, 125, -423, 30, 262, -387, -392, 341, 173, -437, -97, 337, -163, -365, 241, 142, -502, -210, 393, -4, -388, 210, 329, -365, -371, 222, 23, -321, 236, 457, -276, -401, 298, 220, -390, -55, 420, -28, -252, 293, 248, -354, -65, 459, -25, -423, 243, 509, -115, -170, 330, 60, -385, 110, 450, -93, -176, 423, 253, -399, -92, 359, -79, -256, 385, 356, -352, -202, 383, 26, -383, 130, 333, -243, -182, 376, 82, -393, 52, 317, -321]
1409c21r7P35J2n97J77L24m92j79O66P0o31J59N55m11m54N03K63n41pN57k21m39
1431c69M14L01n96j78O55l2n38K93M78m31l47M76N9n26J95N74k81m10M26J43o25
1452c19K9O87j41n44L19L80m81j64N09n5n29K87M33m37k40N94N9o57j1N57j90
1473H6l14M52J76n87o2N39j95m99M15M53m95k70M97k1n07K15M33m07k90N43J36
1494B98n82O9N18l13m62M38L18m68j9N04k25n36L20L68m13j14N75m2o04J77M92
1515B99l57l32M91J90n24O0M87k37l97L98K08n26m9O11n5n03K55L39m84k29N52
1536A97J04m65J88L91m01l56M83K02n18O1N02k43m34L65K80m84j07M87r7m49L36
1557D2M00m72k63M53J7n11J74N02k57l40L70R8n44O3N54k04m39L90K77m90j51
$$ y = [-321, -418, 317, 329, -268, -91, 233, -259, -438, 228, 298, -333, -174, 381, -30, -484, 19, 282, -259, -266, 291, 70, -369, 45, 346, -250, -428, 227, 195, -343, -50, 428, -3, -350, 126, 185, -341, -146, 428, 147, -263, 163, 306, -319, -290, 397, 256, -288, 31, 411, -70, -234, 275, 220, -309, -22, 411, -26, -266, 328, 387, -270, -281, 276, 86, -228, 224, 400, -187, -249, 290, 95, -404, 11, 464, -31, -301, 196, 175, -332, -117, 316, -91, -381, 162, 298, -284, -215, 303, -10, -472, -34, 284, -184, -203, 301, 76, -460, -140, 228, -185, -299, 276, 234, -370, -193, 299, -58, -390, 101, 291, -233, -173, 314, 77, -320, 78, 286, -240, -289, 322, 267, -236, 19, 358, -126, -355, 197, 301, -164, 24, 415, 14, -342, 141, 343, -175, -114, 388, 145, -289, 76, 356, -128, -235, 252, 155, -294, 42, 442, -30, -293, 160, 177, -334, -160, 342, 85, -255, 115, 213, -331, -268, 286, 82, -357, 33, 310, -180, -331]
1578c31M88l5m44K29L41l87j59N08Mn67J18M79k86l11M67K11m84q2M15j87l37
1599c50L94K98m47j34M85p9m90K22M29l49k41M51Q1m70J36M09l07l72M16K34m40
1620a24J0M79j72m79K45K95l55p4M93n2n15J78L72l53k42M72J25m81M4M29k18
1641G7l50L53J55m30j5M78j13m16K85K70m65j84M73Q0m24J79L72l77k97M05J11
1662A67m36J22M35k45l75L55K18m40o8M48r8l90K86L24l78j98M33l4m64J94M63
1683C19k61k90L57R1m79N5M49j71k94L48J92m64r1M69p2m11K20L42l15j75M04
1704B23Qm27J17L54k99k39M43J89m66m8L78j67l59L40K71l52j00L81j42l94K39
1725e0L51l46k15M21M3m32J08L64k64k87L33J56l79L7M26j80m20K49K62l50n7
$$ y = [-331, 157, 122, -322, -93, 248, -139, -298, 210, 214, -353, -235, 244, -42, -353, 114, 325, -159, -241, 174, -13, -350, 44, 342, -105, -239, 246, 167, -323, -101, 328, -21, -262, 189, 270, -200, -64, 345, 38, -334, 82, 316, -124, -114, 365, 193, -286, -41, 254, -101, -175, 318, 266, -249, -71, 301, -52, -294, 178, 303, -178, -134, 295, 77, -273, 80, 235, -195, -210, 268, 155, -261, 24, 294, -171, -355, 118, 198, -226, -47, 325, -52, -349, 56, 167, -269, -147, 288, 43, -332, 23, 241, -199, -267, 181, 83, -307, -21, 303, -75, -273, 160, 126, -338, -144, 319, 58, -232, 125, 216, -263, -208, 241, 70, -224, 124, 316, -148, -239, 230, 158, -253, -33, 309, -6, -181, 223, 231, -196, -79, 275, -24, -263, 180, 369, -97, -145, 233, 66, -293, 47, 318, -34, -134, 247, 105, -289, -50, 301, -45, -260, 161, 204, -228, -120, 244, -20, -307, 26, 182, -197, -160, 266, 86, -334, -85, 177, -173, -230]
1746b30M30l9m17J63K73l23j66M21Q7m23P9L83k35k97L29J63l91JM07j14l25K68
1768D4K27m09j36M27K4l56J84L18l00k60L21R4l31R5L81k30l00K97J76l94k3L88
1790B37r1l62K38K68l09j57L47k3l92J57L65k36k09L19N3m28K3L79j29k56K85
1811G9J60l97p3L84r3l36K31K89l26j64L73J4l76R8L01k44j91L67J04l72J8L35
1833A81j82l23L01K54l04o6L13q8l70K34K71k75j45L68K0l86J00L27k06k58L06
1854G2J25l18L1L52j41l36K20K00l27n0L98k8l38J17K38k90j56L80O0l34P9L03
1876B57k32k56L08J26l23j7L45j23k67K20J91l26j00L30l5l03K06K59k88k11K80
1897D1N6l04R2L29j82k40K54R0l37RL69j20l05K27K20k95r6L10l0l37J53K88k15
$$ y = [-230, 200, 161, -256, -93, 180, -143, -309, 112, 199, -224, -145, 238, 3, -294, 35, 198, -193, -192, 215, 101, -224, 44, 271, -138, -274, 153, 177, -179, 5, 323, 23, -237, 84, 178, -153, -58, 323, 93, -207, 90, 266, -128, -151, 237, 146, -216, 22, 290, -19, -176, 171, 148, -244, -87, 278, 42, -167, 152, 205, -223, -200, 179, 50, -206, 79, 239, -158, -231, 153, 60, -276, -45, 244, -82, -246, 127, 141, -235, -137, 164, -80, -271, 96, 200, -172, -154, 181, -1, -324, -23, 231, -73, -139, 174, 86, -284, -50, 221, -54, -199, 169, 189, -197, -97, 230, 24, -234, 72, 197, -121, -90, 262, 121, -215, 5, 205, -122, -172, 226, 198, -140, -23, 215, -75, -231, 149, 209, -125, -46, 257, 25, -231, 77, 203, -120, -137, 208, 85, -182, 38, 229, -97, -197, 133, 98, -205, 1, 260, -28, -239, 41, 97, -207, -115, 214, 32, -208, 46, 136, -201, -192, 177, 57, -248, -21, 199, -96, -192, 118, 88, -249, -96, 192, -23]
1920b3j69L16K4l60L1L27j43j86K70J24l48l8L12o4k81K20K03k56j10L18k4l24
1942a81J20K83k21j94L10Q6k90K5K80j96k53K70K08k83m4K97q1l18J48K21k26
1963c9p9L01l4l24J10K74k04k05K65R2k98L2L06j50k53K14J32k84l5L36m4k87
1985a74J32J80k72j20L32L7k80Q8K45j97k05K51J10l03M2K97j36k44K30J71k83
2006i9p4K94n7k30J80K13k47j56K70K3k81R4K90j33k11K17N9k91L1L18j14k56
2028a60K10J64k58o7K78o9k48J34K08j96j12K58L6l15L0K64j51j63K60J00l07
2049a04m3K65q4k39K03J79k34q4K49l1k69J28K20k11j55K65P3k63M7K04j54j75
2071b13K20J30k35j5K81j18k56J40J80j90n4K71k7k89J12K20j94j40K42P3k51
$$ y = [-23, -192, 124, 148, -212, -181, 146, 3, -183, 87, 211, -137, -175, 137, 73, -208, 12, 215, -41, -151, 167, 143, -181, -61, 222, 1, -193, 117, 203, -87, -62, 218, 22, -231, 39, 247, -36, -80, 217, 136, -182, -34, 187, -39, -118, 183, 149, -175, -65, 209, 5, -200, 65, 157, -141, -109, 197, 47, -206, 8, 140, -144, -179, 157, 113, -174, -42, 138, -134, -254, 78, 115, -165, -77, 168, -29, -234, 17, 127, -176, -134, 163, 27, -217, 13, 184, -99, -173, 121, 64, -166, 14, 227, -20, -176, 94, 117, -164, -70, 220, 87, -124, 93, 152, -139, -108, 210, 96, -160, 50, 214, -44, -111, 167, 98, -150, -16, 192, -4, -116, 142, 178, -137, -107, 157, 6, -157, 103, 203, -104, -147, 118, 34, -205, -2, 177, -57, -141, 108, 77, -192, -64, 156, -55, -210, 55, 128, -135, -88, 116, -38, -213, 7, 137, -98, -113, 168, 50, -206, -66, 114, -76, -130, 141, 114, -175, -63, 157, -37, -177, 65, 138, -113]
2092a13K4K69j38k11K14Q8k43j5K87l7k33J41J35k37r2K85J5k50J02J90j58j87
2114a64K20Q3k46L5K49j16j98J76J47k56o2K48n9k07J44J91k27j03K32pk53J07
2136f6K40j30j72J77O0k57L4K41j06j82J81J30k51m8K26k1k27J18J74j74r8K47
2158I6J4k66L6K18j13j51K29P7k49%K20j13j83J68J85k12o6K15m6k07J09J97j80
2181b2j10K36K7k29N3K09j47j77J87J09j99J6K26j01k28J41J55j92m0K30j6k27
2203i9Q3J73j91j02K31N0k41L6K03j05j80J72Q9k11k1K27l7j95J24J16k02q1K13
2226E2J2j94R0J75j73j54K05N8k03M2K09j16j63J72R3k10j6K12n4j84J31J69j86
2249c3p9J86j9k10R1K10j30j19J78M4k30RK39r4j44J67Q8k10l7K14n1j74J13J53
$$ y = [-113, -89, 180, 42, -169, 45, 133, -110, -125, 162, 125, -108, 33, 168, -69, -161, 124, 139, -111, -9, 181, 23, -164, 56, 139, -107, -72, 177, 61, -137, 39, 186, -70, -132, 116, 57, -150, -6, 185, -42, -145, 87, 80, -173, -66, 174, 44, -128, 49, 109, -148, -114, 127, 21, -161, 20, 150, -101, -149, 77, 56, -171, -53, 121, -53, -151, 96, 110, -156, -120, 98, -15, -166, 63, 140, -109, -109, 111, -2, -185, -17, 168, -44, -110, 105, 59, -148, -39, 158, -22, -132, 104, 131, -98, -45, 164, 17, -160, 27, 136, -63, -47, 179, 78, -150, -9, 146, -46, -86, 144, 128, -99, -16, 157, -34, -136, 95, 145, -96, -60, 143, 38, -142, 30, 119, -92, -113, 114, 77, -118, 6, 122, -80, -161, 52, 64, -130, -40, 135, -38, -192, 13, 71, -132, -90, 119, 3, -160, 12, 105, -105, -121, 91, 37, -147, -16, 153, -33, -112, 74, 55, -155, -64, 146, 16, -103, 75, 119, -111, -102, 137, 43, -101, 66, 154, -56, -93, 121, 70, -104, 9, 162]
2273A62j72q3K17Jk19M4J78j31j23K02P6k27J0J72r5j65J61J30j75n5J89m1k09
2296a53R8J73j56q4J91J7k13P0J77j39j55J88Q0j96K0J91n0j98J11J08j66k2K16
2319A08j0k09O3J43j45j00K03M9k17O3J72j23j21J63O8j96j2K10m8j56J21J04
2341A30j89n2J88Jj75R0J63j46j33J62N9j92M4J93j01j32J37P9j92j2J82m6j87
2364a29J38J30j47q5J73j1j92P8J69j08j11J65L6k04J3J72n6j34J36Q7j95k9J78
2387G4m6j67J09J40j61o4J71Pj75M3J53j22j04J88M5j59jJ49r7j55J51J30j57
2410d8l8J73m3j87R6J45j32o2J66J2j77M8J60j07j33J61N7j80M4J68n5j67J15
2433A6R2j69k2K01j3j77P1J17j36q2J78N1j92L9J56j13j30J49P0j71lJ61m7j42
$$ y = [162, -10, -93, 124, 125, -94, -50, 128, -3, -126, 76, 152, -75, -65, 107, 12, -153, 8, 138, -37, -92, 97, 56, -153, -55, 118, -38, -122, 69, 86, -127, -57, 120, -19, -174, 14, 94, -102, -82, 109, 59, -139, -28, 80, -86, -108, 108, 98, -111, -48, 95, -50, -150, 53, 102, -115, -52, 120, -3, -124, 39, 107, -89, -101, 109, 61, -95, 26, 130, -59, -111, 77, 78, -97, -7, 156, 10, -123, 39, 98, -94, -50, 143, 42, -90, 47, 126, -66, -78, 104, 58, -129, 9, 139, -8, -93, 80, 69, -123, -45, 124, 16, -95, 70, 106, -98, -85, 87, 31, -103, 33, 120, -75, -104, 74, 28, -139, -30, 110, -51, -115, 56, 63, -112, -69, 84, -38, -142, 46, 91, -68, -69, 80, -17, -172, -21, 109, -48, -86, 87, 44, -143, -47, 98, -34, -96, 70, 82, -95, -47, 113, 6, -127, 34, 91, -89, -45, 123, 68, -99, 16, 108, -61, -83, 118, 105, -72, -1, 116, -20, -102, 76, 127, -65, -26, 130, 17, -113, 36, 106, -65, -68, 93, 46, -96]
2457i6J08R6j50p7J64j2j36P3J52j36j27J42K9j47L2J77q3j40J39P1j59j2J62
2480G0m4j54J00J17j45n8J64pj62O7J40r6q2J52K9j74mJ75p7j07J59P7j83l7J58
2505G8l3j40J12J19j40o0J50Nj60N4J32j15r7J53N7j62K4J17o2j40J10J07j39
2528c0l2J58m0j84R2J18j12p0J78Kj70M5J31j11j02J47N8j55mJ66o7j33R6Q6j53
2553h6j6J69j0j45P1J08j36q0J59L6j51M5J37j06j11J29O6j40j2J43l2j28J10
2576B0R2j44n6J48j9j31Q8J16j22p6J25K9j61N0J45p4j06J13L9j46nJ70m7j37
2600h9J07R0j35m0J48k0j50N8J30j17m8J34J6j67OJ54o5j10J35N5j47k6J48n8
2624Ij26J00J17j41n0J44qj54P0J27j18q1J41M4j44K2J28p9j22J10Q6j29k1J45
$$ y = [-96, 12, 108, -42, -119, 45, 33, -103, -30, 122, -14, -141, 1, 30, -117, -85, 92, 9, -131, 8, 79, -80, -92, 70, 26, -128, -28, 89, -56, -114, 50, 43, -119, -52, 88, -8, -90, 62, 91, -83, -87, 88, 11, -96, 63, 140, -43, -80, 78, 45, -95, 17, 136, -4, -64, 86, 91, -69, -15, 117, 2, -95, 58, 115, -47, -23, 94, 32, -108, 2, 109, -30, -62, 96, 56, -128, -36, 82, -30, -100, 78, 80, -90, -45, 86, -25, -127, 20, 78, -77, -81, 85, 18, -115, -19, 67, -86, -102, 67, 57, -88, -17, 91, -45, -125, 34, 70, -81, -36, 101, -5, -116, 13, 79, -61, -73, 70, 38, -90, 20, 112, -32, -88, 60, 41, -90, -2, 114, -8, -84, 41, 70, -91, -41, 104, 30, -76, 37, 76, -70, -75, 95, 48, -89, 18, 108, -27, -67, 81, 61, -89, -31, 99, -18, -66, 68, 84, -83, -77, 77, 12, -98, 37, 92, -55, -81, 67, 9, -117, -17, 100, -41, -91, 53, 45, -109, -39, 88, -30, -111, 30, 74, -70, -48, 80, 1, -121, -11, 75, -54, -75, 70]
2648G0m6j36P4J03j03m9J40J6j57M9J25r6q8J26N3j39RJ40n7j15Q7Q5j47j4J59
2673H9k6j11O5R4j23p7J43L7j42L9J32j06j08J30M9j36J6J40n8j25R5Q3j37m2
2697g9J36k3j33P3J35j11q4J15Lj42M6J45q4q6R5L4j24pJ47m6j10R8O0j14m4J42
2723D2oj50O4J09q8o5J47J0j44J7J31p8q2J31P2j41j9J24n6j10J02J07j18n8J24
2748F5rj42O9J26j12q0J44K6j41M1J13p8j17J18O4j28j4J54m5j41P4Q8j10k6J36
2773G5j6j21M7R1r5q3J34L3j28NJ37p4j09J05O3j33k7J37kj25O6J00j21n8J26
2798B7J5j18N0J11r3j01J08O3j34K7J19l8j16Q2Q6j19m5J30k4j17P7Q9r4o9J30
2823D6jj44N0J34o6r7J13L7j31lJ31m7q5Q6R8j38o3J38qj14M7R5q6n0J16J6j35
$$ y = [70, 24, -112, -38, 65, -38, -87, 53, 69, -88, -39, 86, -10, -98, 28, 81, -58, -49, 91, 34, -81, 6, 91, -56, -70, 89, 63, -48, 17, 111, -12, -89, 54, 91, -51, -12, 120, 14, -94, 36, 85, -51, -35, 105, 47, -78, 17, 100, -37, -79, 57, 34, -99, -26, 109, -2, -86, 29, 32, -110, -64, 81, -3, -89, 6, 40, -84, -91, 56, 10, -100, -2, 58, -56, -100, 42, 36, -114, -50, 59, -29, -94, 53, 63, -81, -64, 67, -11, -93, 38, 110, -31, -50, 74, 18, -92, 10, 117, -1, -59, 65, 56, -86, -17, 109, -3, -83, 61, 87, -54, -13, 100, 22, -95, 23, 87, -41, -55, 99, 54, -87, -13, 75, -35, -61, 75, 59, -62, -15, 76, -19, -102, 32, 65, -63, -58, 79, 5, -104, 1, 64, -69, -96, 41, 39, -86, -20, 80, -41, -99, 27, 42, -76, -26, 85, -8, -109, -1, 62, -72, -45, 74, 36, -80, 2, 88, -31, -76, 54, 30, -87, -10, 79, -15, -84, 46, 45, -99, -49, 85, 19, -78, 35, 72, -59, -62, 69, 22, -63, 23, 121, -17, -80, 58, 50, -64, -17, 78, -8, -58, 58, 74, -61]
2850f1K5J14o9r4J26M5j07l1J24n8j10Q4R6j01m9J21rj28M2J29r6p1J11K6j28
2875f9K1J24p3r7R4N7j05nJ16m0j24Q0O9r9l0J24Pj15L1R5q5o0J05L3j10MJ22
2902G0o3j00J07N6j22j2J33l0j05P7P2r2o6J19Rj00L7J09r1q1J11K8j20J6J21
2927H3n1r3Q7O1j23j9J17j5j04N1Q6q2o1R7J7j24L3J00o2p7J05L6j30j7J28m2
2953Aq4P3P2j02m6J11lj08N2Q7o7p6J07K6j15J5J07o0p9J12N2j11pJ06m7j05P2
2980a7R7q6m8J29j7j32N0R6p8o2J11M0j33J8J06m5r7Q1N6j04j5J16j8j11N4Q4
3006G5r7m0J24kj17M2R4j03n8J04N2j20JJ05m6j05R5M6r2k2J16j9j10O1Q8r7o0
3033h5J13J2j12M9R4p6p4R3K3j07J8J07m2r4P2O6r4k7J11rj04M6Q2p9m6R8Rj23
$$ y = [-61, -36, 78, 9, -85, 41, 86, -21, -52, 72, 14, -96, -12, 84, -17, -66, 55, 46, -82, -40, 89, -7, -78, 33, 59, -69, -48, 76, 3, -94, 0, 57, -48, -53, 63, 23, -101, -21, 48, -51, -81, 43, 50, -65, -34, 61, -24, -84, 21, 54, -56, -52, 70, 7, -93, 14, 70, -52, -64, 69, 39, -66, 11, 83, -9, -75, 44, 53, -47, -10, 99, 8, -73, 38, 66, -54, -38, 83, 32, -61, 26, 87, -36, -55, 62, 47, -57, -6, 80, -2, -63, 34, 51, -73, -40, 60, -2, -79, 26, 62, -68, -85, 43, 1, -83, -10, 62, -40, -86, 25, 22, -86, -34, 53, -14, -90, 17, 43, -72, -57, 50, -10, -89, 23, 75, -36, -43, 63, 16, -89, -17, 80, -6, -54, 75, 58, -74, -24, 72, -6, -68, 43, 83, -50, -32, 74, 29, -68, 13, 69, -35, -50, 66, 48, -63, -9, 75, -22, -62, 62, 60, -57, -15, 79, -24, -82, 22, 74, -46, -45, 60, 14, -91, 4, 50, -42, -64, 52, 33, -77, -16, 72, -25, -85, 28, 40, -72, -23, 71, -5, -79, 14, 37, -70, -52, 55, 13, -81, -9, 57, -37, -64, 47, 38, -66, -20, 62, -17, -63, 35, 44, -79]
3061g9L8R5o8o4J01M7j37jJ19k4j02Q3P0r4m6J08j2r7N3Q2q2o0J10J6j13K7R5
3088F5o6q7J17M2j11j2J12l0j11Q2O9q3k6R4J3j47N6R2p6n3R2J9r8KJ11o3p8Q3
3116HN2j00k0J02k2j01O0N5q2l1J12lj12N2Q1o8o8Q8M6j07OJ16n7p6O5P4j10j7
3144e7J18l5r2N5P7p7m8J04%r1L2J08p4p2R5J8j07J7J03l9q0O8L9q5j5J03j8r3
3172d6N3P2p4o1J10j1r8J7J10p7o2R1L9j19PR1m9p2O9P1r9l4J03lj03M6J03q6
3200a2l9P6K1j09K3Q9l8q2P2N9r9J1P7k0j05O9P6q9l1J02lj00L2Q0o9m8J02J6
3228F1r1kR9n4p4Q6L6q1l3J12j2j02N9O4p7l2R3J0r4K3Q8n9q5Q4L5r6K1R7n9r2
3258g5P7N8r4pP6pq4M7O2p4l7Q9jj02M1Q3m9n9P2K6q5LJ09m7p9O1N5q5l4Q6j0
$$ y = [-79, -41, 54, -14, -78, 23, 70, -67, -68, 51, 27, -75, 8, 78, -16, -62, 46, 34, -63, -10, 72, -10, -70, 40, 56, -57, -30, 65, -1, -88, 29, 71, -40, -52, 60, 30, -81, 1, 70, -13, -39, 55, 68, -79, -23, 69, -7, -60, 32, 51, -47, -45, 66, 3, -75, 8, 60, -40, -60, 42, 20, -81, -21, 34, -48, -79, 33, 30, -82, -30, 51, -17, -85, 3, 49, -58, -52, 64, 7, -69, -4, 70, -40, -57, 61, 26, -66, -11, 66, -11, -59, 45, 45, -46, -14, 94, 20, -52, 43, 61, -46, -29, 74, 35, -45, 23, 62, -23, -38, 65, 47, -46, 7, 79, 5, -56, 54, 43, -55, -38, 72, -5, -67, 24, 63, -56, -49, 42, -7, -79, -10, 61, -38, -72, 31, 28, -75, -29, 74, -12, -51, 25, 46, -63, -40, 49, 11, -71, 1, 60, -39, -28, 49, 29, -76, -7, 69, -20, -51, 51, 48, -52, -20, 60, -9, -57, 45, 61, -30, -32, 67, 13, -61, 25, 61, -20, -53, 59, 47, -55, 4, 68, -9, -41, 52, 62, -32, -9, 79, 20, -65, 19, 54, -42, -21, 76, 17, -75, 2, 60, -34, -41, 35, 28, -56, -9, 53, -21, -58, 31, 30, -72, -31, 52, 3, -56, 16, 42, -43, -40, 69, 22, -57, 4, 59, -26, -60, 26, 16]
3289A6o8L8P7p5m6R6J5r7J1P2n1l8O1M1r1mR1m0p1N6P2q2l0Q9j7q6N9P3r7k4P1
3320B1J0p9L3P0o0m4O5N0r9RQ6m0p6O4M6p0j0Q2lr5K3Q2p0m8R4K1j06K6P2m3p0
3351e9Q2M3j09JQ7j9q9O6M2p4k9P8Mq6K9P3n8o9R1K9p9J6Q7n5p4P4L3o7j0Q1k3
3382A6p3N5N1p5l0R2op9K9Q4n6n5Q3K0r4KR8j7q5O8M5q7j2P7k0o0N2N4o6m1P0
3413D0Nq5L0O6m5o4Q1K9r4NP7m4o3N2N2n8k5P9j9r5N8O8o5l0O6Op4nR6n2n4O3
3445AM4q6qR4k0q6O7L9p4qQ3j0q9K9O3m7m6Q4K8j00K4Q7n7o4Q9K6p9mQ4k9p8N8
3477A5L9o0l1Q8j1p6L0O4m4p7P9L4p7K1O8m3p4O1N0q4qQ8k5p5M9M9o9l2R0jq0
3508d2J1Q7o3m7P7J8q6QQ8l3o0N9L6q6%O1j2o2M4O6q7k6P2K6q8K0O8o1m0P7K4
$$ y = [16, -52, -14, 63, -12, -58, 38, 53, -44, -33, 39, -12, -50, 11, 52, -39, -43, 48, 8, -63, -7, 65, -17, -47, 42, 25, -61, -2, 71, -26, -50, 21, 31, -48, -15, 55, -5, -49, 16, 66, -33, -24, 62, 22, -54, 10, 56, -14, -24, 58, 55, -40, -17, 65, -5, -53, 41, 62, -44, -18, 54, 11, -59, 23, 66, -43, -42, 45, 26, -63, 3, 45, -29, -58, 20, 24, -62, -33, 40, -18, -87, 4, 33, -46, -30, 57, 2, -72, 2, 35, -32, -42, 39, 16, -57, -2, 49, -26, -56, 36, 30, -49, -20, 64, 8, -47, 36, 56, -38, -36, 62, 45, -40, 28, 73, -14, -26, 51, 31, -29, 23, 77, 11, -30, 40, 45, -40, -10, 56, 11, -53, 28, 57, -37, -32, 45, 1, -62, -10, 42, -16, -41, 38, 19, -76, -18, 50, -15, -45, 21, 27, -47, -52, 44, -8, -62, 1, 45, -41, -49, 45, 25, -61, 6, 45, -29, -37, 46, 36, -53, -24, 39, -8, -54, 30, 58, -42, -18, 69, 12, -52, 37, 63, -16, -20, 64, 35, -43, 15, 54, -6, -37, 51, 40, -36, -6, 58, 14, -63, 16, 50, -27, -6, 62, 19, -55, 6, 56, -28, -36, 52, 27, -48, 1, 50, -19, -51, 39, 38, -42, -31, 56, -7, -54, 23, 41, -45, -37, 51, 18, -42, 17, 53, -33, -33, 28, 16, -46, -2, 64, -23, -49, 23, 49, -39, -19, 49, -12, -52, 25, 49]
3539D9p9mO7j8p7O5N1n9k5P1j9p7M4O7o4k9O7J4q1K0O5m1l8N5L3q8MO9j8p3O0
3570A1M5o1k6Q9j1o6K8M2p9rQ8po9J4O8n1o8Q4L4p7NO3k8o7N0M0o0k2O8K0p7K0
3602iN9n9m5P2K1q8K6P9m6o4N3J7n4lP0j8o6M6M6o1l2P9j1p0K8P0m9l9P7J1r0
3633e0K6Q3m5n6P2L2o6k7P1Jp9M1O7o4l9O7Nq0L9O3l7n4P0J4q0nP6l4p0N1O1p5
3665b2lO1oq5M2N1n6k0Q3j9r3L1O7l1m9O5K9p8JO7l2n7L8N3o1k1P3j3p1N1L7m4
3697a2l3O4K5p2PP4o3l4N1M7p7lQ5l6n5M1N0o3j8O0mo9K1P6o7l2N7J7p1JQ1l5
3729A3n8O1M1r3J5O7k6n8N0M1o3k5P9j6o8K6P0o2l6O5K0p4LN9j8n2M6M9q1jO3
3760C7l5l5L4L4m4k2N9Oo9K2O8o1m3Q0Oo7J0O4l8m7M7M1p3j4P5l3n9M8N0n8l3
$$ y = [49, -30, -34, 33, 15, -62, 3, 54, -5, -30, 41, 22, -55, -11, 56, -8, -37, 30, 44, -37, -17, 48, 7, -31, 24, 57, -31, -27, 42, 24, -49, 11, 56, -5, -31, 58, 47, -19, 9, 51, -28, -37, 51, 44, -25, -11, 57, 6, -62, 22, 56, -21, -16, 47, 19, -48, 2, 42, -18, -40, 28, 48, -29, -9, 50, -9, -54, 18, 39, -49, -23, 56, 10, -54, -1, 16, -38, -41, 29, 11, -55, -9, 37, -24, -56, 23, 12, -58, -30, 40, -9, -48, 29, 40, -50, -24, 59, 14, -42, 30, 62, -4, -31, 40, 41, -38, 3, 70, 6, -33, 34, 39, -41, -2, 61, 24, -30, 40, 54, -26, -31, 45, 11, -59, -8, 53, -22, -25, 36, 30, -55, -13, 38, -18, -38, 45, 26, -67, -36, 31, 0, -49, 16, 45, -33, -32, 35, 3, -54, -16, 37, -24, -45, 28, 15, -56, -5, 32, -12, -45, 19, 44, -28, -21, 53, -10, -44, 7, 54, -23, -26, 59, 23, -32, 9, 59, -4, -22, 38, 34, -35, -14, 62, -5, -37, 20, 37, -34, -33, 48, 13, -45, 16, 57, -36, -21, 46, 20, -38, 12, 53, -10, -35, 44, 28, -40, -14, 56, -6, -42, 23, 43, -31, -28, 31, 13, -39, 7, 56, -25, -26, 37, 2, -33, 1, 35, -9, -31, 28, 34, -35, -13, 55, -6, -49, 31, 37, -30, -20, 44, 6, -41, 6, 47, -26, -40, 35, 2, -57, -9, 41, -17, -50]
3791e0O4J5p5L4N4n2m4N8L9p8PP5l6n8M7M6o9j3P7j8n5L5O0p5l4P3J2o4K0N6l2
3822A9o2M9L6n9mO4k3o0M9M1p0j2O9np5L6O6n8n1P6Lp0J6N8l3n5N9K2p9J2O5q
3854A6o4M0L8o7k0P8j1o6K9N8n6m0P8J4o8QP0k4n6N7L7o5j0N2ro6N2N4o4j1N8
3885D2no6K6O0n7k8O5Jo5J6P2m2n9N6L8o9j2P3k0o3L0M7l4l8N1J4o8J2M2k7m3
3916e1O6K2o9J2L7k0n2M6M5o2j9O3Jp4M6N1n9l1O1On8K1P2m2n3M4L6o6K0O0l7
3947A6m8K4N1n8mN8jp3M6M3m8m0O0J1o5K3N3l3o2Q7mn9oO4j6n1N6K2o0j0N3Qo8
3980c1L8N3o2l4O4ko0J1O7l4n7N5L5o2nO8j8o2L6O1p4j7O7j5p1L6O0n1k8N8J1
4011C7o2mO4k7m3L5M0p0j0O9j3o4L5N1n8k9P1J2o8J9M9l5m5N7J8m6j3P8k6p8P7
$$ y = [-50, 14, 29, -46, -12, 42, -10, -54, 4, 43, -35, -28, 47, 11, -47, 0, 46, -23, -36, 41, 23, -32, 3, 63, -12, -46, 27, 39, -25, -5, 51, 19, -43, 6, 42, -17, -21, 43, 20, -40, 9, 50, -20, -32, 37, 32, -43, -7, 59, 1, -50, 26, 29, -41, -25, 33, 0, -55, 4, 26, -53, -41, 24, 16, -48, -8, 30, -37, -57, 21, 10, -56, -27, 31, -25, -65, 13, 27, -41, -33, 37, 13, -43, 14, 51, -14, -24, 28, 19, -47, 5, 59, -5, -16, 42, 37, -29, -3, 57, 0, -28, 37, 38, -27, -11, 61, 19, -40, 16, 54, -15, -27, 46, 26, -37, -7, 40, 6, -32, 19, 33, -35, -23, 19, -8, -51, 15, 37, -32, -20, 17, -3, -55, -9, 36, -26, -45, 18, 19, -55, -9, 42, -17, -48, 13, 19, -39, -18, 54, 12, -41, 3, 39, -27, -7, 53, 16, -32, -8, 43, -15, -19, 39, 38, -35, 11, 54, 6, -34, 26, 37, -28, -5, 48, 15, -47, 40, 36, -23, -29, 35, 19, -32, 24, 46, -14, -24, 29, 37, -31, 7, 60, -2, -36, 28, 26, -34, -23, 44, 10, -47, 8, 43, -19, -24, 44, 26, -36, 0, 61, -13, -30, 37, 22, -49, -13, 47, -4, -32, 26, 37, -25, -29, 35, 8, -35, 0, 40, -30, -40, 29, 16, -48, -13, 38, -20, -49, 22, 34, -34, -15, 34, -1, -46, 11, 29, -17, -30, 48, 22, -56, 21]
4042B1K4n8oN7k1n5L6M9n5k7O8J3p4K9N8n0m2N5J4n1kP2k4o3M0M0o6pO7j4m6J1
4074gN4n6k1N3J5q6K7O8n8j8L5J8o0lO8m1k2L0L0n1j9O6j5o4L8O8o2l3N5km9K
4106d0P0k1m3M9K3p3jP5k5n9M1N0n3j6O1j1o5K4O8n5rN7j1o5K2N9m3l4N4K6o8
4137a3oO4ro2L5M1n6k9O5Jo2J8N8o2l5P0J1o8QO7l6n9N4M7q2QN4oo8N1N3o3k1
4170c2N9qo3L6N3m5n5Q1Rn6J0O6m0n2M7L4o3j4P7j9o1M7L4n7k1N7K5p4J7N4m1
4201El8M9K7o5pO6k0m9N1K8o1pN1lo7M3M2n6j0M5Ko6K4M9k8m7O3J9n8k0P2j9n8
4234d3L9N3o4JL6J6p0M4K1l6l5P7ro4J7N7m1m1N8K3n7lN7k2n4L3M5o3kM9Kp5M3
4267hL6l3m9N7K8n9J1O3n3m4N9J7n1jO6k5o0M6L7m8l2O7J0n6J1N6l9m9P1J8p1
$$ y = [21, 45, -13, -19, 38, 17, -38, -2, 47, -8, -35, 33, 46, -28, 1, 59, 9, -33, 22, 36, -15, -17, 55, 31, -32, 8, 48, -18, -25, 42, 28, -18, -7, 47, -9, -30, 23, 38, -48, -21, 47, -11, -29, 6, 24, -36, -39, 29, -12, -34, -4, 26, -25, -44, 22, 7, -57, -19, 49, -13, -46, 9, 7, -42, -40, 30, 9, -34, 15, 38, -35, -36, 39, 14, -45, -4, 46, -7, -23, 38, 27, -38, -14, 54, -1, -10, 47, 36, -29, -7, 52, 9, -25, 29, 55, -13, -19, 45, 36, -26, 9, 50, -6, -35, 30, 31, -31, -13, 45, -17, -52, 18, 29, -39, -31, 36, 0, -59, -5, 42, -40, -32, 22, 16, -52, -1, 52, -11, -32, 27, 19, -44, -8, 45, 0, -55, 26, 35, -21, -11, 55, 15, -37, 10, 44, -19, -33, 44, 25, -36, 11, 45, -12, -33, 24, 49, -25, -8, 46, 5, -33, 16, 43, -22, -29, 37, 17, -32, 19, 47, -14, -21, 30, 27, -40, 3, 45, -11, -21, 24, 26, -40, -16, 33, 5, -42, 21, 40, -18, -38, 34, 15, -43, -4, 49, -15, -14, 22, 38, -32, 12, 33, -3, -38, 39, 30, -34, -17, 40, -1, -42, 16, 39, -18, -21, 36, 14, -40, -7, 38, -25, -27, 22, 24, -51, -8, 28, -5, -54, 3, 31, -28, -17, 46, -7, -51, 8, 25, -26, -27, 39, 14, -46, 0, 37, -11, -43, 24, 34, -22, -11, 45, 6, -43, 28, 46, -25]
4298b5J9N4k2n4N4K8o9NM7Np0L5M9n0k3N0J5o0PM5n6l0N3K8p1J5O1m5m5M8M3o6
4330b5k6P5j4n9N3K9n8k7O3Kn7J2N9m0n5P8K2p3PP5k5n6L5N7o2j3O0j6o4L6M8
4361D1m6l1P1Pp6J4O3l1l5O0J9n3j2O2l8l4K7O1o7j0L8Oo1J7O1o2m7P4J2n4ON1
4393C3k0o3O1K7o1j7Q0l2m9L7K5l5l8Q9k0o4K4N7l6m3O4Kn2ON3j7n5M7K8n1mN9
4425C5l0k7L4K9m7l1P4k4m5L3L7l3k8L9K8o5NO2l6m4M1K4m4k2O9k2n7N4L7n9j3
4456b6N8kp0K0N7k7m4M4J9o9J5O7l5m0M9L9o8j0O5j7n6M0L1m3l1N4J5n7K0M5o5
4487b2j5M2L5p7K1N6k8n3M1M2o0oM8qn6J8N6l9l7N2K3n9MO2m3l1M1K5n0j0N4k0
4519Fl9L3L3n1k5O1Lo5M4M8n0k5N6Km5JN8k0n9N9L0o6J1L5j9m0K4N4o2l3Q5nm6
$$ y = [-25, -6, 48, 26, -28, 26, 54, -15, -10, 37, 42, -28, 7, 56, 6, -17, 33, 48, -12, -5, 40, -16, -46, 7, 35, -36, -21, 40, -5, -50, -2, 41, -25, -51, 24, 10, -49, 4, 33, -25, -52, 11, 13, -44, -32, 27, -13, -68, 10, 32, -41, -34, 41, 16, -40, -5, 52, -10, -23, 37, 21, -43, -7, 41, -5, -36, 35, 42, -34, -20, 43, 12, -23, 37, 56, 3, -9, 53, 15, -19, 8, 69, 2, -8, 30, 36, -25, -8, 53, -9, -56, 18, 30, -24, -18, 33, 13, -50, 11, 38, -23, -40, 40, 8, -41, -4, 21, -14, -52, 37, 17, -47, -23, 34, -2, -45, 19, 21, -31, -25, 28, 11, -44, 3, 31, -20, -24, 35, 5, -22, 12, 41, -6, -37, 37, 13, -32, 1, 38, 5, -23, 16, 44, -21, -16, 46, 10, -34, 7, 31, -13, -35, 34, 12, -45, 9, 46, -13, -26, 32, 30, -40, -20, 37, 10, -34, 10, 29, -40, -25, 42, 7, -33, 16, 55, -13, -23, 42, 25, -31, 9, 40, -3, -34, 20, 35, -22, -2, 43, -22, -37, 5, 40, -37, -16, 40, 12, -41, 0, 42, -18, -24, 24, 16, -40, -22, 34, -5, -42, 10, 33, -26, -22, 40, -3, -34, 7, 32, -18, -28, 26, 6, -33, 0, 33, -18, -43, 18, 21, -44, 0, 48, -2, -27, 29, 31, -14, -13, 45, 25, -34, 25, 55, -11, 0, 35, 16, -24, 0, 54, -8, -41, 44, 39, -7]
4552gJ0L8l8l0N6J9p1JN8k3m8L3L4n8oO9k3o4M0M0l7k5M5Nn2NN6l0m4O0J4n8M
4585b7N2k4m6L5N7p7QO0j2n6K9M4m8k4O2ko3K8N3k3m9M7K7o1jN8l0l6L5L9p1q
4617b4O6mo2K8M5m7k9M0J3n5J9N6m1l9M4M5p8OM2j0m8L5L5o6j3P0j3n2K5L6l5
4648a1k5N6Jn4K4M0k2n0N3K6n5k2O9k3m6M6L1m2k6N1nl1K1M5n6l0O1Pn5J0N0l5
4680Cl5M9J6m8J0L2rn7M0L6m8pM6J2p1K2M6l4l5N4J2n9PO8l9m6N2K0m4qM8j6m4
4713b7K9M0m6k8O2Pp0L6M4l9m0M7L1n4mN5k8l6K5L5n1j2O1qn3L3L4n5j4L1J9n3
4745b9J8M4k9l8K5L7o4J4M3j1n1L3M1o4J9L9j6m4J8M2l3j3M4Kn4J9N2l3k9L3J6
4776C1m5PM0om8L7M2n6k6N4j4m4L2M7m2l8O0Pm4oN7k9m9N9Om0j5N4j0n8K7L5m5
$$ y = [-7, 3, 41, 3, -27, 29, 48, -23, -22, 36, 13, -35, -2, 32, -26, -32, 37, 14, -50, -10, 30, -7, -32, 13, 18, -34, -29, 27, -3, -47, 13, 27, -31, -27, 25, 1, -45, -10, 47, -30, -22, 38, 26, -30, -1, 43, -5, -29, 33, 31, -32, -4, 49, 26, -23, 24, 51, -10, -11, 47, 17, -19, 16, 55, -16, -24, 42, 38, -24, 4, 49, 2, -27, 13, 26, -29, -10, 46, 5, -34, 10, 55, -23, -17, 25, 15, -33, 2, 37, -29, -42, 28, 15, -37, -12, 24, -11, -36, 20, 21, -33, -9, 31, 9, -41, 12, 38, -17, -39, 30, 7, -39, 7, 38, -4, -30, 21, 16, -15, 6, 51, -5, -35, 26, 33, -22, -12, 38, 3, -32, 17, 33, -15, -5, 27, 18, -39, 1, 37, -11, -18, 28, 40, -31, -9, 37, 3, -32, 22, 34, -25, -18, 50, 11, -35, 17, 37, -7, -15, 33, 17, -27, 2, 42, -4, -32, 30, 37, -33, 3, 47, 8, -32, 15, 46, -8, -12, 43, 15, -21, 4, 39, -12, -24, 37, 29, -24, 9, 43, -12, -26, 5, 24, -29, -11, 33, 4, -34, -9, 28, -36, -22, 21, 10, -41, -8, 33, -31, -12, 27, 11, -33, -15, 27, -6, -19, 25, 27, -27, -8, 44, 11, -18, 15, 31, -14, -7, 33, 27, -21, 16, 58, 2, -24, 30, 16, -28, 4, 51, 9, -29, 31, 38, -6, -12, 45, 16, -33, 26, 32, -8, -23, 31, 21, -37, -10, 25, -20]
4809b0j3N9lp2L7L5m6j2M4Nl7ML6j4m9M7Pk9pN4k6m5M0K7l8j2N4Mm3K6K6l8m1
4842d0N2K5o7L0L6k0m6M1L3m6j4N5k1m1K6L1o1LM3Mn3J7M0j9m1M2K1n8K0L8j3
4873A7n7L3L8n7jN6l3j6J1M7n9j4N1J2n9J2N8n0j6M3J3n1MM0k3k3K8J3m0jK7Q
4905A1m6L6M1m4k0L1J4l5J1L3k4l8M4J7m9nL3Nm4K9L0m7j8N3j3l4J3M2l5j6L5
4936A0J0m1J5L3rn7M0L3m8k2O0j9n0M6L6n0J3L6j2n3K1M6l4k5M3Rn6K4L5m3j4
4967b3K8J4l2pM6j4l6K3M3m4j2L4qm4K9L0l6k7M4Pm7J8L2k3k0K9K1n9QL8ol7K9
5000bK4l4j8K6K1m4K1M0l5l9M4J6m4J9K3j0l6L0J4k7pL1Pl4J6L8m1j5M8jm2QL6
5033C3j8l1L0L0n1j2M1j2l9K6K3m3RK3j0m8L4L0l3k4N1J2m9kL6k2j5K4J5l2oM5
$$ y = [-20, -33, 26, 23, -49, -12, 23, -23, -35, 9, 14, -23, -19, 17, 3, -46, 1, 8, -21, -28, 26, 0, -45, -5, 22, -16, -28, 26, 30, -13, 13, 39, 1, -40, 12, 37, -30, 0, 36, 16, -30, 11, 44, -2, -16, 39, 18, -23, 3, 34, -27, -24, 19, 23, -30, -13, 27, 8, -33, 9, 30, -28, -8, 30, 17, -40, -7, 31, -26, -27, 29, -4, -20, -9, 38, -21, -35, 16, 28, -31, -19, 39, -11, -27, 16, 29, -22, -18, 22, -1, -24, 4, 17, -23, -24, 3, 11, -35, 1, 42, -2, -22, 9, 23, -12, -1, 32, 8, -30, 14, 31, -18, -23, 10, 15, -29, 0, 30, -17, -35, 18, 5, -29, -16, 26, -9, -25, 10, 20, -21, -6, 27, 18, -39, 1, 34, -14, -36, 24, 5, -45, 1, 37, -13, 0, 36, 24, -29, -8, 38, 4, -21, 22, 31, -25, -1, 34, -9, -23, 5, 19, -13, -20, 26, 12, -24, -1, 42, -2, -14, 20, 12, -32, -3, 27, -9, -36, 8, 15, -32, -14, 18, -5, -25, 4, 25, -34, -26, 12, 6, -31, -2, 22, -12, -30, -4, 17, -27, -6, 34, -1, -40, 4, 20, -24, -5, 18, 8, -28, 2, 16, -11, -18, 13, 20, -14, 2, 40, -1, -16, 32, 31, -11, -3, 33, 15, -16, 14, 44, -7, -19, 22, 10, -29, -3, 20, -23, -14, 9, -1, -49, -15, 15, -18, -42, 9, 21, -28, -30, 6, -16, -31, -7, 8, -24, -30, 15]
5065A5k3j9J9L2l6j7M9ql8J9K4k7j8L8lk8jN3k4l9N6%l7PL2j1k7K2K0l3j2M2n
5098B2k5RL4m2j9L6J3m4oM4j6l3K9M0o2kL0jk7J8K1m3lK4J0k6QK3j3k6K8J4l7
5131b2NN4l3l2K8K0j7j4K8j0l2J9M2m3j0N1k1k9KM5l0rK8j0k8mM7j8l5L4J0k6
5163a0j9L9J3n2J8L1k3k2L4J2m3RL1k5j6K9J7m0NK8j5l1J8L7l7kL4km7J9K5ok9
5196b0M8kl5J0K7k7j7L6Kl3%M0j6k8K4K6m4JL1Lm8K1J9k1j8K3J8m0LL5k0k8L5
5229ENl1LK6j1k1L1%k3oJ6Mj6kL6j8l2K6K2l6OL4j5j6K1J7k5j3K3ll6K0K7j8k6
5264b6M5Jm0K7K0j7j7L5Jl8lL9qk6J6J4k9jK3%k9J7J5l1k4L8J8m2kL0ml5L4J0
5298A1k6pK7nk3QK0k1OJ8j4k7L1J4ql6M0Ml7K2JKk1K1J3l1QK6pk9K1J3j3j8M0
$$ y = [15, -8, -27, -8, 24, -12, -29, 20, 12, -26, -7, 17, -10, -28, 10, 7, -21, -22, 31, 7, -32, 24, 24, -13, -6, 26, 15, -12, 10, 30, -3, -15, 27, 22, -3, 6, 40, -2, -21, 15, 28, -16, -22, 22, 6, -27, 2, 42, -20, -22, 8, 7, -20, -2, 19, -24, -27, -3, 7, -19, -11, 12, -1, -27, 1, 15, -22, -17, 37, 4, -28, 0, 20, 3, -11, 17, 7, -25, -6, 36, -7, -17, 34, 13, -16, -14, 31, 1, -8, 20, 10, -18, -22, 25, 7, -28, 6, 16, -10, -29, 10, 23, -29, -11, 20, -3, -25, 9, 21, -22, -13, 18, -7, -23, 6, 23, -17, -12, 16, 1, -30, -12, 25, -12, -14, 20, 18, -29, -10, 15, 9, -20, 28, 26, -9, 1, 28, 1, -16, 20, 22, -11, -11, 29, 13, -15, 9, 35, -9, -8, 23, 26, -22, -1, 18, -3, -21, 2, 20, -20, -17, 18, -2, -30, 5, 10, -21, -18, 8, -3, -24, 7, 7, -16, -22, -6, -2, -18, -20, 16, -2, -34, -8, 14, -22, -16, 18, 3, -13, 8, 25, 0, -13, 10, 7, -29, -9, 18, 0, -26, 19, 20, -20, 7, 27, 10, -7, 28, 29, -9, -12, 27, 19, -7, 9, 23, -6, -7, 16, 16, -13, 4, 19, -12, -36, 2, 20, -22, -24, 6, 2, -33, 1, 11, -15, -22, 5, 0, -23, -15, 5, -16, -10, 8, -6, -33, -2, 12, 4, -32, 8, 12, -25, -3, -2, 0, -21, 0, 13, -18, -10, 16, 9, -20, 1, 14, 1, -17, 23]
5333B3j4k1KM3k1k0K1J2l5KJ3lj6K1J7k5jj0J9k0K0J0j9j5L0Jl4jL8k3j0J0J1
5366Ek4lL4j6k5K3K4l1KK5rl5K6J6j9j0L7j4k0NK6j7pK1Jk4J1K4j9j7QL9m5MJ5
5401A1Lm1K5J6j2k1L1Jk9J6K1j3l2J7J1k5QK1Rl4J4J8k2j7K2J4l4K2K3l0j1M1
5433B3Om5J5K1kk9K6lj5oK2lk8J6J6k6JJ8nrNK9k9qK1J4l7J2J1nk9K6J3l5QK2
5469A1Jm1L5Lj7j1L2j0l1K1J5oj9K5nk3qM1j3j9J4J8k5pL1mj9RJ3oj0K5j2k1P
5504fL3j3k4K2J4l4J5K9j8l4K6Mj8j0K4Rk9J4J5k4j4L1J2l3j7M8j4l0K2K0l9J8
5536aJ9j6k9K6J3m2j2M1Pm6L3J3k2j2L8Ll0ML6j5k3J6Nl1QM1j9j4J3K5k2j1J8
5569A4Rl9K4Okj8J5J8k7NK7k1k5J4K9m1J2K2j9j7K3J4k5MkQj9j6L2k2lK5Pk6j
$$ y = [23, 9, -12, -10, 33, 12, -8, 13, 25, -10, -8, 5, 2, -14, 7, 24, -1, -2, -12, 7, -13, 7, 17, -2, -17, 13, 14, -20, -21, 17, -6, -16, -6, 5, -19, -22, 12, -4, -29, -6, 18, -13, -11, 14, 5, -30, -4, 12, -7, -17, 20, 6, -14, -9, 17, 0, -7, 14, 15, -9, 2, 26, 7, -10, -2, 37, -8, -4, 11, 14, -27, -2, 14, 2, -19, 12, 13, -16, 0, 21, 8, -24, -7, 4, -21, -13, 8, 17, -17, -3, 15, -7, -24, -2, 12, -22, 0, 23, -7, -18, 23, 29, -16, -1, 20, 18, -11, 15, 12, -3, -9, 13, 10, -18, -2, 14, -12, -11, 7, 2, -7, -2, 27, -2, -10, 11, 25, -12, 0, 11, 6, -23, 3, 16, -19, -11, 11, 12, -29, 6, 9, -8, -19, 13, 3, -28, -7, 8, 2, -17, 8, 3, -20, -28, 13, 0, -19, -5, 13, -12, -19, 12, 8, -11, -2, 11, 5, -5, 20, 8, -13, -6, 27, 14, -10, 12, 26, -8, 7, 36, 18, -16, 10, 14, -4, -14, 10, 19, -10, 4, 19, -5, -19, 12, 24, -9, -26, 22, 8, -22, 0, 20, -19, -1, 18, 2, -27, -1, 12, -30, -42, -1, 6, -40, -7, 6, -16, -28, 10, 13, -17, -13, 23, 8, -15, 1, 6, -25, -17, 24, 5, -9, 4, 29, 7, -4, 14, 23, -16, 8, 14, 12, -6, 9, 27, 0, 5, 32, 11, -14, 0, 29, -12, 0, 22, 3, -14, 9, 23, -2, 2, 0, 8, -11, -27, 5, -17, -20, 5, 12, -14, -15]
5604a5K8j1j7J5Rj5j1K9ok6J8J3j4k1L1kj9OK5rl3M7qk2J4PJj8LK0l6%L6j0k7
5639a8OL2k8j4L3pk9L0%j3pK6Nl4MK0ok4J6Nj7j0L3nk4K8J7j9oL3j4k2OK8k0m0
5675c5M6kl3J9J6Ml3J0K3k3jJ9Nk7K2J7k2j1K2jk0kJ8j3jJ7mj1jJ7pl2K7Mk1J5
5711AJ8j0l6J3K4k2oK3Lj3j0K5j2j8J1J3k2PK4ol3K3K0k0mL0Nl3nK5k5j4K7J0
5745A3k4J8K2j3l1K2J9l0OK6ll5J7J0nj6K6qk1LK0k5oJ9Pk8LL3j1k7OJ6k0oK8
5780EJl8M3Ql5j1L0j5nJ1K8j6k8L5Nk3j3K4Lj7J3Rk4j5M1ok2PK4j8oK4Kl3J1K1
5816B0mj8J2J2k1j0K2kk4K1J6m1ML3j8qQJ1j1j1J0J1k3KK0k0j1K3J2j8MJ4k6j2
5850b3K5Ojj3J6J1l3kL2k2j6L2lk6JL3ol1K4Jj2PJ0kk0ML2k0j0K2rk8J7J9j8j1
$$ y = [-15, 13, 2, -15, 0, 9, -6, -17, 12, 6, -20, -2, 11, -3, -24, 7, 5, -14, -8, 17, 8, -25, 22, 14, -8, 6, 13, 14, -4, -1, 19, -17, -17, 19, 9, -18, -12, 20, -8, -22, 11, 4, -25, 5, 5, -8, -15, 11, 16, -18, -14, 6, 0, -24, -8, -3, -20, -30, 3, -2, -26, 2, 19, 0, -6, 27, 13, -9, -3, 25, 5, -35, 11, 9, -24, -5, 11, 15, -18, -8, 15, -8, -9, 10, 15, -12, 10, 27, 5, -6, 16, 15, -5, -7, 11, -2, -3, 14, 10, -1, -2, 15, 8, -24, 3, 7, -14, 1, 19, 9, -27, -14, 10, -12, -18, 5, 8, -5, -15, 10, -2, -20, -9, 4, -18, -11, 13, 7, -26, -3, 17, -3, -7, 23, 28, -5, -10, 15, -10, -24, 3, 13, -11, 7, 29, 16, -15, 7, 26, -4, 2, 28, 25, -10, 7, 17, 12, -4, 22, 14, -7, -4, 16, -9, -15, 4, 11, -17, -14, 19, 8, -19, -13, 3, -17, -23, 5, 6, -32, 11, 19, -16, -27, 3, -12, -17, -6, 22, 6, -22, 13, 18, -5, -18, 6, 9, -8, 5, 14, -10, -25, 16, 10, -12, -5, 19, 1, -5, 19, 21, -12, -1, 20, 16, -2, 10, 22, 1, -9, 13, 11, -13, 8, 24, -17, -13, 20, 2, -6, 2, 13, 2, -9, 1, 12, -11, -9, 11, -9, -20, 3, 15, -3, 1, 15, -11, -23, 2, 8, 7, -6, 10, 21, -12, -14, 18, -4, -20, 12, 9, -17, -16, 17, 11, -20, 4, 5, -7, 0, 10, 8, -12, -8, 24, 4, -6, 16, 7, -21, -4, 15, -3, -14]
5886a4PJ4l4J2K8j1k1J8J1j8oK1Ll3K0Pj7nJ3J8k3QJ8j2j5J9%j3oK3k1%J1J2j4
5921@qK6kk7mK9rrK3jk4%K5nk7K6Pk5kJ1Jk2J0K8k7j5M3k1mlJ7l2JJ4J5m0K0J4
5959Cmk2J3Rj4lL4j6k0J3J4qj2J8Mj7pK7j7jJ2J5l1OK0j5j5K0Ok5RJ3JlJJLj5
5997cJ2Jj5J2Nj5j7L3rj5MNLqKQk8ML1ml3J9jkkNLnmK4j2j8K5qj1rK4nj3K0Kj6
6039a1j0K4kj6NK8k2j0K8Qk2kK5j8j5J9Oj5JJ2jl1OK1j1KMKk7K0Pk0qK6Pk3MJ2
6077C%k3L4j2j1j2K5pk3J6K4j9jJ9%k2J6%j0rJ8J4k5j0L7pk6J6J1j7OJ2Nk1J7
6112A8Jk0pJ0Mj0MK1k1j3K6jj0kOkk0J6Rqj0J2Mj0jK1l3pK2opQJ6nk5K6jj6JK5
6152A5j7Mj0J7Kj7K2Kk6QJ2j2LJ0J8l5J4J5pljJ7l0lJ5kk8L2Lj1j3K6kl0JK4r
$$ y = [-14, -7, 7, -27, -15, 13, 2, -19, -1, 10, -8, -14, 7, 10, -23, -3, 4, -13, -18, -5, 13, -10, -2, 16, 4, -11, 8, 8, -5, -11, 12, -9, -9, 2, 14, 0, -8, 18, 16, -11, -15, 14, 5, -4, 19, 18, -6, -6, 19, 14, -13, 13, 20, -5, -7, 4, 5, -17, -7, 21, -6, -21, 22, 1, -3, -6, 11, -21, -20, -6, 9, -31, -11, 3, -1, -23, -10, -1, -15, -18, 16, 0, -20, -7, 7, -1, -13, 5, 9, -8, -15, 12, -5, -6, 6, 21, -10, -4, 16, 1, -14, 6, 12, -13, -4, 9, 10, 7, 8, 9, 12, -3, 9, 10, -5, 7, 12, -3, -20, 13, 4, -11, -7, -2, 1, -7, -5, 3, -25, -21, 10, 6, -27, -8, -9, -11, -13, -8, -5, -10, -14, 10, -2, -20, 5, -3, -14, -23, 1, -4, -17, 3, 5, -11, -21, 3, 1, -15, -10, 18, -4, -14, 14, 22, 0, -2, 23, 5, -10, 9, 15, 0, 1, 13, 12, -19, -13, 8, -3, -1, 3, 5, -22, -2, 5, -15, -23, 3, 10, -13, -9, 3, 3, -20, 14, 2, -9, -21, 4, -3, -26, -10, 14, -5, -6, 13, 13, -9, 7, 7, -3, -12, 6, 20, -5, -15, 22, 15, -11, 5, 16, -1, 5, 17, 22, 1, 18, 19, -1, -8, 2, 6, -4, 0, 21, 0, -13, 13, 12, 2, 0, 6, 4, -16, 0, 9, 1, -9, 3, 7, -3, -4, 17, -16, -23, -1, -7, -14, -6, 10, 5, -20, 6, 5, -11, -10, 15, -2, 2, -8, 9, 11, -6, 16, 18, -8, 0, 12, 0, 3, 13, 31, -4, 10, 25, 18, 15, 14, 31, 1, -2, 13, 11, -17, 15, 18, 7, -6, 20, 18, -12, -11, 13, 4]
6189Dk6L1jmk0L9l2%J2Nk0lL1j4rj4L8l1kK8Jk6JK4j3qK3Lk6MJ1%j8NK3j8pK7
6227A8nj8J7Orj8J8LpRK4l1j7K3J2j9kK4k3j1J2Rk4J4LnmOJ0j7nQooLL2l2j1K5
6266FJk5J1J9nj3RMj4pOK2l0RJ3Nk6L0mk3KK0J3k0J3Kj0j1J3kj2KJ4oj0RLj2M
6305@Nqj2K0J9l1lNLqJ0J6k5MJ1Kk6K2Jnj8L9j7k3J7J7kl4L0Qk6J4J5j3nJJlj8
6344a7K7%k4K0J4k6mPJ4k5J0J0qnJ1kj0j8L6Pk3K1Nk3jJ3qk0J7J1j1pPJ4k6RQ
6381CmlPQk3JJ0Rk8K2J7j9rK2nk2J6J2j4j0K1qOj3J7qpJ5Qj5jJLk7K0Nmj6K5M
6421A6k9J3J1j4j5K3J3l4RK5j9j7QLKjJ2j2j5J7PKj5K1j3j1KK2j0lPqnMRqoOQ
6460Ek2K1%kMqJ7Kk4OK2j6%J6rloOqlK0j2olJ4k5LJ0lJj9K8pj2LK2k8J4K1k3j0
$$ y = [4, -22, 9, 8, 4, -16, 23, -9, -9, 3, 8, -12, -15, 16, 2, -7, -21, 17, -14, -16, 12, 13, -13, -12, 12, -1, -9, 14, 17, -9, -5, 6, 6, -12, -7, 16, -2, -9, 18, 13, -5, 12, 18, 9, -9, 9, 12, 5, 14, 38, 7, -10, 13, 25, 6, 4, 28, 5, -6, 6, 15, -9, 5, 8, 3, -1, 5, 15, -2, -7, 1, -5, -11, -8, 24, -8, -19, 6, 7, -18, -7, 12, 7, -6, 3, 7, -7, -14, -8, 14, -16, -7, 6, 11, -15, 15, 11, -12, -10, 10, 23, 3, 16, 18, 8, -3, 10, 8, -4, -2, 12, 6, -4, 5, 8, -4, 0, 5, -3, -15, 5, 24, -7, -10, -5, -2, -10, 0, 16, -9, -5, 6, 8, -18, 4, 5, 0, -18, 21, 4, -19, -2, 15, 13, -21, 9, 17, -9, 5, 20, 7, 2, 3, 4, 1, -17, 10, 10, -14, 6, 20, -6, -10, -3, 11, -14, -4, 6, -2, -7, 4, 2, -8, -26, 10, 17, -6, 15, 20, -3, -4, 9, 1, -19, -2, 9, -2, -9, -2, 12, -14, -5, 3, -1, -4, 3, 11, -12, -11, -1, 8, -20, 2, 19, 0, -9, 13, 8, -14, 2, 14, 0, -10, 11, 3, 9, -4, 13, 5, -2, 13, 21, 6, 5, 6, 9, -18, 2, 7, 3, -13, 12, 16, -13, 0, 11, -3, -18, 5, 18, -16, -7, 18, -1, -18, -10, -7, -5, -6, 6, -6, -21, -4, 3, 5, -10, 11, -2, -13, -11, 11, 1, -2, 5, -3, -8, -4, 5, -3, -9, -3, 5, -17, 4, 4, 2, 6, -2, 15, 17, -7, -1, 21, 5, 5, 21, 12, 9, 3, 9, 1, -2, 18, 6, 0, -3, 11, -14, -11, -1, -4, -3, -22, 6, -1, -13, -10, 12, -16, -2, 19, -4, -14]
6501a4%J2j0j0K9j3qJ5Qj5j1J9Qj6NQmj1J6Nk1J4j0LkLJ5j0lJ2j0j9K0Qj2oJ8
6538A3oj9J6Qoj2OK0k3OrOj2QJ4k1%J7j0nRJ2nj9PJKj4J3J5k0J6nLj2J9j2kRL
6578A1j9NK3j1j5%K7k5%QRJj6K0Lj6mRj3KK3k0jLKplJ8oj1%K6k4nK1j2lr%Mj0
6619a5J2K0k5jJ3prKK4j1LQj1j7J2K6j8k0K0pJ2rjLj6J7J0j7JJ0Kj9LJ2Mj4J6
6656A3Kj1lJ4j0j0J7Qk0rMJ1kMkprK7j5j5PJ5j0j8K6Jj0pJ2jj4J2J4mj3kJ9j6
6694bPMq%J1mj7J3J5qrLOjO%j1kJ2Mj1oJ4J5l1L%%jOOj7kJ5j3JPJ0k8RJ0Jj7P
6738cJ4k2mJ5kk4J0J8rkJ6jk0KJ2Jj1JLLNPoj5J2MMj4J0OnPjkn%Nj0%J7lj8j7
6781b2M0k7J4QplNJ2k5KK3qj4LK3l3NQjnJJ7j6j2NJ7nkLnj0K3j6%oJ6J1j3mK0
$$ y = [-14, -14, -2, -12, -22, 7, -6, -14, 1, 9, -6, -17, 2, 10, -6, -1, 7, 3, -8, 8, 13, -8, 6, -4, -1, -3, 0, 15, 5, 2, 14, 4, -15, 5, 13, 1, -5, 13, 7, -12, 4, 12, 6, -6, 0, 20, -3, 3, -6, 0, -12, -4, 10, -11, -11, 6, -4, -9, 0, 12, 7, -12, -5, -4, -2, -16, -3, 12, -8, 8, 3, 6, -6, 13, 1, -1, 8, 11, -8, -3, 20, 9, -6, -6, 21, -4, -4, 4, 13, 14, -2, 18, 21, 5, 1, 10, -3, -1, 22, 2, 1, 4, 6, -1, -4, 14, 8, -3, -3, 23, -1, -6, 15, 3, 0, -9, -9, -5, -15, -3, 17, -8, -9, 4, -3, -12, -10, 14, 3, 6, 14, 3, -14, -2, 24, 6, -14, 6, -1, 11, 2, 1, 4, -12, 5, 15, -2, -1, 9, 11, -8, -5, 7, 11, -3, 13, 15, 4, 1, 15, 5, -5, 12, 20, 0, -9, -5, 6, 4, 8, 6, -1, -10, 17, 2, -13, -6, 9, -1, -19, 7, 8, -2, -9, 3, 2, -12, 0, 14, 10, -3, -5, 14, -2, 5, 9, 1, 1, 12, 8, -9, 4, 19, 11, 2, 5, 11, 10, 16, 16, 5, 3, 15, 19, 8, 2, 16, 31, 0, 3, 3, 3, 2, 8, 14, -3, -5, 10, -3, -2, 5, 15, -13, -4, 6, 7, -10, -3, 11, -11, -15, 0, -2, -26, -16, 2, -7, -9, 7, 6, -14, -12, 0, 1, -10, -9, -6, -3, 2, 9, 3, -12, 0, 4, 8, -6, 4, 10, 5, 12, 11, 9, 4, 4, 9, -1, -1, 16, 13, -5, -22, 18, -9, 5, 13, 6, 3, 8, 20, -5, -3, 20, 12, -2, 1, 24, -9, -4, 4, 3, -2, -1, 16, 0, -12, -7, 10, 5, 3, 6, 1, -9, 14, -2, -2, -8, 8, 19, 6, 2, 22]
6821B2k9jK5nj5J4J1krlLqPPqplJ9pk3J8nj2K2mJ6l0J5oj0KKNj8K8mk5QRmmlK3
6864A1rrRpJ0j4K0lj0J3J2k7mK2lj5OJ2k0j5L5j1rNJ9pqOMj8J8Rj2lRpKj4K3j0
6904A0JjjqlJ2Nk3QJ2j6nNMj2J6j0NrNJ1qkNqQPRj3mJ0nj2jK2j7%OJ9k4OK0k1
6947CqRJ4j9JJ6Oj4mLJ%LmMjLnj1NJ4j1mRjj6J2l%knJ0k6J2RJ2l4J8mJkJ4qKJ0
6992IojrJ7k1KNRqkJ3Kj0qK3qPmjpmRnmJ3jkpJJj3QOkLnJj3kL3k1LnJ5j8lJ5j3
7040hMJJORj9jljJ7k1K0oOj8%J7lqJ3lljK3jk1MOkqJ1Kj3rJ7J1j5J4mj3kOJJp
7085@kQj1Roj1K0lk1PJ4nj3J2jJmPqmkJ1J%LKmpJ2jpKJ3oj5J6mKmJ0qj2J5J0j5
7130AJ0JoOnJ0j8PklpJ3oJn%Kj6J8Ojk0QOJj0J0lj8J9j2JONNj6J1Roj0LJ0j8J5
$$ y = [22, -7, -8, 17, 12, -3, 11, 22, 20, 11, 8, 11, 3, 10, 17, 9, 2, -1, 18, 11, -12, 6, 1, -11, 11, 7, 23, -7, 8, 2, -8, -6, -4, 1, -17, 11, 7, -18, -10, -1, -5, -9, -12, 11, 2, -7, 2, -5, 5, -9, 11, 8, -2, 11, 23, -4, -8, 14, 11, -4, 2, 14, -6, -21, 14, 3, -6, -1, 18, 11, 3, 9, 13, -5, 13, 22, 10, 7, 16, 9, 11, -3, 20, 10, 11, 10, 9, 1, -2, 10, 15, -8, 0, 12, -4, -9, -4, 0, -12, 4, -6, -1, -10, -5, 6, -2, -4, 1, -7, 1, 8, 17, 4, 0, 10, 5, -7, -8, 14, -3, -3, 3, 22, -2, 4, 24, 3, -5, 4, 18, -1, 0, 16, 22, 8, 4, 7, 8, 8, 11, 7, 11, 10, 13, 8, -3, 2, 16, 5, 1, 10, 9, -7, 5, 2, 2, 0, -5, 5, -21, -9, 0, 12, -22, -4, -8, -7, -9, 5, -3, -1, 9, 3, 2, -7, 10, -11, -9, -4, 5, -3, -5, 8, 10, 0, -8, 15, 7, 14, 10, 9, 2, -2, 7, 2, -2, 11, 10, 8, 1, 2, 3, -10, -2, 4, 2, 5, 0, 1, -12, -14, 19, -2, 1, -4, 11, -7, -10, 5, -8, -4, -3, -2, 4, 13, -6, -7, -10, -11, 6, -15, 5, -1, 5, -13, -13, 4, 1, -7, 6, 3, 0, -1, 22, 21, 0, 4, 10, 8, 0, 11, 13, 0, -9, 8, 19, 4, 18, 14, 1, -1, 5, 6, 7, 0, -2, 6, -5, 4, -2, -13, 7, 4, -17, -10, 4, -1, -14, -2, -3, -2, -6, 1, -7, -11, -13, -2, -1, -1, 2, 4, 0, -7, 5, 4, -3, -1, 12, 6, -9, 7, 3, 5, 1, 11, 3, -9, 6, 16, 1, 11, 12, 6, 12, 7, 17, -1, 6, 4, 1, -6, 7, 1, 2, -3, -3, -1, -17, 1, 7, 6, -14, -6, 0, 1, -9, 1, -2, -20, -1, -13, -12, -6, -1, 4, -12, -1, 8, 2, -8, -5, 5, -13, 2]
7174BlnRjMj0mJ4Ql1K9prKJ9j5%RmnNj2J3nMJ4j5j0JJ3nrJ3Oj6J6j3LoNKj1KJ2
7218Ij2qJ4Klj3J2qlRNnnOPj5LJ0j3rJ8JqlJ9j2J0MK0l6J0%QrLJ0j9LjMlJ2nj1
7262bLJ6Mj1j0J4j3J1j0P%j4J8j2j0J2KpjjmPN%j1nK4jj4nL0j8rJ0Rj6J3kjj2
7302dQJ3k4MJ4lmj4PMpKK1j5mJ3j8J3qJ5j0oK5k3Lj1K2nj9J9Rk7MJ6Mj3krJqK3
7343Fk3lK5kj2nL1j1okJ7j3JKpJJ4Qj4j5J2J5j5NJ0rjOJ7l1lRRj7M%jRMNj5j0
7385eOOj2J0Pj8J0Rk1mLL3j8jjPj1JMmjOnPj3K3j6j4LK0j7kJ7qoJ6%j2JJ4j0n
7427aOJ8pk1J0JpJ7%j5Jj0J3k%Rlj2K0nj0j7J7J9l6J1J0j0j6J5J7k0kK7j4j2J0
7464AMmj2J6Nj9JQnL%Lm%J1k2J4J1j5mKK4j0nJ9j4QpMj4qJ7Pj4J7rLj6J2J6k0
$$ y = [2, -1, -6, 3, 2, 6, -4, -8, 6, 14, -17, 12, 5, -4, -2, 17, 2, 2, 11, 7, 2, 7, -5, 8, 3, 7, 21, 6, -4, -3, 10, 5, -4, 9, 15, -1, 15, 2, 5, -1, 4, 6, -5, -3, 9, -3, -11, 3, 5, 2, -11, 1, -7, -10, -1, 4, -1, -6, 0, 7, -8, -5, 5, -8, -17, 1, 2, -6, -9, 10, -2, 8, 12, 32, -4, 6, 6, 14, 5, 8, 18, -1, 2, 1, 5, 2, 14, 9, -2, 1, 17, 21, 10, 0, 14, 1, 12, 2, 9, 9, -5, 13, 1, -9, 3, 5, -2, -3, -4, -8, -1, 4, 4, -7, -12, 12, 11, -3, -8, 22, 4, -5, 5, 14, -2, 11, 9, 8, -4, 4, 17, -7, -3, 11, 8, 4, -10, -3, 1, -6, -4, 17, 2, -2, 11, -7, 6, -2, 13, 3, -3, 22, -1, 2, -9, 13, 8, -11, 8, 17, -10, -6, 10, 14, 1, -1, -10, -9, -17, 6, -17, -20, 5, 3, -9, -14, 17, 6, 0, -2, 15, 2, 3, 5, -2, -1, 13, 21, 7, -8, 4, 19, 4, 9, 19, 10, 9, 15, 32, 1, -2, 7, 16, -1, 3, 3, 2, 11, 15, 20, 5, -5, 1, 7, -5, 5, 12, -6, 4, 13, -8, -12, -9, 24, 6, 5, 4, 11, 0, 1, 5, 1, 0, 6, 1, 8, -5, 18, 2, -12, -9, 11, -6, -8, 9, 1, -5, 11, 11, -1, 0, 14, 4, -1, 5, 23, 16, -5, 5, 6, -1, 16, 16, 1, 2, -8, 5, 3, 3, 12, 9, -3, 17, 12, 2, -15, 2, 21, -15, -4, 6, -4, -20, -5, 12, -8, -10, 17, 3, -9, 1, 5, 1, -11, 5, 10, -9, -8, 0, -5, -2, -2, 1, -3, -3, 8, -14, 0, 11, -4, -8, -6, 18, 8, 3, 22, 8, 16, 9, 13, -1, -9, 8, 15, 1, 18, 9, 12, -4, 8, 24, 4]
7505Dj7K3Nqj1J0Kj5J5rmk1K8j6J0j1J2OJj6L9l1qK3rjJJ0j0j1J5%j4J0Nj0KJ3
7543A2%lrJ2lj2J0J3k7J2J6j5oJ3kj3RlOj5J6pMj4J9pr%K3j3k0K3qmmOqmQOj2
7584a0MJ1jj2J8Rj3j0MJ3r%J0ok0K4KLj8K5k4KJ2Qj6JMJj5lJ4Qj6J1Mk0J4Rj0
7623Hj3J2Mj2RRk2KK2lJk1J2Jj7kNj2OK0%k1%QJ0m%Rk7J0nJ6j0PjMrJ1jj2QJ7
7665A9j1j2K6j0j2KlJ5j8J1Lj6%PJ9k0KPoqK0j2j6J7jj1JRJOk0K5j7lMJ2kJJr
7705AlNJ9k3j5L5k5PpK3j6j5J9pj7PK5nmkPrLKJ6j5KJ2rj0J7nnojLj1K4J5m2J0
7746@PkqOL%j7K0nj2NNrpK1lpPKr%J0KnpQQk0nJ7l%Jo%Qjj2QJ6Jlk6K3Oj6KNo
7795Bj0L0j4RnMj1OoLj6J0Okj1oK9j7nJ5j1qQqlJ3%j2PrK8j7nJ5Kj4J7jj8rJ6
$$ y = [4, -13, 10, 15, 7, -4, 6, 8, -7, 8, -1, -5, -26, 2, -14, -4, -15, -3, 3, 4, -12, 27, -4, -12, 11, 2, 1, 2, 12, 2, -9, 6, 6, -8, 2, 7, -3, -1, 12, 12, 9, 0, 12, 9, -3, 7, 20, -7, 5, 21, 6, 0, 13, 11, -2, 7, 4, 10, -5, 11, 4, 8, -6, 13, 6, -3, -3, 20, 7, -13, 10, 2, -2, -6, 0, -8, -12, -4, 2, -10, -6, 5, 4, -8, 10, 19, 6, -4, 0, 13, 4, 4, 14, 8, -12, 12, 14, 17, -1, 24, 0, 2, 14, 22, 6, 7, 11, 12, -3, -6, 8, 16, 0, 11, 15, -5, 9, 18, 8, -5, 7, 11, -1, 8, 17, -5, -3, 19, 16, 17, -4, 8, 9, -8, -10, -5, -17, -11, 9, 9, -12, -12, -4, 6, 2, 2, 11, -16, -6, -11, 5, -5, 2, 1, 5, -4, 7, 6, -6, 2, 19, 8, -4, 22, 12, 0, 2, -1, 14, -4, 7, 10, -6, -6, 1, 20, 0, 2, 9, 3, -5, 15, 3, -13, 4, 3, -8, -7, 2, 3, 9, -11, 14, -3, -6, -2, 10, 8, 9, 10, 1, -2, 3, 22, -1, -16, 19, -6, 1, -6, 17, 1, -14, 5, -2, -19, -12, 13, 8, 4, 2, 9, 0, 3, 5, 21, 6, 8, 20, 11, 1, 18, 13, 8, 2, 1, 4, -7, 17, 32, -10, 0, 7, 5, -3, 3, 6, 6, -11, 9, 4, -8, -3, 2, -7, -14, 7, 4, -3, 4, 6, -3, -3, 7, 9, 4, -3, 5, 13, -7, -12, 5, 2, 2, 3, -3, -3, 5, 4, -8, 0, 16, 17, 14, -12, 11, 17, 1, 3, 8, 2, -8, 22, 8, 17, 12, 16, 5, 11, 5, 8, -8, 2, 8, 6, -5, -11, 18, 1, -4, 11, 0, -8, 0, -8, -11, 2, 2, -10, -3, -12, 16, -1, -6, 9, 11, -3, 14, 13, -5, -14, 2]
7836BNrrK5JrnJ1j1PnRkjj4J1O%Qk3LrRoJ9Lj7%OOj6J3Kj4J1lKj6NJ8j6MMkKj8
7882a3J3npQJ6k7NJ0J4k0%J2jj8J9NlMnJj1J9kj4RMMj1J6j4j3J2oJ6mj2LJlJ5
7922A7nm%J3j8j4J6Nj9QK6l2J2KRk2KOKj0nK3j3PmPk1LJ0KrKJ7k5JPJ7j2LLj1
7963dNJ1%kj4J5J2m1K2Mmj0K9rj2J1kkj4J0Mj7J6Rk0JJ0L%j1J1kj5QqpRQJ7j5
8003Fj4K3k4J1oMmj0L2j4j1J3mj8J0J8k4KJ4J2j7kNpLLJ4jj5J3NonJ4j6j0RRp
8042EKRrk6K4Lj4PlJ1k6K2nkj3J9jJjnJ0j1JMOj6K1j2nmJ3%qPpj1J3J6qrJ4Lk5
8085a0J1RjrPPj4Lj6J6qjL3k8mQLpj6K4%j4K1rpQ%qmPpn%OJq%K0j4jjJ4j8NK1
8130A4j8RnJ0j0KmplQJ7j7j0K7k0JOQj4JNKNlRpnNQoOlLj2KOrJ6j4lrNpLqJ6k
$$ y = [2, 7, -2, -11, 14, 15, 6, 1, 12, 1, 8, 3, 12, 10, 9, -5, 6, 12, 12, 20, -3, 0, -9, 0, -6, 13, 16, -1, -1, 5, 11, -5, 8, 10, -4, 7, 4, 6, -10, -5, 13, -3, 1, 5, 3, 5, -13, 0, -5, -12, -4, 12, -15, -10, 0, 14, -6, -6, 6, 5, -13, 6, 11, 8, 12, 7, 8, -3, 16, 14, 0, 9, 13, 17, 6, 22, 8, -5, 7, 1, 17, 13, 1, 4, 5, 2, 17, 12, 8, 8, 21, 3, -11, 5, 10, -9, -1, 25, -7, 5, 7, 16, -6, -4, 2, 4, -6, -11, 12, -1, 6, 2, 9, -12, -9, 1, 3, -6, -4, 13, -12, -11, -4, 13, 1, 4, 7, -4, 1, 12, 12, 10, -4, 11, 23, -18, 4, 8, 4, -6, 23, 14, 2, 13, 11, 9, -5, 5, 9, -8, 8, 17, -3, -2, 8, 11, 11, 0, 11, 9, -6, 2, -6, -13, -4, 4, 21, 6, -8, 15, -9, 2, -4, 0, -4, -14, 18, 4, -7, 6, 2, -16, -6, 12, -12, -10, 4, 16, -1, -3, 2, -5, -2, 1, 15, 14, -1, 12, 17, 11, 6, 20, 4, -6, 3, 12, 5, 7, 16, 7, -19, 5, 8, -6, 1, -2, 9, -17, 5, 0, -2, -15, 4, 3, 4, 3, -2, 8, -3, -2, 2, 8, -8, 13, 1, -4, -8, 5, 5, -3, 4, -3, -14, -1, 15, 7, -2, 12, 15, -10, 1, 10, 9, 0, 7, 14, 0, 3, -13, 3, -5, -6, 27, -1, -5, 3, 6, -1, -17, 7, 7, -7, 14, 5, -2, 6, 6, -2, -6, 1, -6, -11, -11, -5, -4, -12, -12, 8, -6, -7, -8, 6, -12, -7, 14, -4, 5, 0, 10, 0, 2, -2, -9, -12, -4, 13, -4, -14, 13, -7, -6, 0, 8, -6, -5, 0, 2, 7, 4, 13, 6, 1, 6, 14, 8, 14, 11, 14, 2, 4, 10, 1, 17, 3, 0, -9, -4, -11, -8, -16, 0, -2]
8177bLrJ3j2pPJ2rJ0%nj0Oo
$$ y = [-2, 1, -8, 5, -7, -14, -7, 5, -4, 6, 6, 1, -9, -3, -9]
8191i
$$ Imaginary data points
##PAGE= N=2
##DATA TABLE= (X++(I..I)), XYDATA
0@%%%%%%%%%%%%%%%%%%jRj6J6j6J6j6J6k2L0l2L2l8M6m8N4o2P0p8Q6r4J04j18
41f2J30j42J57j75J94k12K36k68L00l35L79m34N00n86P02q63J116j563K574q724
61g076k15J8530k840j0080n188M004M019L068l073m728R41O011j566n531K091
76a633O767k179o858o21M446K141N19j413l958q21N658K416n004k868L650J585
92A827k110P42K105k223k427J537J264n51J437O25l839j778M435K215l931j493
108b165L387N57k704J58J808k07K2R3k963j303N233L680m994n068K529L459j110
125D12q28R46j031q12K100N09k469J45K079j523j821L042K133l296j859K745N31
142A003k648M02K153j043j176J721L81j668Q10R42k889j032M754K447m412l017
$$ y = [0, 0, 0, 0, 0, 0, 0, 0, 0, 0, 0, 0, 0, 0, 0, 0, 0, 0, 0, -1, 8, -8, 8, -8, 8, -8, 8, -14, 16, -16, 16, -22, 24, -24, 30, -32, 38, -40, 46, -48, 56, -62, 68, -74, 83, -92, 102, -110, 126, -142, 158, -177, 202, -232, 268, -318, 384, -479, 637, -926, 1648, -7076, -7291, 11239, 8399, -1681, -6869, -2865, 1154, 4222, 1149, -3579, -2638, 3373, 1807, -3724, -1633, 5134, 2955, -3903, -4524, -78, 2063, 2582, 1169, -2789, -3610, 2048, 4464, -540, -3408, 242, 1827, -283, 459, 2564, 341, -2086, -549, 715, 164, 1601, 2226, -1613, -3391, 1044, 3259, -672, -2165, 1222, 1779, -925, -767, 1041, 834, 856, 949, -2014, -3317, 1916, 5596, 602, -4466, -1937, 1522, 412, -416, 530, -501, -1313, 787, 1296, -1173, -1028, 1051, -472, -2293, 749, 2882, -414, -2273, 472, 1003, -1645, -1243, 910, -133, -1309, 412, 793, -875, -65, 877, -2012, -3044, 1710, 4157, -255, -3272]
158c272K636K197o49n14j134j562K208L608k306m779J688M692q99l560K72J743
174C69K79P27L0k665o45L504O50l729m1M199j53m307o45K743R06k62j29j741r43
193a853K937J691l541k008L382J647k867o24K636m2k124K13O22r10O79J456j694
210d00j520K879J738l742k422K998K209j442o64N55q74P5J978q17k959J139L302
227B033j174k865J310K069j305j009R29n58q58J981J146k381o89K603j24k934
243a826N15K801m21j624Q03K28j532O08J820j165j481J693R17k097j11K383o38
260H73k488J117K213j208j343J431N20j405K76O88j607l09K882N92l079o57K278
277G74j63j713R45J195j260k31J580o67j712J246J304k016r64K488P47k281k22
$$ y = [-3272, -636, 1561, 912, 398, -736, -2298, -90, 3518, 1212, -3567, -1879, 2813, 1914, -1646, -1374, 369, 648, 1375, 1405, -1260, -1905, 1599, 2249, -1480, -1521, 2678, 2525, -1782, -2427, 316, 1222, 960, 831, -910, -1853, 1084, 2775, -766, -2774, 608, 2255, -612, -1236, 1400, 1358, -766, -553, 69, -841, -162, 1294, -400, -1920, 959, 2697, -1045, -3467, -469, 1740, 298, -366, 189, -685, -610, 1368, 551, -2408, -1269, 2033, 859, -2006, -696, 1373, 68, -941, -12, -570, -1428, 553, 1699, -682, -1371, 1232, 1108, -1826, -1311, 1490, 1069, -555, 248, 476, -1056, -448, 1372, 207, -1274, 419, 1336, -761, -872, 1511, 873, -1615, -498, 1715, 507, -836, 595, 1115, -290, -14, 674, -933, -1242, 1640, 2232, -847, -1504, 774, 611, -1102, -157, 1038, -222, -453, 1127, 460, -1252, -6, 1298, -718, -1682, 806, 1553, -728, -950]
294i50J669n99j169R95J40j517J030K374j298k523J162J601j545o86K111L84j838
311f59J6Q95q39Q0J729r25k576J337L074j130k644R45J618j040n63J041l01n09
329d51J535K29k562l26K793J53k415M41K049q11j491Q40L45j027Q70J393j539
346B6j378J979J088k154p13J906J0j519P41J148j096l74J298p56j962J195K101
363A540j146j352J515N68k027l13J725j39r53R59K78j592L41J943r56k210J142
380f77J855j318j119J617N29j537N0R48j010n40J864M00j882J95J716j067j752
397a728J457J545j372p14J390j90j416Q45J124j307o14J722N2j748O70J749j151
414C14j582J234R40j226R7J468p19j385J009O56j644q4K277J8k079J86J378p86
$$ y = [-950, 719, 120, -1049, -54, 86, -1431, -401, 1973, 675, -1848, -686, 915, -630, -1316, 795, 1179, -659, -643, 252, -587, -507, 1222, 297, -2279, -942, 2132, 1002, -1642, -697, 921, -119, -682, 359, 58, -451, 1084, 1313, -1249, -1575, 1218, 1371, -1044, -603, 1446, 635, -856, -16, 329, -698, 172, 1565, 26, -1352, 627, 1715, -439, -1152, 754, 764, -755, -14, 1134, 38, -336, 962, 206, -1756, -561, 1540, 394, -958, 557, 1125, -902, -1215, 510, 371, -582, 377, 655, -937, -596, 1347, 391, -1819, -677, 1178, -140, -1259, 358, 887, -650, -600, 348, -662, -1202, 662, 1062, -820, -625, 1091, 24, -1728, -271, 1274, -98, -812, 578, 388, -1028, -183, 941, -366, -980, 742, 794, -954, -284, 1465, 314, -1268, -34, 906, -320, -223, 1245, 526, -859, 150, 806, -838, -922, 1355, 1373, -706, -520, 858, 72]
432G2p32J183O1j277P58J360j376j262J723Q06k068n40J895K23j239N58N87j255
450e23l27J301m30j262J404J558j742j533J549P99j530q0J446m35r88R69L80j457
468i01J96J608q43j661J302J573j305r10J335P6j454M23J213p84m47J541p3k115
486a226J53J961m06j339R88Q49j294l05J283l76j127J074Q78j557m51J989J66
503A260j949L5J429o25r00J159N25j137K08R96j168j163J545J033j539l60J728
520A077j88j818L54J250o43n03J034j98j227P96J280j319j214J392O71j528rJ718
538I25k37j406M41M93j091J40J662l95j560P47J195j262r43J437M83j261K02J102
556F72p92p63J264K85j631J40J734m80j440R92J162j206q00R93j8p94J036R33
$$ y = [72, -660, 523, 584, -693, 65, 1425, 49, -1213, 510, 1316, -752, -1292, 603, 826, -413, 145, 732, -523, -850, 451, 21, -1241, 163, 1721, -21, -1554, -5, 794, -736, -816, 630, 195, -793, 176, 556, -901, -705, 903, 60, -1601, -299, 1274, -31, -941, 394, 470, -984, -561, 652, -132, -579, 962, 889, -1226, -1073, 888, 482, -857, 131, 980, -314, -619, 664, 288, -839, 235, 1113, -444, -895, 1094, 1260, -689, -654, 775, 150, -750, 409, 934, -203, 5, 1001, -167, -1330, 215, 1248, -291, -651, 1077, 889, -929, -575, 675, 32, -471, 563, 365, -862, -66, 1214, -105, -1319, 73, 744, -784, -793, 925, 688, -718, -277, 216, -875, -735, 927, 532, -1028, -281, 914, -348, -1291, 146, 629, -632, -430, 672, -120, -883, 381, 666, -965, -825, 909, 429, -1011, -19, 1143, -63, -863, 130, 112, -682, 354, 1287]
574A287j424q11J457J55j609M26J773n70j398P37P34r38n5R53o71r33J305Q89
592A307j507n54J539n5j613L38J334n83o45J070R1j342J76J071q21q02J504Q05
610A313j598o21J206o9r26P21O60j232l17J479k9j390M59J061j120r14J436P94
628I13j153j43Q04p16p72J184N93j328k0J504m40j505O79J121r85n83J257K45
646F55j145K64Q49q87m87J324J19j556K63J702m05j328N89O20j084j49J391n5
664F80j034O15N91j320m83J540L11j306K00J078o91p64J003K59j268J07J294m97
682C15j021R55P53j259n13J143j05j036O85J041q66o50Q85j39j208O05J363p24
700B24j042R26N05j193j54J193k70r53O74N96r58k2J240m71j510O08J356o76p31
$$ y = [1287, -137, -948, 509, 664, -945, -519, 1254, 684, -714, 23, 757, -181, -236, 717, 46, -887, 418, 1307, -200, -754, 785, 730, -883, -545, 789, 206, -439, 631, 722, -620, -444, 627, -194, -996, 508, 1313, -285, -906, 300, 231, -695, 26, 686, -546, -863, 616, 587, -803, -344, 717, -403, -1317, 119, 913, -240, -383, 421, -295, -1067, 117, 710, -618, -638, 866, 426, -1079, -400, 721, -264, -847, 410, 655, -490, -226, 623, -264, -751, 573, 692, -864, -601, 1101, 696, -632, -43, 577, -507, -656, 735, 680, -354, 261, 852, -468, -951, 589, 900, -406, -206, 872, 181, -583, 420, 679, -589, -482, 812, 315, -706, 249, 1002, -257, -770, 373, 268, -768, -83, 958, 92, -558, 327, 188, -1020, -415, 948, 224, -818, 108, 613, -580, -734, 459, 189, -764, -90, 506, -452, -474, 766, 295, -1215, -607, 749, 73, -658]
719f58R62K37j147J55R44o85o92J188N93j232j74J069m44j033Q90R42r83m60J072
738E44q8j084N64R71r51p72J086M15r50L01R64q96j159R28Q73p48p7R02n69j035
758g81Q26Q18j099m83J254J73j135K28Q83o79o26Q74J45j039L69J172o50j074
776h24Q39O55j118l34J096J0p78N71N23j114m93J141K01r65M04R01q20p89R65
795G1L97j025P6J036m70q62Q57O48j014l50R87k30r42P32R99p74o62P96l8r83
815g51M98J079o53p12R47L09j231o4J165j87q82O05N50q63j06J036l33j142N47
834a88R43p42m86J016J86j111P9Q07n86n57J001M78j055j71R07l93q72O71O84
853F11q26k01R92k27j122M84R32p17o63Q32K62q08K64Q57o91q78P49M88p89J15
$$ y = [-658, 304, 541, -606, -451, 493, -192, -884, 304, 897, -335, -509, 560, 116, -917, -27, 915, -68, -528, 544, 456, -628, -64, 907, -44, -816, 270, 685, -265, 36, 1000, 104, -1055, -127, 746, -2, -79, 823, 254, -781, 45, 863, -236, -719, 535, 708, -427, -199, 684, 5, -621, 253, 398, -641, -272, 900, 250, -824, 15, 670, -448, -782, 314, 324, -454, 117, 640, -474, -967, 174, 375, -590, -186, 715, -105, -894, 71, 468, -557, -481, 555, 85, -777, 80, 728, -286, -636, 351, 121, -821, -89, 910, 136, -526, 270, 232, -751, -253, 826, 173, -539, 408, 717, -514, -578, 587, 400, -482, 123, 673, -190, -296, 740, 407, -735, -188, 755, 13, -473, 543, 729, -382, -303, 504, -82, -639, 362, 840, -215, -386, 521, 128, -744, -73, 611, -215, -416, 576, 349, -773, -289, 643, -74, -737, 95, 357, -451, -187, 670, -21, -899, -150, 338, -451, -336]
873c36J045m20j080M92O75p55j72J072j05j060L51Q89o68o11Q42K17r10K72R53
892F91n04p68P46L81j024r6J126j37q32N57O31r26m88R11P9p53N05P78q06o36
912e65Q72K11r71J81J001m48q33O86N62q64j87Q27l08q49O87P93p41m38P77j21
932B72r62L67R47n31n30P93J30j085M9J016k95p83O09M89q00j44Q70k76q71N37
952a98O93p62l65J006J22j010J23P21n44m89R07L64q89J2P89m97q23P65O79p63
972a59k01Q61k30q81N17P11p51m48R21J79q98K44Q32n61p08O61L04p48K35R32
992H12m50r10N71N22q22k00J039J2r04K77O05o61l79Q39R8q95K59Q55n40o29P03
1013B02L03r09q9Q91j97o58O04M80r08l74Q28Kp28M78P27p00n90P22J49p88K47
$$ y = [-336, 709, 289, -791, -299, 376, -379, -551, 521, 416, -644, -293, 596, -72, -683, 159, 376, -534, -262, 691, 187, -581, 165, 546, -478, -574, 552, 415, -417, 140, 771, -155, -643, 268, 347, -406, 99, 877, 71, -565, 307, 518, -453, -272, 729, 281, -552, 134, 696, -168, -355, 472, 164, -685, 2, 795, 54, -384, 393, 272, -690, -323, 624, 93, -437, 356, 486, -599, -550, 466, 171, -612, -3, 486, -314, -458, 412, 136, -735, -198, 495, -267, -632, 374, 496, -514, -391, 330, -214, -703, 204, 568, -321, -309, 480, -17, -840, -75, 604, -159, -360, 501, 271, -610, -93, 618, -133, -581, 340, 519, -379, -135, 697, 136, -572, 89, 393, -355, -120, 812, 362, -548, 23, 545, -277, -477, 562, 574, -330, -53, 552, -109, -488, 351, 449, -446, -187, 668, 128, -501, 202, 505, -404, -493, 398, 201, -457, 147, 627, -281, -655, 173, 175, -553, -75, 652, -48, -638, 84, 233, -555, -308]
1034c08Q35n10o65P18M19q63j00Q26k66p47N66O46o53k72P28j69q79M23Q02n40
1054im02Q18J19r98M1Q63l28n61O73M00q23j19P90k27p21N34N37p53k48R38M3
1075E67r13K11O56n92m66Q18L23p61N9O58n59o63P23N24p48j21P90k47p93M20
1095a14O05o58k87P78Qq16L29P29n73o23O37K69p00J29Q08l49o90M94L18p93o4
1116e63R72n1q21L14N55o37l54P38J29o96K35O28n17m50P37K14q97MQ70k22o19
1137d31N50M43p45k70P21r9o16N09O36o73m42O92N2p72K53P98m14n49N83K43p63
1158b94N0P64l28o86N51N22o63j87P30j64q11L15O41m61k50P26k6q98J22P50l78
1179B5n04O45L46p70j23O84k16n76M61L95o73j32Q40j01p94K76O02n42m42P22
$$ y = [-308, 527, 17, -648, 70, 489, -374, -474, 352, 86, -661, -95, 551, -102, -374, 354, 185, -694, -271, 531, -9, -411, 407, 526, -472, -431, 432, 104, -457, 216, 616, -207, -326, 464, 237, -484, 50, 587, -166, -414, 524, 567, -346, -135, 521, -71, -537, 281, 604, -157, -98, 560, 1, -662, 61, 585, -163, -284, 506, 259, -534, -114, 491, -167, -454, 324, 332, -484, -155, 574, 1, -622, 15, 284, -416, -287, 521, 172, -518, -24, 294, -499, -563, 409, 358, -463, -149, 406, -231, -585, 153, 282, -414, -179, 449, -68, -518, 219, 433, -464, -460, 410, 188, -431, 119, 562, -183, -453, 268, 169, -447, 62, 698, 25, -417, 275, 327, -445, -192, 606, 192, -357, 226, 469, -294, -244, 520, 192, -494, 57, 579, -84, -271, 459, 295, -516, -201, 440, -21, -271, 455, 429, -469, -347, 403, 25, -479, 166, 512, -258, -381, 303, 87, -489, -28, 367, -306, -438, 402, 301, -493, -217, 385, -157, -599, 123]
1199A23K41o42R9N69m73n44O17L61o51J5P71k70p50L76N11n42j80P06n4p01K91
1220a27O21n09m42O50J32p14J62P83k88n81M26K35o83jQ16j30o37L92M18o99k95
1241d71P91R8o75J77N31m13l67O13O8p49J28P57l42n72N52L92o92k37O38j18n53
1262d44M54M98o01k85O17m2p29K50O96l59m21N39J12p19L9P40k43n69M39L36n67
1283b59n4O77j97p30L32N62m53k22O51L8p15Q9N20l75k68P10J87p87n0P05j76
1304A85n63L62L52m96l5O39k00o49L88N31n96l88O98K13o16J13N01m14m42N29
1324A12K31n89R8O82k74o63L74L70n47r0P15r1o95K38N36m29l38N45M1o44K17
1345b01O62l81m91M75K40o82n1O88r0m60L77K43o76j82P48K3o36K10N46l79l75
$$ y = [123, 364, -278, -179, 390, -83, -627, -10, 351, -300, -285, 486, 216, -534, -158, 353, -189, -369, 337, 283, -418, -127, 494, -15, -457, 193, 325, -389, -227, 556, 268, -313, 113, 348, -335, -336, 480, 350, -287, 105, 523, -176, -471, 320, 418, -257, -80, 451, 38, -329, 284, 352, -397, -269, 488, 146, -426, 126, 518, -174, -411, 227, 109, -444, 10, 508, -93, -378, 239, 197, -532, -282, 414, 55, -366, 173, 285, -434, -395, 345, 102, -467, -28, 308, -259, -313, 364, 167, -563, -231, 331, -122, -344, 307, 345, -370, -281, 239, -136, -404, 306, 493, -294, -344, 361, 185, -378, -16, 336, -160, -195, 444, 244, -405, -17, 514, -82, -470, 228, 441, -175, -62, 439, 25, -417, 112, 343, -246, -148, 534, 260, -403, -29, 341, -206, -296, 419, 328, -367, -129, 407, -22, -360, 185, 226, -418, -201, 461, 80, -411, 64, 304, -378, -429, 259, 169, -291, 86, 329, -347, -529, 219, 242, -394, -184, 362, -17, -392]
1366c92M88J05n78J77N65l88m47N97L43o70j64N52r8m77M14M15n15k37N97p4o38
1387d25K52N94l60l18N36P3o92R3O57k63m74M33L11n33q3N68j74n42L62L69n29
1408a45j63P02N6p09M9M71l42k26N97J19o65L4N86l08n09M48L73n31j27N55j16
1429A49n12L18L64n38k36O59O7n94J49N31l89m37M52K27n11R2N88k73n18L61K68
1450B17n31l5O77p1o28K33M75m27k67N16O6n25J76N04l32l51M96J66o64k1O47
1471C21p7m30L24K43n50j24N75o7n25L39M74m64l64M79J17n09J37M84l23l70N09
1492A99J95o00l0N48j86n00L83M22m60j93M69j27n25K54M95l56k50M84L2o16J00
1513b62N33k51m15M33K81n16p9M92j44m62L40L17m91j10N95j1n70J46M20l72k64
$$ y = [-392, 96, 201, -377, -200, 365, -23, -470, 127, 470, -200, -364, 188, 90, -387, 27, 442, -73, -310, 287, 213, -425, -173, 421, 61, -257, 279, 352, -340, -247, 410, 147, -327, 106, 417, -116, -199, 369, 195, -347, 15, 384, -145, -308, 394, 450, -259, -210, 261, -81, -307, 290, 409, -256, -222, 364, 56, -453, -5, 368, -163, -290, 265, 149, -363, -45, 319, -219, -455, 204, 271, -323, -174, 357, -32, -469, -17, 210, -301, -209, 379, 106, -412, -51, 217, -314, -349, 328, 257, -371, -138, 337, -90, -357, 159, 225, -300, -124, 380, 48, -303, 193, 359, -305, -326, 321, 244, -186, 138, 381, -169, -293, 282, 215, -310, 29, 503, 39, -325, 154, 271, -238, -101, 383, 60, -310, 199, 394, -206, -236, 312, 126, -374, 9, 431, -29, -222, 247, 120, -405, -151, 344, -12, -262, 222, 254, -362, -262, 271, 20, -395, 38, 319, -197, -276, 216, 72, -390, -50, 267, -224, -334, 261, 250, -320, -174, 246, -126, -390]
1534c90N23J89m95K7M24l15l87M76K83m82n9N06j50m73L06L52m27k14N10L5m73
1555b34K27M08l98l43M45J83m92R0N23k32m48L20K00m56JN60j16n05K64L63m44
1576h4k35N09N5m83J46L98l00k81M56O9n68O2N25j66m10L74K66n03j81M73l4l96
1598c08L23L31m43k52M75J7m75J56M62k76l46M01J73m75K9M35k13l98M01K90m25
1619a18j23M63q9n02K49L97l02j75M47j4n10J15M34k30l25M49J86n10k1M63j47
1640A37l98L00K64m06p9M83o3m71K08L26l82k24M98J31m49M5L79k88l54L96K31
1661B84m36J4M33j73m32K89K96m11j32M60k2m38K05L54l32k92L98O8m21J08M92
1682C12k40l86L04J67m10k0M78p9l89K44K51m26j20M71K4m52J48L95k66k64L75
$$ y = [-390, 133, 322, -173, -146, 278, -37, -424, 52, 335, -147, -206, 300, 150, -323, -17, 335, -92, -306, 204, 239, -234, -7, 401, 3, -340, 105, 288, -204, -114, 409, 177, -271, 49, 249, -207, -206, 354, 238, -267, -3, 360, -84, -319, 190, 245, -238, -92, 306, 6, -275, 181, 250, -318, -256, 269, 103, -307, 67, 333, -170, -351, 122, 88, -308, 15, 346, -97, -349, 126, 143, -332, -176, 286, 10, -336, 65, 238, -237, -208, 227, 14, -384, 17, 307, -118, -241, 222, 133, -369, -120, 277, -25, -200, 247, 233, -277, -162, 272, 42, -283, 166, 352, -158, -179, 284, 137, -261, 39, 303, -103, -182, 301, 238, -233, -25, 301, -81, -305, 193, 324, -125, -80, 299, 11, -343, 53, 284, -152, -138, 295, 122, -310, -21, 275, -136, -268, 192, 170, -268, -63, 291, -41, -333, 65, 133, -288, -180, 312, 72, -314, -10, 157, -253, -273, 205, 126, -263, -19, 232, -194, -314, 157, 181, -271, -123, 272, 6, -258, 117]
1703A17P5m23O2M10k06k80L81K09m65j22M08m2l61K69L21l37k06L54j1m10K12
1724d5L91k75k90L76J12m30L7L86j84l36L35K09l66n6M05j33m37K08L32k79j44
1745a84L91Lm55R1L46k42k14L93J25m45oM05j69l53K98K33l74q7M18n2l82J98
1767f2K71l36j87M30P8l74Q5L32k67l12L42J93l20jL70j75l36K55K25l33j04M22
1789A96l3l81J67L26k78k24L45N5l79J22L83k07k88K80J25l85kM18p8l21K23J99
1811B63l65j22M06j0l52J68K97k89k28L56P3l77M8L35j65k56L18J76m16p1L68
1832A57j13l23K69K93l23j57K89k0l29J48L27k47k11L38O6l90L4L74j55k98K67
1853dJ85l17k7L44j12l51K07K61k76r4L53K2l94P8K92k01j86L37J20l53kL20j59
$$ y = [117, 192, -231, -169, 241, 35, -245, 136, 345, -120, -242, 166, 124, -237, 32, 353, 16, -190, 164, 153, -257, -45, 346, 71, -219, 157, 269, -161, -124, 262, 78, -258, 77, 286, -80, -136, 269, 136, -301, -93, 239, -40, -184, 207, 210, -245, -154, 192, -50, -264, 129, 254, -191, -197, 208, 39, -314, -16, 217, -157, -244, 174, 122, -260, -62, 209, -127, -314, 116, 194, -180, -95, 237, -30, -342, 0, 193, -127, -128, 242, 67, -269, -14, 211, -122, -226, 196, 163, -218, -51, 275, -3, -227, 118, 173, -206, -84, 299, 92, -196, 84, 209, -176, -178, 240, 162, -159, 64, 263, -102, -224, 182, 172, -180, -12, 285, -4, -232, 124, 197, -180, -132, 203, 38, -218, 100, 276, -140, -211, 157, 44, -279, -10, 283, -40, -197, 92, 72, -257, -109, 218, -29, -240, 98, 164, -226, -192, 182, 27, -271, -4, 181, -136, -163, 181, 69, -282, -75, 186, -90, -184, 169, 191, -203, -125, 167, -34, -220, 117, 237, -116, -118, 202, 43]
1876D3k72K65K12l23o3L32m0l25J77K37l09j42L51M2l14J09K83k56k48K92J58
1897B09l01LL47j61l14K32J65k96l5L53o5l41J61K73k66j96L17K5l14R0L20j77
1919B9k42K63Q3l49KL55p8k46K03J63l31r9L43ok95J58K46k43j88L01N8l27Q0
1942a20K89j58k18K66J46l14l3K89j14k60K31K55k84j28L00l4l02J16K80j77j53
1963a23K72J5l23N9L21j45k35K25J49k64m8L01r1k96J65K27k73p7L27k2l27Q4
1985g9K30k15j38L24P9l29K3K72j58k43K50J46k54n4L15j02k90J85K08k66j16
2006b12K92J0k62J25K41k41j98K61J16k90M5K88j11k69J86J29k61NL10o6k92J68
2028b6K19k36j14K55L0k85R3K60j73j71K48O4l01KK97p4k07K03J17k79p7K86k4
$$ y = [43, -229, 36, 248, -75, -138, 194, 154, -171, 6, 243, -66, -208, 143, 185, -129, -20, 263, 7, -241, 51, 209, -92, -89, 258, 97, -217, 15, 180, -116, -151, 202, 137, -204, -43, 230, -36, -232, 85, 110, -204, -114, 206, 29, -213, 50, 133, -216, -214, 141, 63, -183, 20, 183, -148, -247, 96, 90, -205, -47, 199, -44, -232, 69, 127, -200, -120, 169, 11, -207, 59, 205, -109, -142, 147, 33, -227, 4, 259, -25, -153, 147, 113, -189, -73, 207, 30, -123, 149, 164, -159, -100, 221, 76, -159, 66, 215, -49, -97, 204, 113, -183, -18, 209, -64, -141, 186, 164, -163, -79, 151, -64, -202, 122, 201, -128, -105, 167, 9, -234, 16, 162, -92, -146, 169, 67, -223, -38, 170, -96, -212, 80, 90, -172, -47, 194, -47, -245, 16, 132, -158, -113, 175, 64, -205, -19, 110, -151, -146, 164, 98, -194, -26, 193, -43, -157, 98, 128, -157, -64, 196, 23, -148, 100, 164, -137, -135, 162, 88, -119, 84, 201, -78, -155, 131, 107]
2051A07k36J34K31k28j50K51K2k75J00K35j69j88K31J26k79j1K36r4k23K08J65
2072A93k39q4K62n8k90J30K41j67j23K37%k92N8K83j67j74K28J00k58kK42p3k36
2095a89J66J64k36p0L04j8k63O7J89j76j21K77O1k56L5K21j50j89K12J32k26k7
2117i3K49q5k20J59J73k28j09K66K3k27R6J99j86j57K16O1k52O8K58j03k32J52
2139B8J07k19j7K56n5k23J48J38k11j07K39K0k39R1K02j46j60K20M5k61J2K48
2161A16q4j62J64J08k52m6K29l1k19J60J95k07j41K09J9j97P4K10j74j30K15O0
2183A16k25mK31j09j75J69J39j85l9K20n7k43J13K14j67r6K20mk38O6K12j42j42
2206a26K20P2k21k4K31q1j83J35J26j96m9K55l7k27R0J56j62j25K28N8k20M4J89
$$ y = [107, -129, 5, 236, 8, -142, 109, 131, -144, -44, 191, 22, -166, 65, 191, -88, -99, 137, 43, -180, 28, 193, -46, -130, 132, 74, -216, -86, 155, -12, -135, 102, 102, -190, -132, 151, -16, -190, 38, 138, -120, -122, 120, 47, -189, -23, 141, -95, -165, 139, 121, -142, -75, 114, -62, -183, 94, 155, -101, -66, 155, 5, -184, 28, 160, -66, -93, 156, 71, -149, 10, 183, -45, -154, 112, 135, -92, 4, 203, 17, -140, 76, 137, -115, -47, 211, 108, -124, 28, 135, -84, -101, 155, 100, -123, 25, 163, -48, -155, 84, 104, -135, -44, 158, 12, -148, 72, 117, -144, -132, 116, 32, -130, 34, 142, -110, -156, 73, 42, -177, -17, 178, -29, -170, 39, 58, -139, -65, 145, -29, -159, 56, 116, -109, -113, 118, 9, -166, 3, 142, -43, -82, 138, 81, -162, -49, 165, -2, -98, 122, 118, -120, -54, 158, 16, -126, 94, 166, -55, -79, 152, 71, -112, 23, 149, -47, -96, 159, 122, -105, -15, 141, -21, -146, 82, 140, -80, -36, 153]
2229A53j39j81J91J07j94oJ91p2j96J46J27j95n4J99rk18J06J83j76j20J79M9
2251G1k15O5K25j19j78J47Q9k07pK17k5j78J12J23j92p9K31%k05R2J77j45j08
2274a09J88M4k25J6K08r5j41J77J07k26m4J88l5j70J29J70j70j09J85Qk00O9J80
2297A45j17j14J67L7j84K1J78q6j84J66J20j85k2J91o7j97Q6J55j29p4J94Rk26
2320a16L9J67j12j09J81N8j98j1K07r8j53J30J17j79m7K09l1j66Q4J27j64r7J87
2343B5N6j78O0J51j32j45J68R6j89K2J76p8j68J19J29j63m2J91j9j79R0J63j56
2366cj03J73L4j82L5J98r1j41J35O4j97j5K19m0j62J22R5j79n4J85Mj78O6J54
2390A39j33j13J73L8j92J9J75j03j32J81O1j81m9J86n4j53J21J45j46r9J84j7
$$ y = [153, 14, -167, 24, 131, -63, -69, 122, 50, -146, 0, 127, -68, -122, 77, 68, -150, -44, 139, -37, -157, 22, 71, -144, -79, 146, 27, -151, -4, 85, -122, -129, 88, 63, -115, -3, 120, -72, -151, 80, 80, -125, -33, 144, -1, -109, 79, 123, -102, -86, 122, 27, -114, 63, 170, -56, -100, 88, 53, -117, 12, 182, 12, -97, 88, 96, -104, -35, 145, 28, -86, 81, 118, -66, -45, 133, 47, -137, 29, 149, -36, -58, 133, 66, -131, -45, 110, -19, -93, 101, 110, -116, -77, 90, -22, -131, 50, 108, -90, -101, 106, 8, -145, -15, 102, -77, -124, 85, 54, -112, -28, 99, -65, -162, 25, 81, -97, -37, 114, -18, -163, 5, 101, -88, -66, 110, 32, -136, -17, 112, -51, -93, 98, 79, -100, -10, 153, -3, -106, 67, 101, -81, -46, 152, 61, -80, 55, 119, -78, -93, 126, 86, -76, 46, 141, -38, -92, 93, 97, -81, -15, 139, 6, -107, 66, 104, -88, -69, 106, 3, -129, 52, 113, -68, -117, 69, 15, -138, -17, 128, -18, -117, 67, 50]
2412E0j86O6J86j36j03J59J6j62K5J51o6j37J30R1j48k3J83m0j98J03J44j34n4
2435h3J74J5j83L2J57j29r4J65P4j91J2J53p3j53J47R9j52m9J80j6j59O2J30j40
2459b2q5J67L8j60N0J44j16j37J50P1j51RJ65o3j82J18R6j53l5J81j8j75P9J40
2483A11j38q8J69Rj61M5J45o9j30J36M9j72k0J64rj41J00J02j66o5J79j5j35P6
2507b4J36j29r7J49K7j37lJ65p7j10J24P8j49k8J56n7j43J25J35j49n2J42j0j64
2531i2N1J60r2r6J39K6j56J9J47p7j19J16R2j49l5J69l3j55O6J20j24o6J66L7
2555A14j88L1J19q8r5J50N5j53JJ41p3j35J18R9j43m6J71m3j27O9J21j32p9J49
2579C6J3j48M4J37q1j30J27O0j55L3J59o3j31R7Q1j42k3J64j6j42P0J14j26o9
$$ y = [50, -136, -70, 116, -20, -123, 36, 52, -110, -85, 66, 0, -137, -7, 84, -64, -87, 96, 56, -142, -39, 105, -29, -83, 91, 106, -77, -45, 112, -17, -111, 54, 128, -63, -51, 102, 29, -124, 23, 122, -30, -79, 101, 85, -74, -12, 118, -22, -107, 60, 98, -62, -12, 132, 16, -121, 29, 100, -51, -42, 123, 60, -122, -4, 92, -61, -96, 85, 67, -108, -29, 111, -27, -115, 54, 63, -98, -53, 92, 23, -107, 29, 78, -94, -114, 50, 41, -100, 0, 102, -64, -129, 50, 35, -100, -24, 112, -17, -114, 35, 62, -75, -78, 87, 10, -100, 24, 102, -47, -75, 81, 24, -119, 6, 141, -8, -60, 82, 72, -92, -41, 119, 27, -69, 70, 96, -60, -41, 106, 29, -90, 26, 118, -31, -66, 103, 70, -85, -19, 101, -23, -89, 77, 114, -74, -43, 76, -12, -107, 43, 98, -55, -54, 87, 14, -121, -3, 96, -47, -93, 78, 35, -92, -23, 98, -34, -113, 36, 49, -99, -55, 82, 1, -129, -2, 58, -97, -64, 95, 32, -99, -2, 79, -63, -86, 78, 62, -80, -10, 104, -22, -91]
2603i1J61J1j44L4J41p5j13J38N1j63k7J66l2j21J05Q9j44n3J29Oj33O2J34j32
2627aq0J34L7j61J5J56q7j04J17P6j46k7J46m6j48J09J09j20n7J40j6j59N6J43
2651H6r3q1J33J9j48J8J41n5j25J16O1j18l0J51l4j30Q3R0j20n5J61J1j42K4J18
2676H1q9r4J42N4j39RJ39q3j19J15P7j22k1J42k9j41Q5J04j22n6J25K2j35M9J20
2701A14q6r7J10M3j38J1J51n3j27Q6Q0j40k2J33jj45O8J14j31n2J29J1j30L2J39
2726I9r6r2J25M2j49j0J52l9j25J06O9j14m8J28l5j15R4J10j29p6J42Pj36M6J15
2751G1p0q7J08N2j27oJ18l4j11Q0J03j24j7J14k5j41P0J18r0o4J12L5j29J2J26
2776I4p5q8J13N9j44j0J42m2j19P9Q5j05n8J45J0j39L8J06r5r6J37N4j31MJ33
$$ y = [-91, 70, 81, -63, -29, 112, 37, -76, 62, 113, -50, -77, 89, 57, -64, 41, 130, -14, -67, 62, 68, -65, -3, 131, -1, -81, 53, 90, -71, -56, 100, 13, -91, 26, 102, -44, -71, 75, 29, -119, -10, 99, -21, -78, 62, 46, -113, -57, 86, -7, -88, 45, 64, -84, -66, 75, 20, -105, 11, 72, -46, -76, 75, 41, -89, -6, 84, -36, -91, 70, 81, -61, -37, 81, -8, -102, 40, 94, -45, -36, 103, 20, -99, 16, 93, -29, -50, 92, 63, -78, 7, 111, -11, -67, 58, 80, -55, -6, 114, 28, -69, 41, 84, -54, -43, 108, 55, -72, 14, 94, -46, -68, 65, 64, -81, -13, 101, -30, -82, 47, 58, -72, -40, 99, 3, -89, 36, 78, -71, -81, 71, 32, -93, 13, 82, -32, -80, 48, 13, -102, -8, 102, -27, -103, 39, 46, -90, -44, 71, 1, -86, 22, 74, -53, -59, 59, 25, -86, -6, 97, -27, -44, 70, 45, -96, -26, 92, 2, -62, 50, 85, -44, -32, 94, 19, -69, 44, 103, -41, -51, 91, 49, -70, 9, 94, -11, -69, 76, 86, -53, -15, 91, -4, -100, 37, 91, -40, -36, 97]
2801I7p1j21J09P6j29j7J25k4j34P4R6j13o2J29Jj23N1J12p8q7J03L4j26J7J38
2826G7m6j21Q7O5j28j8J44j1j17N7R8j13m5J14J5j27K1J35q3q1J19L7j43RJ33
2851G8n1r9R9P1j16m6J34j2j25O9J13j00p0J09J8j28L4J16o4p6R8L7j28KJ23o2
2877B4j07Q2Q0j07m1J25oj48N9R2o7n9J28L2j50PJ14p0p7J04O5j16l2J29n1j07
2903i7P8Q7j00k7J16rj18M6J00r6o3J11L5j10L2R6o6j05J00O8j14j0J27m8j06
2928g3O6R1j02m2J24Nj21L7J11q2p4Q2L3j11K2J01m3q5P5N9j16l9J45j3j08N6
2954bQ5j17m8J38j4r7K4J20o4r9Q8M8j01j6J12n6p1P4P5j04n1J02qj00O1Q9p5
2981go6R8L1j43L8J17n4j02R2N8j09qJ13l4j02N9Q9j00k1J24k3j13L9J01q3o0
$$ y = [97, 26, -95, 14, 90, -39, -56, 69, 45, -89, -15, 81, -32, -94, 35, 36, -87, -36, 76, -2, -89, 14, 48, -78, -61, 77, 31, -90, -3, 62, -66, -84, 60, 49, -68, -11, 87, -26, -71, 43, 58, -69, -48, 87, 4, -77, 42, 79, -64, -55, 78, 27, -72, 27, 98, -18, -64, 70, 58, -67, 2, 115, 15, -55, 54, 72, -56, -22, 94, 30, -46, 52, 89, -39, -37, 86, 24, -83, -1, 79, -28, -69, 56, 50, -98, -39, 53, -14, -73, 55, 87, -63, -56, 58, -12, -89, 15, 80, -36, -68, 61, 10, -97, -19, 68, -32, -59, 57, 48, -70, -24, 76, -20, -83, 28, 63, -47, -15, 81, 15, -90, 10, 78, -36, -46, 81, 33, -73, -7, 84, -18, -60, 64, 69, -52, -15, 96, 14, -60, 22, 55, -56, -34, 67, 24, -61, 14, 73, -43, -82, 63, 50, -58, -2, 83, -34, -82, 56, 42, -55, -31, 89, 25, -74, 14, 62, -39, -55, 57, 1, -70, 4, 79, -25, -76, 26, 18, -82, -21, 68, -7, -73, 25, 56, -87, -49, 68, 14, -88, 4, 62, -47, -55, 58, 24, -78, -19, 70, -30, -51, 73, 50, -63, -24, 77, -6, -66]
3007f6J14K9j24NR6o1p1J04O6j18j0J02l7r5P3O4q5n1J22J7j23L2J03q2p5J04
3033C3M0j14J6J00n6r6Q5N7j02rJ05k3r7L6Q5r2l4J11j7j00L7R8o1r5J07L1j14
3060f9QJ21m5q7Q3M4j06j2R3lr7N0R0r3o5J18J4j16M9Q2o2o7R0M6j27J4J00k6
3088B7r0Q6M7q7j9J03l2j03O9P6o3o2J11J5j38L4J01n2o5Q6K3j05lJ06l0j03O7
3115aO8r4k9J23j8j17M7P5p6n0J03L6j09jQ4o0o8J02M9r7kQ1k9j00P0Q6j13j8
3143e8Q5Rq9K7R0r2m6R8K1j04K5R0k7j07P7N2r6pJ03j2j05O3O7o8n1J04Rj05M2
3172eP6o3p1R9K4j02MJ01k4j06J03K1r5j6J07j4j00O9O0o1n1P2K1r5K7R3o9o3
3200e8P8N5j03j7J09m0r1P5O0r8k7R4j0j01N4R0p5n4R4Mj15K9R6l9p1N4O5j05
$$ y = [-66, 48, 77, -47, -42, 54, -7, -78, 26, 92, -26, -36, 66, 29, -66, 7, 71, -14, -65, 57, 74, -49, -17, 86, 4, -71, 33, 73, -41, -25, 75, 19, -77, 8, 65, -37, -46, 59, 36, -61, -25, 60, -32, -66, 45, 28, -72, -35, 63, 2, -93, 14, 45, -69, -61, 60, 15, -72, 11, 55, -51, -63, 30, 27, -70, -20, 70, -23, -88, 30, 44, -72, -23, 59, -3, -70, 20, 66, -61, -47, 53, 27, -63, 23, 70, -17, -36, 67, 35, -68, 1, 77, 14, -48, 63, 78, -60, -26, 75, 23, -42, 44, 67, -38, -41, 65, 35, -68, -1, 67, -27, -56, 67, 49, -68, -21, 54, -22, -72, 31, 67, -42, -43, 41, -19, -87, 15, 64, -33, -35, 46, 17, -83, -13, 73, -40, -58, 27, 36, -53, -26, 64, -28, -74, 24, 45, -59, -34, 56, 29, -78, -1, 51, -45, -52, 51, 39, -66, -3, 64, -4, -55, 49, 58, -47, -5, 71, 8, -63, 36, 60, -42, -38, 63, 39, -67, 36, 57, -38, -54, 53, 39, -61, 8, 68, 7, -44, 28, 49, -46, -19, 74, 5, -58, 20, 75, -28, -45, 64, 24, -67, 8, 68, -30, -57, 37, 27, -74, -20, 70, -5, -59, 35, 39, -76, -47, 49, 10, -61, -7, 58, -47]
3228d7qR0j9r2P5N8r3k0J04j4j04M4P2o4l9R0J8j06OR4n4o3Q2M7q8qR0m2o9N3
3258gO5p5m1J21j4q6L4R2p4o2Q4K0p9K2P3m7q2P6K3r9J2J16m1q2N4O0q5k2P7J5
3288D8j01L5P9o5n5P4L7j02J3P9m0o0N5N3q7k9J02k4r1N9P9p8l3P0Rq0K2Q5m8
3317Fo8P0L8r7RR6l9o7O4M6q0k6Q4qq5N4N5n5l7Q4J2j09L9O3m9m7P8L1q2j7R3
3348E6l6o5O0M7q8k3R8j3q7L9N8o6m4R2J7q5K0P1m9n6O6K4p2mQ4l1q6O0P3q5k4
3379d9Q7qr8N1N9o3m4P9J7q6K7Q7m0o4N4K9q0%Q8j8o6M6M2p7k0R6j0o4K7M9m8
3410Cm3O8K5q1KQ1m2o7O5N1q5j6P5Kr9N3P9p5k9O0J9r8L4Q1n6m6O1L9j00J0Q9
3441F0m7n6P4K7p5j9P4j2p7L0O5l9m3P5kp4QQ2n1m8O0L4p2k0Q4j8q4P4M9q9l4
$$ y = [-47, -55, 35, 16, -76, -1, 57, -36, -56, 48, 34, -70, -26, 46, -18, -57, 33, 51, -55, -49, 45, -9, -72, 10, 57, -31, -39, 51, 9, -60, -7, 58, -17, -58, 63, 49, -37, -3, 89, 15, -47, 37, 57, -22, 0, 73, 26, -56, 20, 43, -56, -44, 72, 31, -51, 3, 63, -22, -44, 33, 48, -53, -18, 61, -4, -59, 15, 52, -50, -37, 42, 2, -58, -3, 50, -37, -66, 36, 12, -79, -20, 59, -19, -52, 18, 27, -53, -31, 54, 6, -62, 8, 46, -51, -42, 54, 15, -52, 12, 58, -22, -48, 36, 28, -57, -3, 52, -3, -40, 44, 56, -53, -14, 49, 0, -47, 31, 62, -20, -37, 56, 20, -45, 15, 62, -26, -49, 49, 36, -51, -12, 46, -20, -64, 28, 45, -40, -20, 51, 2, -54, 12, 36, -36, -40, 44, 13, -73, -13, 60, -25, -49, 38, 30, -68, -17, 42, -21, -65, 14, 31, -55, -28, 59, 19, -45, 9, 38, -42, -42, 46, 28, -38, 8, 50, -27, -47, 49, 39, -25, 2, 51, 3, -40, 28, 53, -28, -26, 55, 13, -54, 11, 62, -23, -39, 36, 38, -61, -8, 71, -4, -33, 27, 46, -52, -18, 63, 7, -39, 22, 61, -39, -29, 60, 13, -43, 31, 58, -17, -36, 38, 26, -51, -21, 44, 5, -38, 37, 35, -39, -31, 51, 0, -48, 12, 46, -26, -46, 38, 20, -64, 10, 59, -30, -64]
3472f4R1lp5L8N9n6m4P2Pp6K4Q3n8o8P8L5o5oQ8l2q1N6N3q3qR3j6r0M4O5p0l1
3504d0Q2L1j00J8N7k3n2M6L3p2j2Q3j4o2J5O6p9k5P9mo4L2N2n5m1O9J8p9J0O9
3534C8l3m9N7K9q6lO0np3M9O4p9l2Q1Mr0L4O4m6l2O2J0o1j9Q1k2n2O3L1p1j3Q5
3566D6j8p6M8M3n3k2P5kq0K7O0m4n2Q3J7p2j1R1m9n4N6M3p1j3P6qp3K5O3n6k9
3597c0O7Mo8L2O4n5n9O4K8p3mP7j9p3L8N0o0k1O5oq2L0P8o3m2P7J8p8J6O8k9n9
3629d5M6L3o8rR5l8m6L2M8p2k6O9Po4K6O5o0l6O8J4q7L3O5l8n4N9K7p1j6P6j1
3660B2p1M8N5o7k0P7j1p4M9L9l1l2N7J3r3J6P6l5o6P3K9o5j9O9j7o6N2N4p9j2
3690b9P0Pq2K5N0n3k6P3J1o6KN6l1o6O0M5n8k3O9j3p2M5M1o5k7P9Kp7K3O7m2o5
$$ y = [-64, 27, 24, -51, -13, 46, -10, -54, 18, 25, -51, -27, 56, -2, -70, 8, 43, -22, -28, 60, 28, -53, 3, 56, -27, -35, 58, 42, -48, -4, 61, -9, -40, 42, 73, -27, -9, 48, 25, -27, 19, 52, -20, -32, 51, 37, -25, -10, 56, -23, -48, 31, 27, -37, -5, 47, -8, -49, 20, 38, -41, -31, 38, 5, -44, 13, 42, -44, -47, 13, 8, -65, -16, 48, -31, -63, 18, 22, -68, -34, 30, -16, -48, 14, 24, -37, -56, 25, 3, -49, 14, 45, -26, -39, 46, 28, -48, 0, 43, -10, -32, 43, 41, -39, -12, 48, 4, -48, 35, 52, -20, -31, 60, 11, -43, 13, 56, -15, -28, 48, 40, -33, -8, 55, -1, -30, 37, 41, -27, 5, 69, 14, -45, 19, 47, -26, -30, 47, 28, -45, -7, 43, -17, -38, 27, 21, -61, -31, 47, -16, -58, 19, 37, -41, -25, 43, 14, -45, 1, 34, -34, -43, 52, 14, -32, 0, 48, -24, -50, 19, 26, -38, -12, 53, -7, -43, 25, 39, -48, -15, 50, 12, -42, 17, 44, -27, -43, 33, 22, -49, -1, 54, -13, -33, 44, 33, -41, 8, 47, 16, -16, 41, 54, -39, -23, 53, 18, -48, 25, 54, -11, -30, 39, 22, -44, 8, 62, -17, -29, 41, 48, -34, -9, 41, -12, -38, 35, 46, -20, -18, 38, 7, -59, 1, 46, -12, -35, 34, 21, -51, -6, 35, -30, -57, 22, 24, -53, -30, 37, -5, -70]
3722g0P1K9o9LR3l9p1M2N8p7KN9Lp0L0M1m5k3O1J1p4J7O6l2o1O2M0q3QP0m0n0
3754c8N3L1p2j4P9ro8L1O5m5l9N2K4q2K3N6m0n5N9L3n3k1P1l6n7M2L9n8k3P1n
3785A4o6J9Q4o1k9O4Lp2RP6m5m7O8L0p9RN9j0o6L7N6o9j1N9J1p6J6P0n5l9P3J9
3817E1q0PO5l1p0P4L8o7mO3j2p0M9N6o8k8O1Mo4J7N2m0m0N5K7p8mP6k4n1L3L2
3849B9o0j7Q2qp5M2L7n5k4P0j1m3J4N8l6n7O8K9p4PN4j0n9M4L8n0m1P4j7n8L2
3880a7O3o1l7O4km4J4P4m5m1N8Nn6nO1mo4L5M6n2k7O5ko6K4N6l7l3N1K5p3jP2
3913D6m6m4N1L8o7j0P8l3n1L0N5n8k4O5Oo3J2P0m7m9O5K1p9J1M9j7n5N9L5o9j1
3944c2O7k0o0L7M0n6k6O8pn0J7N4l8n0O1K7p9J4O5k0n4M9L6p4rQ0j4o8L7M9n7
$$ y = [-70, 1, 30, -39, -36, 57, 18, -53, -11, 47, -30, -28, 31, 34, -36, -6, 35, -10, -33, 28, 39, -35, -18, 48, 16, -45, 17, 57, -26, -18, 52, 12, -38, 15, 46, -26, -40, 39, 30, -38, -7, 58, 13, -26, 26, 50, -32, -9, 47, 7, -48, 11, 44, -9, -30, 41, 5, -52, -10, 29, -29, -52, 19, 14, -52, -33, 51, -10, -39, 25, 28, -44, -35, 41, -4, -51, 17, 47, -32, -23, 36, 26, -40, -3, 53, -16, -27, 32, 43, -33, -17, 53, -2, -41, 32, 51, -29, -22, 43, 12, -58, 16, 54, -13, -17, 46, 34, -36, 13, 69, 1, -27, 34, 38, -26, -9, 43, 3, -37, 18, 45, -33, -37, 39, 15, -36, -3, 29, -31, -48, 34, 26, -49, -7, 30, -25, -49, 21, 10, -33, -19, 39, 3, -54, 14, 43, -31, -24, 30, 20, -39, 5, 43, -7, -48, 26, 9, -49, -17, 46, -15, -52, 12, 10, -34, -20, 54, 9, -32, 26, 31, -25, -30, 31, 27, -37, -2, 44, -8, -35, 30, 28, -38, -14, 42, 5, -28, 23, 48, -25, -26, 46, 0, -44, 7, 45, -22, -32, 46, 13, -38, -8, 47, -11, -35, 30, 36, -27, -15, 55, 8, -41, 24, 45, -34, -23, 26, 9, -46, 13, 48, -21, -32, 35, 15, -45, -8, 32, -24, -50, 18, 11, -39, -22, 32, -6, -56, 5, 32, -47, -33, 32, 12, -42, 7, 43, -31, -40, 40, 26, -42, -5, 44, -13]
3975a3k4O2po1L2P1o0m8O4J1m4nO7k7n1N2L4o6j3P0k6o5M3N8n6k9M5K2o1K9M3
4006D7l7m7N3J0n6%N6po1L2M6p4j2O9oo9M1N8n2l6O5J1p2J3N6l0l8M8L2o4ML5
4038A5nn5M3M9o9k8P5Pp8K8O1n2l8N7L3o9RO9m2n9N9L9n1j5P6k0o9M3L6o0j5O7
4070D1jn6RM9l5m2O5J0o5J5N7l3n8N5K5o4j9R3j9n3K5M6n5l1P4j7n4K8N5m3l5
4101c3M7J2n7jP2k5m0L7K8n7j5O7l0n9N3L8o5k1O8jn6J9O8l9o2Q0Jo3KQ0k8o0
4133d0M5L9n6k4P2j2o2K5N3n2k1O7J6r7K0O5n4k6N6K5p7LO9k9n2M1M8l3l6P7j2
4164C8o9K3O5m7m3N8Rn7J7N3n2l6L8L7o3nO8k0o5L8M9n7k8P9Lp4L4L6m4k6N2J5
4196B6o0J2M9l0m2M0L4o7j2Q9j6n4K0M6p1j6O7Ln7K1O6n1l3N1K5o9MO4k1o1L6
$$ y = [-13, -37, 25, 18, -43, -11, 60, 0, -48, 16, 27, -17, -22, 45, 18, -33, 19, 53, -13, -26, 44, 18, -47, -4, 54, -2, -31, 14, 36, -25, 4, 47, 10, -37, 16, 26, -30, -30, 26, 19, -42, -10, 36, -38, -50, 19, 13, -56, -15, 43, -9, -45, 20, 31, -41, -28, 28, -2, -40, 8, 40, -24, -20, 15, 10, -45, -2, 47, -22, -50, 25, 32, -46, -18, 43, -9, -47, 10, 43, -26, -17, 52, 10, -49, 10, 49, -2, -17, 59, 39, -30, 13, 49, -11, -26, 41, 40, -16, -7, 42, 7, -35, 30, 40, -25, -10, 47, 14, -44, 11, 36, -28, -47, 46, 27, -26, -1, 45, -10, -41, 33, 16, -38, -10, 45, 2, -33, 14, 26, -31, -32, 40, 15, -25, 12, 40, -17, -32, 35, 5, -54, -1, 37, -28, -49, 19, 18, -38, -19, 49, 10, -52, 28, 29, -34, -32, 48, 20, -40, 5, 44, -12, -36, 36, 24, -38, -13, 40, -12, -33, 34, 50, -47, -27, 38, -16, -42, 14, 39, -38, -35, 34, 5, -47, -6, 42, 9, -27, 50, 38, -31, -8, 57, 10, -33, 25, 34, -23, -6, 47, -5, -41, -3, 34, -29, -34, 34, 14, -51, -13, 36, -21, -49, 30, 33, -41, -7, 29, -15, -41, 11, 26, -34, -22, 27, -3, -45, -5, 29, -38, -50, 39, 23, -31, -11, 35, -36, -52, 15, 18, -39, -18, 48, -3, -36, 15, 40, -29, -25, 39, 18, -43, -7]
4227gO7p2k6Q8j6p3M4O1o2l6P0lo4J5O4l5n5O9J9p1LN7k8l9M4K5o6j4P0k0o7M7
4259a1M4n0l2O9Rn8J8N6m4m9O2J0n6KN3k9n7N0M6n8j2O7j1p1L0O2m3l5O9nm0%
4291a4N3l2m7M5K8n1KO7k0n7K9M8n9j1N8no0K7M1l7m3N5J7o3J0N9l7m4N0K3n6
4322b4MO1qo3M3L3n3l1O3j0m7K2N1m8m4O0K1o5lP6l8m8O4K0o8rP3j7n9M5J9l1
4354a1k7O4j0o7M4N1l0m6O4J2o9ON6l2m1M1L5n3k2O6j1o9L6M5l9k8O6oo3K0N8
4385D0m2m4O7Rm2kN9k4n3M0K6m1oN7po3J9M9l1l7N6J3p8J5N8k7o1O7K5n8lN6k2
4418A5m6L2K7n1kN4Qp1L0M2n0k9O1kn4J7N4l4m5L9M1o6ON0k0m4K3N1n7l2P6j0
4450A3n5J9O3l4m4M9J3p0L5M9k8n3N0M4p3J3O1k5n6L9L6l3m0O0Jo4K8M7l9k6L8
$$ y = [-7, 60, -12, -38, 50, 34, -39, 5, 66, 4, -32, 38, 35, -29, -14, 50, 15, -40, 29, 48, -23, -20, 37, 9, -30, 14, 39, -27, -41, 29, 9, -58, -11, 33, -17, -49, 20, 29, -29, -11, 45, 1, -48, 14, 24, -32, -30, 23, -6, -63, -13, 33, -25, -37, 30, 19, -52, -22, 40, -3, -38, 31, 26, -14, -14, 39, 7, -40, 5, 33, -18, -16, 51, 31, -26, 3, 51, -8, -19, 39, 34, -26, 1, 42, 5, -38, 17, 34, -29, -19, 40, 3, -41, 9, 32, -24, -20, 41, 33, -30, 13, 46, -7, -38, 25, 15, -32, -10, 41, -7, -51, 9, 30, -35, -38, 38, 0, -48, 16, 36, -32, -41, 32, 15, -44, 1, 20, -11, -38, 26, 16, -51, -7, 44, 14, -32, 32, 44, -25, -19, 37, 5, -36, 5, 40, -13, -35, 31, 20, -49, -13, 32, -7, -35, 31, 25, -38, -18, 40, -2, -46, 21, 30, -12, -14, 45, 21, -32, 8, 34, -7, -13, 44, 37, -26, -7, 42, 11, -26, 30, 43, -35, -20, 38, 11, -50, 17, 42, -16, -19, 37, 15, -31, 1, 28, -23, -25, 29, 37, -34, -4, 38, -12, -41, 20, 18, -36, -19, 35, 1, -44, -5, 36, -30, -24, 26, 6, -38, -15, 36, -21, -53, 23, 13, -42, -23, 40, 6, -38, 11, 24, -46, -11, 38, 10, -43, 7, 51, -22, -9, 52, 27, -29, 10, 46, 13, -27, 33, 34, -30, -2, 45, 6, -20, 18]
4481A8K7p0jP0k7n0L5M7n4j3N5j9n8M2M6n5k0M5J6p1K1O4m2m4M8K2n9QN4l6m7
4512d8N5K1m9k2P0j5n7L0L9l1m1O1J7o3RO5l0m6N9J0n9RP1l6n2L9L6n5j8O3rn0
4544b7J8M1m8k4N7J1n6K1M2l1k5L9K7o4j9P6j9n6M6L8m3l1O5j7n5K2N8m1l9N5
4574B1Qn2j0P1l6l5N9ln2nO7l2l5M0N2o7j7M9Ro3J4M9m1j6N1Ko0NO2l5l4M1L4
4607D1o4JM4k7l7L0N1m3l0M9J1n6ON4l5l0O1Mn6RO1k7n8L6M1m8KM5j4n5M5J6m4
4640a7j9O5Lo6K3N0l0m1N3J6n3%O8m3m2N1J7n0j4O5pn3K8L8m6l2O0Lo1J5N8m3
4672dm0M3K7n4kN9k4n3L5L0l6k1N7%n2K7M7l7l7N2Pn5J3N2k5m1L8L0o9LN6k3l9
4705c6N3K6l8k8M1J3o0K1M1k5l1M6Rl9JN1k7m7N7Qm0qN1j8n6L5K9m8j4O4jo0J7
$$ y = [18, 45, -25, -26, 44, 17, -33, 2, 49, -5, -18, 37, 18, -40, 2, 48, -7, -27, 18, 34, -37, -16, 48, 6, -38, 10, 32, -27, -19, 35, -1, -48, 7, 28, -21, -43, 27, 12, -45, -15, 24, -7, -48, 13, 30, -33, -24, 41, 11, -35, 24, 34, -25, -16, 55, 19, -33, 6, 42, -13, -31, 32, 23, -27, -9, 32, -16, -40, 17, 28, -28, -7, 35, 4, -21, 18, 45, -19, -38, 38, 19, -37, 9, 47, 4, -27, 38, 21, -34, -12, 46, 5, -34, 21, 29, -23, -33, 38, 2, -33, 26, 23, -29, -34, 33, 1, -34, 6, 58, -9, -26, 23, 32, -31, -17, 32, -9, -25, 26, 28, -32, -27, 35, 0, -34, 7, 41, -23, -22, 22, -5, -42, -12, 39, -4, -34, 15, 26, -30, -24, 30, -5, -35, 26, 30, -26, -17, 44, 17, -41, -5, 36, -12, -10, 35, 21, -34, 11, 27, -17, -36, 29, 32, -34, -11, 39, 9, -32, 21, 37, -16, -16, 52, 9, -33, 18, 35, -15, -29, 36, 29, -24, 4, 42, -4, -36, 24, 27, -34, -19, 39, -4, -44, -1, 26, -28, -30, 29, 5, -48, -13, 17, -19, -40, 17, 17, -35, -8, 39, 2, -35, 17, 24, -31, -18, 34, 9, -32, 6, 36, -33, -30, 26, 3, -36, 17, 43, 5, -23, 18, 31, -29, -8, 33, 8, -23, 23, 32, -7, -6, 45, 18, -29, 28, 36, -4, -12, 39, 21, -35, 0, 29, -19, -33, 31, 30, -30, -13]
4738a3L3l0rK9J1l7oN3k9m2N0J9m4pM8j4n6K6L3l1l2O1Nm9QN2k8l7M5J9m6mN3
4771C1k9m0M5L2n8mM9nm8K2L2l2l0O8j1m2J7M4k4n4M9J0n1NN2k9k4L3L2m8j6O3
4803C9j4m5J8L4k8k4L3J2n5J3M1j0m3M2L4o8oN6j5n1L9K7l7k7N3rm1J6N2m4k4
4834c2O2j0m4jM6l3k3M3K2m1j2M5k0n2M3L8m7j4O0j9n1K6K7j8k1M1Om0QN7m4l6
4866c4L3L2n8LN8j7l7J8K6l5j5M8Mo2L9K5k4l6N3Rn5J5N1k5m6M3K5m3rL6Lm1K6
4899A0L6m6k5O5j7l4MN8m1n1N6%m8K6K6km4K5L1m7j0M1mn0L7L8m2j8M6ln2K4M2
4932C1k1m5M3Pl8JL6rl9L8J3l0rM5om7L0L2l9j9M7J4m9jN3k8l0J3L2k5oL7k8k2
4966a9L1K4m6nL6Pn3K2K9l8j6L7J5m9K1K7j7l2M2K2n1qM1km9K5M4l8k5L9jm6K5
$$ y = [-13, 20, -10, -19, 10, 21, -16, -22, 31, 2, -40, 10, 29, -15, -22, 26, 12, -44, -18, 15, -16, -48, 13, 18, -31, -23, 29, 1, -36, 9, 28, -18, -22, 31, 2, -38, 7, 39, -19, -23, 26, 21, -27, -5, 27, -5, -35, 33, 22, -20, -3, 41, 17, -37, 12, 22, -29, -24, 28, -1, -25, 8, 40, -8, -24, 39, 25, -20, -2, 32, 4, -20, 13, 25, -30, -17, 24, 14, -29, 13, 47, -21, -27, 29, 14, -37, 2, 29, -8, -35, 18, 9, -32, -16, 36, -8, -32, 30, 20, -24, -25, 21, -12, -35, 8, 30, -11, -23, 22, 2, -50, -7, 31, -16, -30, 30, 11, -40, -14, 13, -5, -26, 15, 21, -19, -11, 46, 2, -34, -1, 31, -27, -24, 34, 17, -20, -2, 24, -11, -26, 22, 26, -36, 3, 28, 4, -32, 21, 30, -25, -10, 41, 16, -30, 13, 38, -5, -14, 22, 25, -16, 10, 46, 0, -25, 40, 23, -11, -7, 51, 10, -41, 15, 15, -33, -7, 19, 17, -27, -2, 29, -18, -28, 13, 9, -41, -4, 34, -8, -26, 20, 17, -35, -11, 31, 10, -35, 8, 15, -23, -22, 14, 5, -34, 4, 17, -13, -22, 23, 17, -30, 0, 32, -7, -26, 21, 35, -14, -15, 38, 10, -20, -7, 25, 0, -6, 31, 3, -19, 12, 36, -10, -15, 21, 28, -25, -3, 26, -12, -28, 9, 24, -25, -4, 23, 6, -26, 16, 38, -13, -21, 20, 18, -31, -6, 38, 0, -25, 14, 13, -33, -8]
4999hL2k2j8L1Om7J5K4jl6K6K6m7PK8qm2M5J2k6j5K8J3l7J8K2Kl8K9J9n7J4L3
5032B8nl1J3L1o4JM6pm8M2J4k1j3L6ol5J5L1k5l1M3J4m8lL3Rn4N8Rm6j0N6j7m1
5066b6L5K1l5j1L8%k6J1J8k7k7L3K1n1RL9j2n0L9K1l1j1M1j6k3KL8k3k2M7J3m8
5098a3LM3k7k1K1J3l7jL3km6K5M1m5k0N5rm2K0K6k9k1L5K2l4%L8j5l8L0K4l2p
5131a0L6lm0K6K7l8k0L9Kn1K6K8k3k4K8Rm0J0K4j4j3K5Pk0j5K8Ol5J6J7k6j3M4
5164A3J6o3K9J3k6k1M6J1l5jM0k8k1L5J8n5lL7rk9K2M0k8j6L2pk7J1L9l7j9K3
5196@L0k8pL3j8k2K6J4m1rN6k1l5K4J2j1j8J5J9l3J2K6l1k4L4J8n4K2K3j1j5n
5228a9L7l4PL0j1l0K6J9l5k3K9J6m4J7L8j7k5J0J7k7LL1j2l7L2K2k7j4K6jk4M
$$ y = [-8, 24, 2, -16, 15, 21, -26, -11, 13, 12, -24, 2, 28, -19, -12, 16, 8, -34, 11, 23, -3, -18, 10, 23, -14, 4, 26, 28, -10, 19, 38, -19, -5, 28, 23, -8, 5, 36, -28, -27, 19, 12, -36, 6, 20, -1, -14, 22, 16, -19, -4, 27, 2, -29, 14, 28, -20, -23, 10, 19, -35, 23, 32, -14, -24, 32, 15, -26, 9, 30, -5, -16, 22, 22, -4, 7, 25, -2, -29, 4, 25, -26, -17, 22, 10, -40, -1, 20, -11, -22, 19, 3, -20, -18, 20, -3, -25, 22, 35, -13, -10, 33, 6, -15, 6, 19, -18, -19, 14, 12, -34, -9, 32, -13, -33, 22, 13, -29, -9, 17, -12, -33, 2, 24, -10, -10, 28, 13, -25, 5, 29, -3, -10, 26, 23, -17, 9, 36, -2, -22, 17, 19, -32, -6, 22, -1, -25, 3, 12, -28, -18, 6, -8, -21, 4, 11, -9, -24, 4, 10, -25, -9, 8, -18, -31, 13, 29, -34, -5, 8, -18, -39, 7, 18, -17, -18, 22, -6, -27, 8, 26, -29, -32, 5, -4, -33, -11, 29, 1, -15, 17, 10, -17, -6, 33, -4, -23, 0, 30, 2, -5, 28, 10, -12, 14, 28, -13, -22, 34, 13, -22, 2, 14, 3, -15, 0, 19, -14, -2, 24, -7, -31, 3, 21, -33, -11, 12, 1, -14, -19, 18, -16, -9, 21, 10, -20, 6, 25, -10, -33, -4, 12, -32, -15, 23, 6, -19, -9, 8, -19, -16, 15, 3, -34, -2, 20, -7, -21, 5, 4, -20, -16]
5260a6L9k3rK8%l8L0Pnk8M0ll5%K4j2j8L0J5k9j2K3J1l9J1M2k6j8K4J2k7j5K5
5293Hmk6L4J9m1nK9kl7K7K8n2jL3Nm3L4J5k9k0K7K7m2lL6k2k3K4J3j6j1L7k9r
5327a9J2J9k7j0M1Jl5JL0l3NJ2Ql5QL0j2k4K9Nk1j7K9J2l3J1L6k7k4L8Rl4J5K4
5361B4j6k2L0J2m6J2L0j0l5M5Pm2%L7j1k0QK7k5l7M3Ok8OM4k6oJ8kk4j5K5J0l2
5395a3J0L2k5j6K7lk9J9Rk7j3L8J3l8RL0k8k0L4qj7LK1j8j6K0J0lj8K6Ol6JN6
5429C6k0k9L8kk5JK0kk9RL3l6%K7mm1K8J0jk9L7rl0J6J3mk7L1Jj1lK9rl3K9J3
5465B7m1JK0Pk6jK9j8j9K6J3l6J0K2j0k2J4K0l2%L3j1j8J7J8k8LL3k4k5J4L4l5
5498eqK4J0m2K3J3pk1K9J8m0j4L8j8j6L2Mk5rK6nk6J7J5k2PJ7jj6j6M1k2oJ6M
$$ y = [-16, 23, 0, -9, 19, 19, -19, 11, 18, 13, -15, 25, 22, -13, -13, 11, -1, -19, 11, 26, -3, -15, 8, 19, -20, -9, 33, 7, -11, 13, 25, -2, -17, 8, 4, -22, 12, 31, -10, -15, 14, 12, -25, 2, 30, -22, -23, 10, 15, -28, 6, 21, -8, -28, -1, 26, -16, -19, 17, -5, -28, -4, 9, -7, -18, 19, -10, -19, -7, 12, -15, -25, 16, 17, -18, -17, 13, -20, -15, -3, 5, -30, -22, 8, -4, -28, 1, 6, -15, -32, -3, 9, -24, -13, 23, -4, -28, 10, 19, -15, 0, 24, 8, -14, 16, 28, -18, -6, 24, 14, -21, 24, 31, -11, -11, 26, 15, -5, 3, 30, 5, -32, 11, 17, -11, -5, 39, 13, 7, 25, 23, -1, -16, 9, 19, -13, -3, 29, 4, -12, 15, 12, -17, 2, 11, -16, -29, 9, 22, -16, -7, 23, -5, -25, 9, 1, -16, -13, 8, -10, -26, -6, 4, 1, -17, 9, 15, -21, -20, 36, 16, -13, 25, 23, -2, -1, 19, 17, -12, -3, 30, -6, -6, 21, 17, -24, 4, 14, 13, -16, 21, 12, -18, -2, 11, 7, -20, 11, 12, 1, -2, 27, 18, -15, 14, 27, -14, -13, 7, 14, -12, -13, 16, -2, -21, 5, 18, -18, -8, 14, 4, -18, -4, 16, -16, -16, 17, 6, -12, 5, 23, -5, -2, 31, 7, -18, -4, 30, -5, -13, 11, 21, -21, 2, 15, 8, -13, 16, 34, -6, -20, 18, 0, -16, 16, 20, -5, -14, 12, 7, -19, -2, 13, -9, -2, 15, 14, -2, -18, 23, 1, -5, 11, 15]
5533A5k0%K3j2l0J2J0lkK1ml9K3L0k6j6L6pjkPpk6K8K0l2nL0lj8J3K4m5pL1mk0
5570flL0k0j3J0J4j9lK9j9j7J7J2k3rK5Rk4J1K3k5j3K0kj8QJ5Lj6J2K5l6j1K3
5604IRk6K7Kk5KK7Kl7J6J2j5k0M2mm2K4J3nk8K3L0m8JM0j9olJ1lk5L1jk8QK2k8
5641a2JK0Ll8K0J5pj7J1K0j8j1K8nl6J8J2k4OK8Ql9K1J8k4jJ6J1l4J0L3j7k7L3
5675B2nk2NJ3jl0J2L0l8J7J5jpj4K6j9qJ2J6k8OK3j1k2J2K4l3j1M5k2k0J3K3l3
5709a1JK3j2k7J3L4k4j1K6Jk6%J8Mj6J4J1k7j2L5rj1KK9rl0K3Ol2NK3rj4J3J6
5744A7j6k2K7mk5K0J9k2kL0j6k1J7J4qj3K6Ll1pK9j7j7K4K2l9j5N1k3j1NK8k9
5777fKJ7J9n0J7J1j2j8K9K0l3%J8pj5J9J7j6j9K7j1k3J5K3m3kL8jk7nL2k2j2J2
$$ y = [15, -5, -5, 18, 6, -24, -12, -2, -5, -7, 14, 10, -29, -6, 24, -2, -18, 18, 11, 10, 8, 15, 8, -18, 10, 30, -2, -7, 23, 20, 2, 15, 39, -6, -13, 18, 14, -6, -9, 21, 1, -12, -2, 12, -7, -10, 19, 0, -17, 0, 12, -11, -20, 5, 14, -10, 1, 24, -1, -14, 6, 4, -14, -6, 9, 12, -4, 8, 33, -3, -14, 9, 18, -8, 19, 21, -4, -2, 25, 27, -10, 6, 18, 3, -17, 25, 21, -21, 3, 16, 11, -17, 6, 36, -12, -11, 29, 10, 4, 1, 12, 9, -16, 15, 14, -14, -6, 16, -12, -11, 9, 12, -26, -6, 9, 2, -15, -4, 16, -2, -13, 15, 10, -26, -8, 4, -20, -14, 14, 22, -17, 4, 22, -2, -3, 13, 24, -10, 0, 33, 16, -11, 22, 17, -5, 0, 13, 12, -18, -6, 24, -14, 3, 18, 17, 10, -4, 22, 3, -5, 7, 23, -5, 1, 24, 13, -9, 3, 27, -6, -17, 28, 6, -14, -1, 22, -11, -10, 13, 1, -26, -13, 21, -3, -14, 12, 13, -13, -13, 5, 9, -7, 7, 18, -9, -21, 14, 5, -6, -4, 25, 16, -14, 9, 15, -17, -12, 11, 2, -12, 1, 17, 1, -21, 6, 2, -23, -3, 16, -6, -8, 22, 6, -15, 2, 16, 8, -5, 21, 24, -7, -14, 15, -2, -19, 5, 27, -12, -27, 24, 1, -10, -5, 23, -6, -4, 13, 32, -18, -1, 10, -2, -20, 9, 29, -4, -4, 14, 7, -8, 11, 28, 12, -7, 20, 9, -14, 1, 24, -19, -21, 17, 16, -11, -16, 16, -6, -18, -6]
5811fK6m1J0J6oj0J5J1j0k1L6j5k6K0K6k8j9K5Qk9%K3Kk9K9Mj7j3L9k3k1J8J0
5844Djj6L8l0j5J4J9k5KK4Ml4J7K2k9nK8Oj8pK3ok6K1J6k2k4L5mk8J4K3k1nNO
5880Ej8J0J8kk1J3Kj3MK2ol2J0K2j6j3L3Jk5J2J3pl2K9K5n3QK4%k3RJ3j5mK0j5
5916bkMK1l0kK4Ol3PK6j2rK1nj9QNJj9MK4k5KL9k4l0kL7k7MJ0Pk5PJ5j8qK9%j5
5956flK3mk6K0J6pl2L5lk3J2J7j2l1K2Nj3nK9j7kK2jk8PJ5pj8K4Rk6J0J2j0j6
5992a2J0J8oj8J4Lj8kK2j5J%Rk3QQnj9J1Km%J9%j0kJ9j4j1J4J2j7qL3j2k7PK2
6030Inj2J7mj8J7M%j7K2Mj3%J4k0oQJ1k8nL2nl3K7Oj4qJ5Kk0J8K0k1NJMk3MJ3
6069Alj2MQj3jJ9Kj6JK6ok3J8Mj8%K1J0l2K2J0k8MK1rJlJ6j4j7L4k4lJ6Qj6nJ5
$$ y = [-6, 20, -21, -11, 5, -1, -11, 4, 15, 5, -16, 20, 5, -21, -1, 25, -3, -22, 3, 11, -18, -18, 5, 7, -22, 7, 11, -6, -19, 20, -3, -24, -6, 4, 3, -13, 25, -5, -20, -6, 13, -12, -10, 14, 18, -16, 1, 23, -6, -11, 17, 23, 5, -2, 21, 15, -11, 10, 26, 4, -20, 15, 11, -17, -3, 20, -1, -6, -1, 5, -13, -3, 15, 13, -8, 5, 7, -6, -2, 20, 14, -18, -8, 14, -2, -15, 18, 19, -6, 6, 19, 12, -20, 9, 34, -19, -11, 13, 13, -10, -1, 12, -3, -7, 13, -2, -4, 0, 21, -9, -11, 13, 19, -14, -7, 19, 7, -2, 19, 14, -5, 3, 8, 9, -10, -6, 18, -7, -5, 34, 10, -20, -22, 15, -12, -8, 2, 9, -16, -9, 6, -12, -20, 9, 9, -6, -9, 14, 10, -16, 4, 20, 13, -19, 16, 13, -10, 2, 19, 7, -24, -2, 3, -10, -15, 14, -3, -5, 17, 16, -12, -5, 10, 3, -15, 9, 18, -8, 2, 14, 4, -12, -2, 16, 10, -8, 6, 9, -9, -11, 11, -4, -3, -3, 6, -17, -9, -1, -6, -25, -14, -12, -16, -16, 3, 3, -7, -9, 10, -4, -15, -1, 11, -6, -14, 19, 7, -20, -13, 9, 4, -8, 9, 5, -13, 4, 8, 8, -9, 13, 17, 4, 4, 18, -2, -8, 0, 11, -17, -22, 10, 5, -28, -1, 5, -9, -17, -2, 0, -20, -2, 18, -3, 2, 3, 7, -16, -12, 1, -2, -14, -10, -2, -15, -16, 3, 5, -11, -10, 16, 10, -13, 5, 9, -9, -9, 12, 22, -10, 12, 22, -6, -2, 19, 10, 11, 8, 24, 10, -7, 27, 3, 0, 16, 24, 8, 3, 18]
6108A8j3qJ2Ol3kK7kmlOj6kkK6k1OpJ4j9JK9k0j0K6orPpkj5K2J8l1oL0j1k3L1
6147GKk9MK6Mk1oL5k4lK3mj6KJ7kk5J9KnmJ7j4k2J9J8j4k3K6J1l1K0Qk9mK2kk0
6185a6J6JQj5J2J5k1mMPk9L5jk0j6L3Jl6J5K7k0oRNnj7K4Lk0J7J5k2pK9j2npK4
6223B1k0%J1Ql1J3Qj2j1K1Ol3K0J9k1j9K3Qk0kK7lk6lK5oj7K6j0j7K0Mmj1J1J2
6259A7j4k0L7oj6QJ4ok2K6Kk0OKm%J0jj4lJ0mj2K5nj9J2K0j4k0J1J8k3nJ5J1l
6296A3j5K8l0j0K6Lj7JJ9j3l2J6J6k0j0K8mm%jOj3J2Mj5QJ3Kk6J3J1k1J1J3mk1
6332a3J4J6k5pK7Ol7K3J8j6j3K7mj8J2OqkLJ0j8kQLj6J0J2%q%K7m4J2Jj3K4k2
6369gK0j3pNj0KPJ1j7%%Nk2K7Pj4J4%Qk1J3LLj3MJ7k2J0Lmj2J1LrOMll1K7Roj8
$$ y = [18, 5, -3, 9, 15, -18, -20, 7, 5, 1, -2, 4, -12, -14, -16, 10, -11, -5, -12, 2, -17, -16, 13, -7, -17, 9, 3, -6, 1, -6, -8, -23, -1, 17, -14, -20, 10, -1, -24, 7, 9, -20, -16, 10, 14, -7, -13, 22, -2, -5, 18, 14, -2, 0, 17, 15, -10, 9, 11, 6, 2, 19, 5, -17, 2, 20, 6, -17, 9, 20, -11, 9, 17, -12, -16, 6, 4, -16, 0, 1, 9, -6, 6, 21, 0, -4, 0, 7, -22, 13, 12, -8, -24, 9, 10, -26, -11, 16, -4, -10, -1, 4, -1, -18, 6, 9, -11, 6, 21, -1, -8, 21, 9, 4, -3, 21, 1, 1, 12, 20, -11, 2, 10, -2, -13, 8, 14, -19, 1, 20, -1, -20, 3, 11, -9, -11, 16, 13, -13, -16, 9, 3, -14, 12, 2, -15, 5, 9, 5, -6, 5, 17, 3, -17, 20, 14, -2, 6, 20, 14, -8, 18, 20, 0, 6, 8, 4, 4, 14, 13, -1, -4, 6, 2, -10, 15, 10, -9, 3, 23, 9, -11, 0, 18, -5, -10, 5, 16, 13, -2, 26, -4, -14, 12, 15, -2, -1, 18, 5, -27, -11, 5, -15, -25, 3, -1, -5, -5, -6, 0, -13, -1, 3, -12, -4, 9, 11, -15, -2, 9, -12, -1, 12, 8, -13, 1, 17, -8, -15, 12, 18, -19, 4, 22, 6, -7, 20, 16, -2, 10, 16, 8, 6, 9, 19, 1, -1, 7, 10, -6, 4, 16, 16, 8, 8, 35, -9, 3, 4, -9, 15, -7, 13, 0, -7, -2, -12, -10, -3, 8, -9, -9, -9, -4, -26, 1, 8, -6, 8, 8, 16, -5, 8, 11, 14, 1, 5, 22, 0, 10, 13, 9, -3, 8, 11, 2, 8, 12, 9, -22, 5, 14, 8, -10]
6411a0K8k3PKPj1oNJ8k1nK3Jk1QPj1j2J7j1OlJ5j8J7jp%oK2k4kJ2Kj5mL0j3j4
6450a1J0J0j6jJ1Rk0MJ8qKJ2nn%Qmk3J3Rk5J0J6j3j0J9OMl6K1Oj1JLQoJ4j0j0
6489@LJ3rj2QQk2J2MjpJ2Mj7oLK2j5kJ7j3oJ1J5k9K1Pqj7K5j4kj4J2Nj5J4J0j8
6528aJ3qRj7J0Pk1jMJ6j8NJlj2J9Rk6J3J3ok1mJ9j1KK1Jk4%L1pj4nJ9j0j4L7j6
6567A0k4J0J1oNK0k3jj1J9j8J4NJj1lK4j2j4OK2k7J2J9l0M%J1pMjj0OLJ9l4lL5
6605B5j8j4qJ2lrqK6j2NJ0pMjNj0j2L2j4j3QJ0Lj0OpkjJ6j6lJ0MJ0k4L0k7oJ4
6644EMj0jK2rj4KJ8j0j5QRj3j1K1LKoJ3k4kJ8j5%jJ7j5j4K2nLlJ2k1lJ6Pj3qK5
6684A4pk2J1J2j7NkJ0j5NJ3Mj3%Nj4J2mMk6L4Nk4JJ2nj5OJ6qj0MLnPMqlJ0J3j5
$$ y = [-10, 18, -5, 2, 4, 11, 0, -6, -1, 17, -4, -9, 14, 15, -6, 2, 9, -2, -14, 3, -8, -2, -5, 10, -8, 9, 8, 1, 1, -5, 17, -7, -9, 3, 5, -10, -14, 16, 3, -11, -1, 9, -7, -8, 3, 12, -8, -4, 14, 6, 8, 20, 15, 10, 10, 18, 14, -9, 4, 13, -12, -2, 14, 1, -9, 10, 16, 20, -16, 5, 11, 0, 1, 4, 12, 6, 20, 10, 0, 3, 16, 7, -5, 3, 11, -11, 1, 5, 4, -3, 9, 13, -4, -10, -7, 15, 0, -2, 15, 2, -4, 7, 22, -7, 14, 21, 13, -4, 21, 7, 5, -9, 3, 8, -7, 7, 17, -1, 12, 4, 13, -4, 6, 13, -8, -9, -5, 11, -7, -2, -1, -4, -16, 3, 12, -14, -1, 12, 6, -15, -19, 0, -11, -9, 12, 13, -11, -11, 20, 13, -1, -6, 13, 3, -11, 26, 10, -14, -4, 7, 1, 6, 26, 3, 2, -9, 10, -8, 6, 11, 12, 1, -2, 22, 10, -4, 2, 24, -3, 9, 28, -2, 2, 2, 13, 6, 10, 9, -1, 5, 8, 27, -7, -10, 25, 7, -7, -15, -3, -6, -15, -23, 3, -9, -4, 6, -1, 3, 2, 7, -3, -15, 17, 3, -10, -2, 8, 11, 1, 7, 0, -2, -3, 13, -3, -6, 4, 8, 18, -6, 24, -3, -9, 5, 9, -1, -2, 20, 11, -3, -1, 17, 7, -8, 0, 9, -4, -15, 6, 9, 11, 5, 18, -6, -8, 10, -5, -5, -6, 11, -4, -18, 4, -1, 2, -1, 11, -10, -13, 3, 10, -3, -11, 14, 7, -15, -4, 8, -9, -4, -6, 4, -11, -6, 7, 11, -2, -2, 3, -11, 1, -3, 1, -25, 9, 14, -10, -9, 3, -2, -17, -11, 5, -3, -13, -9, -6, -11, -4, 0, -8, -11, -1, 12, -3]
6725cnJ1prJ4Rk9JJ6j4NRPqnJ1pkOjrlK3pk4K1J4rkRj0rJ0NJ3j1rJ8j3j1J9r%
6768EjJmrPRj9nK0pnnJ1rj3K3JRj8J4J8m0J7MOj8J9rj3K0jj9J4Pkk1QPqnRK3l5
6811a4MJ3mmK0Rl0mJ9Lk9K5J6k4PQNnj7J0qJJ3opJ3nj9pJ5Rk1pK6%k0J2Mlk0J1
6852a1Rj9J2L0l4%K2Qk4J3nLqPJ5l0KJ5Ml2K2J4j9oK0kj4mJ8klRk2K1k0K6qj5
6890hJ9j3KnK5j2j1PK1m2J7%j2OOjj3J1j7J1kL%J4rLlqnK2qj4QJ6Jj2J7pj9J3
6930AK5j9k1K0kj6lK0j3J0JNlj2J2Mk4J3J1j0j3L4nl5J4Rkj1J0NokLnoJ4j0Jo
6969a2JPrJ4%nj3J4KojJ4qj4K4Rk2OQklj0K7k9JJ7o%qJ1loKJ2rmOjj2rK2j6mJ2
7013cKj1J2J2k8NJ4kj4OJ2j1mlJJ0Qmj9J1RnpJj%jJJ8k5KJ9Ok5LJ2J0k3K9kok7
$$ y = [-3, -8, 3, -4, -13, 1, 10, -19, -18, -2, -16, -11, -2, 5, -3, -8, 3, -4, -6, 0, -1, -10, -13, 10, 3, -21, 0, 14, 5, 3, 12, 2, -7, 3, 8, 21, 10, 1, 19, 6, -5, 14, 5, 5, 4, 5, 1, -8, -1, 8, -11, -16, 4, -3, -8, -13, -2, -11, -24, -1, 0, 9, -9, 5, 23, -17, 0, 4, 10, -8, 11, 2, -11, 9, 8, -11, 3, 10, 8, -13, -5, 2, -6, -11, -2, 21, -14, -10, 3, -1, -5, 15, 24, -6, -10, 9, 12, -17, 8, 24, 0, 7, 15, 20, 15, -2, 8, 0, 1, 14, 8, 1, 14, 9, -10, -17, -2, 7, -14, -21, 5, 5, -15, -3, 1, -2, -22, -11, -2, -21, -9, 21, -13, -13, 9, 17, -7, 6, 1, 4, -4, 3, 18, -12, -10, 5, 9, -23, -1, 13, -6, -12, 8, 6, -8, -12, 6, 4, 1, 10, -12, 9, -11, 15, 7, -8, 11, -2, 0, -5, 20, 8, -3, 4, 25, -17, 0, 0, -12, -6, 0, -1, -14, -3, -20, -9, -11, -8, -8, 6, -3, 0, -3, -11, -16, 6, -2, -16, -8, 8, 9, -3, 14, 7, -12, 1, 26, 7, -14, 6, 4, -12, -15, 5, -8, 2, 3, 8, 5, -7, 5, 9, -15, -2, 9, -1, -14, 20, 15, -20, -6, 3, 1, -10, 0, 5, -1, -3, 0, -5, -11, 3, -7, -6, -12, -11, -4, -13, 1, 1, -4, -17, -3, -1, -7, -8, 6, -2, -16, 8, 17, -5, 1, 9, 7, 4, -6, 21, -8, -7, 10, 4, 4, -4, 7, 4, -2, 0, 12, 3, -1, 5, 4, -8, -17, 5, -11, -15, -3, -1, -12, 0, 12, -16, -11, 3, 1, -13, -7, 5, -6, -10, -13, -12, -2, 6, 2, -17, -6, 3, -2, -9, -8, -9, -9, -10, -9, 9, -16, -14, 5, 11, -14, -11, 1, 11, -12, 17, 15, 9, -18]
7055a8K8oj2KK8j3j3J6%j1pJ9j0jJ1%k3J3pOJj1J2j0%LOj0jK3j4j3J7j4oJ1J5
7092A1jk4mK1k2QJ3j6OJ1mLJ0j4Ol6L5Lk3J0jK1k4K4j0Kj0OJ2k2J0NNk2RJ4k4
7129a2QJ5jj6mJ0mj0J8Lk0RJ7k4OJ2j0nrK6jj9%J6pnK0Jk7QK1l0J9K%j1JPpjj
7170eJ7k4J6j3J4lkJ4k1mJ9mkjJ1j7j5K2J6k2rL4j8j1K0j3jk1K7Kj1%Oj1lJ7n
7207aj3J9j5mjJ5j1qJ7MmoK1j1nqQMj5QJJ6k9J1kMkRonJ1Nj2mJ2MoQOk2%J7nj4
7251iJ2KqJLPmlJ8j7j4OJ2rkLJoLJ3j7JLkrJ2Oj0LLNjjJ7j1j1QMj1KlPnNK0k0
7297DjJ6%k3jK4j1j3ONqqJ2kMoJ1pknJ6j8J2Nj4JMMj4J5pOr%Jj0%J2nj5K7Lj7
7340hoJ1j%NQj6MMNopJ0qj3K8rJJMMrJ3jMj6mLmJ6Lj9MJ5pj6JMOlJJmOJ3rj6R
$$ y = [-18, 10, 4, -8, -6, 22, 9, -4, 12, 12, 1, -6, 13, 3, 2, 13, 13, -10, 3, -4, 2, 3, -8, 4, -6, -6, -3, 3, -7, -8, 15, 1, -12, 5, -9, -15, -4, 11, 10, -14, -18, 3, -19, -11, 2, -14, -8, 3, -1, 2, 12, -2, 4, -32, 3, 6, -17, -7, -8, 13, -11, 13, 3, 5, -5, 1, 13, -9, 1, 6, 11, -11, -2, 12, -12, -4, 11, 10, -6, -10, 0, -4, -14, 4, 7, -13, -4, 13, -11, -5, 7, -3, -8, -17, 9, 8, -11, -11, 5, -2, -7, 13, 14, -13, -5, 16, -14, 5, 7, 7, -4, -3, 4, -3, -4, -5, 12, -12, 4, -9, 5, 2, 0, 14, -7, -11, 8, 4, 2, 1, 12, -5, -20, 2, 18, -4, -13, 21, 3, -8, 12, -1, -2, -23, 4, 6, -5, -5, 1, -10, -13, 4, -1, -14, 5, -10, -14, -15, 0, -11, -19, -2, 2, -2, -8, 13, 2, -3, -11, -3, 1, -14, -6, -5, 11, -18, -7, -9, -5, -7, 2, -4, -9, 2, 7, -5, -9, 3, 7, 1, 9, 15, -7, -7, 10, 5, -9, 3, 5, -3, -2, 1, 8, 4, 1, 19, 2, -12, -6, 6, -3, -5, -2, -1, -7, -4, 9, -8, -7, -4, -6, -15, -3, 3, -7, -4, -1, 4, 3, 2, 19, 8, -3, 5, 9, -2, 0, -3, 4, -1, 4, 24, 4, 3, 19, 19, -4, -5, 19, 8, -5, 1, 6, -2, -10, 2, 0, 4, -2, 9, 2, 0, -5, 11, -7, 5, 10, -4, -3, 1, 5, -9, 6, -1, 5, -4, -4, -3, -13, -13, -1, -6, -21, 6, 9, -8, -14, -3, -4, -4, 1, 9, -7, -3, 1, 6, 0, -7, 3, -5, -18, 10, 1, 2, 3, 7, 11, 2, 15, 14, 18, 2, -2, 1, -3, 13, 16, -3, 1, 16, 9, -7, -6, -2, 4, 1, 2, 3, -1, 5, 18, 9, -7, 2]
7388BnLoN%j2J3J2j6j8K6J1j8J4kNj9J2lj7J1nJ1j2J8rj0J3Pj9Rj2K9k1RrPj1
7426gRRlk0J4kmPqMrJ3Qj5PpMj6ORj7jK0%k4J4J0Jk4J3Ojj1J3K1k6QMJ0j2oMj6
7469a5MJ2MrkJ3rNJ1j2k0J8nPoK0j5QJLok9K7Ok7J1Pj1RRonj4J8mj7J1J7j3j1
$$ y = [2, -3, 0, -6, -1, -1, -13, 0, 12, -4, -22, 4, 15, -3, 11, 9, 14, -5, 7, 4, -13, -2, -7, 4, -8, 10, 1, -9, 4, 11, -8, 1, -11, 18, -3, 6, -3, 4, -7, 2, 11, 8, -12, 2, 0, -4, 3, -5, -1, -10, 3, 11, -4, 3, -4, 0, -16, -10, -1, -18, -19, 1, 1, -23, -9, 1, 2, -22, -9, -3, -4, -15, -2, 19, -7, 1, 5, 15, 3, -3, 1, -15, -11, 1, 5, -4, -6, 7, -2, 3, 14, 2, -18, 0, -5, 2, -4, 16, 1, 9, 10, 13, 7, -22, 5, 11, -16, -5, 2, -9, 0, 9, 3, -2, -16, 2, -2, -19, -8, 9, -4, -15]
$$ [...]
8191A4
##END NTUPLES=NMR FID
##END=
