##TITLE=1H_Pr Am-Ad-2
 CDCl3, 8 sc, 
 12.3.2019
##JCAMPDX= 6.0         $$ Bruker NMR JCAMP-DX V2.0
##DATA TYPE= NMR FID
##DATA CLASS= NTUPLES
##ORIGIN= UXNMR, Bruker Analytische Messtechnik GmbH
##OWNER= root
$$ XWIN-NMR		Version 3.5
$$ Tue Mar 12 17:32:07 2019 Russian Standard Time (UT+4h)  she@DPX200
##.OBSERVE FREQUENCY= 200.1314
##.OBSERVE NUCLEUS= ^1H
##.DELAY= (6, 6)
##.ACQUISITION MODE= SIMULTANEOUS
##.ACQUISITION SCHEME= undefined
##.AVERAGES= 8
##.DIGITISER RES= 18
##SPECTROMETER/DATA SYSTEM= spect
##.PULSE SEQUENCE= zg30
##.SOLVENT NAME= CDCl3
##.SHIFT REFERENCE= (INTERNAL, CDCl3, 0, 15.7039)
##AUDIT TRAIL= $$ (NUMBER, WHEN, WHO, WHERE, WHAT)
$$ ##TITLE= Audit trail, XWIN-NMR		Version 3.5
$$ ##JCAMPDX= 5.01
$$ ##ORIGIN= Bruker BioSpin GmbH
$$ ##OWNER= she
$$ F:/spectra/data/she/nmr/H-F/1/audita.txt
$$ ##AUDIT TRAIL=  $$ (NUMBER, WHEN, WHO, WHERE, WHAT)
(   1,<2019-03-12 17:31:03.81 +0400>,<she>,<DPX200>,
      <created by zg, POWCHK disabled, PULCHK disabled
       configuration hash MD5:
       00 E9 B6 7A A2 85 ED C7 34 08 36 98 17 FE 4E 26
       data hash MD5: 16K
       20 86 1A 4A 9B 5B 67 12 3C 6D 2C 3D D2 00 C0 F8>)
$$ ##END=
$$ 
$$ hash MD5
$$ 20 D1 5F EF CC 17 9C 9A 21 3E C5 72 9B 90 92 2D
##$RELAX= 
##$RELAX= 
##$RELAX= 
##$RELAX= 
##$RELAX= 
##$RELAX= 
$$ Bruker specific parameters
$$ --------------------------
##$DU= <F:/spectra>
##$EXPNO= 1
##$NAME= <H-F>
##$PROCNO= 1
##$TYPE= <nmr>
##$USER= <she>
##$AMP= (0..31)
100 100 100 100 100 100 100 100 100 100 100 100 100 100 100 100 100 100 
100 100 100 100 100 100 100 100 100 100 100 100 100 100 
##$AQSEQ= 0
##$AQ_mod= 1
##$AUNM= <au_zg>
##$AUTOPOS= <>
##$BF1= 200.13
##$BF2= 200.13
##$BF3= 200.13
##$BF4= 200.13
##$BF5= 200.13
##$BF6= 200.13
##$BF7= 200.13
##$BF8= 200.13
##$BYTORDA= 1
##$CFDGTYP= 0
##$CFRGTYP= 5
##$CHEMSTR= <none>
##$CNST= (0..31)
1 1 145 1 1 1 1 1 1 1 1 1 1 1 1 1 1 1 1 1 1 1 1 1 1 1 1 1 1 1 1 1 
##$CPDPRG= <>
##$CPDPRG1= <>
##$CPDPRG2= <>
##$CPDPRG3= <>
##$CPDPRG4= <mlev>
##$CPDPRG5= <mlev>
##$CPDPRG6= <mlev>
##$CPDPRG7= <mlev>
##$CPDPRG8= <mlev>
##$CPDPRGB= <>
##$CPDPRGT= <>
##$D= (0..31)
0 1.2 0 0 0 0 0 0 0 0 0 0.03 0 0 0 0 0 0 0 0 0 0 0 0 0 0 0 0 0 0 0 0 
##$DATE= 1552397463
##$DBL= (0..7)
120 120 120 120 120 120 120 120 
##$DBP= (0..7)
150 150 150 150 150 150 150 150 
##$DBP07= 0
##$DBPNAM0= <>
##$DBPNAM1= <>
##$DBPNAM2= <>
##$DBPNAM3= <>
##$DBPNAM4= <>
##$DBPNAM5= <>
##$DBPNAM6= <>
##$DBPNAM7= <>
##$DBPOAL= (0..7)
0.5 0.5 0.5 0.5 0.5 0.5 0.5 0.5 
##$DBPOFFS= (0..7)
0 0 0 0 0 0 0 0 
##$DE= 6
##$DECBNUC= <off>
##$DECIM= 24
##$DECNUC= <off>
##$DECSTAT= 4
##$DIGMOD= 1
##$DIGTYP= 9
##$DL= (0..7)
0 120 120 120 120 120 120 120 
##$DP= (0..7)
150 150 150 150 150 150 150 150 
##$DP07= 0
##$DPNAME0= <>
##$DPNAME1= <>
##$DPNAME2= <>
##$DPNAME3= <>
##$DPNAME4= <>
##$DPNAME5= <>
##$DPNAME6= <>
##$DPNAME7= <>
##$DPOAL= (0..7)
0.5 0.5 0.5 0.5 0.5 0.5 0.5 0.5 
##$DPOFFS= (0..7)
0 0 0 0 0 0 0 0 
##$DQDMODE= 0
##$DR= 18
##$DS= 0
##$DSLIST= <SSSSSSSSSSSSSSS>
##$DSPFIRM= 0
$$ [...]
##$SUBNAM2= <"">
##$SUBNAM3= <"">
##$SUBNAM4= <"">
##$SUBNAM5= <"">
##$SUBNAM6= <"">
##$SUBNAM7= <"">
##$SUBNAM8= <"">
##$SUBNAM9= <"">
##$SW= 26.0245685251456
##$SWIBOX= (0..15)
0 0 2 0 0 0 0 0 0 0 0 0 0 0 0 0 
##$SW_h= 5208.33333333333
##$TD= 16384
##$TD0= 1
##$TE= 0
##$TE2= 300
##$TE3= 300
##$TEG= 300
##$TL= (0..7)
0 120 120 120 120 120 120 120 
##$TP= (0..7)
150 150 150 150 150 150 150 150 
##$TP07= 0
##$TPNAME0= <>
##$TPNAME1= <>
##$TPNAME2= <>
##$TPNAME3= <>
##$TPNAME4= <>
##$TPNAME5= <>
##$TPNAME6= <>
##$TPNAME7= <>
##$TPOAL= (0..7)
0.5 0.5 0.5 0.5 0.5 0.5 0.5 0.5 
##$TPOFFS= (0..7)
0 0 0 0 0 0 0 0 
##$TUNHIN= 0
##$TUNHOUT= 0
##$TUNXOUT= 0
##$USERA1= <user>
##$USERA2= <user>
##$USERA3= <user>
##$USERA4= <user>
##$USERA5= <user>
##$V9= 5
##$VALIST= <valist>
##$VCLIST= <CCCCCCCCCCCCCCC>
##$VD= 0
##$VDLIST= <DDDDDDDDDDDDDDD>
##$VPLIST= <PPPPPPPPPPPPPPP>
##$VTLIST= <TTTTTTTTTTTTTTT>
##$WBST= 1024
##$WBSW= 4
##$XGAIN= (0..3)
0 0 0 0 
##$XL= 0
##$YL= 0
##$YMAX_a= 292984
##$YMIN_a= -524446
##$ZGOPTNS= <>
##$ZL1= 120
##$ZL2= 120
##$ZL3= 120
##$ZL4= 120
##$ABSF1= 10
##$ABSF2= 0
##$ABSG= 5
##$ABSL= 3
##$ALPHA= 0
##$AQORDER= 0
##$ASSFAC= 0
##$ASSFACI= 0
##$ASSFACX= 0
##$ASSWID= 0
##$AUNMP= <proc_1d>
##$AZFE= 0.1
##$AZFW= 0.1
##$BCFW= 1
##$BC_mod= 2
##$BYTORDP= 1
##$COROFFS= 0
##$CY= 11.3945322036743
##$DATMOD= 1
##$DC= 2
##$DFILT= <>
##$DTYPP= 0
##$F1P= 18.9103706918063
##$F2P= -1.10871071338519
##$FCOR= 0.5
##$FTSIZE= 0
##$FT_mod= 4
##$GAMMA= 1
##$GB= 0.15
##$INTBC= 1
##$INTSCL= 1
##$ISEN= 128
##$LB= 0.24
##$LEV0= 0
##$LPBIN= 0
##$MAXI= 10000
##$MC2= 0
##$MEAN= 0
##$ME_mod= 0
##$MI= 1.114404
##$NCOEF= 0
##$NC_proc= 0
##$NLEV= 6
##$NOISF1= 3.799351
##$NOISF2= 2.8
##$NSP= 1
##$NTH_PI= 0
##$NZP= 0
##$OFFSET= 15.70392
##$PC= 1
##$PHC0= -8862.064
##$PHC1= 23.20025
##$PH_mod= 1
##$PKNL= yes
##$PPARMOD= 0
##$PSCAL= 0
##$PSIGN= 0
##$REVERSE= no
##$SF= 200.130013532006
##$SI= 16384
##$SIGF1= 3
##$SIGF2= 2
##$SINO= 400
##$SIOLD= 16384
##$SREGLST= <1H.CDCl3>
##$SSB= 0
##$STSI= 0
##$STSR= 0
##$SW_p= 3612.71676300578
##$SYMM= 0
##$S_DEV= 0
##$TDeff= 0
##$TDoff= 0
##$TI= <>
##$TILT= no
##$TM1= 0
##$TM2= 0
##$TOPLEV= 0
##$USERP1= <user>
##$USERP2= <user>
##$USERP3= <user>
##$USERP4= <user>
##$USERP5= <user>
##$WDW= 1
##$XDIM= 8192
##$YMAX_p= 0
##$YMIN_p= 0
$$ End of Bruker specific parameters
$$ ---------------------------------
##NTUPLES= NMR FID
##VAR_NAME=  TIME,          FID/REAL,        FID/IMAG
##SYMBOL=    X,             R,               I
##VAR_TYPE=  INDEPENDENT,   DEPENDENT,       DEPENDENT
##VAR_FORM=  AFFN,          ASDF,            ASDF
##VAR_DIM=   8192,          8192,            8192
##UNITS=     SECONDS,       ARBITRARY UNITS, ARBITRARY UNITS
##FACTOR=    0.000192,      1,               1
##FIRST=     0,             0,               0
##LAST=      1.572672,      0,               0
##MIN=       0,             -524446,         0
##MAX=       1.572672,      292984,          0
$$ Real data points
##PAGE= N=1
##DATA TABLE= (X++(R..R)), XYDATA
0@%%%%Qj6J6k2L0l2M0n6P1q7J04j22J47j78K14k54K98l47M03m66N36o15P04q03
28d27R10j029J164j310J469j645J840k055K286k540K821l129L466l836M247m702
44b470N208n775O410p127P948q898J0007j1325J2923j4907J7447k0834K5608l2895
58a8680M5527p3502K40742j37162m96521K49592L30436P7430j61666j02557r5580
69a41941P7986J87545J5322k56549l8305K63734Q0754k91357j17906K44557J76867
80B00707j29384j31663j4362k660O4024J73341j6768k61501q5729K42157J29062
91A67224j55836q9001R3825j5589j11567O8164J50536m3816j04943M1642J8313
102A8952j13591J4831J81176O850j83584n625J63524j9035j56304K7687J30923
$$ plain form
0 0 0 0 0 0 8 -8 8 -14 16 -16 24 -32 39 -48 56 -66 81 -97 117 -137 161 -186 217 -249 287 -328 376 -427
28 -427 483 -546 618 -692 777 -868 972 -1083 1203 -1337 1484 -1645 1821 -2015 2232 -2470
44 -2470 2738 -3037 3373 -3754 4194 -4704 5303 -6022 6901 -8006 9441 -11393 14215 -18680
58 -18680 26847 -46655 194087 56925 -439596 -190004 140432 217862 56196 -46361 -141941
69 -141941 -63955 123590 138912 -117637 -155942 107792 188546 -102811 -220717 23840 200707
80 200707 71323 -60340 -74702 -77362 -13338 160003 143235 -118266 -203995 38162 167224
91 167224 11388 -77613 16212 623 -110944 -42780 107756 63940 -41003 639 18952
102 18952 -94639 -79808 101368 108218 -75366 -80991 82533 63498 -92806 -65119 65804
113F5804k8786p9685L9642N736q2047O0583J58653p6874k25269L9505K36768J4825
125A28855j77118l0222Q8942J263m188O4654m7975j44839M7586J85679k7565j77759
137i2687L2542J62760m4376j53607K7340J04350j6896j3320O6522m5032j33743
148a06147N3314J70206m0663j68837K8787J34002l5410q4699O6149M6103j06377
159d3572l3714J23797K4659j16005n328R6434k9329p1020Q1851O7017j28033q8419
171a21662J31553R6760j03268o3353Q4811J4433q5707J7207P2823n7037o2061
182g5501R9704O7680j17627o4618J21501M8457j27057l7620J19233K9070q6049
193b2827J220N0291n1117k9867J03940K8960j44338m8521J44853N8666j13051
$$ plain form
113 65804 37018 -42667 -3025 2711 -79336 -18753 139900 63026 -162243 -122738 114030 128855
125 128855 -48263 -78485 10457 11720 7532 72186 24211 -120628 -73042 112637 85072 -92687
137 -92687 -60145 102615 58239 -95368 -68028 36322 19426 6106 72628 27596 -106147
148 -106147 -52833 117373 76710 -92127 -63340 70662 35252 -49447 16702 62805 -43572
159 -43572 -77286 46511 71170 -44835 -50163 46271 16942 -54078 27773 94790 -33243 -121662
171 -121662 9891 106651 3383 -59970 24841 39274 -46433 -29226 43597 -13440 -75501
182 -75501 24203 91883 -25744 -90362 31139 79596 -47461 -85081 34152 63222 -22827
193 -22827 -21607 28684 -22433 -52300 51640 80600 -63738 -112259 32594 91260 -21791
204b1791l2687Q7137j0741q0850M0303P0648n7193m1436Q9877K2245j18867j5259
216f8614J31300O672j38653p380J26779J4727p6323O236J7984o5585O862J23181
228G7186j791j52605j3373J55503K7549j25388k0831Q5109p855n0716M0075J9934
240C2797p6925N228J18467r824j45736m915J35857N923j08381J0723Q3471k5305
252B1380n1155M6183J1184q6897O114J22290K070j22548l763J02235j3307q0443
264d6657L3951N6020o3426m0857Q7786L5321r4513k1573R0621Q60q7367K0058
276b9776P8564m3349o8588O7271O8086p3839n8300O6291K6000o9054O771Q1088
288E1165k7572q2666M7489Q0340o7848q6054O8441Q0424n1148m3732N0424J595
$$ plain form
204 -21791 -54478 32659 21918 -58932 -18629 52019 -5174 -46610 43267 65512 -53355 -68614
216 -68614 62686 69358 -69295 -76675 50104 64831 -11492 -5256 12728 -52857 -45995 77186
228 77186 75395 -77210 -90583 64920 92469 -32919 -53750 31359 23504 -27212 12863 32797
240 32797 -44128 -38900 79567 69743 -75993 -80908 54949 60872 -47509 -36786 46685 21380
252 21380 -29775 16408 27592 -59305 -53191 69099 71169 -51379 -55142 47093 33786 -46657
264 -46657 -12706 43314 -20112 -60969 26817 62138 -32375 -53948 36673 37533 -49834 -29776
276 -29776 48788 5439 -63149 4122 72208 -1631 -59931 6360 32360 -36694 -29923 51165
288 51165 23593 -59073 -11584 68756 908 -85146 -16705 63719 12571 -31161 19263 20858
300B0858o3452K8360P4623n1337q3155O6699Q7872o9446q1697O5647O6318n6758
312D532l7470M3403r976m9638N7646P8547p2150r7538O3505R0683n4609o8156
324e1221M8601L3866m7116R679O3582m0796q9913M4374R1981m3655p4086N4562
336a42N8363o2141m2773N9380J4513o0670J5905P0080l8740p7799N1824Q1019
348F8819n1834p0677M6046L9828n5577j1809P1556m011p6353J8316P5981l4712
360A5573p4717L9527O2296m3620l4851O0589J6717p7885r045P8515m366p3084
372d4351K2258P1116l2693n9716M1742L8429n9355k2892P4665J4058p9484k837
384c9060P9601o355o8923K0106N2162m1325m1366N8182L1159o5686j3038P8053
$$ plain form
300 20858 -42594 -14234 60389 9052 -74103 -7404 80468 11022 -70675 -5028 61290 4532
312 4532 -32938 10465 489 -49149 8497 87044 14894 -82644 -19139 71544 16935 -51221
324 -51221 -2620 31246 -15870 -6191 57391 16595 -73318 -28944 63037 19382 -54704 -142
336 -142 58221 -3920 -46693 12687 27200 -33470 -17565 52515 13775 -64024 -12200 68819
348 68819 16985 -53692 -7646 32182 -23395 -35204 36352 32341 -44012 -25696 50285 15573
360 15573 -59144 -19617 42679 -941 -35792 24797 41514 -36371 -45416 33099 28733 -44351
372 -44351 -22093 49023 16330 -43386 -1644 36785 -22570 -45462 29203 43261 -36223 -39060
384 -39060 40541 34186 -34737 -14631 37531 -3794 -45160 13022 44181 -21505 -34543 43510
396D3510N2q9037R8Q0746n992n9153K5463M3051m3972k8812N7886J1168p5532
409d0524j46Q9595L21q4360M288O7904k0680n4290L5076L8662m8888k1523O3560
422B8995R036p2188K133P5074j4474p6490J9601O5764k6245m3459M4022K8729
434D0498o0290k0877O3409M610o6799J1639P1959j8636o5654K5454M9493m2155
446g349l8545N5802L0850n7716j5118N8375k256o0794J6448N7400l1849n2035
458d6787M6619M9308n3218m1676N6188K8246n6283j5597N0293n850m3140L3101
470A204M8625m8450n0889N4361M2354o1567l5641O3975L0558n1576j1117L9805
482B1642j8759m0301M1607M3139n4604m1658O3954L9222o4048l3762N5413J6782
$$ plain form
396 43510 43562 -45475 -45377 35369 29377 -29776 -4313 38738 -5234 -34046 23840 35008 -40524
409 -40524 -40670 48925 49246 -35114 -30826 37078 16398 -37892 -2816 35846 -13042 -34565 28995
422 28995 38031 -34157 -32024 43050 28576 -47914 -28313 37451 11206 -32253 11769 40498
434 40498 -19792 -40669 22740 27350 -39449 -27810 44149 25513 -40141 -14687 34806 -7349
446 -7349 -45894 9908 40758 -16958 -32076 26299 24043 -36751 -20303 37097 5248 -46787
458 -46787 -168 49140 -4078 -45754 10434 38680 -17603 -33200 17093 11243 -31897 1204
470 1204 49829 1379 -49510 4851 47205 -14362 -50003 13972 44530 -7046 -18163 21642
482 21642 2883 -37418 4189 47328 -7276 -48934 15020 54242 -9806 -43568 11845 28627
494B8627m6963O261M2384k7471l9103M8140M0081o1778m2436N9708L4216n5241
506a3575j7994N2579L233m6065J6369L9044m0483m2228N2191M3255n1624l0543
518c5841N3482J5527n8521o064N3996p186m5718K6010M2872m0310m0503M5785
530C529L2237m9805k0444N0818N811n1176J2508N5114k3389n6222K7485M4982
542C1448l3078l1721M1896K0502m6545l293N2259j1452o1374J5412N9064j8005
554A5113m5690L0042L5325l8653k5657M0492Q604m6549J0635N8281j8903o2894
566c9854J9707N8005k2258m5632K5704K7766l3435p845M6370m580n5951J2426
578a9577N7495k1121n7088K5273N1676k6113l4640L3812J8003m5342p945M8250
$$ plain form
494 28627 -18336 -12075 30309 2838 -36265 11875 51956 -9822 -52258 7450 41666 -13575
506 -13575 -31569 21010 24243 -21822 -5453 33591 -6892 -49120 3071 46326 -5298 -35841
518 -35841 17641 33168 -25353 -31417 22579 15393 -30325 -4315 38557 -1753 -42256 3529
530 3529 35766 -14039 -34483 16335 22146 -29030 -16522 38592 15203 -41019 -13534 31448
542 31448 -1630 -33351 8545 29047 -17498 -20791 31468 20016 -41358 -25946 33118 15113
554 15113 -30577 -535 34790 -3863 -29520 10972 19576 -26973 -16338 41943 23040 -39854
566 -39854 -20147 37858 15600 -30032 -4328 23438 -9997 -17842 28528 23948 -32003 -19577
578 -19577 37918 16797 -40291 -15018 36658 10545 -24095 9717 27720 -17622 -25567 22683
590B2683m595n0487J8073N4419k2254m9968K4486L3334l4725k0509M6560J2889
602B9906n1756l421N3154o310n3883J2982M6694j9547l5349L0012K3209l9820
614a4129j2662M9112L162n6615J522N3475o724m3886K1142L9016l1821l5278L3948
627B62K2652l9906q455M8337L134m8097M121M1926j7192l6282K9277K9100l9687
640a0810k3321N1864K2582n3173k1120M3465Q889l3850J1282L0277k6194k9238
652b9347L8429K4573m6519k0445N1717J3999n3233q415N1401N550l8532M636K0824
665A4638k9363j6012M9836K4185n2355k4225M5907J1423m1669K884L9832j6954
677H127l9063K6709L6757l0272k7767L4559J4298m4330p756M8544M319m0810O475
$$ plain form
590 22683 18088 -32399 -14326 40093 17839 -32129 -7643 25691 -9034 -29543 17017 29906
602 29906 -21850 -25271 27883 21573 -32310 -19328 27366 7819 -27530 2482 25691 -14129
614 -14129 -26791 22321 25483 -31132 -29610 23865 17141 -26745 -5603 33413 1592 -33686 262
627 262 22914 -16992 -25447 22890 26024 -22073 -17952 23974 6782 -29500 -223 28877 -10810
640 -10810 -34131 17733 40315 -12858 -33978 9487 18376 -15474 -4192 26085 -109 -29347
652 -29347 9082 33655 -12864 -33309 18408 32407 -20826 -29241 22160 27710 -10822 -6186 14638
665 14638 -14725 -30737 19099 43284 -9071 -33296 12611 24034 -17635 -14751 25081 8127
677 8127 -30936 -4227 32530 2258 -25509 9050 23348 -20982 -28738 19806 24125 -16685 -10210
690a0210L2452k4259l1418L6920L2353m2189l0550M0147K3511l3104o465L0726
702A7914j4432l8355K3530M2846k4695l3877K9935K4172l8111j7897M0365R015
714B0410l9847K731L9582j1669l7658K1245L4567k8337l1027L0602K0520l1519
726a0400m973L8052n308m4193J2016M3331j8428m1328K3432L8017k3422k5001
738a8205K5613Q626l3937K133L9145r962m0514K0161M2087k4298m0351K4496K9845
751B4839k8468j8112L3510Q493l5603L163L7215j3412l9135J9332L5205k5049
763A978k7919L1234K0484l4987j1746L7913J080m2162M930M1166q987l3330J9273
776a073K6298l0187k3099L1900J5068l3288k773L8965m163m1506R068L6802j6632
$$ plain form
690 -10210 22242 -2017 -33435 3485 35838 -6351 -36901 3246 26757 -6347 -12812 17914
702 17914 3482 -34873 -11343 31503 6808 -27069 2866 27038 -11073 -28970 11395 20410
714 20410 -19437 -16706 22876 11207 -26451 -5206 29361 1024 -30003 599 21119 -10400
726 -10400 -15373 22679 17371 -26822 -14806 28525 10097 -31231 -7799 30218 6796 -18205
738 -18205 7408 16034 -17903 -15770 23375 13413 -27101 -6940 35147 10849 -29502 -5006 24839
751 24839 -3629 -21741 11769 20262 -15341 -12178 25037 11625 -27510 -8178 27027 1978
763 1978 -25941 5293 25777 -9210 -20956 16957 18037 -24125 -19195 21971 12984 -20346 -1073
776 -1073 25225 -4962 -28061 3839 18907 -14381 -17154 21811 17648 -23858 -14790 22012 5380
789E380l2149K3774K5982k8427j6306L3780Q925l7481l314L6787n166l4365J4127
802h453L0811k0695k4082K9528J8097l7267j6261L8803J0837l4678l6L4878r396
815A2086l3378J4116K5877k1832j7415L1734J2600l6305o272L9659o00m3454K824
828b0360L9392n313k7857J5899J8847k7614j4393L4154J0385l7639n293L6231
840A6439j786l3035J2063L2579j9890l0847K1702K1368k6458j0953L5663O467
852B3312l8688l633L3428l936k9764J4094K5244k1492j9004L0202J4472l7342
864a3107j4192L6780Q997l2690P95L0597r040k6705J6552K0535k5664j6738L2507
877H627J3153l4333p792L5053J739l2541N266K7214j5221k4531K3427K3785k5629
$$ plain form
789 5380 -26769 -2995 22987 -5440 -21746 12034 20959 -16522 -19836 16951 11785 -22580 -8453
802 -8453 22358 1663 -22419 7109 25206 -12061 -28322 10481 21318 -13360 -13396 21482 12086
815 12086 -21292 -7176 18701 -3131 -20546 11188 23788 -12517 -18789 20870 20270 -23184 -20360
828 -20360 19032 13719 -14138 1761 20608 -7006 -21399 12755 23140 -14499 -19792 16439
840 16439 14653 -18382 -6319 26260 6370 -24477 -2775 18593 -7865 -18818 16845 23312
852 23312 -15376 -19009 14419 10483 -19281 -5187 20057 -1435 -20439 9763 24235 -13107
864 -13107 -27299 9481 18478 -14212 -13417 17180 8140 -18565 -2013 18522 -7142 -23880 8627
877 8627 21780 -12553 -20345 14708 16447 -16094 -10828 16386 1165 -23366 61 23846 -1783
890a783j7136K7559P171l0965k261L2047l651k7728J4677K6420k3362k7082K5862
903b32K3199k6239j5525K7157P322k5867L935K4804j4294k7448K1065K7261k5297
916a59k3685K8778J9653k7924j2694K4814J247k5966R760K7869j6395k6919K1542
929g9K3726k4631j9936K4778J0545k5953J77L1177n971l3208R013K8649j5531
942B756k4485K1077K1162k2969j3088K3632L336k7060N498K9284j3366l1828J7364
955h687L3404j6595k6290J6333J3881k1226n280K6915r15k9429Q095L0360j2326
968H240k9239J4788K2536j8762j5664K4392J1436k6511m862K7259l440k9690Q255
981a1262K9608j0225k3653J5146J7054k0428j0882K4945L408k9890J534L2860
$$ plain form
890 -1783 -18919 8640 15811 -15154 -17415 14632 10981 -16747 -2070 24350 988 -26094 -232
903 -232 22967 -3272 -18797 8360 15682 -10185 -6250 18554 4260 -23188 -2123 25138 -159
916 -159 -23844 4934 24587 -3337 -16031 8783 10030 -15936 -6176 21693 5298 -21621 -79
929 -79 23647 -984 -20920 3858 14403 -11550 -11373 19804 13833 -19375 -10362 18287 2756
942 2756 -21729 -652 20510 -2459 -15547 8085 11421 -15639 -10141 19143 5777 -26051 -8687
955 -8687 24717 8122 -18168 -1835 12046 -9180 -14460 12455 11540 -17889 -9794 20566 8240
968 8240 -20999 -6211 16325 -2437 -18101 6291 17727 -8784 -13646 13613 10173 -19517 -11262
981 -11262 18346 8121 -15532 -386 16668 -3760 -14642 10303 13711 -16179 -14645 18215
993A8215l253k9535P051K4717j3791j9598J7584J2836k1968n127K8427J793l1626
1006a4275O89K8965o471k5137J2053K1535j6475j4916K1984Q845k8981o169L0382
1019A2029K451k7547L547K5522r816k1440J4857J5902k1870j2567K7186Q615k7905
1032a1036l660K8955j601k7529M729K1913j2413j5399K0624J3736k5952j0864
1044a8497K7437O693k8036k966K5808k310k0520J1292J7076j9211j6326K2880
1056C320J3575k5264r205K7591N147k5271K92K2146q530j9872J5058J7440j9971
1069c544j3494K5311J1102k6372p887K3120R02k1898P830K1387j3421j8684J8747
1082C099J6012k3304j4586K3758J0033k1766j639K1744n588k2213J1785J9932
$$ plain form
993 18215 14962 -14573 -7522 17195 3404 -16194 1390 14226 -7742 -12869 15558 17351 -14275
1006 -14275 -13586 15379 8908 -16229 -4176 17359 884 -14032 7952 16797 -12184 -18353 12029
1019 12029 14480 -13067 -9520 16002 6186 -15254 -397 15505 -6365 -18932 8254 16869 -11036
1032 -11036 -14696 14259 12658 -14871 -10142 11771 -642 -16041 4583 18319 -7633 -18497
1044 -18497 8940 15633 -12403 -15369 10439 8129 -12391 -1099 15977 -3234 -19560 3320
1056 3320 16895 -8369 -17574 10017 15164 -10107 -9815 12331 3801 -16071 -1013 16427 -3544
1069 -3544 -17038 8273 19375 -6997 -14884 8236 9138 -12760 -4930 16457 3036 -15648 3099
1082 3099 19111 -4193 -18779 4979 15012 -6754 -8393 13351 7763 -14450 -2665 17267
1094A7267j7654j8709K1607J7058k1991j1252K0878L982k2125K407K2175r777
1106C866k0993J5880K1482j8988j8730J9405J1644k1061o116K2630m0k1202P950
1119d273K1547j4625k2834J6319K0437j7629j4983J9880R164k0509j896K0618
1131A1216o734k2314J1975K3672j4074k0957J6384J6465j8424j1026J9332L439
1143H954k1200L688K4208p714k3154J0964K0422j5202j7192J6217J2652j7418
1155d775m543K1221j319k3849M649K3350q600k2535J3099J9448j4136j3291J6135
1168D854O689k1029j209K3447k702k3479O962K2854r788j9711J2120J3254j6647
1181d385q157K1392M003k2893J73K3912m365k3868O415J9309r654j3532J5753
$$ plain form
1094 17267 -387 -19096 2511 19569 -2422 -13674 7204 11186 -10939 -8532 13643 3866
1106 3866 -17127 -1247 20235 1247 -17483 1922 13566 -7495 -13611 9019 8979 -12223 -4273
1119 -4273 17274 2649 -20185 -3866 16571 -1058 -16041 3839 13003 -7506 -9402 11216
1131 11216 4482 -17832 -5857 17815 3741 -17216 -832 15633 -2791 -13817 5515 8954
1143 8954 -12246 -8558 15650 7936 -15218 -4254 16168 966 -16226 -9 12643 -4775
1155 -4775 -9318 11903 10584 -13265 -8616 14734 6134 -16401 -3302 16146 2010 -11281 4854
1168 4854 11543 -9486 -10695 12752 10050 -13429 -6467 16387 6599 -13112 -992 12262 -4385
1181 -4385 -12542 8850 12853 -10040 -9867 14045 9680 -14188 -7773 11536 1882 -11650 4103
1194D103R559k0014o339K2536J043k5259K178K4732l353k0792Q155J5227j3899
1207b123j1352J7789O887k1767k485K4717N93k4227K210K0436o978j6995J1581
1220a714J3456j5818q507K1351N694k4629l736K2115K06j9975N967J8039r672
1233B777j4415J4346R960j9423q126K2302O067k1340j522J9962l300j7782P466
1246c028J4714j3622j1766J9059J0023k0528p395K0698L486k0796R15J8247n796
1259D211j5022J2066J3586j6413j2466J8714Q116k0468m669K0736J665j8319M819
1272c444J5677j1277j5763J5012J4098j6995j0642J8739O740j8183k211J7125
1284H876m786j7292J0533J6496j3546j5141J6749J3130j8387j0413J7091M533
$$ plain form
1194 4103 13662 -6352 -12691 9845 10888 -14371 -12193 12539 9186 -11606 -3451 11776 -2123
1207 -2123 -13475 4314 11201 -10566 -13051 11666 12259 -11968 -9758 10678 3700 -13295 -1714
1220 -1714 11742 -4076 -12583 8768 14462 -10167 -13903 8212 8418 -11557 -5590 12449 2777
1233 2777 -11638 2708 12668 -6755 -14881 7421 13488 -7852 -9374 10588 7288 -10494 -3028
1246 -3028 11686 -1936 -13702 5357 15380 -5148 -12543 8155 11641 -9155 -8240 10007 4211
1259 4211 -10811 1255 14841 -1572 -14038 4676 12792 -7676 -12345 8391 10056 -8263 -3444
1272 -3444 12233 956 -14807 205 14303 -2692 -13334 5405 12145 -6038 -8249 8876
1284 8876 4090 -13202 -2669 13827 281 -14860 1889 15019 -3368 -13781 3310 7843
1296G843j5881K645J6056q229j5710J2753J4929j6700j4874J7980J2213j6092
1308c067n873J6834j026j7329M598J6884r633j5987J4403J5047j4977j2396J5543
1321C021O166j6090p94J6942l532j7665Q724J8490j1883j7170J2394J3459j3901
1334a839q095J5309L387j5618K152J6686p758j8890J0332J8140j1461j3612J3344
1347B077R547j5099n178J6056o35j7925M573J9014o259j6703Q787J3400j2904
1360a249j0006J5187N046j6891l3J9616l138k1018M402J9398o634j5469Q190J0889
1374H290j1350m947J6130R83k0425Q38K0638l618j8822O724J7512q379j3420J0262
1388D16P370j4674k875J8092O17j9253K367J9113m564j7436O985J2207j0284q381
$$ plain form
1296 7843 -8038 -5393 10663 2434 -13276 -523 14406 -2294 -17168 812 13025 -3067
1308 -3067 -8940 7894 6868 -10461 -5863 11021 1388 -14599 -196 14851 -126 -12522 3021
1321 3021 9187 -6903 -7697 9245 5713 -11952 -3228 15262 3379 -13791 -1397 12062 -1839
1334 -1839 -9934 5375 8762 -6856 -4704 11982 4224 -14666 -4334 13806 2345 -11267 2077
1347 2077 11624 -3475 -8653 7403 6768 -11157 -6584 12430 6171 -10532 -1745 11655 -1249
1360 -1249 -11255 3932 8978 -7913 -7946 11670 8532 -12486 -8084 11314 4680 -10789 -2599 8290
1374 8290 -3060 -8007 8123 9106 -11319 -10481 10157 6539 -12283 -5559 11953 3574 -9846 416
1388 416 7786 -6888 -9763 8329 8946 -10307 -7940 11173 6609 -10827 -3842 8365 -1919 -10300
1402a0300J5634N806j7790l265J8354L97j8760K250J7104n074j2983R655R501
1415A0529j3403o909J6303L740j8893j526J9392L21j7020L701J3706q579j2375
1428a1013J2533Q961j4373n299J6952K923j8341l93J6503l508j4890P886J3508
1441A1449j1641j0806J4536R011j6878p091J5713K832j3944L037J3677p824j3088
1454a1017J1107J1504j4788j0377J7172R006j6793n587J5372J030j4273L717J1904
1467G977r554j0307J3945J1271j6051r572J6106N367j6357j643J6059j838j4116
1480h713O269J3082j0765j1286J2495Q911j4084n909J5496K412j4485K135J4226
1493I784p291j4764J0001J4399j0528j1908J2116Q678j3326m794J2762j00j3257
$$ plain form
1402 -10300 5334 11140 -6650 -9915 8439 8836 -9924 -7674 9430 4356 -8627 1028 10529
1415 10529 -2874 -9783 6520 10260 -8633 -10159 9233 9554 -7466 -3765 9941 1362 -11013
1428 -11013 1520 10481 -3892 -9191 7761 10684 -7657 -8050 8453 4945 -9945 -2059 11449
1441 11449 -192 -10998 3538 12549 -4329 -11420 4293 7125 -6819 -3782 9895 2071 -11017
1454 -11017 90 11594 -3194 -13571 3601 12607 -4186 -9773 5599 6629 -7644 -3927 7977
1467 7977 -1577 -11884 2061 13332 -2719 -12291 3815 9182 -7175 -8818 7241 5403 -8713
1480 -8713 -2444 10638 -127 -11413 1082 9993 -4091 -10000 5496 7908 -6577 -4442 9784
1493 9784 2493 -12271 -2270 12129 1601 -10307 1809 10487 -2839 -7633 5129 5029 -8228
1506h228N323J4113q693j3386J1322J2279j3252j1023J3154P275j3066j682J4159
1519H295j954j4956M977J3396q681j1479J1100R761j1889o555J3360J914j5351
1532h062J479J5821m729j5474P346J4940q229j2236Q956O464j1101k140J4279
1545G314j272j5563M421J6188p165j5815P728J3808q906r883J0602N803j2036
1558d776o47J3553l900j5505N541J5786o440j2936Q858R580j1263o641J2540L155
1572F905j3621M34J4983k675j4724M883J2631p490j0189R678P206j1767l291J4487
1586G450Q54j6215N79J5319l119j2855N781J0789q092p575J1083M385j3493l139
1600h248J4760O52j4461K757J3478m942j1507O647Q507j0802n667J3445M984j4168
$$ plain form
1506 -8228 -2905 11208 2515 -10871 451 12730 -522 -11545 1609 8884 -4182 -5864 8295
1519 8295 6341 -8615 -3638 9758 1077 -10402 698 10459 -1430 -7985 5375 7289 -8062
1532 -8062 -6583 9238 4509 -10965 -3619 11321 3092 -9144 -188 6276 -4825 -6965 7314
1545 7314 6042 -9521 -5100 11088 3923 -11892 -4164 9644 738 -9145 1457 7260 -4776
1558 -4776 -5423 8130 4230 -11275 -5734 10052 3612 -9324 -466 9114 -2149 -8790 3750 6905
1572 6905 -6716 -6282 8701 6026 -8698 -3815 8816 1326 -8863 815 8021 -3746 -7037 7450
1586 7450 8304 -7911 -7332 7987 4868 -7987 -2206 8583 491 -7084 3999 8384 -5109 -8248
1600 -8248 6512 7164 -7297 -4540 8938 3996 -7511 -864 7643 -3159 -8826 4619 9603 -4565
1614d565k605J3570j301j2441L719J0885o713q620J0296P321j3180n706J3712
1627D372L344j3808j371J3085j356j0473N289Q920r746p941J2006O208j3748l898
1641i117J4339K694j3535M27J1253m706r832P689R029j0042p037J3136M904j4261
1655e059l569J2927O14j1278L859J0376o658r767R848Q090j1934o967J2414N235
1669H131j1860j549J1728k369j0779N250R432r019q532J1239Q266j1528o055J1480
1683C835K363j1218O05J1168m584r962Q099R451r658r317J0816N853j0817k700
1697f066J0854J68j1148L520J0993o562j1228P946R864q766p372R928M382j0490
1711c977p04J0376l199j1468O280J1811p318j0587Q629Q644j0320n753R937K235
$$ plain form
1614 -4565 -7170 6400 5099 -7342 -3623 7262 549 -8071 2225 9546 -3634 -9340 4372
1627 4372 7716 -6092 -7463 5622 4266 -6207 -918 8002 -1744 -9685 2321 8529 -5219 -9117
1641 -9117 5222 7916 -5619 -5192 6061 1355 -8477 -788 8241 -1801 -8838 4298 9202 -5059
1655 -5059 -8628 4299 4913 -6365 -2506 7870 1212 -8555 1293 9383 -2551 -9518 2896 8131
1669 8131 -3729 -5278 6450 4081 -6698 -1448 7984 -1035 -9567 1672 9938 -1590 -7645 3835
1683 3835 6198 -5020 -4415 6753 2169 -7793 306 9757 99 -9218 1598 7451 -3366 -6066
1697 -6066 4788 4956 -6192 -2672 8321 1759 -9469 -1523 8341 -425 -7797 2131 6513 -3977
1711 -3977 -4681 5695 2496 -8972 -2692 9119 1801 -8786 -157 8487 -1833 -7586 2351 4586
1725D586j0564K022J1472m385j1611O114J0597q089q658R189N873r067k854J0872
1739E497l71j2257K336J2077m550j0963O670R803p559o775Q528L152j0777m50
1753e639J1864j397j1765L904J1279m859j0688O373P239q179m129J0466K237j1626
1767d920L59J1446k518j1662M005R930n116p454P777M777r905k728J0894Q03j2051
1782f363R95J1970k017j0416M395P775p040o233Q967L778j0392j529J2226J43
1796F259j2313R91J0487l233r085O672O162q103l871J0471K259j2497j411J2016
1810D804j76j0065K315R159n105p029P387M855j0239l177J1395K620j1367n29
1824e152J0752k048r294L770P409o923n171R186N043j0521l695J0893J480j0822
$$ plain form
1725 4586 -5978 -3956 7516 3131 -8480 -2366 8231 142 -8516 673 6546 -2521 -5375 5497
1739 5497 5126 -7131 -4795 7282 2732 -8231 -1561 8242 683 -6092 2436 5588 -5189 -5639
1753 -5639 6225 4828 -6937 -3033 8246 3387 -7301 -928 6311 -1868 -5997 4469 6706 -4920
1767 -4920 -4561 6885 4367 -7295 -3290 6640 1524 -5930 1847 6624 -3281 -6009 4885 5688 -6363
1782 -6363 -5368 6602 4585 -5831 -1436 6339 -701 -6934 2033 5811 -4581 -6110 6116 6259
1796 6259 -6054 -5063 5424 2191 -6894 -222 5940 -2163 -6034 4437 6696 -5801 -7212 4804
1810 4804 4628 -5437 -3122 6037 932 -6097 1290 6145 -4094 -7271 4124 6744 -4623 -5152
1824 -5152 5600 3552 -5742 -1972 5437 -1486 -6657 2529 7572 -2949 -6644 4249 5729 -5093
1838e093P56R568l059p580O061O941q949o022R665M513j0010k648J0195O72r080
1853d070J897Q256n436p616Q016O273q903m743R593L598j0594j030R199j805q815
1868f180M516Q690o263p281P618O316r253m850Q827K079q291J377Q652l813q546
1883f402N482P979p851o971Q440N707q226l495R118p48q378K139R096m839q531
1898g480O818P708o982o594Q087L169q223j013R113j805q526M163Q551n624q627
1913g265O513O314o965l666P741J937q443R02Q848l597r469N180Q945n521p188
1928e734O794M215o939k496P749k94q630K429R593l545q841M646P594o596n421
1943e476O899L290p870j80Q772j156j0116K698Q728l536q090M949O490o138l391
$$ plain form
1838 -5093 -4337 5231 2172 -5408 653 7594 -1355 -7377 2288 6801 -3209 -5857 4338 5010 -4070
1853 -4070 -2173 6083 647 -6969 1047 7320 -1583 -6326 3267 6865 -3729 -4759 4440 2635 -6180
1868 -6180 -1664 7026 763 -6518 1100 7416 -1837 -6687 2140 4219 -4072 -2695 5957 2144 -6402
1883 -6402 -920 7059 -792 -7763 677 6384 -1842 -5337 3781 3033 -5345 -3206 5890 1051 -7480
1898 -7480 -662 7046 64 -6530 1557 4726 -3497 -4510 4603 2798 -5728 -1565 6986 1362 -7265
1913 -7265 -752 5562 -1403 -5069 2672 4609 -3834 -2932 5916 2319 -7150 -1970 6975 1454 -5734
1928 -5734 1060 5275 -1664 -4160 3589 3295 -5335 -2906 6687 3142 -5699 -1053 6541 -55 -5476
1943 -5476 1423 4713 -3157 -3337 5435 4279 -5837 -3139 5589 2053 -6037 -1088 5402 -736 -4127
1958d127P265J004r022K58R715j436r400L230P994l859o934N537L874o825k297
1973e023Q530P71r332P91R722k403q394L056O548m676m578P071L027q481j422
1988d793R031k20r035J400Q193k233o882M047N694o572m118Q076K074q616p81
2003d735Q715K49p741J319O340l654n531N839M415p266l103Q805K152r157r73
2018d326P651n76p267L568N791m446m774O522L519q196k938Q204J781p540N26
2033b501P154k861o765M570N684o135n188P420M134p272k351P141k8o731K152
2048a577N396l705n742O309N404p048m932P242K906p000j151O564m51n945K891
2063h39N662n195n681O414M781o673l488P197K371p169J16O015k417o355M109
$$ plain form
1958 -4127 3138 4142 -4880 -4622 5093 3657 -5743 -2513 5481 1622 -5312 225 4099 -2726 -5023
1973 -5023 3507 4278 -5054 -4263 5459 3056 -5338 -2282 4266 -410 -4988 2083 5110 -3371 -4793
1988 -4793 4238 4018 -5017 -3617 4576 2343 -4539 -492 5202 -1370 -5488 2588 4662 -3954 -4735
2003 -4735 3980 4229 -3512 -2193 4147 493 -5038 801 5216 -2050 -5153 3652 5804 -3353 -4326
2018 -4326 3325 2749 -4518 -950 4841 395 -4379 2143 5662 -2534 -5472 2732 4513 -3027 -2501
2033 -2501 4653 1792 -4973 -403 5281 -854 -6042 1378 5512 -1760 -4111 3030 3002 -3729 -1577
2048 -1577 3819 114 -5628 681 6085 -963 -5895 1347 4253 -2747 -3898 2666 2215 -3730 -839
2063 -839 4823 -372 -6053 361 5142 -1531 -5019 2178 4549 -2620 -2504 3511 1094 -5261 -1152
2078a152O252m577n505N967L752o341k063O344j67o523J971P399l631o859M757
2093c76N814n429m863N156L542n614l56O102j418p279L373N907l661o038N158
2108A8N410n419l903O085J773o932J71O746j972o170L374O065m307n331M592L655
2124C855n802j730P007J12p009R33O870k294o441K807N688l992l713M828K405
2139C524n556j149O697j122p623K371P604k692o619L440M665m492l004N558J243
2154B845o012L89O663j443o787K376O297l478n307M324M365n600j691O005O07
2169C553p097L57O758j415n717K568M728l763l592N554K028o496j631P508M53
2184C796p070P47O355j404n734K217M140l936k318N816J772p052j001P435r44
$$ plain form
2078 -1152 5100 523 -4982 985 4737 -1604 -3667 2677 2510 -4013 -2042 5357 1726 -5133 -376
2093 -376 5438 9 -4854 302 3844 -1770 -2126 3976 2558 -4721 -1348 4559 898 -5140 18
2108 18 5428 9 -3894 2191 3964 -2968 -2797 3949 1977 -4193 -819 5246 939 -4392 200 3855
2124 3855 -1947 -3677 3330 3442 -3567 -2634 4236 1942 -4499 -1692 3996 4 -3709 1119 3524
2139 3524 -2032 -3181 3516 2394 -5229 -2858 4746 2054 -4565 -1125 3540 -952 -3956 1602 2845
2154 2845 -3167 -2778 3885 2442 -4345 -1969 4328 850 -4457 -133 4232 -1368 -3059 2946 3553
2169 3553 -3544 -3187 3571 2156 -3561 -993 3735 -28 -3620 1934 3962 -2534 -4165 3343 3796
2184 3796 -3274 -2527 3828 2424 -3310 -1093 3047 -889 -3207 2609 4381 -2671 -3672 3763 2819
2199B819o484J396N881k540m751M187L513n227k598N774J232o071j052O887l84
2214B582n581K182M506m223l859N493L335n977k559O384J727o159l35M984j631
2229H69m271K852L833m104l178N748K512o701k090O294R77n317J003N179k676
2244I30m654L649M223m767l980N629K151m942o80N349j255n414K651M680l581
2259a1m691N118M432n150l295N031J442m741q4M825j576m817L507M868m519m681
2275d342M531L702n052k479N459M84m494R30M758k878m634L566M608l924l852
2290c617M589K477n006o89N095j608m882J872O077l248m968L525L893l955k931
2305c376M376J216m865J039N499k300n561K668N176l056n068L712L441l723j860
$$ plain form
2199 2819 -3665 -2269 3612 1072 -3679 508 4021 -1206 -3804 1970 3202 -2869 -3921 2966 2582
2214 2582 -2999 -817 3689 -534 -4393 1100 4435 -1542 -4101 2283 4010 -2149 -2484 2500 869
2229 869 -3402 -550 3283 -821 -3999 1749 4261 -2440 -4530 1764 2741 -2576 -1573 3606 930
2244 930 -3724 -75 4148 -619 -4599 1030 3181 -1761 -2441 2908 1653 -3761 -1110 3570 -11
2259 -11 -4702 416 4848 -302 -3597 1434 2876 -1865 -1949 2876 1300 -3517 -10 4858 339 -4342
2275 -4342 189 3891 -1161 -3640 1819 2303 -2191 -1261 3497 619 -4015 -449 4159 235 -3617
2290 -3617 972 3449 -1557 -2246 2849 1241 -3641 -1769 4308 1060 -3908 -383 3510 -445 -3376
2305 -3376 1000 2216 -2649 -1610 3889 1589 -3972 -1304 3872 816 -4252 -540 2901 -822 -2682
2320b682M729K13n768J428N123k009n085L182M753l581l365L786K061m793o08
2335b616N325m15n460J275N387k053m707K387L850l996j835M728Q64n079j50O179
2351C684j272n892J792M984k032l873L192K427m366j087M759o5n360P46N559j239
2367A957m756J693M443l244k877L450K318m398r27M703M89n337L46M781j517m020
2383b896K421L416l660k178M283K016n571j370N679J97m920J133M276j846l943
2398b963L381K273m370j768M965J641n110q49N217o00m329J489L288k495l011
2413c241M329K350m814j831N055R14n107J84M544j246l934K816L166l966k852
2428c633M354K450m574j659M761Q86m317M41M131k750l477L728L456m519k450
$$ plain form
2320 -2682 2047 2260 -3508 -2080 3043 1034 -4051 -869 3884 303 -3062 724 2785 -2008 -2616
2335 -2616 2709 2294 -3166 -1891 3496 1443 -3264 -877 2973 -1023 -2858 1870 2734 -2345 -2495 3684
2351 3684 2412 -3480 -1688 3296 1264 -2609 583 3010 -1356 -2443 2316 2251 -3109 -2363 3196 1957
2367 1957 -2799 -1106 3337 93 -2784 666 2984 -1414 -2341 2362 2851 -2486 -2140 2641 1124 -2896
2383 -2896 -475 2941 -719 -2897 1386 3402 -2169 -3539 2140 2337 -2583 -1450 2826 980 -2963
2398 -2963 418 2691 -1679 -3447 1518 3159 -1951 -2800 2417 1817 -2512 -1023 2265 -230 -3241
2413 -3241 1088 3438 -1376 -3207 1848 2762 -2345 -2161 2383 1137 -2797 19 3185 -781 -3633
2428 -3633 721 3171 -1403 -3062 1699 2585 -1732 -1291 2840 90 -3387 341 3797 -722 -3172
2443c172M812J857m759j304M199l22m022K034M074l042l796L878L214m545k349
2458c243M240J656m126K60M135j690l981K540L790l701l463L875K943l655j872
2473b292L935K65m530J191M175k017l941K683M239l448l657L843J781l903n25
2488b201M230r00l881K003L654k345m205K883L706l307k081L266J478m325M36
2503a589L898j123m496K095M430k293l762L237K231l264j620L867J70m581J284
2518a516M565j612m024J553M028k575l264L394J607l247o96M141j95m943J016
2533a768M753j865l997K266L347k927k073L541J005m483J61M736o87m781J486
2548a286M564j847m034K692J905l214j005M092O61m716MM710r19m405J116M009
$$ plain form
2443 -3172 1640 3497 -1262 -2566 1633 1311 -2711 -677 3397 355 -3441 437 3651 -894 -3243
2458 -3243 997 2653 -1473 -1213 2922 1232 -2749 -209 3581 -120 -3583 292 3235 -420 -2292
2473 -2292 1643 1908 -2622 -1431 2744 727 -3214 -531 3708 260 -3397 446 2227 -1676 -2201
2488 -2201 2029 1129 -2752 -749 2905 560 -3645 -762 2944 -363 -2444 822 2300 -2025 -1589
2503 -1589 2309 1186 -3310 -1215 3215 922 -2840 397 2628 -636 -2256 1611 1781 -2800 -1516
2518 -1516 3049 1437 -2587 -1034 2994 419 -2845 549 2156 -1091 -1787 2354 2159 -2784 -1768
2533 -1768 2985 1120 -2877 -611 2736 -191 -2264 1277 2282 -2201 -2040 2696 2009 -2772 -1286
2548 -1286 3278 1431 -2603 89 1994 -1220 -2225 1867 2528 -2188 -2184 2526 1607 -2798 -1682 2327
2564B327k066k505L331J730m490o39M093Q18n003K30M404r54l577K020K547k977
2580g11j923L751J113m091o33M417K4l737K08L627j489l203K920K823l886k066
2596b856M428J212m714n75M077j55l492J319L264k279l038L558K129l837j905
2611b864M368R91l993l53M092p58l567J834K574k653k413L705J983l837j480L903
2627A532L30l681N27L255j474k960K918K510k947k713L032J951l377j170L495
2642A228K58l145Q58L075j909l606L135L009l158k247L475J315l441k07L029r69
2658G00l426K104L321k468l303L469K412l432k004L536N52l409N31L896j521l845
2674b887K482L330k778l027L219J936k775j023L394n11l731J202M030j849l706
$$ plain form
2564 2327 261 -2244 1087 2817 -1673 -2312 1781 2599 -2404 -2174 2230 1276 -2301 -281 2266 -711
2580 -711 -2634 1117 2230 -1861 -2494 1923 1947 -1790 -1582 2045 556 -2647 273 3096 -790 -2856
2596 -2856 1572 2784 -1930 -2505 1572 1417 -2075 -756 2508 229 -2809 749 2878 -959 -2864
2611 -2864 1504 2495 -1498 -1851 2241 1483 -2084 -250 2324 -329 -2742 963 2946 -891 -2371 1532
2627 1532 1862 -1819 -1292 1963 489 -2471 447 2957 10 -2703 329 2280 -1097 -2267 1228
2642 1228 1486 -1659 -801 2274 365 -3241 -106 2903 -255 -2502 973 2288 -1153 -1360 1669 700
2658 700 -2726 -622 2699 231 -3072 397 2809 -623 -2627 909 1461 -1948 -1417 2479 958 -2887
2674 -2887 -405 2925 147 -2880 339 2275 -500 -1523 1871 1360 -2371 -1169 2861 1012 -2694
2689b694K348K719k237k146K680J347l711J43L651p42l951J800L721k283l219
2704b574K312K571k908j366L039O83l466M05L864j224l957J924L229k453k069
2719a990K331J839l218q20L697p6m115P06L796p80l363J290K883k520j859K988
2735G89J161l304m20L634j15l809P24L337j368k922J788K352k349j129K376J156
2751A901l632m15L817k68l499J137K899j220k687K195J553k880j174L663P88l752
2767a574M3L414o54k949J347K311k522j294L162J432l821r91L565M19l504J17
2783a499L234q09k419J532K200k641j740L222R77l375r87M055l00l259R41K688
2799A820j334k755K399K184k656j724L351Q59l174r7K639p88k493J154K832k274
$$ plain form
2689 -2694 -346 2373 136 -2010 670 2017 -1694 -1551 2100 1358 -2593 -793 2928 645 -2574
2704 -2574 -262 2309 -599 -1965 1074 1757 -1709 -1304 2560 1336 -2621 -697 2532 79 -1990
2719 -1990 341 2180 -1038 -1858 1839 1763 -2352 -1646 2150 1370 -1993 -703 2180 -340 -2199 789
2735 789 1950 -1354 -1774 1860 1745 -2064 -1340 1997 629 -2293 -505 1847 -502 -1631 745 1901
2751 1901 -1731 -2146 1671 1403 -2096 -959 1940 720 -1967 228 1781 -1099 -2273 1390 2178 -1574
2767 -1574 -1531 1883 1229 -1720 -373 1938 -584 -1878 1284 2716 -1105 -2096 1469 1888 -1616 -1499
2783 -1499 1735 926 -1493 39 2239 -402 -2142 1080 2057 -1318 -2305 1750 1450 -1809 -868 1820
2799 1820 486 -2269 130 2314 -342 -2066 1285 2144 -1030 -1127 1512 724 -1769 -615 2217 -57
2815e7k134K701K100l400j659L096J350l340K56K706r46k898J813K394k564j778
2831b360K720J811k779j055K928J79l064N63K774j096k587K009K589k873k022
2846b263K816J042k837r0K787o68k626J270L032k001k684J980K116j982j698K542
2862G36P18k480M22K494j655k689J710K798j697k784K545J895k653q72K634J40
2878A262l145Q10L137j401k817J882K570k230k211K763J308l182K71K449m56l013
2894b003N85L651j695k557J678K003j621j250K138M80k846mL181o90l223J056
2910a117L468j572k572J281J988k162j003K947r1k628L47K840p16k578Q88K214
2926A534j528j358K202J127k937o03K777K54k732j74K857l96k348J249J589k019
$$ plain form
2815 -57 -2191 510 2610 -790 -2449 647 1997 -1343 -1087 1619 673 -2225 -412 1982 -582 -2360
2831 -2360 360 2171 -608 -1663 1265 1444 -1620 -1057 1717 621 -1966 43 2632 -241 -2263
2846 -2263 553 1595 -1242 -1332 1455 787 -1839 -569 2463 462 -2222 -242 1874 -108 -1806 736
2862 736 1454 -1026 -604 1890 235 -2454 -744 2054 357 -2427 118 2013 -640 -1512 1122 1262
2878 1262 -1883 -1073 2064 663 -2154 -272 2298 68 -2143 620 1928 -1254 -983 1466 1010 -2003
2894 -2003 -1418 2233 538 -2019 -341 1662 41 -1209 929 1409 -1437 -1441 1740 1050 -2173 -1117
2910 -1117 2351 779 -1793 -512 1476 -686 -1689 1258 1167 -1461 -1114 1726 1010 -1568 -680 1534
2926 1534 6 -1352 850 1977 -960 -1563 1214 1468 -1264 -1438 1419 1023 -1325 -76 1513 -506
2942e06j229K859N31k753q50L437N37l230R3K498r48j853J693J290k370r44L066
2959A321L85k833o42L058o6k446O51K340j560j813K005J705l118o38K683J28k285
2976a125j26K541m73k352J234K023k032j726K287J883k527j007K304J39k089L12
2992g34K014r63j997J936J939k546j534K275J443k853p53K568J37j983M69K275
3008A693j748j494J649J731k136j200K230J147k429l94K173o49k486J039K747
3023A873j730j697J711J794k395j150K255L12j987L96K325j075k085J359J821
3038A727j581j798J717J189j657p35K228J75k489O66J874j303j886J564J792j596
3054a13j397K204M94k170J14J958r4k419N65K631j270k154J265J934k024n32K102
$$ plain form
2942 -506 -1735 1124 1655 -1098 -1948 1489 2026 -1204 -1111 1387 439 -1414 279 1569 -801 -1745 1321
2959 1321 1706 -1127 -1769 1289 1223 -1223 -572 1768 208 -1605 400 2105 -1013 -1651 1032 1160 -1125
2976 -1125 -1251 1290 817 -1535 -301 1722 -310 -2036 251 2134 -393 -1400 904 1043 -1046 -734
2992 -734 1280 317 -1680 256 2195 -351 -1885 390 1833 -1020 -1773 795 932 -1051 -582 1693
3008 1693 -55 -1549 100 1831 -305 -1505 725 1872 -557 -951 1222 573 -1913 -874 1873
3023 1873 143 -1554 157 1951 -444 -1594 661 973 -1014 -618 1707 632 -1453 -94 1727
3038 1727 146 -1652 65 1254 -403 -1138 1090 1265 -1224 -558 1316 13 -1873 -309 1483 -113
3054 -113 -1510 694 1188 -982 -868 1090 996 -1423 -858 1773 503 -1651 -386 1548 -476 -1008 1094
3071A094J2k335M47K545j330j801Q14J793r36j616J142J250j703o61K356n11j829
3088a269O51K179r42j764J157J228j162j222J589Q27j977J06J945q7k742P44K055
3105A316p98j864J047J403j760m03J905N02k270j16J989R4k129L40K011q66j441
3122a040J470Q01j776o97J923L28j848K5K085n94k151J379J259j475r78J754Q48
3139A313j854n54K099L7k100L73J879j286j299J418J433j762r97J835Q24k197
3155h38l84K116m3j400J18J650q01j469J444N89j556p26J965M67k190L27J515
3172G84p2j647P76J426j335j357J907J061k015o95J989L50j967L36J301o51j648
3189a457J318J407j632j023J711R48j849n47J872j31j414N38J226j097p47R36
$$ plain form
3071 1094 1106 -1229 -782 1763 433 -1368 -554 1239 303 -1313 -171 1079 -624 -1285 1071 560 -1269
3088 -1269 -618 1561 619 -1145 12 1240 78 -1144 445 1272 -705 -599 1346 1259 -1483 -739 1316
3105 1316 518 -1346 -299 1104 -656 -1059 846 1348 -922 -1038 951 1045 -1084 -744 1267 401 -1040
3122 -1040 430 1231 -545 -1242 681 1009 -839 -814 1271 677 -1474 -95 1164 -311 -1289 465 1313
3139 1313 -541 -1095 1004 1041 -1059 -686 1193 -93 -1392 26 1459 -303 -1300 535 1359 -838
3155 -838 -1222 894 851 -549 -431 1219 418 -1051 393 982 -574 -1300 665 1132 -1058 -731 784
3172 784 712 -935 -159 1267 -68 -1425 482 1543 -472 -1167 822 1172 -795 -459 842 191 -1457
3189 -1457 -139 1268 -364 -1387 324 1272 -577 -1124 748 617 -797 -259 967 -130 -877 59
3205E9J403j619q17J494M99j734j59J873p26j357Q56J209r67j384J129J547j712
3222d06p19J695M63j742M28J372r43j366P45J644j219j084J112Q17j161l68J445
3239G13l49j162L68J805r62j813J239J545j252j087J231R4j050o4J716k70j761
3256a059P94J526j099j367P77J376j215m12J271J03j734J033J166r79j492Q80
3272d31J649q52j221J154O91j494k36J255J64j502K18J944n49k005Q92J678j219
3289A36q54J328L50j315j96J572j94k027L06J765m38q64K73J099j257m77J262
3306D69Q49k267L80J379J1j608L35J507r80j033J271N01j342m99J832m6j693k4
3324i58J553l08j401P14Q71n38p69J200Q74j679o21J500Q2j062Q7J299m53j409
$$ plain form
3205 59 1462 -157 -974 520 1019 -715 -874 999 273 -1084 -228 981 14 -1370 -241 1306 -406
3222 -406 -1125 570 1033 -709 -281 1091 148 -1218 -473 1171 -48 -1132 -20 797 -364 -732 713
3239 713 364 -798 -430 1375 413 -1400 -161 1384 132 -955 276 370 -680 -744 972 702 -1059
3256 -1059 -265 1261 162 -1205 -428 948 -267 -679 592 695 -1039 -6 1160 181 -1311 -431
3272 -431 1218 366 -855 299 990 -504 -740 515 679 -823 -605 1339 790 -1215 -323 1355 136
3289 136 -718 610 960 -355 -551 1021 827 -1200 -894 871 433 -431 -158 941 -316 -793 469
3306 469 1318 -949 -569 810 821 -787 -452 1055 75 -958 313 814 -528 -1027 805 759 -934 -958
3324 -958 595 287 -1114 -400 471 -67 -836 364 1238 -441 -1062 438 520 -542 -455 844 391 -1018
3342a018R60O08q79n39J496L06j576l08J681J48j854O99J205q38j083J274N96
3359H78j196n99J402O93j427o67J659l03j277Q04J215j324o62J114Q54j589o48
3376a073J716K38j489M1J193n47j228J134M80q08o01J294N47j151n06J173p6o57
3394c20P7J008n10j175P65J155j440o43J138N86j125k20J277L8j469N17J175r80
3412a46o05Q54Q61r64o90P82N44j230K20R72l17j375Q05J161j015o79Q26R19j217
3431b94k06J120j69r07K06J276n80j208M16J207j045r85J362O0o81J6J241p71
3449E8j028K37J228l70j083O81J185o80q11J065K6q12J43R67k09j392O28J007
3467H40p16q75O51L83l68q12J467p9j049O3J219j85j405N04J154m61r83O73O02
$$ plain form
3342 -1018 -58 550 -329 -868 628 934 -642 -950 731 879 -975 -276 929 91 -992 282 878
3359 878 -318 -917 485 1178 -249 -916 743 440 -837 -33 1182 -142 -804 310 1164 -425 -1073
3376 -1073 643 881 -608 -567 626 79 -1149 -15 465 -343 -944 350 897 -254 -760 413 337 -320
3394 -320 -243 765 255 -920 -155 1000 -440 -1083 55 641 -484 -704 573 611 -858 -341 834 -146
3412 -146 -751 103 964 0 -690 92 636 -594 -374 598 281 -1094 -289 872 -143 -822 4 923 -294
3431 -294 -500 620 451 -456 -250 1026 446 -762 -346 861 -184 -1169 193 253 -428 -412 829 58
3449 58 -970 -733 495 125 -958 -277 908 228 -583 482 508 -304 -161 806 597 -795 -167 840
3467 840 124 -751 -100 283 -85 -897 570 491 -558 -495 724 539 -866 -362 792 331 -652 21 623
3486F23j069k74J402P9j520J73J116n23p63P97P42j195j01R07K28j256K85J093
3504G44J3j593L40Q00k35o93M95J144j277n63J177J34q75l14J328L25j621K82
3522c89J232q97l38M48R23j493n02J729J16j459J07J031l01j019P73L88l25q96
3540h72J044O87j540k32J643J80j501L08O93k02q22Q00K34p35p83J245M56j052
3558d49L45N38k36r02N71J075p87o07O10N49r11j29N29K28j006M5Q05m13l65O78
3578A68M44n87r60J142K23o85n85J142L96j163J89O03L3j133Q90O23r02p80R72
3597C0N97j065k83J094K04j362N51O45j10o56L73O10r46k50Q35L86j039l01J063
3616C76j44q09o6J440o58n63J82N85k86m80N64L16n92j96J001k75r59K11J124
$$ plain form
3486 623 -446 -720 682 761 -759 -586 530 7 -756 41 783 -412 -513 394 622 -634 -349 744
3504 744 757 -836 -496 304 69 -624 -129 1015 -262 -825 352 486 -389 -703 625 950 -671 -389
3522 -389 843 -54 -392 56 979 -514 -1016 713 829 -630 -523 508 207 -812 -39 349 24 -872
3540 -872 172 859 -681 -913 730 910 -591 -283 410 208 -614 186 420 -315 -1098 147 603 -449
3558 -449 -104 434 198 -704 -133 942 155 -452 158 707 -204 -333 196 424 -582 -537 268 -145 -510 168
3578 168 612 25 -935 207 430 -255 -840 302 698 -465 -276 327 360 -773 117 740 -162 -942 30
3597 30 627 -438 -721 373 577 -785 -234 411 301 -355 18 628 -318 -568 267 653 -386 -687 376
3616 376 232 -577 -643 797 139 -424 -242 343 57 -423 141 457 -135 -331 670 395 -564 -353 771
3635G71m49r95N45P37p79l13J092j13r11J56R41l75r27K41J166n23o13M73N62
3654F86p39m07J210k45o45l07J062l28p95K20P48k43o43P54L1q68Q3Q25N63j540
3674e78K00R95m77p02N76O20p63l07P26L39j016l0J034j92r95N51N46l82p74R07
3694B78M99p94l86Q04n3q68M33N68j98o88M01M99k03j113Q81K02o64j61Q99L15
3714F51q89k48P82j16m18K5P17l04q61Q16J8o57K1O84j11n09K41O35l25q00N23
3735a25P18p88m79J015K46p17k37Q23j24j117N40M40j53o96N65O89l84n75L51
3754hL38p34M57L58l37l69L47M81n33k77L15J96q0n28M35N6n85J78P60k78o89
3775d97O02J82l16l95N51J58m12p8K27J10l94N9N76k77m94L86N11l31k43M04j78
$$ plain form
3635 771 322 -673 -128 609 -170 -483 609 496 -415 -259 682 307 -620 -379 787 264 -349 124 686
3654 686 -53 -460 750 505 -140 -447 615 287 -508 -288 460 217 -426 328 359 -509 -426 399 962 -578
3674 -578 -378 617 140 -562 14 634 -129 -436 290 629 -387 -417 617 425 -570 -19 527 145 -629 278
3694 278 777 -17 -403 401 348 -520 -87 481 283 -405 -4 495 292 -821 60 262 -402 -563 336 651
3714 651 -238 -486 296 180 -238 -213 504 200 -661 155 173 -484 -463 221 110 -399 -158 477 152 -648 -125
3735 -125 593 -195 -674 341 587 -130 -367 456 332 -785 -245 195 42 -654 -89 600 216 -359 -8
3754 -8 330 -404 53 411 74 -295 52 533 0 -277 38 234 154 -374 61 117 -468 -290 470 192 -497
3775 -497 105 287 -29 -424 127 285 -127 -205 22 132 -262 -203 373 96 -398 -12 499 168 -75 329 151
3796A51o15J40R27l42q65K96Q65N5q99l2N81j39n25P67K74p83N9N68l44p83K58
3817c86P86j15o37M34L87n84l74M59K80o39J79O08R0r21K86K03m9k19K73K31m39
3838a47p6N57k42k59l65Q80l71k86L98M58m99m22N70M4m16l72J094l96k15j16
3858a81K37J26n48O06J07m63o2N36j4q03J00N00k09j25J06K21k23p01J171r9l38
3879e6k03P14l36m07Q4K23P5l27k4M45m12J22L53K17p76j66N90M31r89M20K31
3900B09k73qK4L76o07j69J97N06m89j11O31r7k18k48N62j41m98N97J02l99J57
3921A03K27J4o68L06J88k21j05K14N92l82n31M49K54o56J94K84m86l45N13M62
3941D06m41m82O76K63o07K9P8N1L4m52P64P7o89M0N41l54j97K89L51k83l09L01
$$ plain form
3796 151 -464 -324 603 261 -604 -308 557 612 -287 -319 262 123 -402 365 639 -144 -85 483 139 -644 -386
3817 -386 400 285 -352 82 469 -115 -489 -30 250 -389 -210 398 488 -433 -147 56 7 -212 61 292 -147
3838 -147 -223 334 92 -167 -532 348 -23 -309 89 547 48 -374 196 240 -176 -548 546 150 -65 -181
3858 -181 56 182 -366 240 347 -116 -178 358 344 -459 -359 141 -68 -193 -87 134 -89 -790 381 282 -56
3879 -56 -259 455 119 -288 -204 19 94 -233 -257 188 -224 -102 251 468 -308 -474 116 547 -442 -22 209
3900 209 -64 -72 -48 328 -279 -448 -251 255 -234 -345 286 189 -29 -277 285 144 -354 243 345 -54 103
3921 103 330 344 -324 -18 170 -51 -156 58 650 268 -263 186 440 -216 -22 262 -224 -569 -56 406
3941 406 -35 -517 159 422 -185 -156 -78 -27 7 -445 319 396 -293 -253 288 -66 -263 26 377 94 -215 86
3963H6M5k63l5O45k32n87L00K58r4l88J49om6m0M85l53RJ14L79m82r4L14J89j82
3987A71q02N23J17J09n30O98J86o24k08O55k44n93O77K63j83l49R6L54m35J78
4007E9M45k30p46L89L09p8m30K14p4K64m14K39O64r60K85K45Km53L25J72j20j70
4029f3J40L19n91k32P92p4m76K45o7m39K52o9N74l71l94N44K14j43k86M98J28
4050E01m79j62M37k42j88K0K6k34L8L75J83m34l61R66r8p32J85L24O0m36L72L54
4072D75o06p2OK79n24L27J35p9k99L57m3j15k23N61Ml90k71M48K39l2j35j91K7
4095a22j31K70J73k09l12M08m9l17lN73%n38L00q0oj12M65q0l41j8K09Q0J19m61
4119a82L86j80l6K0M66m44k92K07M94m48k7J08q0K55m36J79Q6p9J74L0j85k08
$$ plain form
3963 86 131 -132 -167 478 246 -341 -41 217 123 -265 -116 -122 -168 -208 277 -76 -67 47 426 -56 -150 164 353 171
3987 171 -631 -108 9 118 -412 286 472 -152 -360 295 51 -542 135 398 215 -134 -38 316 -119 59
4007 59 504 274 -472 -83 226 148 -282 -68 -142 122 -292 -53 611 -349 -64 181 183 -270 55 227 107 -63
4029 -63 77 396 -195 -427 365 291 -185 60 -7 -446 -194 -263 311 -60 -454 90 304 161 -125 373 501
4050 501 22 -140 297 55 -133 -113 -87 -321 -283 92 275 -159 -520 446 348 -384 -199 125 185 -251 121 475
4072 475 -131 -203 -197 82 -442 -115 20 -59 -358 -1 -44 -159 -382 179 183 -207 -478 -30 209 177 42 -149 -122
4095 -122 -253 17 190 -19 -331 77 28 -289 -292 281 281 -257 43 -37 -43 -155 310 230 -111 -129 80 160 279 -182
4119 -182 204 24 -12 8 474 30 -262 -55 439 -9 -36 72 -8 247 -189 -10 76 -3 171 201 16 -192
4141a92J38M55l75q9K28k10J05J5j32O6l08L34L03k86j78L13K17k93o6N42l92
4162A95m12j22P74m22l16J14L83m36M2J56j91n6J56L76j04j55J23K7K4j31P4L45
4184D44m77j77M32p2n78M56M03o77L27o1L67n22J74K91j65j06l5M90k12o89K08
4205a79P41n69l88K33K69m42J79M3K31k40k20L50K55m81K64J80J3j18J26m0k64
4226e7M3K56p1j36l34O08k83n7j94J91J61l89N04r6j49l65N06J01k57J63Q0j87
4248C8k8Q0k01p2K34M2j03J20l7k98K61m02K83K57l06J71J32K26m60J54p2J92
4270B11n90M36J82k83l7k7K86l27j42M21j10k71L18K0K22j15k79K67J79l14J79
4291B26p0N2m00K24j7J34k67L32j36m87M02J33L18m28L0M48q18J90n8K40r3K01
$$ plain form
4141 -192 -54 401 26 -63 165 -45 60 75 -57 9 -299 35 338 52 -126 187 404 111 45 587 195
4162 195 -217 -339 435 13 -303 -189 194 -242 -200 -44 -235 -291 -135 241 137 -18 105 132 156 25 99 444
4184 444 -33 -210 222 150 -428 28 431 -246 81 20 387 -135 39 330 165 59 24 514 302 -387 -179
4205 -179 562 -7 -395 -162 107 -335 -156 -113 118 -122 -342 8 263 -218 46 226 239 121 247 207 -57
4226 -57 -14 242 171 35 -299 309 26 -31 -225 -34 127 -262 242 146 -3 -368 138 239 -18 145 225 38
4248 38 10 90 -111 -183 51 93 -10 110 73 -225 36 -366 -83 174 -132 39 171 397 -63 91 19 211
4270 211 -379 57 239 -44 -81 -108 178 -149 -291 130 20 -251 67 87 309 194 -85 182 361 47 226
4291 226 156 208 -192 32 15 149 -118 214 78 -409 -7 126 444 16 46 494 -324 -134 -192 48 -45 156
4313A56J7N5k42k15M58l24p2N29Kl37p7K44o2J27l02L38Kl16l6K34k3k86J26K28
4337B24l33l23K68K85k51M6J25j32O5j14M02k29p3q1J0K2k39R12l47J3k65l9N2
4360bj07J35R7p6k93J69O19k10m93L97J11k15p7O1j20N8K0O2j60l13L37J65l51
4383a86r7N41k8k31j9L5L18m92J02N6L77m39P9M1J32q1k2p0j19K06l07J44l31
4406c91M24J37m50K69Q1J04l14O4J81j00j17L9K50o8Kk55K26m8j68R5J04j74P5
4429c4J5L60p85L05N32k25k68K70J47n92M64l1pm67j7P63l53k71K55p7J07o78
4451e87O17Nj6J32N4K1k69O2k48N3q2K89J62k89j82K47K20m43J96j02L21j89N0
4474B2K40n01J15p9L31j43N4K34L9k58m64Q11j61l09j37R8N51o91K12J61Nj02
$$ plain form
4313 156 173 228 -14 -229 229 -95 -167 362 364 27 -50 194 132 259 -43 295 297 -19 -55 179 156 -130 -4 224
4337 224 -109 -432 -164 121 -130 -84 41 -91 -26 -140 262 33 -40 -121 -111 -89 -328 584 237 250 -15 -54 -2
4360 -2 -109 26 123 47 -246 -77 542 332 -161 236 347 132 55 116 -4 54 74 136 -24 -337 0 165 -186
4383 -186 -283 258 230 -1 -20 15 333 -159 -57 -1 376 -63 16 57 189 108 86 16 -103 103 -204 -60 -391
4406 -391 33 170 -280 -11 70 174 -140 -76 105 5 -112 -73 177 109 111 -144 82 34 -134 -39 65 -109 -34
4429 -34 -19 341 -444 -139 393 168 -100 170 317 -275 189 158 151 -316 -333 430 77 -194 61 -16 91 -587
4451 -587 30 35 19 151 205 226 -43 19 -229 -176 -258 31 193 -96 -278 -31 189 -254 -58 -160 161 -28 22
4474 22 262 -239 -124 -203 128 -15 39 273 312 54 -410 401 240 -69 -206 -108 443 -248 -36 125 130 28
4496B8K72L8m57nJ89K25j12j07j32K42j25k69M31j94k28j5N37o15J87K85J56q8
4518B43j77J01l53j26L19L13n03L88k50J68m45NM94k49Q5j90L98K46p82N75j24
4539A36j32j51L81j83m9m7N04m99mj14K12j89o6M51l07k95J90L39j89J19l33M06
4561A80k59j45L55K83l73o4o0J83k61J36J86J7m74J30K05k28L31j18j34N26m51
4582c5j93O16n62J4l3M1r4K03J58l18m0J77J84j27K92p0j81k34J50K77k1j88m7
4605c1K83j01m93K87L61k99j2j68M4K29k42J82k15lP1N2jj09J14lJ64m84O75J20
4629D21l27l27O06j70l42J7M13n18L68n9K47k63l9j70M23l81j04P99m24j72j44
4650a46N32m56J7M5k2m01M9K03L25j08k02Q3K23k9j47L75n70J27N5J74o2K02R2
$$ plain form
4496 28 300 338 -119 -124 65 290 178 71 -61 181 56 -213 218 24 -204 -219 318 -297 -110 175 331 243
4518 243 66 167 -186 -312 7 320 -183 205 -45 123 -322 -317 177 -72 13 -177 221 467 -315 260 136
4539 136 4 -147 234 51 2 -45 459 -40 -44 -158 54 -135 -201 250 -57 -352 -162 177 -12 107 -226 180
4561 180 -79 -224 131 414 41 -23 -83 100 -161 -25 161 178 -296 -166 39 -189 142 24 -110 416 -35
4582 -35 -228 388 -174 -160 -193 -152 -246 -43 115 -203 -243 -66 118 -9 283 213 32 -202 -52 225 204 16 -31
4605 -31 252 151 -342 -55 306 7 -5 -173 -129 100 -142 40 -175 -178 -107 -55 -56 -165 -51 -54 110 -374 301 421
4629 421 94 -233 373 203 -139 -122 291 -227 141 82 329 66 27 -143 280 -101 -205 594 170 -2 -146
4650 -146 386 -70 -53 -8 -30 -431 -382 -179 146 38 -164 -81 142 113 -34 341 -229 -102 -47 127 65 267 359
4673C59K2o75J22L84m22k3J69L36n89J05L25L82o68J28J7L02m64P9J14m6j34J60
4695a7J57N9n39K99K27m08j1M17l18j13M12j10K41l83j2R7J35j33K77j38j07k78
4717b46R9K15k25j08M51k38k34N41k40k84L76L2K8k99L9L07j49O0k46O9J68j53
4739c7M0M05m82RP8O9o0n1J62K9J9n38O42l87O7J82L29p32R2K0P0j03j21J66K56
4764A24m80K62K75m46J29K5K02m3j8J07o8m7J0lK16l92K98K50m65n09O08m5l29
4787c39J75L41q2j31J25J12p8k28J76J56k4m49M04j33j98K59K89n92j66L51j80
4808b12L89j80r0J45j27j61L04k6k97K25J86j74M1l11M04p3o0J89k15j11k4M96
4830C18l31l08L26K14j70J12j25J98k78j90O10j59m14j45K76j82Q2L10K42m19
$$ plain form
4673 359 381 -294 -172 212 -210 -233 -64 272 -317 -212 113 495 -173 -45 -28 274 -190 -111 3 -43 -177 -17
4695 -17 140 199 -340 -41 186 -222 -233 184 -134 -247 165 55 296 -87 -99 -2 133 0 277 139 32 -246
4717 -246 -147 68 -157 -265 186 -52 -286 255 15 -269 107 139 167 -132 -93 214 65 125 -121 -52 116 -37
4739 -37 3 408 -74 -65 13 82 22 -29 133 162 181 -357 285 -102 -35 147 476 -256 -164 -144 -74 -177 -298 -132 124
4764 124 -356 -94 181 -265 -136 -111 91 48 30 137 69 22 32 29 245 -147 151 401 -64 -573 35 -10 -339
4787 -339 -164 177 95 -36 89 201 123 -105 71 227 203 -246 158 25 -173 86 375 -217 -383 -32 -212
4808 -212 177 -3 -93 52 -75 -236 68 42 -255 -30 156 -18 23 -288 116 43 -17 172 -43 -154 -178 318
4830 318 -13 -321 5 219 49 161 36 234 -44 -234 376 217 -197 -342 -66 -248 -166 144 386 -33
4850c3j31K16jk65Q9M02j31l01K65L63n55k68L73K65j86p5J30O0j13L6J58j50
4872A48l91K80o5K2j48L62K10l08k67L67k05k68L08j05J12K2k12M88l47l15L87
4893G5k18j03O8J01J56j12j46M11j63n14M69K10M9k16k9R9k03k92M96j04j40j53
4915b59O63m54k57J23M93l99j78K33J92m23K45j52M24m36K02K36k10k01J20N54
4935E16q38L35m5K53m27%R4K69l03j82O07l39J52K88n01l06O24n4J06l44J08J84
4957A97K5l43K95O7k63J41k77K65rk63M21q3m28K61J79j66k37J72K78j62l10J50
4979i0k98J06K20K1j3n21O50K04l32j20J87M46m24l45L53k2k7l86M59q8j76M37
5001B41j90j38l70N58K68o11J19J68J64m47L79Om00k8j09N40j29k78M61j01j78
$$ plain form
4850 -33 -164 52 51 -214 -125 277 146 -155 110 473 -82 -350 23 288 102 27 157 217 104 140 298 148
4872 148 -243 37 -28 -6 -154 208 418 110 -157 210 5 -263 45 -60 52 74 -138 350 3 -312 75
4893 75 -143 -246 -178 -77 79 -33 -179 232 69 -445 24 234 283 67 38 137 -66 -358 138 34 -106 -259
4915 -259 404 -50 -307 -184 309 -90 -268 -35 157 -266 -21 -173 251 -185 17 253 43 -158 -38 516
4935 516 -322 13 -32 221 -206 -206 -112 157 -146 -328 279 -60 92 380 -121 -427 197 143 249 -95 13 197
4957 197 222 -121 174 241 -22 119 -158 107 98 -165 256 173 -255 6 185 19 -218 -46 232 70 -240 -90
4979 -90 -388 -282 -62 -41 -54 -575 75 279 -53 -173 14 460 36 -309 44 22 -5 -391 68 -20 -196 241
5001 241 51 -87 -457 101 369 -242 -123 45 209 -238 141 147 -253 -281 -390 150 21 -257 204 103 -75
5022g5K4K17m5r0k05J60R9l18L48J30n50L26M3J70k80j01O82j59l41j45j2K10
5044H8r7rM22l62l45M41M8p5j72Q8k96j71K25K66j09oj41M01k54m4K49o9l69L56
5068F5K16o81O8K74M21j55l93L01R5l75J13L74k26k21m5NM5j11J77N3P2l09M78
5091B41J74o12M5N21k47l65K23j23L45k57J37K40l64l31N73j50k36M4N4K07j44
5112b5M2L92m97K6O4j77PR7J93r5j83O3N18m7o11L86m7k82m1K17K84r3l96L53
5136A48m60R6m5N91k76n05O26Nj46j67K59L23m38n9M54k04l24j40O51n45k65P13
5158B92R3n61k84K23L25k62L60j27J02k59J90j73k03j6N95Q3m49O5N1N34m59j3
5180A07K7j69l11R7M25k87K28K30l37m27L15L86j95k92L24K83l64l47M80Ml36
$$ plain form
5022 -75 -51 166 121 31 -174 -14 85 -233 115 245 -305 21 64 234 -46 -147 535 376 35 -110 -122 88
5044 88 -9 -18 404 42 -303 138 186 111 -61 27 -269 -440 -215 51 -58 -64 -205 196 -58 -102 147 78 -291 65
5068 65 281 -400 -332 -58 363 208 -185 116 211 -164 -51 323 97 -124 -169 -164 -119 -230 -53 0 72 -237 241
5091 241 415 -197 -152 369 122 -243 -20 -143 202 -55 82 322 -42 -373 200 50 -186 -142 -88 119 -25
5112 -25 17 409 -88 -62 2 -175 -168 -71 122 27 -156 -93 425 378 -233 153 106 -176 -217 0 284 191 -205 148
5136 148 -312 -216 -261 330 54 -451 175 180 34 -133 126 449 11 -48 406 202 -122 -262 389 -156 -421 292
5158 292 385 -176 -460 -237 88 -174 186 59 161 -98 92 -81 -284 -300 295 378 -71 -6 45 579 120 107
5180 107 134 -35 -346 -249 176 -111 117 347 10 -417 -102 284 89 -203 121 404 40 -307 173 177 -159
5201a59J9M9K3P4j24M30k86l3l4M38l20O1J8M8j70m3o6K93l68m1L81j55l35L28
5225B8K98l03o46O79N61o92j9R7j41k7K23k7j3j71p0M18r9l22L94P9k16L0J17
5248A78j77l70P7L92j48rl0M50n79L18j00k05J11r4N29k81j59j86O61l61n10N55
5270F2j71j47l0K38J96n99L43mK42j88j19L47k56j29M12J87n12j21L13j82J55
5291C7l11L38O6l72J34L55l68L26L13m06K1k02J31pn19L61L79j91k96K39L14l66
5313b4k60K24ok84L89R7k39Nk2N90k88l76K44L04k41n51O12M0l65j07K54K08m72
5336b68K36K37n22R4K08L90n61P8M91j03j40k79K98r6l21K67L92l23m33N41J46
5357C32m19q1J05jp5N4N7L35n70K01O17l57l56L36k27j08K02Q4j17l70M6O05l36
$$ plain form
5201 -159 -140 -91 -68 6 -118 312 26 -7 -41 397 77 138 156 204 34 -9 -75 218 -150 -191 190 35 -300 28
5225 28 326 23 -623 56 617 -75 -94 3 -138 -165 58 31 18 -153 -223 195 96 -226 168 247 31 61 178
5248 178 1 -369 -292 100 -48 -57 -87 363 -216 102 2 -203 -92 -186 343 62 -97 -283 378 17 -493 62
5270 62 -109 -256 -286 -48 148 -451 -108 -112 130 -58 -177 170 -86 -215 197 384 -128 -249 64 -118 37
5291 37 -274 64 130 -242 -108 247 -121 205 518 112 133 -69 62 55 -464 -103 276 85 -211 28 342 -24
5313 -24 -284 -60 -66 -350 39 136 -103 -98 -120 470 182 -194 50 354 113 -438 174 214 -151 -258 -4 204 -268
5336 -268 -32 205 -317 -223 -15 375 -186 -108 383 280 140 -139 159 63 -258 9 401 78 -355 186 332
5357 332 -87 -168 -63 -64 -139 -85 -28 307 -263 -62 555 198 -158 178 -49 -157 45 129 12 -358 -312 293 -43
5380d3j65K25O3l85O2N05k91j51J30K48o2k4j9K46m95m1k7L99l73J64Jl2l50K39
5404a76K32J1o52O99M1q5o3J80J26l99L8l4Mj06o4K29Nk10K8K98N0k01K00j03
5428D8k88J24N78k58j01j78K84K70o34J51M41m00l75M56l6l01J24K94j87Q3o3
5449C2K60o05J77L35k89lm3J70j19J47L2L38k03n63J20L46k16n3K77q3j4l02L61
5472A02k78p0K10j50K06P9l01N89l66j60K88K94o07p7J41R7p2K08J59o46J00P4
5494a80N65n24J23K1K66k82rJ06K08m2m11L07k40m47Q66J62o33N1j50M37k56n1
5516a13M52j7n04K98K86l96j55L77j94j24O7J44K18o28L86r2J0k93J19L88j40
5537H9l61N53j10Q2m55M54J98n18j48M90k27r3nK70k63l40N34l67p5K70K71n6
$$ plain form
5380 -43 -208 17 80 -305 -243 262 -29 -180 -50 198 136 112 93 339 -156 -197 -224 175 -198 -34 -33 -65 -415 -176
5404 -176 56 67 -585 114 155 70 7 187 313 -86 -48 -82 -78 -184 -248 -19 -14 -224 -196 102 152 -49 151 48
5428 48 -240 -116 462 204 103 -75 209 479 -155 -4 437 37 -338 118 82 -219 -95 199 12 95 32
5449 32 292 -313 -136 199 -90 -93 -136 34 -85 62 94 432 229 -334 -214 132 -84 -137 140 57 43 -259 102
5472 102 -176 -246 -36 -186 20 99 -202 387 21 -139 149 443 -164 -241 -100 -3 -75 133 292 -354 -254 -180
5494 -180 385 -139 -16 5 271 -11 -20 86 294 252 -159 148 -92 -539 327 489 -144 -93 -243 194 -62 -113
5516 -113 339 322 -182 116 402 6 -149 228 34 -90 -23 121 339 -289 97 5 15 -278 -159 229 89
5537 89 -272 281 171 253 -202 252 450 -68 -216 274 47 -46 -51 219 -44 -384 150 -217 -292 -22 249 193
5559A93q19P41L98p24K77q7L31k89m64O75l21j7QL6L7j50q6M70j68j80N9K03l56
5582b33R6M96k36l92L97N2N2l37K9J79k51M22j88r0n84K46M88m3kl61L95p2m74
5605d11P90r4l31k97Q82l52o02K40N97m0o43J07L09m56J05M19j36j89J06j0K49
5626B43o04L35J71k8m85M91J75n39N5N27j44o08M54j49L91l84n8M93l45L3r8J40
5648F6q0KJ87J28n54J93L37p6l51j96L89j35k6K96K4n25J48L20k29J29K8J05p3
5671A07l86K85l3J63k08L63J59n58n0M66j92j87q4J59K61n85L86L37p09K00J41
5692C5N91o67j51P4M40n31K50J89j77k77J59L99o01Q8L21Q0l58j73K43K02n67
5713d31J86M62j52m85O28J78l95k9K7K59n23M21jj78l71L43M25n21L25j49K48
$$ plain form
5559 193 -626 115 513 -211 66 -21 310 21 -443 232 -89 -106 -98 -62 -25 -175 -261 209 41 -139 -80 123 -233
5582 -233 -137 359 123 -269 128 180 232 -105 -76 103 -148 274 86 -4 -588 -342 146 103 101 -260 135 63 -411
5605 -411 379 285 -46 -343 539 187 -415 -175 422 382 -261 -154 155 -301 -196 223 87 -102 4 -6 243
5626 243 -361 -26 145 117 -368 123 298 -241 -186 341 197 -411 43 -106 285 -99 -157 336 -9 24 -74 66
5648 66 -14 -12 175 303 -251 -58 279 203 -148 -344 45 -90 -116 180 204 -321 -173 147 -82 47 75 180 107
5671 107 -279 6 -27 136 -72 291 450 -108 -158 308 116 -71 -155 4 265 -320 66 403 -306 -106 35
5692 35 626 -41 -192 -118 322 -209 41 230 53 -224 -65 334 -267 -179 142 222 -136 -309 -66 136 -431
5713 -431 -245 217 65 -420 208 386 -9 -38 -11 248 -275 146 145 -33 -404 -61 364 -157 168 19 267
5734B67r2lk41J27j49J27M4k93o9l2L42k0m47L23J16j43P9K20n6l04j04P11m39
5757c6n49M32O75m00l69L47K55n12Q9K12J48p78L95M67k75k95K36L14m63J54J2
5778E9j7j60M82j98j51k40L57J41l71j43K56j20K22O5O7q2j02k23Q1J46l60L34
5800D3L59j01m89Q9J71m50j59P31j37k00m0M96o6l72L39J28n14J06K24J09n19
5821b52J68K68r1j05K30r9r6l56P56j58r8q52J006r9k63k64M65j50k46K78J77
5842B19l57j68L06J75k30j75M22J22l80R5J90Jl56k8K37l42M04L5Ll50K02M26
5864D51l15m49K66K22k09l54P19P2k20k80J20K04m14qP33m41k13L1P19p70k83
5885d19N09M44m91k58M02j82k24k81P72k45m69M43J97l65j21L51L75n55J50O23
$$ plain form
5734 267 175 172 -69 58 -91 36 80 -213 -282 -314 28 8 -439 -116 0 -143 -64 156 100 -204 -308 403 -36
5757 -36 -585 -153 522 122 -247 100 355 -157 -68 144 292 -486 -91 376 101 -194 42 356 -107 47 59
5778 59 42 -118 364 166 15 -225 132 273 -98 -241 15 -105 117 182 249 167 65 -158 -77 69 -291 43
5800 43 402 301 -188 -99 72 -378 -537 194 57 -143 -183 313 247 -125 214 342 -172 -66 158 267 -252
5821 -252 -84 184 93 -12 218 119 23 -333 423 265 167 -685 321 222 -41 -305 160 10 -236 42 219
5842 219 -138 -306 0 175 -55 -230 192 314 -66 29 219 220 -136 -164 73 -269 135 170 173 -177 25 451
5864 451 136 -313 -47 175 -34 -388 331 403 183 -97 23 227 -187 -195 538 97 -116 -85 634 -136 -419
5885 -419 90 534 43 -215 187 5 -219 -500 272 27 -442 1 198 -167 -288 63 438 -117 33 656
5905F56n79n70O05K37j18p13M69L13m03K21K21k31n58K43L48j67k31Q9M06r5n95
5926d52N88K7p3P6l6j91k20M4P91k50q08M51L18n59j64N03j29j44j44P34l96l0
5948f4j27L53o5m92L38J50k94j01M66J17m02l77P93k33m57M58J15l0n53Q34p8
5969C51n82j28L94K91n10j2L51J10m96J17K07N4Lm54O39m72l01O85k5m08J55K75
5991B44k82Rk3M50n32J42R6L92o82j17O03M9n45O3L59L77q26M55j30l79R8K83
6013A04K30p07K18M14nm92r3M87k02l99L67M57m52n14N05N68q59j74O17o2J03
6034A11j48Op6l17N77L58n15j33K78m1l31J20L02N8n51M51p0l78K08J95J30l83
6056a49k66M50J70m64J94M73J6j037M63N72l51o27P46O6m44l14N66l3l96K29N69
$$ plain form
5905 656 77 -493 112 349 231 -482 -13 300 -103 118 339 108 -450 -207 141 -26 -257 -168 238 143 -452
5926 -452 136 163 90 166 130 -61 -281 -237 554 304 -504 -53 265 -294 -458 45 -84 -228 -372 362 -34 -64
5948 -64 -191 162 97 -395 -57 93 -201 -302 164 281 -121 -498 295 62 -395 63 178 148 -405 429 351
5969 351 -231 -359 35 326 -184 -196 155 265 -231 -114 93 147 150 -304 335 -137 -438 247 222 -186 -31 244
5991 244 -38 -29 -52 398 -134 8 104 496 -186 -303 300 349 -196 -133 226 603 -223 232 102 -277 -179 104
6013 104 334 -373 -155 259 254 -238 -331 156 -46 -445 -78 379 -73 -587 -82 486 -373 -547 70 8 111
6034 111 -37 -31 -107 -424 153 511 -4 -137 141 100 -231 -111 191 249 -302 149 79 -299 -91 104 234 -149
6056 -149 -415 35 205 -259 -65 408 424 -613 -150 422 71 -556 190 256 -188 -502 64 31 -365 -136 433
6077D33l01n52L50K53O3n47L78O2n2q3K28j30l76K55L49m19j77J49L87m98J5O14
6099D01k38k08pL71J12q56N95J98n23J8L72j92k74JL27J21n52J06N61k04m05K81
6121EO64p68J10L63l37j58j0K03J30o08L27N19n38j25l1P62m12j93K62K38m63
6142f0J48J57O8p79N35N9j62j92L00J09m97l4M41K5l44LM21J2m61Q6L59k92n96
6165f94R86q6o0l23K64K71m23j47M00k49m43P45p6n51J45M61N6o68M35K40R6l00
6187G9QL74l47j10O8J2q1m15R43j07p81J16N61j70o25K83L87j4l23K30K13l55
6209e4m89M69K14j44J67k3P5n45J77N43l82m63N75J36m55R9J92J96l46P6J33k26
6231g5l09L55J35j07j46M08j2n90J19N88j08r4l1j4J22l91K88L5l20k67Q11j24
$$ plain form
6077 433 132 -420 -70 183 246 -301 77 139 87 4 232 102 -274 -19 330 -89 -266 -117 270 -228 -213 401
6099 401 163 -45 -52 319 431 -425 170 368 -155 -137 235 43 -231 -230 97 218 -334 -228 333 129 -276 5
6121 5 669 -99 11 374 37 -121 -131 72 202 -406 -79 440 -98 -223 -254 508 96 -97 165 403 -60
6142 -60 88 245 313 -466 69 128 -34 -226 74 183 -314 -348 93 118 -226 -223 198 210 -251 -165 194 -98 -694
6165 -694 292 206 146 -177 87 358 -65 -212 188 -61 -504 241 165 -386 -241 220 276 -392 43 283 379 79
6187 79 87 461 114 4 72 84 3 -412 531 424 -357 -241 320 150 -475 -192 195 181 -142 88 301 -54
6209 -54 -543 -74 140 -4 163 140 215 -330 -153 390 8 -455 120 256 -199 -100 92 288 -58 18 151 -75
6231 -75 -384 -29 106 -1 -147 261 249 -341 -222 366 258 164 133 119 241 -150 138 173 -147 -414 397 273
6253B73o31Q1P58p0o16M54J28m19l42K64L40l96j41M53K4l52R9M38l73m36N63
6274I9K85n78m04M49L61l44RM89l00o39N69M90l05m03J99N53q84L09K15l67j71
6295c68r6P75l65k44J67P39n29k66J72K57l42m03O92l07J00k57J68j3j12oN27
6316B89j66m61N12L10p24k78O89P4k34l31O32n9n14R2N42m71j84K47Rk21j85O46
6338B14K04n94k16N73m39j7L29J17m4o55Q61l52k12j89O33k48m08K27M65j35k42
6359a28K64N04q42k9M28j7m33M9O49j14q02N27K34k49l92K08N64p31J07M03Rk33
6381b4k9K13j88k95L85K15n09j0K48J61k34k82K83J46m64L78Mk13k87M94L95m70
6403h3l86N17L62q06J78J49L57l76j8P25p69k29N85M9k87j55M73Nm72K23J21o4
$$ plain form
6253 273 -358 -277 481 411 -205 249 377 -42 -384 -120 220 -176 -317 136 160 -192 -93 345 -28 -464 99
6274 99 384 -194 -598 -149 212 -132 -123 366 66 -573 -4 486 181 -222 -23 530 -354 -45 170 -197 -368
6295 -368 -464 311 -54 -298 -131 608 79 -187 -15 242 -100 -503 189 -118 -18 -275 -107 -120 -232 -238 289
6316 289 123 -338 174 484 -240 -518 171 245 11 -320 312 253 -261 -169 373 -98 -282 -35 -26 -247 -432 214
6338 214 418 -176 -392 181 -258 -275 54 171 127 -528 333 -19 -231 -420 213 -35 -443 -216 249 114 -128
6359 -128 136 640 -202 -231 197 180 -253 -204 445 331 -471 56 290 41 -351 -143 421 -310 -203 200 209 -24
6381 -24 -53 160 -28 -323 62 277 -232 -242 6 167 -67 -349 -66 80 -384 -6 -2 -215 -502 -8 387 -83
6403 -83 -469 48 410 -396 -218 -69 288 -88 -106 619 -150 -379 206 255 -32 -187 286 291 -181 42 163 99
6425I9k68K11k00j66J19M83k42j0m05M03J72o03M24M63l25l22J84K64m67j48M93
6446A59l1l62J74J5L22o36M55L01k28n66N01J40l80j08K35J95o15M18J89k39j06
6467a67J13L03m3m91L88m4j41K89K5m6o01L73L54j0m86j1N04l18k58J81R8n23
6489e11J7N10K9pk1M43n32j41J43J25l34K02J18N6m06J6N70n4m35J4L35%l13K74
6513I8J50n9k68O7J54l88J47N49n97J28k0M43l71l04M86J83r61L16N93K1o74P5
6535b32O34k29l38K86L53n59r0M79L18q41J37O4N26q56L34L23l93k45K78L46n56
6556b61J61K70o5n96O03J19j73l58J79O02n12l81N71K41r03L90M67m59j19o7P93
6577E02m03m56O10K60n26k87M27J95n81Q7M74n45j35K03M19l42k89K19N43m05
$$ plain form
6425 99 -169 42 -158 -324 -205 278 36 26 -379 24 196 -407 17 480 155 -167 17 281 -186 -334 159
6446 159 128 -234 -60 -45 277 -359 96 397 169 -397 104 244 -136 -244 -9 186 -429 -11 178 -61 -167
6467 -167 -54 249 206 -285 103 59 -82 207 232 186 -415 -42 312 302 -184 -195 309 -9 -267 -86 12 -511
6489 -511 -494 16 45 38 17 460 -72 -213 -70 55 -279 -77 41 97 -309 -293 277 223 -212 -198 137 137 -176 98
6513 98 248 189 -79 -12 142 -246 -99 450 -147 -19 -39 404 33 -271 215 398 -563 -247 346 367 -307 -232
6535 -232 402 173 -165 121 474 -85 -175 304 622 -219 -82 -18 508 -348 -14 309 -84 -329 -51 295 -261
6556 -261 -100 170 105 -491 112 231 58 -300 -121 481 -31 -412 159 400 -503 -113 354 -105 -224 -291 502
6577 502 99 -357 253 513 -13 -300 127 322 -259 -172 302 -243 -378 -175 244 -98 -387 -168 375 -30
6597c0o16N95N82p95L5M74j89k66N13R4l25j67L74j11k33l50N68j75j01J69r4
6618d8J12m43M64J54k18l19O05L25o96NQ9kj80J62L90o08k12K82L69l10l98O05
6640A28R2n17R3L47j93k37K69N48m08l08J86M2m39N2L52K98n69m7M69J73p28K86
6662a11L86k82k97M26J21r0l39N47k95l33K58M63m27l21L24j47J05n56Q36L9n03
6683a96K76L54n33k61N57nk23j64K27N20o10l25N30k54K3L7J54l2n69N96M06m49
6705E9m23L44J72m01L4N46k82j46R1K25k87k01K55M15m88j88K27L43l34j02L57
6726B16k23n38P21L3l95M40k00K10j45l16O18o47j57J58L03J03m61N36rl72j89
6747c14P37m15j78nL27k48J6j91K88n4J52j32J71n00Q3M23j09l74l17R86j18o80
$$ plain form
6597 -30 -646 -51 531 -264 -229 245 56 -210 303 397 72 -95 279 168 -65 -415 153 -22 -123 46 -48
6618 -48 64 -379 85 239 21 -298 307 632 -64 -59 30 28 -152 10 400 -208 -420 -138 231 -79 -477 128
6640 128 220 -297 -204 143 -50 -287 -18 530 122 -186 0 42 -397 -345 7 305 -264 -311 158 331 -397 -111
6662 -111 275 -7 -304 122 243 153 -186 361 66 -267 -9 454 27 -294 30 -117 -12 -568 268 307 -196
6683 -196 80 434 -99 -360 197 192 -31 -195 32 552 -58 -383 147 -107 -84 -47 107 75 -494 102 508 59
6705 59 -364 -20 152 -249 -215 331 49 -97 -6 219 -68 -269 -14 401 -87 -275 -48 295 -39 -141 216
6726 216 -7 -545 176 209 -186 254 54 264 119 -197 421 -226 -383 -225 78 181 -280 256 247 -125 -314
6747 -314 423 8 -170 -175 152 -96 -80 -271 17 -37 115 -17 154 -346 -263 160 51 -323 -640 346 228 -452
6769d52J76L38k36K70L67k28l64J31l4J37l13K21K77l05l50J20L68j35M0J93m9
6790A72j60k47L27m9n4j68M32j77m53O59j88j22j94M17ko01J13N05m9l03J27n8
6812g3M0j03J14L26j48l02N49j82k02j72J60M2m69M13K14l03k98M65l1n7o24J013
6834C72k40m89K30L14K5o95N50L18j87n83L97J61m66r4K51J75l11j22N73K0m24
6855b25M09o6j94l58O37J55k53n14P62m67k92L71M55l00m15K56M22l43k31O22
6875D31l70k21J62L08l28o01N04M78l09j18J26N16p79O3M2J9k2q9M22k85k85J36
6897b00K03o0k47K65N40n50p6M59l77r2K66J58m7k95Q8K87m76M0J50J12k90L6
6919a06K06K17q21L47N28j89n29L25Q9l72K01M73k30p80M22N20k7n44O1M14l43
$$ plain form
6769 -452 -276 62 -174 96 463 235 -129 2 -32 105 -208 13 290 -15 -365 -245 123 -12 28 221 172
6790 172 12 -235 92 43 -11 -179 253 76 -377 282 94 -28 -222 195 193 -408 -295 210 161 -142 -15 -73
6812 -73 -33 -136 -22 304 156 -146 403 221 19 -153 7 49 -420 -7 207 -96 -394 71 40 -17 -641 372
6834 372 132 -357 -127 187 212 -483 67 385 198 -385 12 173 -293 -387 -136 39 -272 -394 179 199 -225
6855 -225 184 118 -76 -434 203 358 105 -409 353 -114 -406 -35 420 120 -295 -39 383 40 -191 431
6875 431 61 -160 2 310 -18 -619 -115 363 54 -64 62 578 -201 -138 -96 -77 -99 -188 234 -51 -336 -200
6897 -200 3 -57 -304 -39 501 -49 -125 334 -43 -135 131 289 242 -53 35 322 -154 -114 36 148 -142 -106
6919 -106 100 317 -504 -157 371 182 -347 -22 67 -305 -104 369 139 -641 -219 301 274 -270 -209 205 -138
6940a38j54J61R0k73j72J029k72o24J2L78J34k45L8J67j5n99O80k12j18l78P56
6961B45j08n02M52J82k29l16K80M16m41l48O80o4n41J31L85p2n33M41K56o30J19
6982a97M17J18n93M7L83N0j79l00M82j53j63L9J95k23m90P82M05n73l66O48j12
7003B17m69J17L59Pm57O2L69m18kK93K41m02k56N89j04l76J87L06m42j85L55M65
7025D56o02oN22j35n27K42L08j22m23O27p1l01k31J99O63n00m97M60J08p56O94
7046A08L13k66o18L32M57k98j46o3L90l08J37K55l66m23M65O57n87l66K74J46
7066I3l33J71L30J69p47R9O29j85k18J19j43J63l52J08M78n12j95L44j94n9K44
7087IK81l31l10K42K23k3m26O92j19n42L08L03j18o67M18L00l60r3L52R5m04r
$$ plain form
6940 -138 -292 -131 -41 -314 -486 543 271 -353 -341 37 171 -74 -36 131 116 -483 197 -15 -133 -511 245
6961 245 137 -365 87 269 40 -276 4 420 -21 -369 311 247 -294 -163 222 150 -383 58 314 -316 -197
6982 -197 220 338 -255 -208 175 225 46 -254 228 75 -88 -49 146 -77 -567 215 620 47 -319 329 217
7003 217 -252 -135 224 231 -226 -164 205 -213 -215 78 319 -83 -339 250 146 -230 -43 263 -179 -364 -9 456
7025 456 -146 -152 370 235 -292 -50 258 136 -287 340 269 -32 -263 -64 599 99 -398 62 170 -586 108
7046 108 421 155 -463 -131 326 28 -118 -181 209 -99 38 293 -73 -496 -31 626 39 -327 -53 93
7066 93 -240 -69 261 430 -317 -218 411 226 8 127 -16 147 -205 -97 381 -131 -326 18 -176 -235 9
7087 9 290 -41 -351 -109 114 91 -335 357 238 -304 4 307 189 -478 -60 240 -120 -213 139 234 -170 -179
7109a79P22j96q61K73L70n1o34M57L75m8m83L99N01o39m5K60K06o82K64L84k94
7130I9o73N01M28k50l06M50k18j27k37O12p2m49L8L37k64l33L38K80m71M1M86
7151B10O6n31K13M11j72o34M36M62m11l61K6M04l12k11K75L26l30k90P09Q3q08
7172d39J17O00j63n28L23L60j25m10L20J09o37L8N64j84l27L17N09m43m74N04
7192C1P3k86k79O57L3m88R8M63k51k35J58L95m76j31J76K83j84l08J78K42n89
7213d40K12K81k15j88M58J69l57l95Q29J12q13K84M04j64n34M32J97m61p5N60
7233B96K11n80j62P02n48r1q4M02J2m70P7O72k24o78N46J75j59m62Q25l0p94J81
7255a83L57J19o64M47K38q15J93M82J38o86J13M29j30n36K65N93l98k46J97M22
$$ plain form
7109 -179 543 347 -514 -241 129 78 -556 -99 276 228 -255 144 645 6 -39 221 427 -255 9 393 99
7130 99 -574 -73 355 105 -201 249 31 -96 -333 279 207 -242 -204 133 -131 -464 -126 154 -317 -276 210
7151 210 276 -255 -42 369 197 -437 -1 461 50 -311 -285 119 -193 -404 -129 197 -133 -423 286 369 -439
7172 -439 -322 278 115 -413 -90 270 145 -265 55 164 -473 -435 129 -55 -382 -65 444 1 -473 31
7192 31 104 -182 -461 196 229 -259 -161 302 51 -184 -26 369 -107 -238 -62 221 37 -271 -93 149 -440
7213 -440 -228 53 -162 -350 108 277 -80 -475 354 466 -347 -63 341 177 -357 75 272 -189 -264 296
7233 296 507 -73 -235 467 -81 -172 -256 146 158 -312 -235 437 213 -465 81 256 97 -365 460 430 -364 -183
7255 -183 174 293 -371 76 314 -501 -308 174 312 -374 -261 168 38 -498 -233 360 -38 -284 -87 335
7275C35l40l53L84J96p57M05N60l82l62j01Q36p63J28J75N30o24k33O43j85n32
7295d40L04L00j44m59L57M72l81n3L35K61o88j23L87R4m67L8P21j79n89N58j9
7316B85k93j48M93M5n57O6L84r8o95L22M03J56p71M73Q3l72n4K69Q1l40J94M28
7338C54j75m53M69N2l21l65M06N8j76r9M10L68o83L08K0l56k76L95J85m56P2L64
7360A01j37j02o4M83n4m65p7P52l78m80Q67J39p33k77M75j35m24L89N03m38l02
7381c57K9N37k25n8M28J20l45k63L18P1n15L68J86m0n88M47J9k13l46M72L67k86
7403A26k01J21L16p55L62M91k34k23j15L37k08j38K42K44k45k5j21K56o53O76
7423B53Lk64l96N72r0k64K4M65l17p57Q87K17n4o53K88M75l45j79N65m21m18L51
$$ plain form
7275 335 -5 -358 26 222 -535 -130 430 48 -314 -415 421 -342 -214 -39 491 -133 -366 277 92 -440
7295 -440 -136 164 20 -439 -82 390 9 -44 291 552 -136 -259 128 222 -245 -207 514 335 -254 304 285
7316 285 -8 -156 337 382 -175 -109 275 177 -518 -196 207 363 -408 65 148 -224 -278 -9 72 -268 -74 354
7338 354 179 -274 195 247 -74 -439 -33 25 -151 -250 160 528 -155 153 173 -183 -459 -64 121 -335 -263 101
7360 101 -36 -138 -202 281 227 -238 -315 437 59 -421 446 585 -148 -425 50 -85 -509 -120 383 -55 -357
7381 -357 -328 209 -16 -74 354 474 129 -134 184 255 -260 108 294 254 -334 113 132 -81 -427 45 412 126
7403 126 -75 46 362 -393 -31 460 226 3 -112 225 17 -121 121 365 120 95 -26 230 -423 253
7423 253 256 -8 -404 168 78 -186 -162 303 -14 -771 116 333 279 -374 -86 389 44 -135 430 9 -409 -58
7445e8J21n2o38M59L94j91p71Q78L01n75j78L86p0k36J4L38J0o95M68K37%m02
7467b60J96O4p7p4M77j56n82J38P09k65l27N07k37k7l23L42K17m43l12P53k50
7488G0l36J35P37m86m83N43j85o5L2J55L56n94l4K05Pn64L04M96j22m52K64J87
7510A70l49j3L41J05n44K77L31J0q18L46K86k85k25M67J43m66k19N57K09o07J1
7531b73N11j53p18K11O02l70o2N22Jj27l62O59j77o34K92M10j74k99K26l4l15
7552b64r6M65L52n96k9L05j58K5P1L25n96Q6L09K96o40k57R08k78o12M39P3m8
7574H0j87L12k35p7k77L38N47o67j02M18l9m39L70J7n8l60J14P30o84j26N70K08
7596D53r39L46K09o8o35L86N79k31n50O64J47m47m36M78J69o14L67M74j85m70
$$ plain form
7445 -58 63 11 -627 -168 226 35 -736 142 443 -132 -310 76 6 -230 -216 122 132 -563 -95 142 142 -260
7467 -260 -64 0 -77 -151 326 170 -412 -274 435 170 -157 350 113 86 -237 105 322 -121 -433 320 70
7488 70 -266 -131 606 120 -363 180 -5 -70 -38 117 473 -121 -155 50 57 -507 -203 293 171 -281 -17 170
7510 170 -179 -192 149 254 -290 -13 318 328 -490 -144 142 -143 -368 99 242 -224 -443 114 323 -284 -273
7531 -273 238 85 -633 -422 180 -190 -252 270 271 144 -218 441 264 -370 -78 332 158 -141 85 51 -264
7552 -264 -360 105 457 -139 -168 137 -21 4 75 400 -196 -110 199 495 -145 -402 506 228 -384 55 128 80
7574 80 -107 205 -30 -107 -384 -46 501 -166 -268 150 111 -328 42 59 1 -359 -245 485 -199 -325 245 453
7596 453 -486 -140 69 1 -634 -248 331 100 -450 214 361 -86 -522 -44 125 -489 -122 352 167 -303
7616c03M18J81m49l0J76L22k90m65M19K87p71M14M03l35q7j7L83m15j23J47O60
7637E25o31J59K38r2k44j01N39k12l13K86L4j91j70N04m4m75RM35l00n63L94M77
7659B64k47l68M09J50k45j23N40j6n78K4L80j26J9l22O51j67n39M47L7n23L17
7680a6j92J45j29L4M49k50k73K28M83o32k45M47j2l34q4M72M6j92j13K42k84l17
7702e27P08K8j56m02N57J06o65J86O01n83qL22k3l30p3N24q4n29K45K65j23r1
7724e2j24N71k67k75K22J25l42k29P87k6p09q6O23Q6n01O7P32l45l18l1P80q51
7746a63j20O14L95j020K21K18M11o65ON31m65k46M31L76p17j15M74m6k73k18P52
7767C81l87k39M34M7r4l46M08L3m57j07J77L28o25K75K62k76k57L75K24n16j79
$$ plain form
7616 -303 115 296 -153 -183 -7 315 25 -440 -21 266 -505 -91 312 -23 -110 -127 256 -159 -282 -135 525
7637 525 -106 53 291 199 -45 -146 393 181 -132 154 188 -3 -173 331 287 -188 -179 256 -44 -607 -213 264
7659 264 17 -351 58 208 -37 -160 380 364 -214 -190 190 64 83 -239 412 245 -294 153 190 -333 -16
7680 -16 -208 -63 -192 -158 291 41 -232 -4 479 -153 -398 49 37 -297 -381 91 137 -55 -168 74 -210 -527
7702 -527 181 209 53 -349 208 314 -351 -165 436 -147 -155 167 144 -186 -259 265 181 -348 -103 162 39 -52
7724 -52 -176 395 128 -147 75 200 -142 -371 416 390 -319 -405 218 304 -197 -130 602 257 -61 -92 688 -163
7746 -163 -283 331 726 -294 -73 145 556 -109 -103 428 -37 -283 148 524 -193 -308 166 120 -153 -371 381
7767 381 -6 -245 189 236 142 -204 204 237 -220 -327 -150 178 -447 -172 90 -186 -443 -68 156 -360 -539
7788e39M16K84k91mL02J5o72M21K94Q7o91K88L44l91l74L79L48l92j62M32k74
7809a80J09m6O38j28n89m6N09l02N5L09L3k99m1N77m14l79K2O45p64q3M37J83
7831B46k12k11L88R1n89L05J46m1o08L12M55o6o58R84j79m55j76N63k2p82M82
7852b7O02p15j21M11J47L2q46O61K42m55l83O45j33k57K0M22l35k52O36l09n13
7873e28L70L03j46k65J33K69r6k58L21N19o64l79P84k79n81J02M06R9n96P48M9
7894C11k34m25N66J56k30m16M32k0l79L22M4m2j26k22O08l69l30J24K94j72n31
7915f39Q18j45o8o6M74l35k82m7N16k40l74R09k20l56n53O45R8m54Q2M54j35q70
7937g88P40K27j89l89L79K82k51p0L03n9m19J86N58n38k39j09O39l51j73J32M26
$$ plain form
7788 -539 -123 161 -130 -134 168 183 -489 -68 226 313 -378 -90 254 -137 -511 -132 216 -176 -338 94 -180
7809 -180 -71 -117 521 393 -196 -242 267 -35 20 329 362 63 22 599 185 -194 -172 473 -291 -374 63 246
7831 246 34 -177 211 302 -287 18 164 123 -485 -173 282 216 -442 542 363 -92 -268 295 273 -509 -27
7852 -27 575 -140 -261 150 297 329 -517 144 386 -69 -452 193 60 -197 -177 245 -90 -342 294 -15 -528
7873 -528 -158 145 -1 -266 -133 136 40 -218 103 622 -42 -421 363 84 -497 -395 11 110 -486 262 311
7894 311 77 -348 218 374 144 -272 160 140 -239 83 127 85 -41 -263 345 -24 -354 -230 64 -108 -639
7915 -639 179 34 -34 -100 374 39 -243 -290 226 -14 -388 521 301 -55 -608 37 135 -319 -237 217 82 -788
7937 -788 -48 179 -10 -399 -20 262 11 -59 244 185 -234 -48 510 -28 -267 -376 263 -88 -261 -129 297
7958B97k06r6P5j24n8O8O40n55l02K79K53k85l97N59J54l36k52M85L6o98N25J50
7980B12j82l83O33N9n68k60R02j55m54p0O03k83n33M29M52p32J08K97o8l0k18
8001b41N48j50n96J16O94k72m79M90K90l24m38Q31j20n46K33J93j98o55M07K90
8021G3K7k16J76J79m30M06L4k51k08L37J24k93r2L7K40q5l81M56K14q06K52L74
8043A67Q2p27J80O56m02k71K04P47p16l75P94j14j13p6J04J6m57M54m9K32p29
8064c93N46p5q5l42M99j61k94J57O55m06m08L49L22l98k86M35O6l29j38L87J34
8085B35l97J15J29J1l71M13L13m40Q9j5j24k87Q5M28J34o30l7M78q3k62K53K28
8107B65l56k59L62J05n02j9P70K3m12j49M30m31R7M60P4o31k82P20J54n28j35
$$ plain form
7958 297 91 -5 70 -54 -112 -44 596 41 -261 18 271 -14 -411 148 302 -34 -286 199 235 -463 62 212
7980 212 30 -353 280 339 -229 -489 413 258 -196 -266 337 54 -479 -50 402 -330 -222 75 7 -23 -241
8001 -241 307 157 -439 -323 371 99 -380 110 400 76 -362 469 349 -197 36 229 31 -624 -217 73
8021 73 100 -116 60 239 -191 215 249 -2 -210 127 251 -42 -134 -97 143 58 -323 133 347 -459 -207 167
8043 167 249 -478 -298 358 -44 -315 -111 636 -80 -455 339 225 112 36 140 156 -301 153 104 336 -393
8064 -393 153 78 -7 -349 150 -11 -305 -148 507 101 -307 42 364 -34 -320 115 181 -148 -286 101 235
8085 235 -162 -47 82 93 -278 135 448 8 97 82 -42 -329 -244 184 318 -312 -349 129 46 -216 37 265
8107 265 -91 -350 12 117 -385 -404 366 389 -23 -172 258 -173 -76 384 458 -173 -455 265 419 -109 -244
8128b44O45l11p27N98N44n62m29M82K50m26J71K76j17m56J64O93m06k39K12K98
8148D16l50l31Q1N33l73m32O26L7n29p7M06k61J1M53K1l22k96R27m30m04N15%
8170B21j79m16K53K52m13k16N02L48n70pN13j32Q3l06K44j09l08L67K10n05L
$$ plain form
8128 -244 401 90 -637 -39 505 -57 -486 -4 246 -180 -9 267 150 -306 -142 551 145 -94 118 416
8148 416 66 -265 -184 349 -24 -456 170 207 -322 -399 7 -254 -243 210 231 -91 -387 540 110 -294 221 221
8170 221 42 -374 -121 131 -282 -498 4 352 -218 -225 288 156 239 -67 177 68 -240 127 337 -168 -165
8191a65
$$ Imaginary data points
##PAGE= N=2
##DATA TABLE= (X++(I..I)), XYDATA
0@%%%%%%qJ6j6J6k4L2l2M0m8N6p2Q8j04J20j42J66j89K19k52K89l32L78m26M81
30B56n44O08o79P65q55R48j054J173j302J441j595J766j955K165k400K662k959
47a559L298l685M136m671N318o112P114q430J0241j2901J7193k5247M5426j84317
61a54196l70250M02674M14756m2493k75350j03175J1639J05921J46673k2155k31216
72a17172k4688K56512O1028k87219r7722K72496J54746j95684j62704N4063P7534
83h810N3442R4193n1788k29584l5304K64515J16939k01589j20713J16851L5399
94C3551r5110N0378J34563o3104j39859L3311O0085p1033R222J55723m088j87789
106h4150j1092J72778o195j59116K6750J47079k8618j10376K9715M2405n7477
$$ plain form
0 0 0 0 0 0 0 0 -8 8 -8 8 -16 16 -16 24 -24 32 -40 48 -56 64 -78 88 -101 118 -134 155 -177 201 -225 256
30 256 -288 320 -359 406 -449 499 -555 618 -684 757 -838 928 -1027 1138 -1262 1400 -1559
47 -1559 1739 -1946 2190 -2481 2837 -3275 3839 -4591 5650 -7251 9942 -15305 30121 -154196
61 -154196 -524446 -121772 292984 250491 -24859 -128034 -116395 -10474 136199 114044 -117172
72 -117172 -141860 114652 175680 -111539 -209261 63235 217981 22297 -140407 -86344 -8810
83 -8810 44632 138825 87037 -142547 -177851 86664 203603 2014 -118699 -1848 33551
94 33551 -61559 -11181 123382 60278 -79581 -46270 13815 -57218 -47996 107727 103639 -84150
106 -84150 -95242 77536 71341 -87775 -61025 86054 57436 -52940 -23225 19180 -38297
117c8297K9847J16547p7660j97564O3425K41007r422k13015k7747J35466K1999
128D4586m3696K9623k7025j05487N4228J72474l7207j87254K5319J67579m2910
139E0230j61224L8261J36540j6458n9695L6098k2309j00891N4852J58749m6690
150F7463j72043L4570J56018k8026j09815M7658O1913q8469l8756J17815K9566
161G7894j23339j6624J06630r617q2811N4223O5662j07458p5244J36613R8699
172A24628j17846q4049R1183L7116q4866J796Q0128l5705o6148P8767O3299j13024
184b4721o9930J19449N6581j24924m1697J26966L5645j04282j6297O7530k4861
195e41l7054P7857K6506j27525l7907J49495N5925j31306n1276R6867R559q2685
$$ plain form
117 -38297 -8450 108097 30437 -167127 -103702 137305 127883 -85132 -112879 22587 44586
128 44586 890 30513 3488 -101999 -47771 124703 87496 -99758 -74439 93140 50230
139 50230 -110994 -72733 63807 47349 -12346 23752 1443 -99448 -44596 114153 67463
150 67463 -104580 -70010 86008 57982 -51833 -4175 57738 -30731 -69487 48328 77894
161 77894 -45445 -62069 44561 34944 -47867 6356 72018 -35440 -110684 25929 124628
172 124628 6782 -77267 13916 51032 -33834 -32038 48090 12385 -53763 25004 88303 -24721
184 -24721 -94651 24798 81379 -43545 -85242 41724 77369 -26913 -43210 24320 -541
195 -541 -37595 40262 66768 -60757 -98664 50831 106756 -24550 -75826 21041 30600 -52085
207e2085K7751P7816m7921n6256P2220K9921j05699j7621J27538J1390j35199
218f8145m361J36951J2116j05609j0715M4385l3707j146R6552o347j42150n359
230h7535J58449K1864j42962k6742J05781Q726o6033K4552L5961n7381n135R7630
242F7175j0791j36145K791J44574P911j22331M18R5420j8685o9782L4248L0623
254B5426o4835K743J08253k758j26154m906J12840l311r1331K3089O7702m8089
266a331m6810P6347L7416r3826l1083R2244J1295q9707R431Q4106l1056p2024
278e4998N6924O8033p3485o5500P0009M4321o5427q568P5348j8604q4259L5828
290b0378Q0555n9445q3152P1145Q6730n9857o4801M7651K1642n5546J4978P0083
$$ plain form
207 -52085 -24334 53482 5561 -50695 21525 51446 -54253 -71874 55664 67054 -68145
218 -68145 -72506 64445 76561 -29048 -39763 4622 -29085 -30231 66321 59974 -82176 -87535
230 -87535 70914 92778 -50184 -76926 28855 37581 -28452 -3900 32061 -25320 -30455 67175
242 67175 56384 -79761 -76970 67604 75515 -46816 -46398 49022 30337 -39445 -5197 25426
254 25426 -39409 -36666 71587 68829 -57325 -62231 50609 47298 -44033 -20944 46758 -1331
266 -1331 -48141 28206 65622 -28204 -59287 32957 44252 -45455 -36024 48082 17026 -54998
278 -54998 1926 69959 -3526 -69026 983 45304 -20123 -28691 46657 28053 -56206 -20378
290 -20378 60177 732 -82420 -11275 75455 15598 -49203 -1552 20090 -35456 -20478 49605
302D9605l9796p8709O0748Q7268o9337q6484O8246P4641o2785n3965M8721J5788
314A3941m3641L6988O2861o8483r1924O9312R7805n8462p9937N1849N3333m6332
326b690j2104N3421k8751p7766M5838R4079m3078q3553M7531O5084n9924n1923
338e3836O0795L0183n8209R12O5608k8407p3492M6397Q0679n3128p8971M8280
350a3189N6720m8967k4347O4038K933p6139J0057P5506k7798p5822L8219P0814
362E2025m0376m9423N0440K4117p0869j1800Q0155L731p5509J3655P1911k9135
374A8922o6914L5954M8800n0057k9504O7863J7976p7774q377Q0249k066p5511
386d0439J2297O0590k9948m5729N1447L7713o2335k2477P1077M928q5894J290
$$ plain form
302 49605 9809 -68900 -8152 79116 9779 -76705 -8459 66182 3397 -50568 -1847 13941
314 13941 -29700 7288 70149 1666 -90258 -20946 76859 18397 -61540 -9691 43642 -2690
326 -2690 -14794 38627 9876 -67890 -22052 72027 28949 -54604 -7073 58011 -1913 -53836
338 -53836 6959 37142 -21067 -20155 45453 17046 -56446 -10049 70630 17502 -61469 -13189
350 -13189 43531 -5436 -29783 34255 37188 -38951 -28894 46612 18814 -57008 -18789 52025
362 52025 11649 -37774 12666 36783 -34086 -45886 34269 38000 -37509 -23854 48057 18922
374 18922 -47992 -12038 36762 -13295 -42799 25064 43040 -34734 -43111 37138 35072 -40439
386 -40439 -28142 32448 2500 -43229 8218 45931 -16404 -38881 32196 37124 -48770 -47480
398d7480Q7190j096o9973J4298N0219l5060l6164N0503K0432o6120l389Q4567
410D7927j45q8991O00P6572j1971o0801K8845M7250m1795l0146N6621J4770o9543
423c0807l885P4318r735p6312J8544P2998k1476n4594L3822L4715n3782k5137
435d1331O3022J4051o4441M595O9319j6197p1064K0873N7389l3447m2626M9674
447I817L5259n7642k4854N7835O487n9817Q969O0047k3533n4484L9890N0864n1396
460b558m6487N4665L4841n6953k2251N3960O474m5853J9377M4916m2535n1196
472e3600N1495M7451n7216l7905O4579L4347n9179k3029M4616l481l9098L1994
484I74M1964m8447m2732N9668M0234o4853l7770O0409K6558n0367m983M4330j6669
$$ plain form
398 -47480 39710 38614 -31359 -17061 33158 -1902 -38066 12437 32869 -33251 -36640 47927
410 47927 47782 -41209 -40609 35963 23992 -36809 -7964 39286 -2509 -32655 23966 38736 -30807
423 -30807 -34692 39626 29891 -46421 -27877 45121 23645 -30949 2873 37588 -16194 -41331
435 -41331 21691 35742 -28699 -24104 45215 29018 -42046 -21173 36216 2769 -39857 9817
447 9817 45076 -12566 -37420 20415 26902 -32915 -23946 36101 12568 -41916 -2026 48838 -2558
460 -2558 -49045 5620 40461 -16492 -38743 15217 21691 -24162 -4785 40131 -2404 -53600
472 -53600 -2105 45346 -11870 -49775 14804 49151 -10028 -33057 11559 8078 -31020 974
484 974 42938 -5509 -48241 11427 51661 -13192 -50962 9447 36005 -14362 -19345 24985 8316
497H316m0647L8758L8941n6224m2419O2105M0822n7307k6497N4093J0382n0655
509b0332N887M1629k8800l9572M8259M4384n2275l8524N1767K2063n6712r696
521c1922N7116P94m9813J6024M3801l4802m2199M3701L7097m8669k6233N0582
533A5477J3239n0985L997N2334j9634n6628K5238N2112k9260l8494L8179K5985
545C1560m4572j2589M8617n596n7231J4452O2154j5627n2944K3694L9043l5531
557d570l1144M0056J8622m2650K085N2245j5724o2227J9920O1540k1036n2146
569c5029K4032L7062k8307j7566L9665O43n2114R044N6991j6867n7373K4504N5372
582D0057k4821m3978K8773K5179l9738j2629M7959K667m8894J2016N2738k1348
$$ plain form
497 8316 -32331 6427 45368 -10856 -53275 8830 49652 -7655 -34152 19941 30323 -20332
509 -20332 -14445 27184 -1616 -41188 7071 51455 -820 -39344 12423 34486 -22226 -31922
521 -31922 25194 25988 -23825 -7801 36000 1198 -41001 2700 39797 -8872 -35105 15477
533 15477 28716 -22269 -18272 34062 14428 -42200 -16962 35150 5890 -32604 5575 31560
545 31560 -13012 -25601 23016 17420 -39811 -25359 36795 21168 -31776 -8082 30961 -4570
557 -4570 -35714 4342 22964 -19686 -17601 34644 18920 -43307 -23387 38153 17117 -35029
569 -35029 -10997 26065 -2242 -19808 19857 20500 -31614 -22570 34421 17554 -39819 -15315 40057
582 40057 15236 -28742 31 25210 -14528 -27157 20802 23469 -25425 -13409 39329 17981
594A7981n3720K1823M2783k8823k6073M1424J6315m9904q381N2789k373n4288
606c0447J0333N1176j5473m1467K4144K9035l4864j7869M3802P000n3143o20N6559
619B8166l326m9077J3287M0249k7460l7860L3255L0087l6311j4729M4421N425
631B6127n0030Q6M4806j0253l8949K3281L3321l4268k6092M5955K2555n4101k2704
644d0266M9039J6311l7642J503L0970j9438k9514L2499K7396m2965k2470M9532
656A4955J7671n2357j0486N3105O589m6652j825K8967j5705j5998M1856J9688
668C9808n3495k5031M8881J8702m2953m247M0629j0248l8811K2539L8277k8720
680E331l3840L2027K0829l9289j0099M7761O660m5832n02L6189j5449l1027L1319
$$ plain form
594 17981 -35739 -13916 28867 44 -26029 15395 31710 -18194 -26575 26214 23841 -30447
606 -30447 -20114 31062 15589 -25878 -1734 27301 -7563 -25432 18370 25370 -27773 -28393 28166
619 28166 24840 -24237 -10950 29299 1839 -36021 -2766 27321 -8990 -23719 20702 26127
631 26127 -23903 -23817 20989 10736 -28213 -4932 28389 -5879 -31971 13984 36539 -17562 -40266
644 -40266 8773 25084 -12558 -11055 19915 477 -29037 3462 30858 -12107 -34577 14955
656 14955 32626 -19731 -30217 22888 29477 -17175 -19000 9967 -5738 -21736 20120 39808
668 39808 -13687 -38718 10163 28865 -14088 -18335 22294 12046 -26765 -4226 34051 5331
680 5331 -28509 3518 24347 -14942 -25041 22720 29380 -16452 -16954 19235 3786 -27241 4078
693D078L2126m0183l1939M1956K7541l7174j5572L0674n309l4021K0904M1915
705C4996k4256l9721K6358K8737l4840k0744L9973J3668l9988l117M0019p138
717A3947l9908J7159L5676k5424l3095L0174K6407k9890j3375L4262j181m1686
729b6934Q898M4311j4613m2574K2014M0269k3863l2730K3432J6835k9357k471
741a6783L7731n630m0176J5459M1312k2979m2822K4825L6118k6081k3731L1476
753H719J3096l4234l046L6389q930l8177J6435L8146k2140l1427K8834K3805l3726
766f256j6389L6291O193m0036K328M3082o864l7617J3507K8632k5088k4837L1555
779D501K0791l2847q812L6194j895m1260O591L9454j2764l4834K0803K9579k5794
$$ plain form
693 4078 36204 -3979 -35918 6038 33579 -3595 -19167 11507 6198 -27823 -6919 34996
705 34996 10740 -28981 -2623 26114 -8726 -29470 10503 24171 -15817 -18934 21085 13947
717 13947 -25961 -8802 26874 1450 -31645 -1471 24936 -4954 -18329 15933 14752 -26934
729 -26934 -18036 26275 11662 -30912 -8898 31371 7508 -25222 -1790 15045 -14312 -16783
741 -16783 20948 15318 -24858 -9399 31913 8934 -33888 -9063 27055 974 -22757 8719
753 8719 21815 -12419 -15465 20924 11994 -26183 -9748 28398 6258 -25169 3665 27470 -6256
766 -6256 -22645 13646 19839 -20197 -17869 25213 18349 -19268 -5761 22871 -2217 -27054 4501
779 4501 25292 -7555 -16367 19827 17932 -23328 -16737 22717 9953 -24881 -4078 25501 -293
792b93k1994L0832J2477l6471o662L7811m08l5761R862L2650j7090k7854K4875
805A974K0608l4351j7029L9322J4400l6803n852L4429o050l4114J1672L0514j6990
818A730k1066K6559J5030l4527r693L7769K296m1843K400M2648k952l3733R438
831e944K2761k1776j6585L1727J2625l6386q068L7493K429l4480P165L2285j6739
844F507l2127K0889K6985k3084j5708L0985P849l8192o030L7169L67l1210R100
857f500K7917j8124k2528K5970J6365l4960j4426L7918J2446l4853m170L1898
869A6953n420k9443J2331K3546k1014j8435L0052J4745l3919j0481L4948M202
881A8065l4372J431L0114j0264k5355J9980K4071k4784k1471K6459J2083k9723
$$ plain form
792 -293 -22287 8545 21022 -15449 -22111 15700 15292 -20469 -10607 22043 4953 -22901 1974
805 1974 22582 -11769 -28798 10524 24924 -11879 -17731 16698 10648 -23466 -11794 18720 1730
818 1730 -19336 7223 22253 -12274 -21967 15802 18098 -23745 -21345 21303 18351 -15382 -5944
831 -5944 16817 -4959 -21544 10183 22808 -13578 -21646 15847 18276 -16204 -9039 23246 6507
844 6507 -25620 -4731 22254 -830 -16538 14447 22296 -15896 -21926 15243 15610 -15600 -6500
857 -6500 21417 3293 -19235 6735 23100 -11860 -26286 11632 24078 -10775 -14945 16953
869 16953 11533 -17910 -5579 17967 -3047 -21482 8570 23315 -10604 -21085 13863 18065
881 18065 -16307 -14876 15238 4974 -20381 -401 23670 -1114 -22585 3874 15957 -13766
893a3766m315L2652l63k9566R116K5564j9878k6521K4907K6008k5418j9496K6455
906E379J1383k6124k251K5176r380k6044J8385K7646k3068k5147K7027K1875k8676
919c819j7124K6601P230k5029N114K6442j3050k7376J8760K5572k3605k2170K4915
932B461J6111k4728m707K8462m205l3101P460L1039j1579k5852J8442K2690k2181
945C12j7425K2741P841k5182R97K8446r755l0466J6276L2969j7193l0657J4864
958f232K0568j8148r378K4385J940k8274M429K9707j0830l0072J3035K6560j6465
971A225j8537K1494J3614k6169q355K6777N44k8960O876L0613r320k7044J2170
984e072K0424j8155j3784K2617O943k7185l14L2175k692l1663M670K7100j0493
$$ plain form
893 -13766 -18081 14571 14208 -15358 -6242 19322 -556 -27077 -2170 23838 -1580 -21076 5379
906 5379 16762 -9362 -11613 13563 4183 -21861 -3476 24170 1102 -24045 2982 24857 -3819
919 -3819 -20943 5658 12888 -12141 -7027 19415 6365 -21011 -2251 23321 -284 -22454 2461
932 2461 18572 -6156 -10863 17599 13394 -19707 -12247 18792 7213 -18639 -197 22493 312
945 312 -17113 5628 13469 -11713 -10716 17730 7975 -22491 -6215 26754 9561 -21096 -6232
958 -6232 14336 -3812 -13190 11195 13135 -15139 -10710 18997 8167 -21905 -8870 17690 1225
971 1225 -17312 4182 17796 -8373 -16728 10049 10593 -18367 -11491 19122 9802 -17242 -5072
984 -5072 15352 -2803 -16587 6030 12973 -14212 -14526 17649 14957 -16706 -12036 15064 4571
997D571k1953J5817J6907j9551q987K5607L224l1124o21L0626l052k6882R456
1010e962K3814j4290j8788J9209J1728k6178o748L0278M564k8842L94K6261o800
1023H640k3892J2219J8712j8764j3455K5176J0565k8128n956K8396K30k8573K901
1036a1929K5237p895j8163J6062J4639k4167j2688K6936Q777k7941m769K7696
1048A1795O14k3299O155J8248j5845j6756K1886J5285k4436j1112K6405O724k6226
1061a0562k567K3409m719k0748J2091J8973j7728j5337K3033J2231k6439j0504
1073a8867K5136M966k2262L939K2055j1029k0701J6296J7458k1468j5303K4285
1085D505J2901k2353o210K1406k295k1986Q541K1631j4958j8992K0068J8359k2158
$$ plain form
997 4571 -17382 -1565 15342 -4209 -13196 12411 15635 -15489 -16110 14516 11464 -15418 -5962
1010 -5962 17852 3562 -15226 3983 15711 -10467 -17215 13063 17627 -11215 -10821 15440 8640
1023 8640 -15252 -3033 15679 -3085 -16540 8636 19201 -8927 -14883 13513 13743 -14830 -11929
1036 -11929 13308 5413 -12750 3312 17951 -6216 -18904 8032 16809 -11132 -15901 11795
1048 11795 12409 -10890 -4735 13513 -2332 -19088 2798 18083 -6353 -17465 8940 15664 -10562
1061 -10562 -13129 10280 5561 -15187 -3096 15877 -1851 -17188 5845 18076 -8363 -18867
1073 -18867 6269 11235 -11027 -7088 14967 3938 -16763 -467 16991 -4477 -19780 4505
1085 4505 17406 -4947 -11157 10249 7954 -14032 -5491 16140 1182 -17810 2258 20617 -1541
1098a541j4835K1373P544k1824O3K2272o324k1307J3586K1184j8104k0688J9151
1111E50J5008j9872q480K2092K992k2004M225K0721j2165k2361J5995K2214j7069
1124A846j7792J8846J2047j9966o548K0236k140k1332R491K3729j3282k2968J5336
1137b497J8357j7452j4217J9020P458j9735K16K2434n361k4288R272K1434j3037
1150A604j9219J6431J5894j7181q592J9268J014k3197L076K4268o790k2476J1262
1163d638K0830j3331j6912J4730R889j8256l285K2008k83k3447M331K3679q462
1176F853k1950J0782J7110j4358j0059J8856O181k2127k533K3865k433k4320N383
1189h750K2146p612j6327J2719J1459j8672p882K1372L694k3550N51K5343k975
$$ plain form
1098 -1541 -16376 4997 12541 -9283 -9220 13052 6728 -14579 -993 20191 2087 -18601 550
1111 550 15558 -4314 -12794 9298 12290 -9714 -5489 15232 3067 -19294 -3299 18915 1846
1124 1846 -15946 2900 14947 -5019 -11567 8669 6529 -14803 -5312 18417 5135 -17833 -2497
1137 -2497 15860 -1592 -15809 3211 10669 -9066 -8850 13584 8223 -16065 -6793 14641 1604
1150 1604 -17615 -1184 14710 -2471 -11063 8205 9219 -13978 -10902 13366 6576 -15900 -4638
1163 -4638 16192 2861 -14051 679 10568 -7688 -10973 11035 10752 -12695 -8364 15315 6853
1176 6853 -15097 -4315 12795 -1563 -11622 7234 13415 -8712 -11245 12620 10187 -14133 -8750
1189 -8750 13396 5784 -10543 2176 13635 -5037 -12919 8453 12147 -11403 -10852 14491 11516
1202A1516k2974N500J7654j0763j3433J5999R379k0207m520K3827J298k5377N51
1215a1550K2419m104j8946R315J5404j3792j0682J8575O340k3520m564K3668K282
1228A0845k1280L341J9044p822j6679J1891J1609j7173q721K1619P568k2173l719
1241a1650K0913r21j9701N223J6510j0403j2676J6883J0578k0186r367K1217N293
1254A1713k0730j187J9441k903j6159Q850J4750j4976j3457J7805J0273j9518
1266f098o103K1074L379j9724Q63J6883q169j5614J3543J5099j5824j2282J7962
1279D989Q527j8988m418J7834j518j6772P477J7584j2496j6584J5832J3486j7870
1292b917j1857J8104Q002j6536j059J5824n619j6329J0763J5442j5343j4868J8050
$$ plain form
1202 11516 -11458 -5958 11696 933 -12500 3499 12878 -7329 -11849 11978 13276 -12101 -11550
1215 -11550 10869 6765 -12181 -2866 12538 -1254 -11936 6639 12979 -10541 -15105 8563 10845
1228 10845 -10435 -7094 11950 4128 -12551 -660 10949 -6224 -14945 6674 14242 -7931 -11650
1241 -11650 9263 8342 -11359 -6136 10374 -29 -12705 4178 14756 -5430 -14797 6420 11713
1254 11713 -9017 -10204 9237 6334 -9825 -975 13775 -1201 -14658 3147 13420 -6098
1266 -6098 -12201 8873 12252 -7472 -6609 10274 2105 -13509 34 15133 -691 -12973 4989
1279 4989 13516 -5472 -9890 7944 6426 -10346 -2869 14715 2219 -14365 1467 14953 -2917
1292 -2917 -14774 3330 11332 -5204 -6263 9561 3942 -12387 -1624 13818 -1525 -16393 1657
1305A657J4006j7578r068J6245J808j7088K634J7415p119j6064J2462J5465j4907
1318a32j4621J5691R284j5690l560J6794j660j7478O996J7821j0663j8026J1951
1331c293J5792j3332j0296J4757N948j5882p39J6470n620j7759R669J8841j0589
1344C967j6133J2207J1705j4662p387J5913K007j6733K778J9395n676j8693P642
1357c670J4910j0530j1864J3963Q164j5923k845J8558k156k0353L667K0302n502
1370F721j7745P580J3826r998p926J3897K190j8709O27K0556k007j9629M800J8360
1384A2543p945j5603Q986J0432j2146m785J5981J940j9174J035J9384l498j8820
1397a1670N421J5217q343j0405J2937P560j7281m684J7914K237j9175J172J8480
$$ plain form
1305 1657 15663 -1915 -10983 5262 7070 -10018 -7384 10031 2912 -13152 -690 14775 -132
1318 -132 -14753 938 10222 -5468 -9028 7766 6106 -11372 -4376 13445 2782 -15244 -3293
1331 -3293 12499 -833 -11129 3628 9576 -6306 -7045 9425 3805 -13954 -4285 14556 3967
1344 3967 -12166 41 11746 -2916 -10303 5610 7617 -9116 -6338 13057 7381 -11312 -3670
1357 -3670 11240 710 -11154 2809 10973 -4950 -7795 10763 8607 -11746 -8079 12223 6721
1370 6721 -11024 -3444 10382 384 -7542 6355 8545 -10164 -9537 11019 9012 -10617 -5817 12543
1384 12543 4598 -11005 -2019 8413 -3733 -8518 7463 9403 -9771 -8736 10648 7150 -11670
1397 -11670 -6249 8968 625 -9780 3157 10717 -6564 -11248 6666 8903 -10272 -9100 9380
1410I380l439j5176P315J0951j1527q212J5204N365j8039k285J9825Q08j8579
1423h409J749J4892o232j2741J0760J0864j2559p669J5178M087j7855j615J7557
1436H007j395j5542N952J4250r997j1939J2833J0136j5680q643J6708N014j4314
1449d610k09J3603n377j3686R432J2280j2742j1001J6163J0006j7480p011J5485
1462D853L468j4898J116J2959o353j0719J2150J0654j5868j0677J6050P843j6398
1475e820l113J6178j66j5175M332J3079q684j2342J1877J0539j3557p820J4977
$$ plain form
1410 9380 5941 -9235 -1920 9031 -2496 -10708 4496 9861 -8178 -10463 9362 10170 -8409
1423 -8409 -6660 8232 2000 -10741 19 10883 -1676 -9345 5833 9920 -7935 -9550 8007
1436 8007 6612 -8930 -2978 11272 1275 -10664 2169 12305 -3375 -12018 4690 9704 -4610
1449 -4610 -4819 8784 3407 -10279 -847 11433 -1309 -12310 3853 13859 -3621 -10632 4853
1462 4853 8321 -6577 -5461 7498 1145 -9574 2576 13230 -2638 -13315 2735 10578 -5820
1475 -5820 -8933 7245 7079 -8096 -3764 9315 631 -11711 166 10705 -2852 -10672 4305
$$ [...]
8191I4
##END NTUPLES=NMR FID
##END=
