##TITLE=1H_Pr Am-4
 CDCl3, 8 sc, 
 29.10.2020
##JCAMPDX= 6.0         $$ Bruker NMR JCAMP-DX V2.0
##DATA TYPE= NMR FID
##DATA CLASS= NTUPLES
##ORIGIN= UXNMR, Bruker Analytische Messtechnik GmbH
##OWNER= root
$$ XWIN-NMR		Version 3.5
$$ Thu Oct 29 13:29:45 2020 Russian Standard Time (UT+4h)  she@DPX200
##.OBSERVE FREQUENCY= 200.1315066352
##.OBSERVE NUCLEUS= ^1H
##.DELAY= (6, 6)
##.ACQUISITION MODE= SIMULTANEOUS
##.ACQUISITION SCHEME= undefined
##.AVERAGES= 8
##.DIGITISER RES= 18
##SPECTROMETER/DATA SYSTEM= spect
##.PULSE SEQUENCE= zg30
##.SOLVENT NAME= CDCl3
##.SHIFT REFERENCE= (INTERNAL, CDCl3, 0, 15.7039)
##AUDIT TRAIL= $$ (NUMBER, WHEN, WHO, WHERE, WHAT)
$$ ##TITLE= Audit trail, XWIN-NMR		Version 3.5
$$ ##JCAMPDX= 5.01
$$ ##ORIGIN= Bruker BioSpin GmbH
$$ ##OWNER= she
$$ F:/spectra/data/she/nmr/H-F/1/audita.txt
$$ ##AUDIT TRAIL=  $$ (NUMBER, WHEN, WHO, WHERE, WHAT)
(   1,<2020-10-29 13:28:37.12 +0400>,<she>,<DPX200>,
      <created by zg, POWCHK disabled, PULCHK disabled
       configuration hash MD5:
       00 E9 B6 7A A2 85 ED C7 34 08 36 98 17 FE 4E 26
       data hash MD5: 16K
       88 F0 5B F3 9D 11 98 5B 02 77 B7 86 06 ED 28 08>)
$$ ##END=
$$ 
$$ hash MD5
$$ DA 9B 06 64 BF FD 44 D8 B5 DF 52 53 E8 5C 4A 2E
##$RELAX= 
##$RELAX= 
##$RELAX= 
##$RELAX= 
##$RELAX= 
##$RELAX= 
$$ Bruker specific parameters
$$ --------------------------
##$DU= <F:/spectra>
##$EXPNO= 1
##$NAME= <H-F>
##$PROCNO= 1
##$TYPE= <nmr>
##$USER= <she>
##$AMP= (0..31)
100 100 100 100 100 100 100 100 100 100 100 100 100 100 100 100 100 100 
100 100 100 100 100 100 100 100 100 100 100 100 100 100 
##$AQSEQ= 0
##$AQ_mod= 1
##$AUNM= <au_zg>
##$AUTOPOS= <>
##$BF1= 200.13
##$BF2= 200.13
##$BF3= 200.13
##$BF4= 200.13
##$BF5= 200.13
##$BF6= 200.13
##$BF7= 200.13
##$BF8= 200.13
##$BYTORDA= 1
##$CFDGTYP= 0
##$CFRGTYP= 5
##$CHEMSTR= <none>
##$CNST= (0..31)
1 1 145 1 1 1 1 1 1 1 1 1 1 1 1 1 1 1 1 1 1 1 1 1 1 1 1 1 1 1 1 1 
##$CPDPRG= <>
##$CPDPRG1= <>
##$CPDPRG2= <>
##$CPDPRG3= <>
##$CPDPRG4= <mlev>
##$CPDPRG5= <mlev>
##$CPDPRG6= <mlev>
##$CPDPRG7= <mlev>
##$CPDPRG8= <mlev>
##$CPDPRGB= <>
##$CPDPRGT= <>
##$D= (0..31)
0 1.2 0 0 0 0 0 0 0 0.06 0 0.03 0 0 0 0 0.0002 0 0 0 0 0 0 0 0 0 0 0 0 
0 0 0 
##$DATE= 1603963716
##$DBL= (0..7)
120 120 120 120 120 120 120 120 
##$DBP= (0..7)
150 150 150 150 150 150 150 150 
##$DBP07= 0
##$DBPNAM0= <>
##$DBPNAM1= <>
##$DBPNAM2= <>
##$DBPNAM3= <>
##$DBPNAM4= <>
##$DBPNAM5= <>
##$DBPNAM6= <>
##$DBPNAM7= <>
##$DBPOAL= (0..7)
0.5 0.5 0.5 0.5 0.5 0.5 0.5 0.5 
##$DBPOFFS= (0..7)
0 0 0 0 0 0 0 0 
##$DE= 6
##$DECBNUC= <off>
##$DECIM= 32
##$DECNUC= <off>
##$DECSTAT= 4
##$DIGMOD= 1
##$DIGTYP= 9
##$DL= (0..7)
0 120 120 120 120 120 120 120 
##$DP= (0..7)
150 150 150 150 150 150 150 150 
##$DP07= 0
##$DPNAME0= <>
##$DPNAME1= <>
##$DPNAME2= <>
##$DPNAME3= <>
##$DPNAME4= <>
##$DPNAME5= <>
##$DPNAME6= <>
##$DPNAME7= <>
##$DPOAL= (0..7)
0.5 0.5 0.5 0.5 0.5 0.5 0.5 0.5 
##$DPOFFS= (0..7)
0 0 0 0 0 0 0 0 
##$DQDMODE= 0
##$DR= 18
##$DS= 0
##$DSLIST= <SSSSSSSSSSSSSSS>
$$ [...]
##$SUBNAM2= <"">
##$SUBNAM3= <"">
##$SUBNAM4= <"">
##$SUBNAM5= <"">
##$SUBNAM6= <"">
##$SUBNAM7= <"">
##$SUBNAM8= <"">
##$SUBNAM9= <"">
##$SW= 16.880792210976
##$SWIBOX= (0..15)
0 0 2 0 0 0 0 0 0 0 0 0 0 0 0 0 
##$SW_h= 3378.37837837838
##$TD= 16384
##$TD0= 1
##$TE= 0
##$TE2= 300
##$TE3= 300
##$TEG= 300
##$TL= (0..7)
0 120 120 120 120 120 120 120 
##$TP= (0..7)
150 150 150 150 150 150 150 150 
##$TP07= 0
##$TPNAME0= <>
##$TPNAME1= <>
##$TPNAME2= <>
##$TPNAME3= <>
##$TPNAME4= <>
##$TPNAME5= <>
##$TPNAME6= <>
##$TPNAME7= <>
##$TPOAL= (0..7)
0.5 0.5 0.5 0.5 0.5 0.5 0.5 0.5 
##$TPOFFS= (0..7)
0 0 0 0 0 0 0 0 
##$TUNHIN= 0
##$TUNHOUT= 0
##$TUNXOUT= 0
##$USERA1= <user>
##$USERA2= <user>
##$USERA3= <user>
##$USERA4= <user>
##$USERA5= <user>
##$V9= 5
##$VALIST= <valist>
##$VCLIST= <CCCCCCCCCCCCCCC>
##$VD= 0
##$VDLIST= <DDDDDDDDDDDDDDD>
##$VPLIST= <PPPPPPPPPPPPPPP>
##$VTLIST= <TTTTTTTTTTTTTTT>
##$WBST= 1024
##$WBSW= 4
##$XGAIN= (0..3)
0 0 0 0 
##$XL= 0
##$YL= 0
##$YMAX_a= 873881
##$YMIN_a= -956249
##$ZGOPTNS= <>
##$ZL1= 120
##$ZL2= 120
##$ZL3= 120
##$ZL4= 120
##$ABSF1= 10
##$ABSF2= 0
##$ABSG= 5
##$ABSL= 3
##$ALPHA= 0
##$AQORDER= 0
##$ASSFAC= 0
##$ASSFACI= 0
##$ASSFACX= 0
##$ASSWID= 0
##$AUNMP= <proc_1d>
##$AZFE= 0.1
##$AZFW= 0.1
##$BCFW= 1
##$BC_mod= 2
##$BYTORDP= 1
##$COROFFS= 0
##$CY= 11.3945322036743
##$DATMOD= 1
##$DC= 2
##$DFILT= <>
##$DTYPP= 0
##$F1P= 15.9154993809931
##$F2P= -4.1035820241983
##$FCOR= 0.5
##$FTSIZE= 0
##$FT_mod= 4
##$GAMMA= 1
##$GB= 0.15
##$INTBC= 1
##$INTSCL= 1
##$ISEN= 128
##$LB= 0.24
##$LEV0= 0
##$LPBIN= 0
##$MAXI= 10000
##$MC2= 0
##$MEAN= 0
##$ME_mod= 0
##$MI= 1.114404
##$NCOEF= 0
##$NC_proc= 0
##$NLEV= 6
##$NOISF1= 3.799351
##$NOISF2= 2.8
##$NSP= 1
##$NTH_PI= 0
##$NZP= 0
##$OFFSET= 15.70392
##$PC= 1
##$PHC0= -10693.79
##$PHC1= 17.20088
##$PH_mod= 1
##$PKNL= yes
##$PPARMOD= 0
##$PSCAL= 0
##$PSIGN= 0
##$REVERSE= no
##$SF= 200.130013532006
##$SI= 16384
##$SIGF1= 3
##$SIGF2= 2
##$SINO= 400
##$SIOLD= 16384
##$SREGLST= <1H.CDCl3>
##$SSB= 0
##$STSI= 0
##$STSR= 0
##$SW_p= 3612.71676300578
##$SYMM= 0
##$S_DEV= 0
##$TDeff= 0
##$TDoff= 0
##$TI= <>
##$TILT= no
##$TM1= 0
##$TM2= 0
##$TOPLEV= 0
##$USERP1= <user>
##$USERP2= <user>
##$USERP3= <user>
##$USERP4= <user>
##$USERP5= <user>
##$WDW= 1
##$XDIM= 8192
##$YMAX_p= 0
##$YMIN_p= 0
$$ End of Bruker specific parameters
$$ ---------------------------------
##NTUPLES= NMR FID
##VAR_NAME=  TIME,          FID/REAL,        FID/IMAG
##SYMBOL=    X,             R,               I
##VAR_TYPE=  INDEPENDENT,   DEPENDENT,       DEPENDENT
##VAR_FORM=  AFFN,          ASDF,            ASDF
##VAR_DIM=   8192,          8192,            8192
##UNITS=     SECONDS,       ARBITRARY UNITS, ARBITRARY UNITS
##FACTOR=    0.000296,      1,               1
##FIRST=     0,             0,               0
##LAST=      2.424536,      0,               0
##MIN=       0,             -956249,         0
##MAX=       2.424536,      873881,          0
$$ Real data points
##PAGE= N=1
##DATA TABLE= (X++(R..R)), XYDATA
0@%%%%%%%%Qj6J6j6J8k6L2m0N6p2Q8j08J32j61J97k36K78l28L85m48N19o00O92
31C70p95R08j031J171j327J498j686J890k114K362k633K928l252L607l993M414
47B317m873N376n925O526p188P917q721R612j0603J1714j2972J4403j6047J7957
61I493k0208K2908k6215L0364l5726M2911n2929O7215j13955R50023j056221n01461
73f83801J248466n99916r1143J77119j54627M31827m72973k06758Q81912p13797
83a83691k06797Q70077n43052k38199N70745k21513j20571k1006J40042J94001
93B40036n41297J97412N31272o50895O3546M60387l97783O8877R7325j85642K61340
104A44578j96224o7035L07454l04540J08987J83800m10002L18547R9523m62426
$$ plain form
0 0 0 0 0 0 0 0 0 0 8 -8 8 -8 10 -16 16 -24 32 -40 48 -60 72 -89 108 -128 150 -178 207 -241 278 -322 370
31 370 -425 483 -548 623 -704 794 -892 998 -1116 1246 -1387 1541 -1711 1896 -2097 2317
47 2317 -2556 2820 -3105 3421 -3767 4150 -4571 5041 -5562 6152 -6820 7583 -8464 9493
61 9493 -10715 12193 -14022 16342 -19384 23527 -29402 37813 -76142 873881 -182340 -683801
73 -683801 564665 -35251 -126394 50725 -103902 327925 -145048 -351806 530106 -183691
83 -183691 -390488 479589 -63463 -301662 269083 47570 -73001 -94007 46035 240036
93 240036 -301261 -103849 427423 -223472 -159926 300461 -97322 -28445 68880 -116762 144578
104 144578 -51646 -118681 188773 -115767 -6780 177020 -232982 85565 185088 -277338
114b77338L63342K8677k79203K88798j95519J7675K83593m47091J81469L04147
124B68550n18228K47583K07753m45691L08238P1857l49091K80776M407j78132
134a01978J51058j06274O0260J07596k58696J24449J78242k14315l0776J31931
144D1497L8158j17752p6072K14903m3193j94693J92568j0124j18876J33616p5466
155a5434k5191J01294r1391M4997r407p6453J94289j25516j54676K99202p7330
166F4384k16300J98558K3114j01200J8410j0919R0476n6290j01409J71102n9195
177B0731j12850J79895p9491j13016J92804m1177j46580J01044P9314p8301r1332
188h8959J01004R5050j64740k5484J70679n7605j00697O1485N3284l2639o8942
$$ plain form
114 -277338 86004 114681 -164522 124276 -71243 -53568 230025 -217066 -35597 268550
124 268550 -249678 -2095 205658 -240033 68205 140062 -209029 71747 76154 -101978
134 -101978 49080 -57194 3066 110662 -148034 -23585 154657 -59658 -90434 41497
144 41497 79655 -38097 -114169 100734 57541 -137152 55416 45292 -73584 60032 -15434
155 -15434 -40625 60669 -30722 14275 4868 -71585 122704 -2812 -157488 141714 64384
166 64384 -151916 46642 69756 -31444 -13034 -23953 66523 10233 -91176 79926 20731
177 20731 -92119 87776 8285 -104731 88073 46896 -99684 1360 80674 2373 -88959
188 -88959 12045 107095 -57645 -83129 87550 29945 -70752 -9267 44017 11378 -57564
199e7564O9186L7609j15813P9337N0453j59905J07306Q6361j85707N9258J01506
210G2027q4891j1555k409N2985K8198j40675P1668J11443j55107K6765Q4135q7731
222c5147M4306J4297p2418O4273J5393m7624J646J804O0010l8218q4465J13753
234C7610K0426j13763L7269N4333j8736l1458j9566P0262j0745p0760O3886p191
246A1567l0851N5914n4372j1148Q0680n6548j8979L6628j9257M1191m6091m3421
258e4687J19304m0969r7215R6866J0985n1427J5682k3047M9023Q446r0467N8276
270G70M4033p1683K2162Q368j8916M5222m1987k0707N8517j8642k0297K213J416
283i531M1248l5835m5154P4586R27n4305J4780J6096J8788k4630l5376N5426O919
$$ plain form
199 -57564 11622 49231 -66582 12755 63208 -96697 10609 96970 -88737 -29479 72027
210 72027 -12864 -24419 -26828 26157 54355 -86320 -14652 96791 -58316 -31551 52584 -35147
222 -35147 9159 23456 -48962 15311 30704 -16920 -15274 -13470 46540 8322 -76143 37610
234 37610 58036 -55727 -18458 35875 17139 -14319 -33885 36377 25632 -45128 18758 11567
246 11567 -19284 36630 -17742 -28890 51790 -4758 -23737 12891 -6366 34825 -11266 -54687
258 -54687 64617 23648 -73567 23299 34284 -17143 -1461 -24508 24515 32961 -57506 770
270 770 44803 -26880 -4718 3650 -15266 29956 -12031 -32738 25779 7137 -13160 -10947 -9531
283 -9531 31717 -4118 -49272 25314 26241 -28064 -13284 2812 21600 -3030 -38406 17020 23939
296B3939m8430K2576j446Q369J8577n9378K6717N3058n7519r097L1997k395J1496
309A8464m0447n12O9648m8312l3193N2462q608q126K732k6196L7762J2326n4429
322b6429J8368K8994j0476j4768j5898L2025K1327n3884l227N2345j2763l1486
334a5872K139K6138Q205l3188n303L1146J004k1158o820J3058K2229k4237k3849
347b6508L4533J0728k6039r143J2877K0857j2173l4496K7563K5530l1758q414
359a6443J2584J1843K501k8430R7L9771j5240k9338J5123J9021J232k8438m556
372b0273M0325l718l9228R655K9780j407k9363p155M1518o29m1176J0086L1111
385A9526p884k3717K163K5176k327k4026Q711J0523n80k799j3195O994J6719q397
$$ plain form
296 23939 -24491 -1915 -3361 5008 23585 -35793 -9076 43982 -13537 -22634 9363 6968 18464
309 18464 -21983 -22495 47153 -1159 -34352 18110 9502 1376 4108 -22088 15674 28000 -26429
322 -26429 -8061 20933 10457 -4311 -20209 11816 33143 -20741 -23968 28377 15614 -15872
334 -15872 -13733 12405 20610 -12578 -17881 13265 14269 -6889 -13709 -651 21578 -2659 -26508
347 -26508 8025 18753 -7286 -16429 -3552 17305 5132 -29364 -1801 23729 -8029 -16443
359 -16443 -3859 7984 10485 -17945 -17848 21923 6683 -22655 -7532 11489 12721 -15717 -20273
372 -20273 20052 16334 -22894 -13239 16541 15134 -14229 -21384 20134 19505 -21671 -11585 19526
385 19526 11642 -12075 -9912 15264 12937 -11089 -2378 8145 7565 4766 -8429 -1435 15284 6887
399F887j5834R79K1065Q875m2242r13N7193k0854n2670L4057M0089l6638k9661
412b9667L1277K7673l0995k6345L3196J9038l1453j2136K6264K691j5679O83L861
425a592r42P104q07k1445J2340K8336k7483k5853M2577R032m0047L982K4017K765
439A1984j7520j4670K3921J6619l0752p810K5484L926j3987j1477J2578J4428
451A2724q283j8380J898L3615o392m8867K8429M7419n2462k0069M9323j635k7089
464i769P56J2752R362j2131j3008J8186L966j4746O370L058j1267J2989J1716
477A8234l5089L197M9734k8387m9583N3481L2588o5755q488N6689l380m3449P55
490a9453L5744Q262m4022p265N7954j6108n0875L7778K3855m1415P400K1115k2127
$$ plain form
399 6887 -8947 -7968 13097 21972 -20270 -21183 36010 15156 -37514 -3457 36632 -6 -29667
412 -29667 1610 29283 -1712 -28057 5139 24177 -7276 -19412 6852 9543 -6136 -5453 -1592
425 -1592 -2534 4570 3763 -17682 -5342 22994 -4489 -30342 12235 21267 -18780 -14798 9219 11984
439 11984 -5536 -20206 3715 20334 -10418 -18228 7256 11182 -2805 -14282 -1704 12724
451 12724 4441 -13939 -12041 21574 15182 -33685 -5256 42163 -10299 -30368 18955 17320 -9769
464 -9769 -9013 3739 13101 970 -12038 6148 10114 -4632 1738 4796 -6471 6518 18234
477 18234 -16855 -13658 36076 7689 -41894 11587 44175 -21580 -30068 26621 23241 -20208 -19453
490 -19453 16291 24553 -19469 -26734 31220 15112 -35763 2015 25870 -15545 -8145 12970 -9157
503i157M280J7754j9538j1214L0230j053l1225J0958K1851r535j3039m277J7952
516C987J7914m0883n583N2495j8093l8134K5508J8330j2263j2038o841K7172Q392
529A9963l9776J782M1661j0218m0092K1676L1003k9379j4722L1417p582j6656
541a0923K2710r695j5909K6455J344k8691R210K2371n804k4264j691M1370q403
554A8080n2867K8058M9458m7901l0720N4388P431m6779R689L1381k1483o218J5377
567G894j4791N089J7354k3806n783K5427m266j2868q453J3856K4939l6957j8838
580c1203N5699o966n1625K9713K6833k8327r899J8075M302j2492K750M940q892
593g092O380J2018k2250l425K9514n005k8847N883L3697q720m1172K0181M4472
$$ plain form
503 -9157 -4877 12877 -6661 -17875 12355 11302 -19923 -8965 12886 3351 -9688 -13965 3987
516 3987 21901 -18982 -24565 27930 9837 -28297 -2789 15541 3278 -8760 -15601 11571 19963
529 19963 -19813 -18031 23630 13412 -26680 -5004 25999 -3380 -18102 13315 5733 -10923
541 -10923 11787 2092 -13817 12638 13982 -14709 -5499 16872 11068 -13196 -14887 26483 18080
554 18080 -34787 -6729 42729 -5172 -35892 18496 25927 -20852 -11163 20218 -1265 -7483 7894
567 7894 -6897 -1808 15546 -8260 -14043 11384 7118 -5750 -14203 -347 24592 -12365 -31203
580 -31203 24496 17530 -34095 -4382 22451 -5876 -15775 2300 6602 -5890 -3140 1800 -7092
593 -7092 -712 11306 -10944 -14369 15145 10140 -18707 -12824 20873 12153 -29019 -8838 35634
606C5634l7788l2263M7587J3632m2039l185L6145m381k9939J3635J9149k2151
618e964K144J7825k2666K712K3583j6666j4883J5268J6142j3652k7904K8625L0883
631C5447n4938o180N8573k2980l6283K9556J2284j6661n667M340J0003o274m402
644c182L892o127R224O632k3533K719K9797j6003k5734K1659K1505k5634j8190
657b2975L1355P934l1092M538K1169j1667m789N862m619L509M803m616r334O956
671b966J8275j7593k3039L7787R945m6950J2630L4633j9283j9820J2360J7020
683A2999o517k2742J4956J7416k2671K711J0555j1869Q603N534j8749O425J7145
696A3796j1310j3617R467J8101j3513k0031K0059J6152k2732j1192K2091O346
$$ plain form
606 35634 -2154 -34417 13170 26802 -15237 -18422 17723 13342 -16597 -2962 16187 -5964
618 -5964 -3820 14005 -8661 -5949 17634 968 -13915 1353 17495 3843 -24061 4564 35447
631 35447 -19491 -25671 32902 9922 -26361 3195 15479 -1182 -6849 -2509 7494 1220 -3182
644 -3182 710 -5417 3807 10439 -13094 -10375 19422 3419 -22315 -656 20849 -4785 -22975
657 -22975 8380 16314 -14778 -10240 10929 -738 -5527 335 -4284 -775 4028 -588 -9922 -2966
671 -2966 15309 -2284 -25323 12464 22409 -24541 -11911 22722 3439 -16381 -4021 12999
683 12999 6482 -16260 -1304 16112 -6559 -3848 6707 -5162 3441 8975 -9774 -3349 13796
696 13796 2486 -11131 -1664 16437 2924 -17107 2952 19104 -3628 -14820 7271 13617
708A3617j8269n474J6526J977j1749j59M030L723Jr264j221J4392k731j3140J633
723f108J2190K883j7251l785K3096j283k4956R307J7412r994r343J935J0407J589
737F099j3376j04J3038k728p078j724M121J0961j0476j1506J4131R698j4432q844
751a2220J4355R428j5177q309J6495L790j1323m250Q224O552p591o806O791O646
765F605l817p214j577J4256N87j9482N967J6753p041j3793N384J2642k342j5546
779h618M730J4954p758q903L536O847Q80p788m957J1323M865j3059l569J0963
793C446O473j2445p771J4100O794j5536m207J3482K051r209n715R483O840j0826
807c040n557R625M240o097o009K356J2342o128j2171Q169R251n671q032J004J1429
$$ plain form
708 13617 -4652 -10126 6400 8377 -3372 -3531 499 4222 4223 -5041 -6262 8130 5399 -7741 -6108
723 -6108 6082 8965 -8286 -12071 11025 9742 -15214 -5907 11505 1511 -7832 -5897 4510 6099
737 6099 -7277 -7381 5657 2929 -4149 -5873 -1752 9209 -1267 -12773 1358 11056 -3376 -12220
751 -12220 2135 11563 -3614 -11923 4572 8362 -2961 -7211 1013 7565 -26 -6832 -41 6605
765 6605 2788 -4426 -6003 8253 8840 -10642 -4675 12078 5037 -8756 -3372 9270 6928 -8618
779 -8618 -3888 11066 3308 -5595 -2059 4788 5668 -2120 -7077 4246 9111 -3948 -7517 3446
793 3446 9919 -2526 -10297 3803 10597 -4939 -9146 4336 6387 -2822 -8537 946 7786 -3040
807 -3040 -8597 1028 5268 -829 -6838 -4482 7860 1732 -10439 -2270 6981 1310 -6722 -5718 5711
822E711P11j6753M775J3862n403r292M07J1869K091j6408P01J8386n948j3176
836h467N621R257q94j0227j39J0483L4r361J064N136K564l999o583O582O275o003
852A343p457N304R376m662j3608P817J5575j3159j1363J3071P370r845o689N246
866a681J0619n826j3828J0307J0029j0652o613Q118M555m033n815J114P773k97
880C770q626j619J1428j16j1580J716Q748l91o682k836O042P886j1465o472J3840
895C643L340j2143k706J0796K986r027m091Q261M940n458q922O711J2849j2456
909a277r246J4006M736j1450j496N001N648k963j0931P960R824j0548o479J0578
923C363K846p162o32K616N20J609m35r113P102J0734j5123n317J6681r99j0937
$$ plain form
822 5711 6422 -10331 -5556 8306 2903 -6389 -5982 5887 7978 -8430 -7729 10657 4709 -8467
836 -8467 -2846 6411 5517 -4710 -4849 5634 5668 -3693 -2629 2507 5071 1072 -5511 1071 7346 1343
852 1343 -6114 -810 8566 3904 -9704 -1887 13688 529 -10834 2237 9607 -238 -6927 -1681
866 -1681 8938 3112 -10716 -409 9620 -1032 -7645 473 5028 995 -4820 -3706 4067 3770
880 3770 -4856 -6475 4953 4837 -6743 -5027 3721 3330 -3352 -6188 -146 7740 -3725 -10197 3643
895 3643 6983 -5160 -7866 2930 5916 -3111 -7202 1059 5999 541 -8381 -1670 11179 -1277
909 -1277 -10523 3483 8219 -3231 -4727 274 5922 2959 -7972 -12 9812 -736 -7215 3363
923 3363 6209 -953 -1585 1031 1551 3160 2725 -6388 714 11448 -3675 -8992 7689 6690 -4247
938d247M54L633J0927j0878j6375K5532N774k9842Q819J9569j3720n944M754M610
952C066L32q098K376M285j895L62l689q29R438m984o565M715K588M784j1944n178
968a1236K2708n070k3834J7519J1669j6657r59N149M374q76r642M216Q645n022
982I84m755R7O412M945j4702K030J3032o498l422o07J307J2653j3368j1286K6171
997A2993p253j7286J6983l251m019Q786j2748L157J4106j3793j944O522R57K511
1011E721j2559K904J5828j1517q358R122L995p4j3540L404J8996j6304p866J6536
1025F288n213k636K843r042J1762K887j7555Q932O825n344p71n409P595P448j6719
1040h109J923J3475p803j746j588J700J0297j1975n629J6495n581n899M991o271
$$ plain form
938 -4247 -3793 -160 10767 -111 -16486 9046 14820 -15022 -6203 13366 -354 -6298 -1544 3066
952 3066 3398 -4700 -2324 1961 66 428 -3261 -4090 5348 364 -6201 -1486 1102 5886 -6058 -11236
968 -11236 11472 6402 -17432 87 11756 -4901 -5860 -711 3663 2787 -6855 -2639 6006 984
982 984 -3771 -3674 2738 7683 -7019 -4989 8043 1545 -1877 -2484 -1177 11476 -1892 -13178 12993
997 12993 5740 -11546 5437 2186 -1833 6953 -5795 -2638 11468 -2325 -4269 2253 3210 5721
1011 5721 -6838 -3934 11894 377 -7981 1141 5136 5062 -8478 -5074 13922 -2382 -10248 6288
1025 6288 1075 -1561 1282 -7760 4002 6889 -10666 -1734 5091 -253 -1024 -6433 1162 8610 -8109
1040 -8109 -6186 7289 -514 -2260 -3848 -2148 8149 -3826 -9455 7040 1459 -4440 551 -5720
1054e720J1613p17j9124J5987Q737j7018K006N987J649N45j2805R040J0294j4818
1068d344O77O354p76K238q476J427J2060j0316j578M453k588Q369q899p581J8327
1083I347m249j2901R112Q11J253k027r972J4371K413j6455P138O321n003N91o001
1098e251M889R136j3998m39J0372l865j491k525j1R789o697q717J1730J43m873
1113a808m22k225R374k198j2455R572O428r057l69M4O481R88j3423P423Q882r650
1129b415n50K309N64O022j0676p8J2138p753k241K855j753Q020o789q864J6033
1144F822j258j1741N952J832K407k943p814J0411L873j2710L315N958k474Q6n073
1159c357L694O022o980l093M884K299r12p180J885J1072q434o078P679J668j881
$$ plain form
1054 -5720 5893 5176 -13948 2039 10776 -6242 -4236 1751 3400 3945 -8860 180 10474 -4344
1068 -4344 -3667 2687 1911 4149 -4327 -2900 9160 -1156 -2734 1719 -869 7500 -1399 -8980 9347
1083 9347 5098 -7803 1309 2120 3373 1346 -8626 5745 8158 -8297 -1159 5162 159 750 -5251
1098 -5251 -362 8774 -5224 -5663 4709 844 -647 -3172 -3183 6606 -91 -8808 2922 3065 -1808
1113 -1808 -2230 -4455 4919 2721 -9734 -162 6266 -2791 -3160 -3116 3365 4353 -9070 -1647 7235 -2415
1129 -2415 -2965 -656 -92 5930 -4746 -4824 7314 -439 -2680 175 -1578 6442 -347 -9211 6822
1144 6822 5564 -6177 -225 1607 4014 1071 -6743 3668 7541 -5169 -1854 4104 1630 1716 -3357
1159 -3357 337 6359 -621 -3714 1170 3469 2557 -4623 -2738 8334 -100 -6178 1501 3169 1288
1174A288m989K35R868n180q749R488L69l492J217m846O380L768j1697K106R037
1189D803m802j564k983M026P831j2323k141J3849n429o724M690O53L204l986n475
1204f371R990q18o045K021O0L779N74r585N575P516p902k777L330N730k455r504
1220f882P128Q090j0591j440O673j037Q30n304k73R091n602m363N298p72K064
1235B910j741p692J0547K664j2733L988P410l676l421j600N436L876j0846O93
1249d185R710m689l698J179J669L111l942m213O437J487m210j788J373N538l275
1264E04o832O171N245p080k299L937L507k545o516N107N125n416k215K521K121
1279A335J207o163p6Q390l371m922K239L593P82n421k047Q932n44q934M067M766
$$ plain form
1174 1288 -3701 -3466 6402 1222 -7527 1961 2330 -1162 55 -4791 1589 5357 -6340 -4234 4803
1189 4803 1 -1563 -4546 -520 7311 -5012 -7153 6696 1267 -5457 -767 -114 3090 -896 -6371
1204 -6371 3619 2801 -3244 -1223 -1163 2616 3190 -6395 -820 6696 -1206 -3983 -653 5077 2622 -6882
1220 -6882 246 8336 -2255 -3695 2978 1941 2771 -2533 -2806 6285 683 -3680 1618 846 2910
1235 2910 1169 -6523 4024 6688 -6045 -2057 5353 1677 -1744 -3344 2092 5968 -4878 -4185
1249 -4185 5525 836 -2862 -1683 -14 3097 -845 -5058 1379 2866 -1344 -3132 -1759 3779 504
1264 504 -6328 -157 5088 -1992 -4291 -354 3153 608 -5908 -801 4324 -1092 -3307 -786 1335
1279 1335 2542 -3621 -3697 4693 1322 -3600 -1361 2232 3014 -2407 -4454 4478 3934 -5000 -933 3833
1295C833j972l302q52M779J527n829p40N499j51k762k481L306M173n263l380N283
1311A668K764m728l025M005M537n101m757N815L186m798l565M426L156l217l880
1326c514K999L762k266l941N46N835j717o163K265N758l050m138J553L976J55
1341B060n806M20O166j318n007J060M206n88k725j440L820J485l205k939L655
1356a56M519n291m310O892L256p385q20M791J358k987l524M064M505n607l161
1371c856O199M96k870j347N70L779r36m454J219M521q70m994J48P319k534o616
1387d226M451K811j578k495j309M794J230p218J491N994l142k337p6K512J966
1402B868l904k814N450J625n257j628M622K948o635j207N880l17l954K29J716
$$ plain form
1295 3833 1861 -1441 -2293 2486 4013 -1816 -2556 2943 2792 30 -2451 855 5028 -235 -3615 1668
1311 1668 4432 -296 -3321 684 5221 120 -4637 1178 4364 -434 -3999 427 3583 366 -3514
1326 -3514 -515 3247 981 -2960 -2414 3421 1704 -4459 -2194 3564 514 -3624 -2071 1905 2060
1341 2060 -3746 -3326 2840 1522 -3485 -2425 1781 1193 -1532 -2972 848 2333 -872 -3811 -156
1356 -156 4363 -928 -5238 1654 4910 -2475 -3295 1496 2854 -133 -3657 407 4912 -695 -3856
1371 -3856 2343 2839 -31 -1378 -808 2971 2035 -2419 -1200 3321 2451 -2543 -2395 4924 2390 -4226
1387 -4226 225 3036 1458 -1037 -2346 2448 3678 -3540 -2049 3945 803 -1534 -1610 902 2868
1402 2868 -1036 -3850 1600 3225 -2032 -3660 962 3910 -2725 -3932 1948 1631 -2323 -2094 -378
1417c78J798p16n121L777M046m647j959K629J956m2m520n22Q009k680p080M193
1433a257N479l268n270L392M955m194l184M384J%j061l113N879M50o134K292K571
1450A922j67m81n263M567O266r746j021Q340j417m646n64M286J822o088Q3N470
1466C363k953j25m21j786N314j772n862M560K951k948j923j166N958J09r574M826
1482a449P679p680l212O050J68j750k582J216M148l281j602K121j016L061j480
1497C91o113P318K044p359J410K718J931k378o063P999L995j1615L371O856n349
1512h44L78o75N66M142m449j775M599j238P60k355k095P660k311p103N245L626
1528D131l556l016J285N645k819o095N926K504m920K66R58L64J658l222r67M431
$$ plain form
1417 -378 1420 704 -4417 -640 3406 -1241 -3200 -571 1385 1343 -3177 -3699 4310 1630 -5450 -1257
1433 -1257 4222 954 -4316 -924 4031 -163 -3347 1037 1038 1038 -23 -3136 2743 3193 -2941 -649 1922
1450 1922 1755 1274 -3989 578 6844 -2902 -3923 4417 3000 -1646 -2210 2076 3898 -2190 -2107 3363
1466 3363 410 285 -136 -1922 3392 1620 -4242 318 3269 321 -1602 -2768 3190 3299 -6275 -1449
1482 -1449 6230 -1450 -4662 1388 1556 -194 -2776 -1560 2588 -693 -2295 -174 -1190 1871 391
1497 391 -5722 1596 3640 -3719 -2309 409 2340 -38 -6101 1898 5893 -5722 -2351 4505 -844
1512 -844 -466 -1141 -575 3567 -882 -2657 1942 704 1464 -891 -2986 4674 2363 -4740 505 4131
1528 4131 575 -2441 -1156 4489 1670 -4425 1501 4005 -915 -649 309 673 2331 -891 -1858 2573
1544B573p61k826p27K152L462n107l064P258N56p139J747L748j90l229j583N315
1560B185k13n360K277J808j165J477l712P07M944l713k512K489K301q58m526J841
1576b030O402m813m255N229J648k441k491K265L267l073k160K672N43p2p66k647
1592b722M389R24m524L68L539L30l240j538M488K097o402K80N384j503k980J60
1608i50K754N88k878j093L367j37k051n39O50L147k187l613L676K432l917j079
1624a830J474K579r11m956L317L511l949j749K619O23J32l215P67M031k639k189
1640b385J532J516L96k794r53M994r77m383J851K202j10j792k175M156J062m723
1656b583P92L415r28j166j848K666K426m192q45L823J15k297m36R50L029k714
$$ plain form
1544 2573 1812 -1014 -1741 411 3873 -1234 -4298 2960 3516 -3623 -1876 1872 1682 -1547 -3130 2185
1560 2185 1972 -3388 -1111 697 -468 1009 -2703 -1996 2948 -765 -3277 -788 1513 655 -3871 -2030
1576 -2030 4372 -441 -4696 533 2181 -260 -2751 -486 2781 -292 -2452 220 763 691 -75 -2722
1592 -2722 1667 2591 -1933 -1565 1974 2304 -936 -2474 2014 4111 -2291 -2011 3373 1870 -1110 -950
1608 -950 1804 2392 -486 -1579 1788 1651 -400 -939 -289 2858 671 -2942 734 3166 -751 -1830
1624 -1830 -356 2223 1312 -3644 -327 3184 -765 -2514 105 728 860 -2355 -1588 2443 -196 -2385
1640 -2385 -853 663 1059 -1735 -2688 2306 1329 -3054 -1203 999 889 -903 -3078 1078 2140 -2583
1656 -2583 -1791 1624 696 -470 -2318 348 2774 -1418 -2263 1560 1675 -622 -1058 -108 2921 207
1672B07k784L499J678k319j737J585K547j370m032L389K391k829j371Q36K604
1687B294r25l452J696L403k507k020J286J292J097l740k76M170q41l158L23K341
1703I83Q21k939j516M817o23l785R04K477K9k064j412K889J724m112l11K664N20
1720A066j388k112J804K594k436k197K380J912j563k891K052L360l205k330L252
1735B98J396j631j461R4L674j466l404K714J245j215o75o96K047J579m525P47
1751a279M031j654j810m51K556J460m003p94M507o63l137J014Q57J175j796j807
1767a794K911J144l061l61J642J344j456k631K670K132k628j963K003J889j555
1782B86k996K319K648l081r78J900M08l7k074l4L554j389l039J992J088k49j442
$$ plain form
1672 207 -2577 922 2600 281 -1456 129 2676 1306 -2726 663 3054 225 -1146 -310 2294
1687 2294 1369 -2083 -387 3016 509 -1511 -225 1067 2164 -1576 -1852 2318 1477 -1681 -1358 983
1703 983 1804 -1135 -2651 2166 1543 -2242 -1338 1139 1168 -896 -2308 581 2305 -1807 -2118 546 1066
1720 1066 -322 -2434 -630 1964 -472 -2669 -289 1623 60 -2831 -779 2581 -624 -2954 298
1735 298 1694 63 -1398 -1304 2370 904 -2500 214 1459 244 -431 -1127 920 2499 -2026 -1279
1751 -1279 2752 1098 -712 -1163 1393 2853 -1150 -1944 2563 1900 -1237 -223 634 1809 13 -1794
1767 -1794 1117 2261 -800 -1161 481 1825 369 -2262 408 2540 -88 -2051 -48 1841 286
1782 286 -2710 -391 2257 -824 -1802 98 506 469 -1605 -1639 1915 526 -2513 -521 567 318 -1124
1799a124j043L205L58l746M01L504q52k189k31K168J533m141O58K948o15j609
1815g75l67J376K019k745j969L609M88j923o38R64J816j050k475K155K212k948
1831b51o59J112J779j183k494K199J647j996q61M98R89R94l366M25L751j742k237
1848a395J247J392j01j918j161L629j98l317N45K717o69k233m8K355L20k778J70
1865a443J884M30j191j725J949J850k756j621L051J27j260p50M57K916k201k539
1881b822L000J487k857p9J121J352q80k246J991J160p50j320l71K718J02l521
1897a915J186L007j718j046j70J709J260m092P19L746j646k056J168P09N15j868
1913d92n53K597m14j164r73J144J818j547k658L071J513l191n00J665J401j699
$$ plain form
1799 -1124 -2167 1038 1396 -2350 -1949 1555 703 -1486 -1717 451 1984 -2157 -1499 1449 834 -775
1815 -775 -1142 234 2253 -492 -2461 1148 1636 -287 -925 39 1855 805 -1670 485 2697 -251
1831 -251 -910 202 1981 798 -1696 503 2150 154 -707 -209 780 1774 -1592 -1167 2584 842 -1395
1848 -1395 -148 1244 1143 -775 -1936 1693 1495 -1822 -1277 1440 771 -1462 -1510 845 1165 -1613 -1443
1865 -1443 441 871 -320 -2045 -96 1754 -1002 -2623 428 555 -705 -1455 -998 1918 -283 -2822
1881 -2822 178 1665 -1192 -1271 -150 1202 322 -1924 67 1227 477 -843 -1214 1504 1606 -1915
1897 -1915 -729 2278 560 -486 -656 1053 2313 -1779 -1060 2686 1040 -1016 152 861 1376 -492
1913 -492 -1045 1552 1138 -26 -999 145 1963 416 -2242 829 2342 -849 -1349 316 1717 18
1929A8k424K595K403m124m66L138j313J07r00m04K819j213k444J689J140l67j227
1946i73j377M003o97m125K744K019j719j007o09K791N65m641K822K020k516P11
1962A1n96l34L181k629j994L827m00j197j121J062K878k813k632M354N64l384
1978a223R98P97R07o76k543K901O60k446P27L45m42K265k723j693M855j508l163
1995a962J838J396k30k070q24M404j433l832L305N57j300k29q33J846O24k897
2011a640J293N74p64J629l391J226L902m098j673M280l46k333j63J073K672l842
2027a601q16L974j559j416J359l19O57K14k076J465J032o28p21j052K877N68m268
2044b310J012M229k484k271K031J318o02k442J300K405k256n76J488o83P30j79
$$ plain form
1929 18 -2406 189 2592 -1532 -1998 1140 -173 -66 -966 -1370 1449 236 -2208 -519 621 254 -973
1946 -973 -2350 1653 956 -3169 -425 1594 -125 -1132 -1741 1050 1615 -3026 -204 1816 -700 11
1962 11 -585 -919 2262 -367 -2361 1466 1066 -131 -1252 -190 2688 -125 -2757 1597 2161 -1223
1978 -1223 -225 572 1479 803 -1740 1161 1821 -625 102 447 5 2270 -453 -2146 2709 1201 -1962
1995 -1962 -124 1272 1042 -1028 -1852 2552 1119 -2713 592 1149 -151 -380 -1213 633 1257 -1640
2011 -1640 -347 227 -537 1092 -2299 -1073 2829 -1269 -2942 1338 992 -1341 -1504 -431 2241 -1601
2027 -1601 -2417 1557 -2 -1418 -59 -378 279 493 -1583 -118 914 286 -435 -1487 1390 1958 -2310
2044 -2310 -1298 2931 447 -1824 207 1525 923 -1519 -219 2186 -70 -646 842 159 889 710
2060G10j932K183Q49k232k64P33J907j516k873L800J359m984J354K311q22q26
2076b43p87J382J072k427M70J312j230J283j628r06L388j035k499J235J575n52
2092D10k389J72M007j955l261L341N13j627k93O30O70J86j989J040Q91n53J68
2109c9j385J254K157k789j465L345J55k153o9J456J792l344o27L788j339j992
2125a255J640K49q8K34j850J705P51j698K76j05R51J159l467P78L729l051j064
2142a106J799J16J03k118R65K602k672j043K317q32k25j17j249K771m65k417J055
2159e16N28M16o12j780K374J467l901Q33K548j214j271j13J109J255k627J91K170
2176H57q75n31o8k64J750q40j987K115R07j701J21p9J687m26k598J988J984k531
$$ plain form
2060 710 -1222 961 1810 -422 -686 47 1954 438 -2435 1365 2724 -2260 -906 1405 583 -243
2076 -243 -1030 352 1424 -1003 -533 779 -451 832 -796 -1702 1686 651 -1848 -613 962 410
2092 410 -1979 -1807 2200 245 -3016 325 838 -789 -1082 -452 218 404 -1585 -545 346 -207 -39
2109 -39 -1424 -170 1987 -802 -2267 1078 1233 -920 -989 467 2259 -1085 -1712 2076 737 -1255
2125 -1255 385 634 546 780 -1070 635 1386 -312 -36 -141 810 1969 -1498 -720 3009 -42 -1106
2142 -1106 693 809 912 -1206 -241 2361 -311 -1354 963 131 -94 -211 -1460 1311 846 -1571 -516
2159 -516 12 428 -184 -1964 410 1877 -2024 -1191 1357 143 -1128 -1241 -132 1123 -1504 -1313 857
2176 857 -18 -549 -617 -881 869 29 -1958 157 1064 -637 -516 -595 1092 666 -1932 56 2040 -491
2194d91n75J500K32P8j908Q37K049j394j050Q35N50L01j370m88K416o55k006J262
2212A23P31L01j339o98K016N73l009R32K011j217n49o80J126P79j466n55J650
2229G29j28n41r03O24J812j642j314J338R70j271p17N34J414q47j921J889Q27
2246H53j214q69J042O30l74j111R2K046r63j204K98J255rj422k70J924r8j658
2264a052L64J010N05j656k85K177K2j724K67J311m60n85n29J186R89j575o22J256
2282E99Q35j459p12J202Q22j054r57J099R63j012j012R84Q05n84j275P89J061
2299A094q15p17K62J110m15j400K46J782o88j661Q16R37k4j388J82J199l9j352
2317h71O1J088Rj262j74J472K04j331k65J161O25j409n21J360M68j248m04J280
$$ plain form
2194 -491 -1066 434 666 744 -1164 -327 1722 328 -722 113 663 964 -406 -894 1522 867 -1139 123
2212 123 854 1155 -184 -882 1134 1707 -1302 -370 1641 424 -125 -805 321 1100 -366 -921 729
2229 729 601 60 -843 -219 1593 -49 -1363 -25 945 -326 -1043 -509 905 58 -1863 26 853
2246 853 -361 -1230 -188 442 68 -1043 -951 1095 132 -1072 -774 481 472 -950 -1220 704 606 -1052
2264 -1052 -688 322 827 -829 -1114 1063 1085 -639 -372 939 479 -106 -635 551 1540 -35 -657 599
2282 599 1434 -25 -737 465 1287 233 -724 375 1338 326 -686 298 1103 519 -756 33 1094
2299 1094 279 -438 -176 934 519 -881 -635 1147 459 -1202 -386 551 527 -861 -679 520 481 -871
2317 -871 -810 278 287 -975 -1149 323 527 -804 -1069 92 717 -692 -1213 147 615 -633 -1037 243
2335B43L37p60o67R90N22o24p57P73Q73o41j504J286J001j021r22Q44J157m25
2353G05j564Q44J569j300r67R67N37l19r30R2J313jj177M8J204Lj155p08J690
2372H51L20k101M64J644o40r49j39O72J071j738p5J409o20n81P2j12J287m45j985
2391a595J436R97r49r02K37J842j113k025K074J044j907L77M63j11L42j715J105
2408d00J301j227l07J70K50J110j327j266K635k89j765N24J403j95j359p1J976
2425A163m43j809J468K86n98M80o84K08J423j453p46J548j15R1j592K97K432j775
2443A81k106K924L75k277P63L00R33j286p63J881r22n29J033j185L57J732k654
2460a243K58J938n09r04n81J663R81l441M01L627k401j420J792k51J74p38j10
$$ plain form
2335 243 580 -180 -847 143 665 41 -716 57 930 289 -1215 71 1072 51 -871 -27 1130 705
2353 705 -859 -15 1554 254 -713 254 791 472 -458 -366 947 946 -231 -183 1021 1024 -131 -839 851
2372 851 1171 -930 -466 1178 538 -411 -550 122 1193 -545 -620 789 169 -412 -340 -452 835 390 -1595
2391 -1595 -159 838 -111 -1013 -776 1066 -47 -2072 2 1046 -861 -484 -21 -132 210 -1505 -400
2408 -400 901 -326 -633 -463 -213 897 -430 -1696 939 650 -1115 -591 812 617 -742 -813 1163
2425 1163 720 -1089 379 665 67 547 -137 71 1494 41 -705 843 728 819 -773 -476 1956 181
2443 181 -1925 999 1374 -903 -140 160 1093 -193 -956 925 3 -526 507 -678 -321 1411 -1243
2460 -1243 -985 953 444 -460 -1041 622 1603 -1838 -1437 2190 -211 -1631 161 -90 84 -654 -764
2477g64O65j18k30K35q08J387O21k914J602K089k548o53J968L01q87j479J673
2494A40J930l400Q29J904j573k81J147j128J058N00j707N32J85J294j342j728
2510a640L180M14l621J489J959j994k87J51J441j99k283K220K76k205J578p6j686
2527a283K388q51j630J507M42m8j597K86K897k288k220L597m0k835J248R30k66
2544B37q65j69J108k74o85J135j081m49K291j862j060K538j93k201R09J517k63
2561F33j911L7L264k341j630K791l14j062P31o2j91M52p29P16r55N55J324k723
2579a415R85K893k724j149K439Rq78j202J495J110k687O41K378k155j71J452j251
2596b30K96Q79j172J23L48P96r12j378K469K55l113J141K303j930q53P75J037
$$ plain form
2477 -764 -99 -217 -447 -212 -1020 367 988 -1926 -324 1765 -783 -1436 532 833 -54 -1533 140
2494 140 2070 -1330 -501 1403 -170 -451 696 -432 626 1126 -581 -49 136 1430 88 -1640
2510 -1640 1540 1954 -1667 -178 1781 -213 -500 -349 1092 893 -1390 830 1106 -1099 479 403 -1283
2527 -1283 1105 254 -1376 131 573 525 -1072 -786 2111 -177 -2397 1200 1160 -1675 -427 503 237
2544 237 -628 -797 311 37 -648 487 -594 -1043 1248 -614 -1674 864 671 -1530 -621 896 633
2561 633 -1278 -1241 2023 -318 -1948 843 529 -533 198 136 -55 397 -332 384 -571 -16 1308 -1415
2579 -1415 -430 2463 -261 -1410 1029 1038 160 -1042 453 1563 -1124 -483 1895 -260 -431 1021 -230
2596 -230 66 945 -227 -104 244 1040 128 -1250 1219 1474 -1639 -498 1805 -125 -978 -203 834
2613H34r30j385J648Q58j993O32R06j595J314K09j704Q48J462j663l69O80J012
2630G64p69j919K902M9l034J417J562j007n40L0P65J57j200Q12J67p50J404r94
2648a84q43K183m40j998J197J213p79j105K73K192j191j869K200L13j552N78j3
2665A75JM87r62L41L73j1J32r20J13J613j329j317K228r4j358J46J163N1j499
2684f67o4J656o30j168R25k80L18J03q83M67N70o36l00K15N08L64j858O76K072
2703A388j268j223J416r5n01m10K77Q77q67k68P80j00M9l02l09R00M10j105l05
2722f56J211k2l32j024J346N03j384n9J259n16n25K39L15K62n53l8L84K73n39
2741A44m94K30Q85l25j507J342N15p95k07K56P08n70q37N68Q71r66l9L29K94m82
$$ plain form
2613 834 -96 -1481 167 1025 -968 -336 570 -1025 289 498 -1206 -358 1104 -559 -928 -248 764
2630 764 -5 -1924 978 1027 -2007 -590 972 -35 -575 -545 220 377 -823 -11 156 -594 810 -184
2648 -184 -1027 1156 716 -1282 -85 1128 349 -756 -483 1709 518 -1351 849 1162 -390 188 175
2665 175 176 663 -299 42 415 404 536 -384 -271 1342 13 -1304 924 830 -528 -382 781 832 -667
2684 -667 -731 925 295 -873 52 -228 90 193 -690 -223 347 -289 -589 -374 134 498 -1360 -684 1388
2703 1388 120 -1103 313 218 -283 -693 -416 461 -406 -674 106 6 55 -247 -556 344 754 -351 -656
2722 -656 555 533 201 -823 523 1026 -358 -417 842 326 -199 40 355 617 64 26 410 683 144
2741 144 -350 -120 765 440 -1067 275 790 -5 -212 44 752 182 -655 -87 784 -182 -221 108 402 -80
2761h0l74Q8M13mn54m6P17k6q85j33J353m60j085N13P46r2p14J23P51l1j100L32
2783e48M35K65l17m00N47P04q08o48Q28K95n20o77J214L80r58m12Q23M53p08l74
2803d26O22L49m53m26L20M87k84k62J19M03K44j151N4R76k88m13j22Q76J35q97
2823a37n7R03m70n74Q4N84K54o51r0N87j1o05k78L31O45n20q84R87K23o32n13
2844h24R77J52o05l24Q26m8p80L46M0L04k95k60L96K41K0j025M44O36J20q76K45
2865b90P44j74q64J17J058o65l69J48P25r2p44M02L28j79j32L4j15P22q23m73
2885f42J179k31k06l81O11M74o26q46J268j57o47lK69O32o67m16O54L01o08J48
2905A06k38O76k53j014P58N13n17n79N45K44k85o35K68R41q46l45L84N63m18j81
$$ plain form
2761 -80 -454 -366 47 43 -511 -557 160 134 -751 -884 469 9 -1076 -563 183 91 -623 -500 251 220 -880 -548
2783 -548 -113 152 -165 -565 -18 686 -122 -770 58 353 -167 -844 370 750 -208 -620 203 656 -52 -426
2803 -426 196 545 92 -334 -14 473 189 -73 46 449 693 -458 -404 572 284 -129 -251 625 760 -137
2823 -137 -194 709 239 -335 -251 333 587 -64 -154 433 422 -183 -461 -130 515 -5 -889 98 321 -311 -824
2844 -824 153 305 -300 -624 202 154 -626 -280 -240 64 -231 -491 -95 146 166 -859 -415 221 341 -535 -290
2865 -290 454 280 -584 -467 591 -74 -443 -295 430 338 -406 -4 324 145 13 47 -68 654 -169 -642
2885 -642 537 306 100 -281 330 804 178 -668 600 443 -204 -207 62 694 27 -389 265 566 -42 106
2905 106 -132 544 291 -723 35 548 31 -548 -3 241 -44 -679 -411 530 -316 -661 -277 286 -132 -313
2925c13k26M70K92q70K49L89k8k49m78R62K14j103k4J209k02o74J99K81M14p28
2945b16j73O04J24o06K19j3N60j19q20O29O20o34l90J4P24Nj021P57M86o09l48
2966b07K27N74p0p15L5P70k91o54K90L00L37p71m00Q97K98r50k97J066J3o14l36
2987d98J048K5r85q1N47J49l51j05O8N64n10n27N67J88k60k33L14L58n61p80Q74
3008a89O05r40Q3j93R01m54m63M33M97k51j23l99N00O67j246O01O62l82l78m60
3028e29J065J63j057j0J225o38k07J34R3J47k52j89L39j13j20J66l96P52j79r38
3048e44P11O62o46m11K88M11l75n83P49K55r50L23M45k95k56L67k20M97J7q03
3068c58R8J33N51p85n50J303N2j336N61O53n37j70o4P46l25p96Q65K36q74N23
$$ plain form
2925 -313 -539 -69 223 -647 -398 -9 -37 -286 -764 198 412 -691 -715 494 292 -382 -183 98 512 -216
2945 -216 -389 215 339 -267 -48 -61 499 380 -440 189 809 175 -215 -201 523 528 -493 264 750 141 -207
2966 -207 20 594 524 -191 -156 614 323 -331 -41 259 596 -175 -575 322 620 -330 -627 439 452 -162 -498
2987 -498 550 575 -410 -491 56 205 -146 -251 -183 381 -129 -656 -89 99 -161 -394 -80 278 -283 -1063 -189
3008 -189 416 -524 -441 -634 267 -187 -650 -217 280 29 -94 -493 7 674 -572 29 691 309 -69 -529
3028 -529 536 699 -358 -368 857 219 12 146 239 386 134 -55 284 171 51 217 -179 573 394 -544
3048 -544 167 829 183 -228 60 471 96 -487 262 517 -433 -110 335 40 -216 151 -69 428 445 -358
3068 -358 -260 -127 424 -361 -911 392 444 -892 -331 322 -215 -385 -449 297 -28 -824 41 277 -597 -74
3088g4j09l96J054o37j03L98J15k11l88J09J004o58r73J651k0j189L82N12j35
3107C32l54k26N24J43n37N98m56J08N38o40l27J064n48l49K90J56M70j371M80
3126a05J206j244p75J215J52o13K17k42N26l44k10M98n55K08M46j065L78J069
3144G62j277l43R79P9m76l83Q34J03q76M8Q98m73l14M03n16M48L00o17L48R0j13
3165i6j49n43Q79M29j432Q09Q86j073J16K27L31k05m70N86M35j109L90K67o33
3184c55O86kp92Q23J58o99L47M9M09n59o26J096K61j341N58O52o16K10l99L21
3204A81M72p68PJ14O0k30J46m30J088k89r05M02L92k25l91J44N27m51p72R29N06
3225E07p03k00K08q7L09n52L29J76j66jj60K12N71p44j70Q38l43m11K93J76P5
$$ plain form
3088 -74 -183 -579 475 -162 -265 133 248 37 -351 -242 762 104 -869 782 762 -427 -45 467 332
3107 332 -22 -248 276 419 -118 480 24 132 670 30 -297 767 219 -130 160 316 786 -585 -105
3126 -105 1101 -143 -918 297 449 -164 53 -189 337 -7 -217 281 -274 -66 380 -685 -307 762
3144 762 -515 -858 121 200 -276 -659 175 278 -598 -550 348 -125 -439 -36 -552 -104 196 -421 -73 17 -96
3165 -96 -245 -788 91 520 -912 -103 783 -290 -174 53 384 179 -291 295 730 -379 11 278 -355
3184 -355 331 329 -463 360 518 -181 166 215 624 65 -561 535 796 -545 13 665 49 259 -140 181
3204 181 653 -115 -108 6 66 -164 -18 -448 640 351 -554 -152 240 15 -376 -232 295 -156 -928 1 507
3225 507 -196 -396 -188 -275 34 -518 -189 -13 -179 -180 -340 -128 443 -301 -471 367 24 -387 -94 82 157
3246A57k98m32Q42L2o34N08r5J7K0k67L13M08p82M4M85J87l64l60L88M94o93j69
3268a99L66J70m6m68J29M24j96j30Q3J91m6n40J1N36J23o69m6O37j0m13j53M08
3290A62j53k40nN66m78n8j79K22L79n47R8R0M48m15l70N27j17O8m91L76L55m08
3312a70m52P32K23m74j66J68N58p52L9L57r8L5j0j39N07k78m45L94P6L06n64L66
3334B13K64j69m66Q5K98K61m58k37P39j46l39J42j56N83n72k11N72L9n89J26J97
3355A76Qk06m41Q48j20m66k00N15J10m61k4O5L72m39j29J97K24l17j33k3O06k42
3377h0k35M2M80j64o67N26Q6J54o76L27M03k35k63R9L71Q8k35n02Q54j00o70L72
3399b5Q9M85k95n85O69k4n26J0K14J94n4l35N65J24m27p5K87J68l00j58J6M56
$$ plain form
3246 157 -141 -573 269 301 -333 175 80 97 117 -150 163 571 -211 -167 318 505 141 -219 169 663 -30 -199
3268 -199 167 337 291 -177 -48 376 180 50 133 324 278 -262 -251 285 408 -261 -307 330 320 -93 -246 162
3290 162 9 -231 -236 330 -148 -206 -385 -163 216 -331 -233 -143 305 -110 -480 47 -70 -2 -493 -117 238 -170
3312 -170 -622 110 333 -141 -307 -139 419 -333 -294 63 -35 0 -10 -149 358 80 -365 29 105 411 -153 213
3334 213 477 308 -158 -73 225 486 28 -209 530 384 45 187 31 614 42 -169 403 442 -147 -21 176
3355 176 184 -22 -463 385 265 -201 -401 114 224 -237 -261 -196 176 -263 -392 -195 29 -288 -421 -444 162 -80
3377 -80 -315 -273 207 43 -624 -98 -12 142 -534 -207 196 -39 -302 -203 168 256 21 -481 373 273 -397 -25
3399 -25 64 549 254 -331 338 314 -212 -202 12 206 152 -183 382 506 79 4 291 459 159 1 17 473
3421D73l38l33K81J53J46m39K13L61k93o90O37M56o88j32o0M77j56l89L29M00
3441D08n18l05M30j00L70n45j4K86R7n42K25k0K75m24j56N90P9k49k24K14K59
3462A36l13k17N39k26m42K39K32N5K33m52J58M09l51k17n5M38P1n15K44M96n11
3483d9J15j10K90k45k26J93L95j06p92O98J31k30J84l98L07O44r11NN08N2k34
3504B21o41O70J47l68k00M10R1n31J71PM55n00k23M57r5l39J61j37J1J88n14P20
3526A61k84k16K81l56M64J04n88J6P01n74J6L5J62K54m41P1M57p9l12J52m38O70
3548B56m00l17Q58j89m09O8M59j77N0l14K73K73n96K9K12K10p5m29J44M44o07
3569b37J1N66l2l99P2L0L63p8o90M82K49m39L13k80K57L87r52L89K77l96R0MJ27
$$ plain form
3421 473 135 -198 83 236 382 -57 156 517 224 -466 171 627 -61 -193 -253 224 68 -321 8 408
3441 408 -110 -415 15 -85 285 -260 -274 12 109 -433 -208 -228 47 -377 -533 57 136 -113 -337 -123 136
3462 136 -177 -394 145 -81 -523 -284 -52 3 236 -216 -58 351 0 -217 -272 166 237 -278 -34 462 -49
3483 -49 66 -44 246 1 -225 -32 363 257 -535 163 294 64 248 -150 157 801 -110 -105 403 455 221
3504 221 -420 250 397 29 -171 239 330 -201 -30 -23 432 -68 -291 166 71 -268 -107 -244 -233 -45 -559 161
3526 161 -123 -339 -58 -414 50 154 -434 -418 283 -291 -275 -240 -78 176 -265 -194 263 184 -128 24 -414 256
3548 256 -144 -461 397 208 -201 -133 326 149 199 -115 158 431 -165 -136 76 286 211 -218 -74 370 -237
3569 -237 -226 340 308 -91 -19 11 374 296 -394 88 337 -102 211 -69 188 575 -377 12 289 -107 -17 -13 114
3592A14L17n48l1M22n21N6L9K77Jj79j79K42jl55L76l28M26r0n87M00L01o65K80
3615b33M5N8M20o76M10L58n27k7K81l3n5k33l5N85j58k09K93k55N8M4l09O07L8
3638D47q08M78J96R1m06k90N15m6m74L23K99j18k44%K52K94m60o05P57j22k27
3659a48jK66L31p30o7N10k54l7L7j30N29k73m02K47L2J71l79P7K79j91j48J53
3681a28L13j80m91K89J46j80k84M33J85k33l32L45L32l26n5k03L84nk75L15K9
3702G9M0k59j22K84K10j74l1M1P0j03r8J53R9m20r6R67m29L7k28P2M9m3l38M35
3726A95K1l64J22J71L50l75l11J88J20k57J10JJ27n2n25M42K84k67j15J9J87J93
3748B64k09j59P3R0k96K80j91M11n62J50K21k1m22N7K37K14r6m95M79m3k79O0
$$ plain form
3592 114 431 -117 -148 274 -247 -191 -152 125 126 -53 -232 10 9 -346 30 -298 128 38 -549 -149 152 -513 -233
3615 -233 -188 -130 290 -386 24 382 -145 -172 109 76 21 -212 -247 338 180 -29 264 9 67 111 -198 409 447
3638 447 -361 117 313 404 -2 -292 223 177 -297 26 325 207 -37 -37 215 509 49 -556 201 79 -148
3659 -148 -149 117 448 -282 -349 161 -93 -130 -93 -223 306 33 -369 -122 -90 81 -298 -221 58 -133 -281 -128
3681 -128 185 5 -486 -197 -51 -231 -515 -82 103 -130 -462 -117 215 -111 -166 -369 15 10 -265 50 79
3702 79 119 -140 -262 22 232 58 27 68 138 35 -63 90 189 -231 -327 640 211 248 20 92 141 98 -240 195
3726 195 216 -148 -26 145 495 120 -191 -3 117 -140 -30 -29 98 46 -479 -37 247 -20 -135 -116 71 264
3748 264 55 -104 -31 59 -237 43 -148 263 -299 -149 72 51 -371 -314 -77 137 41 -454 25 -18 -297 -237
3770b37L41mk6l17J61M8j16Q9j6J09n8l6L4L75m63K37j74J26j94K74j51L20j7
3793C05k97J46P2j1j19J19J7k4m44L03j23M08l37j70J79J76j39j21J67j0m73K48
3815a28L17j36r4l47N23O9m83L40k55K33j58n6j09N66k49m03K54Q4K6j31q3L69
3837A49l83P5J6J40j06j50k49M96j87j45L57M7l9j00O0N32m11m29L10K18J40m85
3859a44J22K70k2l07J01K81l33j62J67J91n0J5j6m5K03j98PmL36j41m45M30J2
3882B68m30J28J4L56l39L2o7O24n92l0q5Q8K34m57j51N07J35l23o5K66p9l17R1
3905a92M25l25%j49K45j10p9k04M70n6l09K32j57L09j76j4J05K82k82j21N00j89
3927B05n12j43Q00k02k73J4L64j80J9j50R9J47O3j18r3K54k28P3m1l0J37n0p6
$$ plain form
3770 -237 104 100 74 -243 -82 -34 -150 -61 -77 32 -26 -62 -28 347 -116 121 -53 73 -121 153 2 322 305
3793 305 8 154 226 215 96 215 232 208 -236 67 -56 352 15 -155 24 200 61 -60 107 97 -376 -128
3815 -128 189 53 -41 -388 135 204 -279 61 -194 39 -119 -175 -284 282 33 -370 -116 -32 -6 -137 -220 149
3837 149 -234 -159 -143 -3 -109 -259 -508 -12 -199 -344 13 60 21 -79 -19 513 102 -327 -17 201 341 -144
3859 -144 -22 248 226 -81 20 301 -32 -194 -27 164 114 129 113 68 271 73 80 76 412 271 -174 256 268
3882 268 -162 -34 -20 336 -3 29 -38 586 -6 -36 -121 -33 201 -256 -407 100 235 -88 -153 113 34 -283 -192
3905 -192 233 -92 -92 -241 4 -106 -185 -389 81 25 -284 -52 -209 100 -76 -90 15 297 15 -106 394 205
3927 205 -307 -450 350 148 -125 -111 253 73 92 -58 41 188 251 133 40 294 66 139 98 68 205 155 79
3950G9J25l5l56L96j29j14J93k06L05j90n3K1j59J15J59n34K70L28m02J25r6N36
3972C78m72l92N46k59j01K43K90l11l7j5J51q1j37K45j87J07l9J47l64L27j77
3993a38k84M29J84k85j27J75M6Mk87J90J06k34K57J0P0n6R9j80J49L6j58j30J87
4016F3L08k31n15M47L36o38K65J75k44K62m26L87K21n61L55l4m1J36k91Q4L18
4037C76l36L3j42K84p7p9j85K90k53j80J67J07j16j64J99N3Pj27R1m9o5K17j29
4060g8k65M92k80j96K53N27o48lM18r0l38N6M26k91j21J96o7J01k65j00L53N9
4082A39l40K26J5l4k2l89M06M19k17m74J73K49J33o81N49K14m56J20P1o4N4O9
4104A60j25R7L34o11J67j57K18j59j90M41R7m97J03L40k30k46NM07j6l31R4K9
$$ plain form
3950 79 204 169 -187 209 80 -34 159 -47 258 68 15 36 -123 -8 151 -383 -113 215 -187 -62 -158 378
3972 378 -94 -486 60 -199 -300 -57 233 -78 -115 -130 21 -60 -197 48 -139 -32 -71 76 -288 39 -138
3993 -138 -422 7 191 -94 -221 -46 0 4 -283 -93 13 -221 36 46 116 60 159 -21 128 164 6 -124 63
4016 63 371 140 -375 72 408 -230 35 210 -34 228 -198 189 410 -151 204 170 129 265 -26 58 376
4037 376 40 73 -69 215 138 59 -126 164 -89 -269 -102 5 -111 -275 -76 -23 -16 -143 -52 -101 -166 51 -78
4060 -78 -343 149 -131 -327 -74 453 -195 -198 220 130 -208 -152 274 -17 -138 58 -9 92 -173 -273 80 139
4082 139 -201 25 40 6 -16 -405 1 420 203 -271 -98 151 284 -397 152 366 -90 30 101 37 91 160
4104 160 35 132 466 -145 22 -135 83 -76 -266 175 272 -225 -122 218 -12 -258 -253 154 138 -193 -99 -70
4126g0J90j75Mj02L03n5l16K27o0K6j4k56J17J51l29K77J16%l90M05J76o1j69
4149ek21M87l76J09p7M1m6J94k03M9M8l25M79L5K9o9k63K51p9l41J79O5J11j05
4173c3j66L47J44j24q2R0o4j57N3J01J73j85OJ22j53L42m40J50J13k70r0q5L13
4196A05k13O5j08J21j61j06M75k34j23k7N7j7R1j03J41L0k20k0K31J78l37j17
4218b92J61L30k81R0q1P9J96k63j37L02j6q8j67K90k18K4p2R3K25l31J96J04L9
4241A83j86J18k1j54K2L1o3K63J20k51j97M06k18k44K16K24o5k78J7L45j70j19
4263b1j05K07N4r6j66q8K32o9k10L96j72k55oJ48M35n98K45K87l34J41j71K22
4285G6j66Q9k84J49J17k27k9l0M84k97K63m5J28k90m6J69PO5m00K28J83n6k13
$$ plain form
4126 -70 120 -55 -51 -153 150 95 -221 6 -54 -28 -42 -298 -181 -30 -359 -82 34 34 -356 49 225 164 -5
4149 -5 -226 261 -115 -6 -83 -42 -88 106 -97 -48 0 -325 154 189 218 149 -114 137 58 -283 -104 -39 72 -33
4173 -33 -199 148 292 168 86 176 112 -45 8 109 282 97 103 225 72 414 -26 124 237 -33 -123 -208 105
4196 105 -108 -43 -151 -30 -191 -297 178 -56 -179 -206 -149 -166 -75 -178 -37 -7 -227 -247 -16 162 -175 -292
4218 -292 -131 199 -82 8 -73 6 202 -61 -198 104 88 0 -167 123 -95 -71 -143 -50 175 -156 40 144 183
4241 183 -3 115 94 -60 -38 -7 -70 193 313 62 -135 271 53 -191 25 249 184 -94 -77 268 98 -21
4263 -21 -126 81 135 39 -127 -215 17 -52 -262 134 -38 -293 -299 -151 284 -314 -69 218 -116 25 -146 76
4285 76 -90 -1 -285 -136 -19 -246 -275 -305 179 -118 145 100 228 -62 -108 61 68 133 -267 -39 144 88 -125
4308a25J66J2n1o1J49J61k65k74M20r7j45J16K02j08J15k99L7L76k19j41n5j9
4330a05J86j06j50L65k86K31k2J45l8j00j67N3J08j95L4K06o0m33J4J13j1L68
4352A50j33LP3k80k1j88M07l8j63N9M0Q8R0l97L44j38k62P6L47j79p9J6J46o4
4376a03J31k70J77M1M13k96k45M35j83j22L8n1J23n3j23N02m69K32j55P2p3N1
4398G2j8L44l22k38J35J24M7j08l59P65j74l11P8M3O4j66n6K40J13j07k91J7L41
4421B33m36Q9L50l38P4j26L53m23R6k01M36r0n1q9K50K9l15L5k56L43r9k88L46
4444g8J46Ml80J51N9J52j23N2L16k51k49J87o0M9Q4j83K61p5P3p1L4J26j10j58
4468d4K41n02L63p2K37k89L23m39Q8k6K45j29L72l78p8J15j19K81k85L51j35n4
$$ plain form
4308 -125 41 53 2 -59 90 251 -14 -288 132 35 -110 6 208 100 215 -84 -47 329 110 -31 -86 -105
4330 -105 81 -25 -175 190 -96 135 113 258 220 120 -47 6 114 -81 -47 159 99 -334 -320 -207 -218 150
4352 150 17 20 93 -187 -208 -396 11 -27 -190 -131 -91 -3 87 -310 34 -104 -366 -290 57 -122 -201 -185 -39 -103
4376 -103 28 -242 -65 -24 389 93 -152 283 100 -22 16 -35 88 35 -88 414 -55 177 22 94 21 72
4398 72 54 398 76 -162 -27 97 144 36 -323 442 268 -43 35 78 142 -24 -80 160 273 166 -125 -108 233
4421 233 -203 -114 236 -102 -28 -154 199 -224 -128 -329 107 17 -34 -123 127 156 -159 -124 -380 -37 -136 -424 -78
4444 -78 68 72 -308 -157 -98 54 -69 -17 299 48 -201 -14 -74 -25 59 -124 137 62 135 64 98 224 114 -44
4468 -44 197 -305 58 -14 223 -66 257 -182 -94 -120 125 -4 368 -10 -88 27 -92 189 -96 255 120 66
4490F6j33Q1L4K52j36l95L10R9q1n3j67p4J21L7j52J13L8r8J10l6M0l04J93Q6
4514d9J68l13p5j79O05k30J6K34l73M4O6j85J77K15l05p1M10k60L4K87r1q4j13
4537g2M8L50l14r2K66k31L82j37j49R0o4j5Q5m0o0k4p7K02j74K8j1J20j80mJ18
4562D5J3J6k92J86L0Q9j76r2J71j12l5J37nO0j43l9J15J69R2j68R4k18OJ3j00
4587a44J14q0R2K14k43j12J49m3P5l5j07JK05l5k49Q5K69m9k26J30l7R1k75K25
4611A5K17j55J07l98J86lj4M34k00k20K36k95J78J19k10L5L18J73l74j52q2K22
4633A37j43p6L21k00j57K25R3l05J13k09J52k3k0J68r4o9K49j42j97K47rl55K42
4656e2m7j53L71k71L65l20n6K57q1l4K8l9K54k49PO9j81M31n22J12J87n0j6K26
$$ plain form
4490 66 -67 14 48 300 164 -231 79 178 97 44 -123 -197 -76 -39 -191 -78 -40 -138 -28 -64 -24 -328 -135 -49
4514 -49 119 -194 -269 -448 157 -73 -57 177 -196 -152 -86 -271 -94 121 -184 -255 155 -105 -71 216 125 41 -72
4537 -72 -24 326 12 -80 186 -45 337 200 51 141 77 62 147 107 47 23 -54 148 -26 2 -9 111 -69 -73 45
4562 45 58 74 -218 -32 -2 87 -89 -181 -10 -122 -157 -20 -25 35 -108 -147 -32 137 229 61 155 -63 -57 -44 -144
4587 -144 -30 -110 -18 196 -47 -159 -10 -53 22 -13 -120 -119 86 51 -198 -113 156 107 -119 11 -26 65 -210 15
4611 15 232 77 184 -214 -28 -31 -45 389 189 -31 205 -90 88 207 -3 32 350 523 149 -3 -85 137
4633 137 -6 -82 239 39 -118 107 200 -105 8 -201 -49 -72 -92 76 -18 -87 162 20 -177 70 61 -294 -52
4656 -52 -99 -252 119 -152 213 -107 -163 94 13 -21 7 -32 222 -27 -20 49 -132 299 -223 -111 76 26 10 236
4680B36k98L7J98n12M58k3Pq5J09o8l1j49J8L56l12J94r5J02J0j18L1O8r6j18
4704h1L0K67l04J49J57K2j02j64R3k2J2P6j00k0k21r7L08p4J22%k50K80j33j67
4728b19O4QJ03l1j55J31J8P4J55n5k6m46L33R2o0j18J1O1o0J78k6l23M80j25P2
4753A36%j78%j73L32j81R5n8J50m09K79p3K10J42m76L09j07K41p5k88P0N6J53
4776A55j05p4K36l66J81j07J79J62j5k55J59j0j58J43r2J05k8j79J2J18k59J20
4798g8J48N6n6j14P8K00k42k52J02L42k64k7K70k92ko6K0K87k78k31M71p8n1j21
4822a78K72k79Q7J20q8j44J15J38k38K04J11j91n8J74l3j16K7J97L12k52j86J86
4844A80L2m24K6K68p2j51j27J98r1J10J12J74l31j2K12J18O5k12j94J46O3J1n7
$$ plain form
4680 236 -62 -25 173 -339 119 96 103 18 127 59 28 -121 -103 253 -59 135 40 142 152 34 65 133 37 -81
4704 -81 -51 216 -88 61 218 240 138 -26 67 45 57 133 33 13 -208 -305 3 -71 51 51 -199 81 -52 -219
4728 -219 -155 -147 -44 -75 -230 -99 -81 -7 148 93 67 -379 -46 46 -14 -132 -121 -60 -120 58 32 -291 189 64 136
4753 136 136 -42 -42 -215 117 -64 31 -27 123 -286 -7 -80 130 272 -204 105 -2 239 164 -124 -54 2 155
4776 155 50 -24 212 -154 27 -80 99 261 246 -9 150 140 -18 125 33 138 110 -69 -57 61 -198 -78
4798 -78 70 126 70 -44 34 234 -8 -260 -158 184 -80 -107 163 -129 -131 -197 -177 110 -168 -399 72 -6 -57 -178
4822 -178 94 -185 -98 22 -66 -210 -95 43 -195 9 120 -71 -129 45 12 -104 -77 120 432 180 -6 180
4844 180 212 -212 -186 82 10 -141 -268 -70 -161 -51 61 235 -96 -108 104 222 287 75 -119 27 90 101 44
4867D4J03K5J6l36J04J08L5l86J39Q5L14k39l10J40OR5p3M3K31j86P1M3J76m35
4891a87J85m9J10j15j61M55j51j07R6k00K51Q9k75J07Q8k4k38R3P2rn9K72o5k08
4915c0n0J17j45K26k88OL46j96lNl1K08m56L49J02J08m21M34k28Mj72J78L14n04
4939a27RL07Oj98J7J45l5j05L5l82L95j99J28j42l7L40k48m8J94l98J89L0J06
4962a8K31k79j58J29J37J91j29l3J07j46k21p9K23m2J34j85K31j58r1J10J97J
4984A52r5N2q3J40j5P4k94KP5J1N4J99j12k53K62k06K46k53q8J49k9Jn1K38k84
5009a08p4L7J93j0%J54k46J7n4m1J81M0R6l84L03p4k25J11J42j58L0J33k03L2
5033a08j88K37J13p0J47j86j00J41O7K93m51k76L23k02J97L5J67q6k0r8q6J24
$$ plain form
4867 44 147 172 188 -148 -44 64 99 -287 -148 -63 251 12 -298 -158 -152 -57 -130 -87 144 -42 29 72 248 -187
4891 -187 -2 -51 59 -56 -217 238 87 -20 76 -124 127 216 -59 48 136 112 -126 -33 39 30 -29 243 178 -30
4915 -30 -80 37 -108 118 -170 -164 182 -14 -17 -12 -43 165 -291 58 160 268 -153 281 53 57 -115 63 377 -127
4939 -127 -118 189 195 -3 14 159 124 19 54 -328 67 -132 -4 -146 -183 157 -91 -139 55 -343 -154 -124 -18
4962 -18 213 -66 -224 -95 42 233 104 71 178 32 -189 -268 -45 -87 47 -138 93 -65 -156 -46 151 152
4984 152 57 109 26 166 151 225 -69 -67 8 19 73 272 160 -93 169 -37 209 -44 -132 17 -12 -11 -62 176 -108
5009 -108 -182 -145 48 38 38 192 -54 -37 -91 -132 49 89 185 -199 104 30 -195 -84 58 -100 -70 63 -140 -108
5033 -108 -296 -59 54 -16 131 -55 -155 -14 53 346 -105 -381 -58 -260 -63 -28 139 53 33 -65 -151 -27
5055b7j10N3k07K22K39R1j38m05L75j2j87P2N6K20o5k31k2r1J66K56l84L45p0
5078A46n8j58J25j48P3K91k30j67J15L40l97K32j68j01j5K94j5l83J71L17k73
5099ij30J43K29l28P8J04k78J65J36j82J51Q6j86r6RJ32O0m12M40p5q4k23J52
5122a18p2K40l0K02j10m06L93j82l26K88j2L4J69j38K7OJ11m3k0K4m8J1L5k5L2
5147D2p7K82j05r2R1J10j51k7k6R2j79J56r2q4J47R0k04Kk28R5p6J11K21M8l15
5172a69p6L38q7J59l84J32J01K1j69J97J26k1j94j00J29M4pj83K37j27j09J13
5194b9NJ5l00K00m2J19j16j2J90n0k79L74j08n6k0N3P4k64J28K03l87M08O9n3
5218A22J22k24J51j79K24m1j0m25K65K47r6j84M20r8k39R9l29J27R0K61j64k3
$$ plain form
5055 -27 -137 -84 -291 -69 170 261 123 -282 93 81 -106 -34 22 242 177 -54 -76 -167 -1 255 -129 216 146
5078 146 88 -70 55 -93 -20 271 41 -126 -11 329 -68 164 -4 -105 -120 174 159 -224 -53 264 -9
5099 -9 -139 4 233 -95 -17 87 -191 -26 110 -72 79 165 -21 -117 -108 24 84 -328 112 37 -47 -270 -118
5122 -118 -190 50 20 222 112 -294 99 -83 -409 -121 -133 -99 70 -68 -41 -35 76 33 13 37 -11 0 35 10 42
5147 42 -35 247 142 50 141 251 100 73 47 139 -40 116 24 -60 87 177 -27 -25 -253 -158 -234 -123 98 146 -169
5172 -169 -245 93 6 165 -219 -87 14 35 -134 63 189 168 -26 -126 3 47 40 -143 94 -33 -142 -29
5194 -29 -24 -9 -309 -109 -151 -32 -148 -160 30 -20 -299 75 -33 -89 -109 -56 18 -246 -118 85 -302 106 175 122
5218 122 244 20 171 -8 216 175 165 -260 5 252 156 -28 392 294 55 154 -175 -48 42 303 139 116
5240A16j13j87k6J26K28k2J0j30Pl75J79K65j77K2J87j99J46j53J93q7J1j82J36
5263b5J3J03j85j62M15m4R2k79J49j90J18q3K99J86n34K95j18m6m7n3K37j44j7
5286b0q8j22J67K41k31k6k1J61q9q7P2L38q2l62L87l10j41P1M40o0j59R2j45J54
5310A80j44nr6K7J84k2QK51n25M27j35j57P8j39k6NJ75j1L0k37J88k45J61K30
5334B02o5j71K41r8j39N7K66k63j44l2m9K52k11J34J44m46K33%P8k8K31k5k41
5357g4l81K65J15o1J39l1j27K25p2rk8j17J64K0j09KK36j75Q4l66M00m2j10K46
5381A94o08K60K73m2j8o5J69k30M5J81j64j7J53k09J64J89j71l82L19J89m79K22
5403b7K97m65o1J54p4L83k71j60K72j16j52M01k47j99K94q5K53l81L29p1k53J32
$$ plain form
5240 116 3 -184 -210 -84 144 122 132 2 9 -366 -187 78 -99 -77 110 -89 57 -96 97 10 21 -161 -25
5263 -25 -12 91 -94 -256 159 115 207 -72 77 -113 5 -78 221 407 -127 168 50 4 -43 -96 141 -3 -20
5286 -20 -108 -230 -63 178 -53 -79 -100 61 -28 -115 -43 295 213 -149 238 -72 -213 -142 298 238 79 171 26 180
5310 180 36 31 -65 -38 146 124 132 383 -142 285 150 -7 71 -68 -94 -89 86 75 105 -132 56 -189 -28 202
5334 202 137 -34 207 109 -30 27 293 30 -114 -146 -195 57 -154 -20 124 -322 -89 -89 -11 -39 192 167 -74
5357 -74 -455 -190 -75 -136 3 -28 -155 70 -2 -11 -39 -156 8 28 -81 -79 157 -18 66 -300 100 58 -52 194
5381 194 -414 -154 119 77 59 -6 163 -67 -22 159 -5 -22 131 -78 86 275 104 -278 41 230 -249 -27
5403 -27 270 -195 -256 -102 -176 207 -64 -224 48 -68 -220 181 -66 -265 29 -56 197 -184 145 74 -179 -47
5425d7j1N5j01Q5k37M07l0l06J26L07l27R8J26o5r2O7j07K5ON5j66k0K41j96J99
5450I2k55L23J02j88j13oJ25q3J99k46J71k49L4K23k11J44J1N3k99M82l37L1j90
5473a87L07N4m2k10j15K29j98R0j91J31J14K19n21L73l40K25k30K54P2P7l28J51
5495f6lJ85k61J16j27K44j15j6R0q4K65n14K32q9J72l06J91j1L84m70K2O6m9L32
5519A88j70Qj23o6K55Q7J2k04R0R2j43P1j00J62j8l8k1K3J10k03o8J43J67j95
5543E9q5J30J02l01J19L4J86Lj67k26J86p4j68M3J50j31J0l5J06K38k82K46n25
5566c82K18J87k47J26l6NJ17k14L47k56J48J4J78k86J24m5J40l9J07k26J95l18
5588a43J6K21J8J78k28j25K61M5m06j70K07K19O6m8J19j96Mk1j35J25j69r3P16
$$ plain form
5425 -47 -58 -3 -104 -19 -256 151 121 -185 -59 248 -79 19 145 80 -12 55 -52 -27 -21 34 -132 -152 89 -107 92
5450 92 -163 160 262 74 -39 -45 80 -3 196 -50 121 -128 -94 129 -82 62 73 126 -173 309 -28 3 -187
5473 -187 120 174 132 -78 -193 36 -162 -72 -263 -132 -18 201 -320 53 -287 -62 -292 -38 34 111 -217 -66
5495 -66 -69 116 -145 -29 -156 88 -27 -43 47 -37 228 -286 -54 -143 29 -277 -86 -97 287 -183 -161 -95 -144 188
5519 188 18 26 -97 -163 92 179 191 -13 77 169 26 97 -3 159 141 103 82 105 215 12 -56 87 254 59
5543 59 -26 104 206 -95 24 58 244 247 80 -146 40 -34 -202 -159 -9 -140 -130 -165 -59 179 -103 143 -382
5566 -382 -164 23 -224 -98 -134 -129 -12 -226 121 -135 13 27 205 -81 43 -2 138 99 206 -20 175 -143
5588 -143 -127 94 112 290 62 -63 198 243 -163 -333 -126 93 159 111 230 34 38 17 -118 7 -162 -255 461
5611D61n00L8j04K53r9J77k12J79j47M8p7L46l63k03K5O9K49J88k52J48j52k85
5633b13L32k59p9K99j53J05m6j95P0J08K2N5k92j5K88q6o8K98j47L3K57l75J20
5656E9mj40N6Kn7j6J53n2J0J00N3O6p5j49K6n9j21J49kK77j61j68j2K83J43l18
5682D3j58K95pl58K68p5q1J40q9J31K65m50L45k67j0j32L58l40J13N6J55o9n7
5705G6K7P9l35Mj9K82k42R2k90K41J21J49k07L8j35Q5J36k29M8j55N0J89J42m3
5729A04M7rj93k6K4Q5J8J63k56j65M29k63P5p8N8LP3J1J13k09o5j16Q3J43n8L86
5755C77j22j97N4J14l00J38K8p0p8K02L1j03j22o0k5O7%J81j90J07L0J34J5l20
5779a09L7k1K29k36P2n7M5L3J70k50O7%J4j40K68n4j77M6J90o8j10P9q3J8M15
$$ plain form
5611 461 -39 -1 -105 148 49 226 14 193 46 94 17 363 0 -203 -178 -109 140 328 76 224 72 -213
5633 -213 119 -140 -219 80 -73 32 -14 -209 -139 -31 -9 46 -246 -261 27 -59 -127 171 24 57 314 -61 59
5656 59 55 -85 -29 -27 -84 -100 53 1 11 111 164 230 155 6 32 -27 -148 1 -1 276 115 -53 -65 218 361 43
5682 43 -115 180 173 -185 83 8 -73 67 -22 109 374 -76 269 2 -8 -140 218 -122 -9 47 202 133 76
5705 76 103 182 -153 -149 -168 114 -128 -36 -326 -85 36 185 -22 16 -119 -34 102 -127 -79 -234 -184 5 147 104
5729 104 151 142 -51 -77 -53 32 50 213 -43 -208 221 -42 33 -45 13 16 89 100 213 4 -61 -177 -94 49 -9 377
5755 377 255 58 112 226 -74 64 92 22 -56 146 177 74 -48 -108 -133 -66 -66 115 -75 32 62 196 211 -109
5779 -109 -72 -93 136 -100 -28 -85 -40 -7 163 -87 -20 -20 -6 -146 122 68 -109 -63 127 59 -51 28 -55 -37 378
5804C78m02J5l2kK41k76j26J84k82K44M33m68R6J45O3q8k42j72N87k45J24j39
5826C6O8m4k6K5k55L57k29L6l69P49j41m87J15J98p4l4J32k29L18j30j1j34K14
5849H5mk54L63k13ro7j6J28o8j02K28m3q4j20J58k3j41J95J1k71L07k18j17M56
5873A81k17N7m87L44m9K60k90J05K76j94j30K8K49j60l04M45J47K3l58O8NJ18
5895A17j45L32l48J39j23L61k57%k17J73K2n8j50J88j19K21p5k1ql8j8n5Qq6J39
5920a8j01j60K12R6r6K33j16nk29OL79k80J06j59J50j66j04L51p2j93L11j6j77
5943d8k1J45j05o2J72k41Q3J37L6m26L66rn2j01J53m2q5p4J00lK08j58lK72k76
5968c4k69L55k16N24n05J35j83J30K33m35L88N3k56K64j23R7J20k65K28k97J54
$$ plain form
5804 378 -24 -9 -41 -43 198 -78 -204 -20 -302 -58 375 -93 3 148 211 123 -119 -291 296 51 175 36
5826 36 104 60 34 59 -196 161 -68 -32 -401 348 207 -280 -165 33 -41 -75 57 -172 146 16 5 -129 85
5849 85 81 -173 190 -23 -32 -99 -115 13 -55 -157 71 28 -56 -176 -18 -41 -182 13 24 -247 60 -158 -275 181
5873 181 -36 21 -466 -122 -171 89 -201 -96 180 -14 -144 -116 133 -27 -331 114 261 284 -74 -6 -1 117
5895 117 -28 304 -44 95 -28 333 76 76 -141 32 54 -4 -154 34 -85 136 61 40 32 -6 -24 -79 -71 -157 -18
5920 -18 -119 -279 -67 29 -67 166 50 45 -184 -178 201 -79 27 -132 18 -148 -252 99 27 -166 145 129 -48
5943 -48 -69 76 -29 -91 81 -160 -77 60 96 -330 36 27 -25 -126 27 -15 -100 -174 -74 -77 131 -27 -30 242 -34
5968 -34 -303 52 -164 360 -145 -10 -193 -63 170 -265 123 176 -80 184 61 158 278 13 241 -56 98
5989I8p5m7J44K29k62j75J64r1J07j33j01j3j38J13R3j29K70l57K93M2j09N4J60
6012A37k38O8j1l01J15K09p7ML9j40M05J39n71M7J64J20j60k87K59N6L10j14l75
6035b02p4K44P1j30J49j59P5n9o1O3K88l32O2j12K0L41l26K49p8o4j02J83J05
6058A51o8j76J7L87l21N8J2k74J53j73K77l08K35K65l43K35K8k64J89k01n1M7
6080a25M1n2L03O7l21L65l10j61J84N3k20O8j53L63j6o7j73L48l44j30J11J16
6102e3k1J76k84K28N8j79J27k33M9P8J30j18J23L8J12m19K90o3m1n9J36k75J08
6125i2J1OJ35Oj38K37l3N6j40j7J53p9j40JK04j8k37K74%j66q0J3J54j45rJ89
6151A45l22K36j04R7j74m1l5N9J41N7o6r0kk18J38K07l00M25k60M7j12J11j52
$$ plain form
5989 98 23 -24 120 349 87 -88 76 -15 92 -41 -142 -155 -293 -180 -87 -216 54 -303 -10 32 -77 -23 137
6012 137 -101 -33 -44 -345 -230 -21 -98 -94 -55 -195 210 349 -222 -175 -11 109 -51 -338 -79 -23 287 173 -202
6035 -202 -276 -32 39 -91 58 -101 -26 -85 -146 -83 205 -127 -65 -177 -157 184 -142 107 29 -35 -137 46 151
6058 151 83 -93 -76 311 -10 48 60 -214 -61 -234 43 -265 -30 235 -108 127 155 -109 80 -121 -172 -125
6080 -125 -84 -136 167 234 -87 278 -32 -193 -9 44 -176 -108 -261 102 86 19 -154 194 -150 -280 -169 -53
6102 -53 -74 102 -182 46 104 -75 52 -181 -132 -54 76 -42 81 119 231 -188 102 39 -2 -61 75 -200 -92
6125 -92 -81 -75 60 66 -72 165 132 188 48 31 184 105 -35 -34 170 152 -85 189 189 23 -57 -44 110 -35 -44 145
6151 145 -177 59 -45 52 -122 -163 -198 -139 2 59 -7 -97 -99 -317 -179 28 -272 153 -107 -60 -172 -61 -213
6174b13N6j17L47L7O2n7j94L72k46j51J27l51J97M0J30M7o6k9K58k50p2L32n21
6197b62K52J16k01J4J22l20N0J26J0J30q7k0J10M4m3l17J69L3L24j63q4K28k12
6220A9l6k41M24l5O0j32Lj54K28N4k27Q7K78m31Q7r1K71M4j44j45j9k3k17K85
6244e5o2mM7KJ59J05j15q7j6K13l79J41l1J02Q2l1J0Q8j79L99k71k59K50o4K24
6269B69l07K33J66l29J1O1k43J08J95j07J15k91r6R7M8J01NQ0l53M32k53J9lO6
6293B4M1o4Pq1o2J73n9j72k6K53j11j59L56L1j71O6J21j41J49k61J99k74L16n8
6317I7J13l55J62R4k35J66J02r4j43j03j00J67J83R7K3m55L18jl73L27L0j9R7
6340I8j7P1j33K5l4Q4p8J27K5j07l15J87J47j00K90k86q0L06j52k34K87k34K08
$$ plain form
6174 -213 -157 -274 73 110 172 115 -79 293 47 -104 23 -328 -131 -91 39 86 20 -9 249 -1 -73 259 -262
6197 -262 -10 106 -95 -81 41 -279 -229 -103 -93 37 -50 -70 40 84 41 -276 -107 -74 250 87 3 231 19
6220 19 -17 -258 166 131 191 59 62 -92 136 190 -37 50 328 -103 -16 -107 164 208 64 -81 -100 -123 -340 -55
6244 -55 -117 -121 -74 -72 87 192 77 -10 -26 187 -192 -51 -82 20 102 71 81 169 -10 389 118 -141 109 45 269
6269 269 -38 195 361 32 43 104 -139 -31 164 57 172 -119 -215 -118 -70 31 36 116 -237 195 -58 -39 -42 24
6293 24 65 1 8 -73 -135 38 -21 -193 -219 34 -77 -236 120 151 -20 46 167 26 175 -86 113 -161 155 97
6317 97 210 -145 17 111 -124 42 144 50 -93 -196 -296 -129 54 151 174 -281 37 36 -337 -10 20 1 98
6340 98 81 152 19 44 10 94 16 143 168 61 -254 -67 80 -20 270 -16 -96 210 58 -176 111 -123 85
6363H5k69J63K43J9n23L64K7M3K39m79Q5J60l41J78J5k20L56j43m2K86n22K49
6385b7q8L8O8K6r0M9J34m26J96K82j06k6Q5m26J78J90j25M4R3k02K09o5p2J6N4
6410Ik18K30j56j6j00L91M3j04J01j32l0P0j28O4K62k91j77K58j55K32o0lL4j11
6434A3j14J53j68J26oK07j80m32M70N2j40k2j41J3O2K5km5J9k20K30j23L45m1
6458H1R3l31P2K30j47J29k74J88J7j50qK8QL27l75K6N3q7O1r7J45j07J54jN3O9
6484A57j60P3j82K22k02j04K58k5k10J20Q9K3K3k07Qn9L21k16J22j55K30j06j5
6507En3J87J02k32L45k87j24n9O3J30j06j71Q0L7J19J60q0k01N8n0k8L71m04l4
6531a72L45k29lL57m76J70O9M5J93k36OJ6j22n9j10J9K12m9o8o0Q6N5M5l8O3k98
$$ plain form
6363 85 -184 -21 222 241 -282 82 109 152 391 -88 -3 157 -184 -6 9 -211 145 2 -40 246 -276 -27
6385 -27 -115 -77 -9 17 -73 -24 110 -316 -120 162 56 30 115 -311 -133 57 -68 -24 69 -133 76 11 -61 -45 9
6410 9 -209 21 -135 -151 -251 140 183 79 180 48 18 88 -40 24 286 -5 -182 76 -79 153 93 90 124 13
6434 13 -101 52 -116 10 4 211 31 -401 69 121 -19 -41 -182 -169 -107 -82 -84 -129 -110 -330 -100 -223 122 81
6458 81 174 -157 -85 145 -2 127 -147 41 58 -92 -100 -72 -64 263 -112 -86 -33 -120 -59 -156 -11 -118 36 35 88 157
6484 157 -3 70 -112 110 -92 -196 62 37 -173 -53 36 59 82 -125 -117 -176 145 -71 51 -104 126 20 5
6507 5 -48 139 241 9 354 67 -57 -116 -53 77 -29 -200 -120 -83 36 196 116 -85 -27 -77 -105 266 -138 -172
6531 -172 173 -56 -59 298 -178 -8 61 106 299 63 69 85 -37 -96 -206 -187 25 -24 -92 -152 -66 -11 34 -4 59 -239
6557b39K00J58j21P0q3K36l69Q4j27J89J23j05K23m0r7m6n8K03j16j56N2J80l33
6580a72K91k43K54k59J04K40j52r4P9K60j30l08M21k83J79j64j95K22J41k12P
6601a4J39k08O6L2k36L2L93k16j49M53l9j54j41J92j12n9j59K47K2r3k01R2j06
6624b19J46N1O5j30K8K2k07N98m33J03M0n7q8K6n0K23j31o3l6J35k54L18j9n9
6648IJ94j90N6O6m33K98J07k90L49n4M3q5Q7j79r9J40M7J55j87M6j37J5j18O3
6672i7J42q4L61k64J42k90k2r1R6Q0l1p0qP7J48p8K5j47K21q2j14P4l37N03j18
6697C6k51J90J72k30L47l07j44K39kj18j48L39j37K89k95J30J26k39J60l76L06
6718H7j35k3j09K35o0j33Q4J98k11j81O2J37J31J7J00j76L3M9K52j51m23M01k23
$$ plain form
6557 -239 -39 119 -2 68 -15 221 -148 -64 -191 -2 121 16 239 199 102 56 -2 201 85 -71 -19 161 -172
6580 -172 119 -124 130 -129 -25 215 63 -31 48 308 178 -130 291 8 187 23 -172 50 191 -21 -14
6601 -14 125 -83 -17 15 -221 -189 204 -12 -161 292 253 99 -42 150 38 -21 -180 67 89 -4 -205 -113 -219
6624 -219 -73 -22 43 -87 -59 -37 -244 354 -79 24 64 7 -81 -55 -105 118 -13 -76 -112 23 -231 87 68 9
6648 9 203 13 69 135 -298 0 107 -183 166 112 155 70 157 -22 -121 19 66 221 34 80 -57 -42 -160 -97
6672 -97 45 -39 322 58 200 -90 -112 -203 -107 -27 -58 -128 -136 -59 89 11 36 -111 110 28 -86 -12 -349 154 36
6697 36 -215 -25 147 -83 264 -43 -187 52 50 -68 -216 123 -14 275 -20 110 236 -3 157 -219 87
6718 87 -48 -71 -180 55 -5 -138 -54 144 -67 -248 -186 -49 82 99 199 23 56 105 357 206 -217 184 -39
6741c9J67j50oj37K01N1Jk51P7K03k4k29L0J79l83M02j27oP3j8p1j14J04J0m0
6766i7o9n9J70N3n7J81O3l86J41J81k7l27R7J02K1m0K67o3J00k32k2j32L05j09
6790F1M4r3K0j94J19J66o8j52J82M6M6j74Q8k3N8p1p7N5M7j21K69r6n5M4J89k43
6816F7j91J16Q8J08p2j96J71O8m73K01M80j73j01q9k95Q5K65l5n7op6j36J62K64
6840A75l67L24k10J40j76lL71k57Mj53J33j00J6J1L05j29k83l2J38j59K03O8j79
6863a60M6j08K96l30M15M6J9L3l36L4J13l4o0r9K25J08q8K4j64K41j69R5k21J92
6887A18k32mQ8M0pL8k09R7K7Q4K86l66J85R3k21K7P1j22P0k18L33J46l97j48J14
6912a07J99pJ12j94n1J64k23J31q5j6J3j5j65J90J60K3K01m86J75j46K4NN8K31
$$ plain form
6741 -39 128 -22 -28 -165 36 87 88 -163 -86 117 93 -136 -106 73 -310 92 -35 -41 32 14 -57 -171 -67 -57 -97
6766 -97 -166 -225 -55 -2 -59 122 185 -201 -60 121 94 -233 -136 -34 -13 -53 214 151 251 19 -3 -135 170 61
6790 61 105 12 32 -162 -43 123 55 -97 85 131 177 3 91 68 126 55 -22 33 80 -41 228 132 77 121 310 67
6816 67 -124 -8 80 188 116 -80 91 159 -314 -113 367 194 93 4 -291 -206 59 24 -33 -39 -115 -251 -89 175
6840 175 -192 132 -78 62 -114 -117 254 -3 1 -152 -19 -119 -103 -92 213 84 -199 -231 -93 -252 -49 19 -160
6863 -160 -114 -222 74 -256 159 205 224 257 -79 -45 68 34 -26 -125 100 208 120 144 -20 221 52 147 -74 118
6887 118 -114 -118 -30 10 3 41 -168 -71 -44 40 326 -40 145 238 17 44 115 -7 63 -155 178 324 -73 -221 -107
6912 -107 92 85 197 3 -48 116 -107 24 -61 -77 -64 -79 -244 -54 106 129 330 -156 19 -127 -103 -98 -40 191
6936A91l01J87k5kn9J14l76L34J15k1n6J09j84J34j03l3n6M1lR8j53J07q7J31
6960A02J91j83K0j19Q4j96K57j28j05J5k7M23k94r6J2K24j39j78J85%l48L71k69
6983a98K48l9q5lk6K34j56j84O8Q0N3r2j22O9J40N0k57L43r3j84L13n6q7j35K11
7008I2p2k22J54M1jK5j14j71L14k13k9M54m27L47O1k05lL9l4q4K2N3L7J91k56
7033ap5k4J28j6R3j60J24J07j57J9j75J90J41j48l9J46l23K11j28N6O3l2L4oJ12
7058A40k09K47j31J22j49n0l0K40q2O8m49K89N4J2N2k04J10k0K31l7k52n0J89
7081I1k15%L27j26PK42k73j76R6j54K40K3l12J77n3Q9Q4j03R3j24J42N2j16m6
7105c5k32K64J15J85j65L4k71j49L75r6j93K41K7j04M9j28R8j77L04Q8j14k22
$$ plain form
6936 191 -110 77 52 50 -9 105 -271 63 178 157 101 210 26 160 57 24 -32 9 6 104 -49 58 -29 102
6960 102 293 110 130 11 95 -101 156 28 -77 -62 -89 334 40 -56 -44 180 41 -137 48 48 -300 71 -198
6983 -198 50 11 -74 -77 -103 131 -25 -209 -141 -61 -8 -100 -222 -153 -13 37 -220 123 30 -154 159 103 16 -119 92
7008 92 20 -202 -48 -7 -8 17 -97 -268 46 -167 -196 258 -169 178 239 34 31 70 36 -48 -26 27 64 255 -1
7033 -1 -76 -100 28 12 105 -55 69 176 19 38 -137 53 194 46 7 153 -170 41 -87 -31 32 0 34 28 140
7058 140 -69 178 47 169 20 -30 -60 180 98 166 -283 6 60 72 124 -80 30 10 241 204 -48 -98 91
7081 91 -124 -124 203 77 84 326 53 -123 -27 -181 59 82 -230 -53 -106 -17 67 -36 57 -67 75 127 11 -35
7105 -35 -267 -3 112 297 132 166 -105 -254 121 25 -168 73 100 -4 45 -83 15 -162 142 230 116 -106
7127a06J54j89J81q1l1K38q7k28N6K23j54R8j98K09J12k9k12L8j17O8M8k52J40
7150a19J2J50j9J50j17M0j36Q9n6j86J71j45p3L52q1o7J49J22m01n5K58N6k82
7173a88K22j70J7J48r1R8l2J45R0j22k8k57L78nj82p1J36k44J65J34k77J77j64
7196a21K74k04O9p2RJ34R8l31J5J48L9j80Q9J60N4l9j00R6p0n3p9K60r3j09O6
7221F0r4j73k6L12k09n1R0Q2K26l52K93Q3Lk01j65Jo6OJ00P8R9j11J67j18k4j31
7247a21L56k45j2p0J35k06O3J57m8n8jK66l66Q9J26j50L56l45L2N8p9J57j18J09
7271H5N9j96K35J0R3p7j40J85l04n7L7K02l19P8q5L30m52K32k7L25l13mJ14J67
7295A78p2k30J38J56m05K69j70K92l60J44K7j96L19l78M57Qk88J59%J53k3j32
$$ plain form
7127 -106 48 -141 40 -41 -72 166 79 -149 -93 130 -24 74 -124 85 197 168 -44 -6 -123 -55 -7 -259 -119
7150 -119 -107 43 24 174 57 97 -39 50 -6 -192 -21 -166 -239 113 32 -35 114 236 -165 -220 38 94 -188
7173 -188 34 -136 -119 29 -62 36 4 149 239 117 89 -168 210 205 23 -48 88 -156 9 143 -134 43 -121
7196 -121 153 -51 18 -54 -45 89 187 -144 -129 19 58 -122 -33 127 181 142 42 138 68 15 -64 196 103 -6 60
7221 60 -34 -207 -233 79 -130 -181 -91 -9 217 -135 158 241 244 43 -122 -121 -187 -181 -81 -3 96 -15 152 34 10 -121
7247 -121 235 -10 -22 -92 43 -163 -100 57 9 -49 -50 216 -150 -61 65 -85 271 -74 -42 16 -63 94 -24 85
7271 85 144 -52 183 193 286 209 69 254 -50 -107 -70 132 -187 -109 -194 136 -316 -84 -111 214 -99 -103 11 178
7295 178 106 -124 14 170 -235 34 -136 156 -204 -60 -33 -229 90 -288 169 177 -111 48 48 201 178 46
7317D6j66Q3M3m9N9l7L5qj13L8N5j66P1L35l22L4PM4oJ9j29K89j07O8k8k21K08
7344H2n8q7L5k2L0J09q1q0J31j08m7L08j69l41L44q2r1P9J6N3R3j27L9l9N4J49
7370A90r7j31oJ42m27L07n9p3K43k28L19l60J37j41J51L27k43q6J19k06J71M6
7392I5r4qJ98j88R2l09K03N7m0r2l7Q9J08rj50J97k16k3J00J84qq4k96J30J98
7417I7R9p4m8l9j18K26O5j45j95M44k12j19n2K19j65J22j99k8l6J67J25o9Lr0
7441b2n6M7j16J38k61K25K87k75O9k36K12J3k84lK82l25L03r2pL9J80k85M2J33
7465HL1j42L7K38j31r6L5J90l54P3J99P9k55O3l8Q4M4l8L5p5j76J43K25n45K25
7490a41J11J01J04l45K82k90L45m2o5j01J66k39L93j66Ql94P4M08k07j57p5M32
$$ plain form
7317 46 -120 -37 6 -43 16 -21 14 6 -107 -69 -14 -180 -109 226 -96 -62 -55 -11 -17 2 -127 162 55 123 95 -126 82
7344 82 24 -63 -28 -50 -20 89 8 -72 59 -49 -96 212 43 -298 46 -36 -127 -48 -32 21 114 -13 26 -13 41 190
7370 190 93 -38 -44 98 -329 -22 -81 -154 89 -139 180 -180 -43 -184 -33 294 51 -35 84 -122 49 95
7392 95 1 -7 191 3 95 -214 -11 46 6 -86 -123 -34 74 65 -85 112 -104 -127 -27 157 149 65 -231 -101 97
7417 97 196 122 74 35 -83 143 208 63 -132 312 100 -19 -71 148 -17 105 -94 -122 -158 9 134 65 68 -22
7441 -22 -78 -31 -147 -9 -270 -45 242 -33 36 -200 12 25 -259 -262 20 -305 -2 -94 -101 -62 118 -167 -125 8
7465 8 39 -103 -66 172 41 -55 -20 170 -184 -111 88 167 -88 -25 -63 21 65 27 62 -13 -189 -46 179 -366 -141
7490 -141 -30 71 175 -170 112 -178 167 125 60 -41 125 -114 279 113 121 -273 -199 209 2 -155 -230 202
7512B02nk84J64M8l38J15o5J18l9O3P4r0LJ0q0R1j38J65o2P2j67K54k98K95k2
7537H6r5Q9k8J11j80j11rJ90j31r2K06o6P6k73J10O7K40q0K3j0j93n7j35K94j7
7562A5j61m1L07k71n6K39R5j90K68q4J00j62r8J47l66N23l03Q2N9j95L05j95q3
7585f5j43L02o4n4J35J3j91J89k10J92o0q7o9k25L82k9l1K25j31qJ01n39M83l10
7609a94J92m7j7J3J4j24N4M5K7J55j8j95j6p2L80m32Q4J27j2j77M22j06j73J13
7633D3p6L5J11m5o1k3k2j23L15P0l93L06Lk58P2M4m0J38j71Q1k59J21l3J88j99
7658a76J67N8j06o1O1J25k04o9L51l67K27N2r6m4l56N31j49J73qj13R0j70J62
7681G8j93N3P8rj91%J13n6J78Q9j35j80J54j43L56k8k58K78k1l52L6J67q9K13
$$ plain form
7512 202 197 -87 77 125 -213 -98 -163 -45 -84 -21 53 -37 -34 -24 -104 -13 -151 14 -48 24 -143 111 -187 108 86
7537 86 -9 80 52 163 -17 -128 -137 53 -78 -170 36 -30 46 -227 -117 -50 190 110 133 123 -70 -127 -262 32 15
7562 15 -146 -187 120 -151 -207 32 127 -63 205 121 221 59 -39 108 -258 265 -38 44 103 -92 213 18 -65
7585 -65 -208 94 30 -24 111 124 -67 122 -88 104 44 -43 -112 -337 45 16 -15 210 79 71 172 -367 116 -194
7609 -194 -2 -49 -66 -53 -39 -163 -109 -64 -37 118 100 -95 -111 -183 197 -235 -151 -24 -36 -213 209 103 -70 43
7633 43 -33 2 113 68 7 -16 -38 -161 154 224 -169 137 140 -118 -46 -2 -42 96 -75 6 -253 -132 -165 23 -176
7658 -176 -9 49 -57 -118 -57 68 -136 -205 146 -221 6 58 -38 -82 -438 93 -56 117 109 -4 86 -84 78
7681 78 -115 -62 16 7 -184 -184 -71 -127 51 140 5 -175 -21 -164 192 164 -94 184 163 -189 -153 14 -75 138
7705A38m4j25lL02l53K94j79j53L0J31j08j23pm9J73K1L8p6n3p1J69Q2oR3k22
7730a01K55p3j8J15j51J17l98J94J60K65m79j61o5K12K23l4pj41J03j64K88j58
7752a8J8l75L59K58j71l78L45m0j80Q9Q6R4k29l4N02m97P5K11j89%K27j35j2R8
7776A04j76R4N3j48L4q9nJ46j00K10k3k3j4j1J22k27J71K31k41K8k13L53m92O7
7800a49J06J67j48m0L23k54pl00KM60r6Q7j89p8J02O1kj58O9K04k52M7J13l5l1
7825Bk7M0j62L63k90J08m0j95N6P5n4%J68j6j07J35R8j70O6k01O2K39l19K79l10
7850b00mJ73j96L11k34J48j57P3O3J50R5k68J21P3j17N4L8l7K18r2l45nK98j42
7874A8J38j48J27m01J51J07J60j00j6m7j4J31k25J42j69J64N8N6l00K19l1q8n2
$$ plain form
7705 138 94 -31 -34 268 -85 209 30 -123 -93 38 -70 -193 -200 -249 -76 -55 -17 -93 -146 -217 -48 34 28 121 -101
7730 -101 154 81 63 178 27 144 -254 -60 100 365 -114 -275 -340 -128 95 61 54 -87 16 -148 140 -18
7752 -18 0 -375 -16 242 71 -307 38 -2 -182 -93 -7 87 -142 -176 326 -171 -96 115 -74 -74 153 18 6 104
7776 104 -72 22 75 -73 -39 -128 -133 13 -87 123 100 77 63 52 174 -53 118 349 108 136 -77 276 -216 -149
7800 -149 -43 124 -24 -64 259 5 -2 -302 -300 160 64 151 -38 -116 -14 47 45 -113 -44 160 -92 -45 68 33 2
7825 2 -25 15 -147 216 -74 34 -6 -201 -145 -70 -124 -124 44 28 -79 56 154 -16 50 -151 -89 150 -169 110 -200
7850 -200 -204 -31 -227 84 -150 -2 -159 -86 -23 127 222 -46 75 148 31 85 123 86 304 212 -133 -138 160 18
7874 18 156 8 135 -266 -115 -8 152 52 36 -11 -25 106 -119 23 -146 18 76 132 -168 51 20 -68 -120
7897a20J99k26J48p6K89l13J31J45j47J01j58k28P4K03Q4q3k21N4K12K9l54J44
7919a13L83j73q7o3M1J35j7k6j75l43M48R0RN3k02r5K09q3n1J65j45Op7M04n1
7944B42p5k36K22k12j21P1M0J82j27J6j70O7K57j28j46L3L76l50L2qr7J07Q8k5
7968C8J27j80J41j50m2Pj32RQ0L15k27O9k8j9N8k8lK28m00J87J47j51l1j77K26
7993F4n1j70K39k22K32j73m5M0J35R1p6j49J54j33K50j16P9l00O5J87Oq6l20L65
8017F6Mk27O1J0j49J51K75j98n4P7L9q0K6K19j74r8p4J32J72q1r1Q3l42M62l21
8042a12K32q4j9j39O7Q3l7Q0j93J54j13o5Q9j10M5J82k40K60J36k70Om1r9L63
8066A75k71N2k8l9J43Q1J1j71j08R4J20%n1L3j47o4n8L56j15K5k39L53P0j86k61
$$ plain form
7897 -120 79 -147 1 -75 214 -99 32 177 30 131 -27 -255 -181 22 106 23 -198 -144 68 97 -257 -113
7919 -113 270 97 10 -53 -12 123 106 80 -95 -438 10 100 109 162 -40 -135 74 -9 -60 105 -40 -34 -111 293 242
7944 242 167 -69 153 -59 -180 -109 -69 113 -14 2 -168 -101 156 28 -118 -85 291 -59 -27 -35 -132 -25 63 38
7968 38 165 -15 126 -24 -66 -59 -191 -182 -102 213 -14 55 27 8 66 38 35 263 -137 50 197 46 15 -162 64
7993 64 13 -157 82 -140 92 -81 -126 -86 49 140 64 -85 69 -64 186 70 149 -151 -86 101 107 21 -299 66
8017 66 70 -157 -96 -86 -235 -84 191 -7 -61 16 55 -25 1 220 46 -52 -126 6 178 97 6 89 -253 209 -112
8042 -112 120 36 17 -122 -55 28 -9 71 -122 32 -81 -146 -57 -167 -122 60 -180 80 216 -54 -48 -89 -188 175
8066 175 -96 -44 -72 -111 32 113 124 -47 -155 -61 59 59 8 41 -106 -170 -228 128 13 38 -201 152 222 36 -225
8091b25K61j2J57k74P5l5j42J57J55J1P8L8k86J60l48K26j71L38j40P1j55R3J06
8114A38m8J08j79l4k2K01l61K14j89J7K2K06j24Q5q7J17n7j00M6Q4l5K01n9j13
8138C1k0mj8J3r4j59L97rk77J18k29L14L7j55J5K10j96L17l80J50K31r2q9j06
8162ER2j95J94N5j39O9p6oJ71j73J96m3m6Q6k88J34P0K74l89K44l35q5L00k46
8186a31J81j10J66k08Q9
$$ plain form
8091 -225 36 24 181 -93 -18 -53 -195 -38 117 128 206 244 -42 118 -230 -4 -175 163 23 94 -61 32 138
8114 138 90 198 19 -15 -37 164 -197 17 -172 -155 -133 73 -51 34 -53 64 7 -93 -47 37 2 203 144 31
8138 31 11 7 -11 2 -92 -251 146 137 -140 -22 -251 63 100 -55 -40 170 -26 291 -89 61 292 200 111 5
8162 5 97 -98 96 151 12 81 5 -1 170 -3 193 150 104 190 -98 36 106 380 -9 235 -100 -185 115 -131
8186 -131 50 -60 106 -102 -13
8191a3
$$ Imaginary data points
##PAGE= N=2
##DATA TABLE= (X++(I..I)), XYDATA
0@%%%%%%qJ6j6J6k4L4m2N6p2R6j20J44j76K16k64L12l68M32n04N92o90P97r18
29d91J056j210J378j564J771k002K256k534K838l172L540l940M376m853N376n947
45c122O570p249P990q805R699j0684J1771j2972J4309j5806J7491j9405K1602
58A1389k4150K7146l0725L5093m0564M7637n7164P0731r1658J28240k09323O69753
70E36405k33798j258856J477323l02673o09619M84879j23436J70622n0780m89873
80c99806Q18880l05134o40816Q96380k21889o13870O87787p6393l13702J54489
90a4074N5075J54899l45394p9232O26881m85950k53670O45420k97609j82857L16327
101A39816k16260J27511M984k38493L20568j47390j36002L30638l19010P0444
$$ plain form
0 0 0 0 0 0 0 0 -8 8 -8 8 -16 18 -24 32 -40 56 -64 80 -96 120 -144 168 -200 232 -272 320 -370 427 -491
29 -491 565 -645 733 -831 940 -1062 1194 -1340 1498 -1674 1866 -2074 2302 -2551 2825 -3122
45 -3122 3448 -3801 4189 -4616 5083 -5601 6170 -6802 7507 -8299 9192 -10213 11389
58 11389 -12761 14385 -16340 18753 -21811 25826 -31338 39393 -52265 75975 -133348 536405
70 536405 302607 -956249 521074 218401 -391218 93661 -29775 140847 90067 -399806
80 -399806 419074 113940 -526876 369504 147615 -466255 221532 145139 -168563 -14074
90 -14074 41001 195900 -149494 -228726 398155 -87795 -341465 303955 6346 -176511 139816
101 139816 -76444 51067 56051 -182442 138126 -9264 -145266 185372 -133638 -63194
111f3194L24281m74122J62673K83347m11533J96098M1417j99709L27128k67786
121h1400q6438M62516m18761l5389M34007m31617P6864L03548m01935J53329J91666
132A66390k82040J25205K2595p7000J52685j90672M043K48710j99426q9719J81223
143F1994J6809j04812p0273J62458L5928k33526J33623J03615j86119J02366J6831
154C8894j00335J19798n2695l5181O8717r2859J12901m871k11257K38702M4221
165A26035k88939J67153J13342j70527K4865K8414L1182n13j21363J25448L2596
176F7693j68790J39119K0204j69772J56467L3359j84410Q8548J03965r0782p7948
187h2347P9745J00981j34588o8333J79395k1565j40413P0941O7374m2843n8306
$$ plain form
111 -63194 261087 -213035 -50362 232985 -178548 17550 58967 -140742 186386 -81400
121 -81400 -167838 294678 -124083 -159472 274535 -157082 -80218 223330 -178605 -25276 166390
132 166390 -115650 9555 32150 -44850 107835 -82837 -78794 169916 -29510 -119229 61994
143 61994 78803 -26009 -96282 66176 102104 -131422 2201 105816 -80303 22063 38894
154 38894 -61441 58357 5662 -29519 39198 -53661 59240 54369 -156888 81814 126035
165 126035 -162904 4249 117591 -52936 -28071 343 31525 31012 -90351 35097 67693
176 67693 -101097 38022 58226 -111546 44921 78280 -106130 -17582 86383 -4399 -82347
187 -82347 -2602 98379 -36209 -104542 74853 53288 -87125 -16184 51190 8347 -49959
198d9959M2296O6167j00735J5557J00861j34073K5832J43761j67411q955J58721
209I2062r3326m4083M5514J6579L1682j02292J1593J46344j27940m4736J38444
220F9841p6809j4451O1906p4751L4061M7254o7501M827J9715K4343p595q4916
232f4076P9993N8655j25729J6375Q5535l6791l3683n028M7337J3943q1843M2932
244b380L6480o0166M2470j2960m3623Q0137k8282n6334O0098j1859L327l470n7106
257e3668R0977N551j21514Q0006N4626q5668J5559Q304J1173K8407q0092K5822
269b0517P5915p5668o626M5842l1869K6773j0560m1315O0007l953m1254J7629
281e596M748K0586j2867n1209N9790K5291p1783J5382L1531L9j4195l2589M1368
$$ plain form
198 -49959 -7663 58504 -42231 -26674 74187 -59886 -34054 109707 -57704 -66659 92062
209 92062 -1264 -45347 167 16746 48428 -53864 -42271 104073 -23867 -68603 69841
220 69841 -6968 -21419 40487 -34264 -203 47051 -20450 -15623 4092 28435 20840 -64076
232 -64076 15917 74572 -51157 -34782 50753 13962 -19721 -24749 22588 36531 -45312 -2380
244 -2380 34100 -26066 16404 3444 -40179 39958 11676 -44658 15440 3581 6908 3438 -53668
257 -53668 37309 42860 -78654 1352 55978 -29690 -14131 -5827 5346 33753 -46339 -20517
269 -20517 55398 -20270 -26896 18946 -12923 13850 3290 -38025 21982 18029 -23225 -5596
281 -5596 -848 19738 6871 -44338 15452 40743 -31040 -15658 15873 15912 1717 -30872 10496
294A0496K5709n9373J2805K5558j5129J9372l7897p2O4811m8693l1131N1292m413
307A3335p521j4686j4955O2054k4601n7841N8809Q429l3996J2305j3383J6271
319D220K5106n2594N056M3996j9720j7496l725K0655K1810m4383j4502N6987p710
332A7700m2127J0031K5643M821k9748p730L3456K635k7080k298J5861J4667j6689
345h58k6012L1578J7005l1235q385J8812J3901j0177k9254J8995L3729l3216j5681
358b0798K3969P343l017j9545l189L6117p347l6735J8281K1995o645k1919n367
371a6857L6194Q05m1581P979L4944p584k6810m632L5236N432m3891O667L6465
384B2367r957k6536M933K3387o24k6180O129J7831p067m261p395M399J6109r252
$$ plain form
294 10496 36205 -23168 -10363 15195 66 19438 -18459 -18531 46280 -2413 -33544 17748 13335
307 13335 5814 -8872 -23827 38227 13626 -44215 14594 23023 -10973 1332 -12051 4220
319 4220 29326 -23268 -18212 25784 6064 -11432 -15157 5498 27308 -17075 -31577 25410 17700
332 17700 -24427 -14396 11247 16068 -13680 -21410 12046 14681 -12399 -14697 1164 15831 -858
345 -858 -26870 4708 21713 -9522 -17907 905 14806 4629 -24625 -5630 28099 -5117 -20798
358 -20798 3171 10514 7497 -12048 -15237 20880 13533 -23202 -4921 17074 10429 -11490 -16857
371 -16857 19337 20142 -21439 -13460 21484 13900 -12910 -17542 17694 23126 -20765 -14098 22367
384 22367 12410 -14126 -9193 14194 13570 -12610 -6481 11350 4283 22 -7373 -2974 13135 3883
398C883j6155O059J6343N127l0860q231N2370j0007n7027K8831M6763l6900l4340
411c4144L4385K7113k9764k7842L2283K2396l2152j5998K9245P677k2374N07R274
424F06n56J177P60j3925N521K5692j9057k8757L5892J9040m3998k74L2205l033
438A1293j7953r340J9835J7196k7839j3486L0588M348j8881p145J2607J3720j1501
451C442j4744M444K4855k290m1834J5748N1462m1911l6417N5375O154l8357L469
464a0604J8167L482j0628j2966J5449R945j8397J754Q954q956L748J2534k3687
477a1205o504M3881j5377n1499M1007M2781o2375k0099O3221N83m9982L345L8276
490A6053L333l7378j0946N2763l057n7709K8784L8982m2457p204L3746j7957p248
$$ plain form
398 3883 -12272 -6213 10130 15257 -15603 -23834 28536 18529 -38498 -9667 37096 196 -34144
411 -34144 241 27354 -2410 -30252 2031 24427 -7725 -23723 5522 13199 -9175 -8668 606
424 606 50 1227 1987 -11938 -6417 19275 218 -28539 7353 26393 -17605 -17879 14326 11293
438 11293 -6660 -16000 3835 21031 -6808 -20294 10294 14642 -4239 -11384 1223 14943 3442
451 3442 -11302 -6858 17997 15707 -26127 -10379 41083 -828 -37245 18130 24284 -14073 -10604
464 -10604 7563 11045 417 -12549 2900 12845 -5552 -3798 5156 -3800 -52 12482 -11205
477 -11205 -17709 26172 10795 -40704 303 43084 -19291 -39390 23831 24414 -25568 -22223 16053
490 16053 19386 -17992 -28938 23825 20768 -36941 -8157 30825 -11632 -18836 14910 -3047 -10295
503a0295K1064j3046j4416K5680N730l2359P358K7059j1509j6431L922J2916J3037
516A8710k8174j5317N0210o849m7469K4430K7815k1249j2258K075J7540J0467
528A9931l5342l059M1256n695m1464J5516L6440k6097k3377L1513M076k6729J7716
541D685L269k1576J9824Q681k9453N371K5603r349k1013K46L2335j199m8803J7775
555a3604N2775l9003m1402N3588J8054n1840J563M0520j7033j9386K0784o660
567a644n295J7993j5468j3223K7226q87j9361J16J0123J8958k4348k4946M8312
580A7556P407n6987K0920L9967l1541j6399K3048O844j5101j094R891o277p6J1892
594A0050j4400r254K7384j046k9068O139L0240n847l7894J3605M3724k8320m0495
$$ plain form
503 -10295 10769 -2277 -16693 8987 14717 -17642 -10284 16775 5266 -11165 -7243 5673 18710
516 18710 -9464 -24781 25429 18580 -28889 -4459 23356 2107 -10151 -8076 9464 19931
528 19931 -15411 -18470 22786 17091 -24373 -8857 27583 1486 -21891 9622 13698 -13031 4685
541 4685 7954 -13622 6202 14883 -14570 -9199 16404 7055 -13958 -13712 18623 17424 -31379 -13604
555 -13604 39171 168 -41234 12354 30408 -21432 -19869 20651 3618 -15768 5016 -1644
567 -1644 -6939 11054 -4414 -17637 9589 8702 -10659 -10543 -420 18538 -5810 -30756 17556
580 17556 24963 -32024 -11104 28863 -2678 -19077 3971 10815 -4286 -5380 4511 -1766 -1842 10050
594 10050 -4350 -13604 13780 12734 -16334 -10195 20045 14198 -23696 -10091 33633 5313 -35182
607c5182M5159K2311m6418o729L8536q50l3147Q835K5175j8595r704K2620j3871
620a860q964K5823j1529j9453J7417J3576j3855k0852J8292L2148m2282k1781
632c3320O0943j0343m9661K9462K3082k4502o714Q752P816m015q978O666j678
645b490K035P972j6783l211K8194r635k8567J9629K3680k3432k0729K9176J4089
658A9928l2716j384K7789r570j3323J0971j781m79N410m903n883M884J3853j0838
672A958k1782K7287J8856m4695K009M2388j8569k5867J6473J6792q324j9823R128
685d169K2879k0638p872J9134j0029q11J0575j5553M54J9278j0725j4251J0092
698a636J5631j0619k0810J7413J8549k2197j4152K3385Q062k0162n801J6864M368
$$ plain form
607 -35182 9977 32288 -14130 -20859 17677 16827 -16320 -7485 17690 -905 -10609 12011 -1860
620 -1860 -10824 14999 3470 -15983 1434 15010 1155 -19697 -1405 30743 -11539 -33320
632 -33320 27623 17280 -32381 -2919 20163 -4339 -11053 -2301 5515 1500 -7478 -812 -2490
645 -2490 -455 7517 -9266 -12477 15717 6082 -22485 -2856 20824 -2608 -23337 5839 19928
658 19928 -12788 -14172 13617 4047 -9276 1695 -86 -565 4845 -58 -5941 -1057 12796 1958
672 1958 -19824 7463 26319 -18376 -16367 26021 7452 -18415 -1942 14850 6526 -13297 -4169
685 -4169 18710 -1928 -9800 9334 -695 -1506 9069 -6484 -6030 13248 2523 -11728 -1636
698 -1636 13995 3376 -17434 -21 18528 -3669 -17821 5564 13626 -6536 -12337 4527 8895
711H895j5242L6P449J388j664o092j205J1745j99j4641L097J1752J019j3895m268
726a1825K0680J660k4650N223K2322j1197j1960N910R178P99j2242j034J3803
739F667j663j0227J771M357P007o483j2085J2749J0488j3952r725J4360R324j4119
753a531r803J6215O617j4655l392R188N920q145o803P025P063n633o558P27J0221
768F456K211j8081K916J8739p290j5509O635J2995m014j4120K639J6361o734j2334
782i130O356P368j469o975l417R561N742j3638l655J2217M292j0879p340J2962
796A995P460j4969n765J5476K507j1117l435Q275P013r995o289J0426M977q244
810a685m067L488R378l391j3470P944J0870p571p940L305R351Q49j4622K064J5948
$$ plain form
711 8895 -6347 -6311 1138 2526 862 -5230 -6435 5310 5111 -9530 -6433 5319 6338 -7557 -11825
726 -11825 8855 10515 -14135 -8912 13410 2213 -9747 -3837 5341 6140 -6102 -7136 6667
739 6667 5004 -5223 -3452 905 7912 1429 -10656 2093 12581 -1371 -11096 3264 12588 -1531
753 -1531 -11334 4881 11498 -3157 -6549 2639 8559 414 -6389 636 7699 2066 -4492 -3765 6456
768 6456 8667 -9414 -6498 12241 4951 -10558 -3923 9072 5058 -9062 -6423 9938 3204 -9130
782 -9130 -2774 4594 3125 -3850 -7267 2294 8036 -5602 -9257 2960 7252 -3627 -10967 1995
796 1995 9455 -5514 -11279 4197 6704 -4413 -7848 427 7440 -2555 -8844 1582 6559 -1685
810 -1685 -5752 -2264 7114 3723 -9747 -1803 9067 1496 -6444 -3139 6212 7061 -7561 -5497 10451
825A0451o239j0817K978J0051J542j4096j242J8291l544j6538O861J0254k950
838E002r470j40J0818q6j0376P95P367J38l941n486N723O552o404p027N562Q343
854G370n058j1436N593J5348j1173j3458J3290R137j1601o834P293Q348m595j3265
868a1041Q202J2394j1028q196R578N670o319m667J967P343j083q222o53J0229
882D174J277j2292J471J0064r50p503r79N511O418q719p635J3369M499j2602k973
897f870J1450L288j0489l108Q727M562p218o549N748J1530r754j2028J4381O860
911A0530j3288k740Q253K576k572q927M611J1869j0002q667J0926M725r671j002
925c379M544K37m28k73n157K459J1093j1548q849J6839J855j4763K360O177M467
$$ plain form
825 10451 4212 -6605 -3627 6424 7966 -6130 -7372 10919 7375 -9163 -2302 7952 5002
838 5002 -4468 -4608 6210 6124 -4252 -3457 3910 4048 107 -5379 344 6896 492 -6535 -973 7370
854 7370 2312 -9124 -3531 11817 644 -12814 476 9613 -1988 -8822 -1529 6819 2224 -11041
868 -11041 -2839 9555 -1473 -9669 -91 5579 -740 -5407 -3440 3903 2820 -5402 -6055 4174
882 4174 5451 -6841 -5370 4694 3744 -3759 -4738 773 7191 -1528 -9163 4206 8705 -3897 -6870
897 -6870 4580 7868 -2621 -5729 2998 7560 342 -6207 -459 11071 1317 -10711 3670 10530
911 10530 -2758 -5498 2755 5331 2759 -6168 -1557 10312 310 -8357 2569 7294 -2377 -3379
925 -3379 1165 1402 974 701 -4456 -1997 9096 -2452 -11301 5538 7393 -7370 -5010 1167 5634
940E634n372j5252J8474J2462k9303J623K6346j2852j2604J0381L271o27o741
953d560P11P121l060j546l88j447P256j573r396O772L342O7n820o683J7880J212
969I888k5137J2441J8852j9352m644J0972J615j568p734K403R751n009o870L454
983i38M331L532j0671k447J5476n708q132M266Q06O731n720j4745K1361L298k5087
998a3647J4885O514j2786Q549n242m374J5893j0175q389J2011q28o80o428j171
1012e868J5498p964j2580J1304N058m317p325r22J8057j0218j5030J9283k19j0483
1026e726O327m777M060Q372j6996L839J3152r131k209N0K946P977j2294m384J7646
1041H852o534p273M420m22P369o483r514J5997j20j2660P969j656K082N581j7869
$$ plain form
940 5634 262 -14990 3484 15946 -13357 -11734 14612 1760 -10844 -463 2808 2181 -4560
953 -4560 -3849 3272 212 -1334 -1722 -3169 4087 2514 -6882 -110 3232 3299 -2521 -9204 8676 9888
969 9888 -15249 -2808 16044 -3308 -7952 3020 4635 3067 -4667 -2264 7487 2478 -4392 -938
983 -938 3393 6925 -3746 -6193 9283 3575 -4557 -291 515 7246 1526 -13219 8142 11440 -13647
998 -13647 1238 7752 -5034 3515 -1727 -6101 9792 -383 -8772 3239 2411 1731 -4697 -5868
1012 -5868 9630 1666 -10914 390 5448 1131 -6194 -7116 10941 723 -14307 4976 4757 -5726
1026 -5726 601 -4176 -116 8256 -8740 -4901 8251 -880 -3089 -3039 -93 7884 -4410 -8794 8852
1041 8852 2318 -4955 -535 -957 6412 -71 -9585 6412 6292 -6368 1601 -55 2027 7608 -10261
1056a0261R225J5182j8823j833J1904j986m47q449L223J3847j3883m025J1302
1069D976k666p45l676j657J1547o696p517R311k607K872k383j0270J5201J827
1083G517j7604Q870O137n671J162p438Q214P696j7434L275J2064p776j611l32
1097b931N39R484j0063n672J4096l305o012K295j008O904k475j0640J0480M170
1111E862r418J493O18M672R19j1715N879J0388j0550k534M782K480K308j1193
1125f009K916J2419r712m493P002r89K796n083m400J3397n046q076P069r87K701
1140C505j290j0150J2191M772j6553N803O266k843j019o210O523P253j2874k47
1154d873J0307m582j838j605J079P018o539m459O453J704k383m407J94J0316n273
$$ plain form
1056 -10261 -1036 14146 -4677 -6510 5394 3408 2961 -5488 -2265 11582 -2301 -6326 4976
1069 4976 2310 1565 -2111 -3768 7779 1083 -6434 2877 270 3142 759 -9511 5690 7517
1083 7517 -10087 -1217 4920 -751 411 -7027 1187 8883 -8551 -5276 6788 -988 -2599 -2931
1097 -2931 -2392 7092 -2971 -8643 5453 2148 -3864 -1569 -2577 4327 1852 -8788 1692 5862
1111 5862 -3556 -2063 -1445 3227 4146 -7569 -1690 8698 -1852 -4386 396 2876 5184 -6009
1125 -6009 -3093 9326 -386 -4879 2123 1134 3930 -1153 -5553 7844 2798 -5278 1791 804 3505
1140 3505 2215 -7935 4256 9028 -7525 -1722 4544 1701 682 -5528 995 8248 -4626 -4873
1154 -4873 5434 852 -986 -2591 -1512 5506 -1033 -5492 961 2665 282 -4125 -3931 6385 1112
1169A112r360R085L127m672l175O10P556j948j0580Q116N201q141K070j355K346
1184hN497r825q99J1246m465n117J929J104P044q486o085J4773j898j1154O336
1199hK752j043r75n657P836K673r122K858K528K31J113p353K479R769q259m420
1215d598N921K679j258q197M408R339r179n179R775j407k227j493j602P985l224
1230A743p208N994J775k110M43n696O063O352j3330J220J0489m832m814J108L583
1245G80L611q294k295J1518l760o588L656J817J234j985m657N565L418o288o66
1260b934K216M019k240o827N409O108o914l507N706K471k661n127L752N831n403
1275a01l662M616J728m73m034j150P948j690p475L773L854o10m142j844P211J032
$$ plain form
1169 1112 -8248 837 3964 -708 -3883 -3273 4283 2335 -8245 -129 5072 -3069 -999 -2354 -8
1184 -8 5489 -4336 -5235 6011 1546 -3571 -1642 -538 6506 -1980 -8065 6708 4810 -6344 -8
1199 -8 2744 1701 726 -4931 2905 5578 -3544 -686 1842 2073 3186 -4167 -1688 8081 -178 -4598
1215 -4598 1323 4002 2744 -5453 -1045 8294 -885 -6064 3711 2304 77 -1416 -3018 4967 1743
1230 1743 -5465 529 2304 194 637 -5059 1004 7356 -5974 -4754 5735 903 -3911 -2803 780
1245 780 4391 -3903 -6198 5320 1560 -5028 -1372 445 1679 -306 -4963 602 4020 -2268 -2934
1260 -2934 -718 3301 1061 -5766 -357 5751 -1163 -4670 1036 3507 846 -4281 -529 5302 -101
1275 -101 -3763 853 2581 2108 -1926 -3076 4872 3182 -4293 -520 3334 2724 -1418 -3262 3949 4981
1291D981r673K795P295l849l558K33M292J086n593j230O238n63l622j005K524
1306C51L517m362m065N276L368n199l003L705M300m333n106N810L715n395l275
1321d696M481L414l585l822K874M048k552l119Q69M654n76o629K004O239k611
1336I93n335K929L838m78m970R7O301r08n492R91M783r37l122q26L849J357m018
1353i48j726L309L581m337m193N739M465p621j719O307L36l090k860K992M801
1368E036m929m464O360J679m646j26J083K501j352l683J390L934j080m489L39
1383b447N893j078p375M072M672l511k578K92L515J473o390j74P296l001l893
1398c234J819J924J214l094k461M439K634n328j987N100K759n786k425O569N88
$$ plain form
1291 4981 -4692 -1897 5398 1549 -2009 -1776 2516 3602 -1991 -3221 3017 2454 -1168 -2173 351
1306 351 3868 -494 -4559 717 4085 -1114 -4117 -412 3888 -445 -5551 259 3974 -1421 -4696
1321 -4696 -215 3199 -386 -4208 -1334 2714 162 -2957 -2088 2566 1990 -4639 -2635 3604 993
1336 993 -4342 -1413 2425 1947 -3023 -2926 3375 2467 -3025 -2034 2749 1812 -1310 -2136 1713 3070 -948
1353 -948 -2674 635 4216 -121 -4314 1425 5890 -1731 -3450 2857 3193 103 -2757 235 5036
1368 5036 107 -4357 2003 3682 -964 -1090 -7 2494 1142 -2541 -1151 2783 1703 -2786 -2447
1383 -2447 3446 2368 -5007 -935 3737 226 -2352 -2060 1455 2928 -3462 -3636 3660 659 -3234
1398 -3234 -1415 509 1723 -1371 -3832 607 3241 -2087 -4074 1026 3785 -2001 -4426 2143 2731
1413B731m992J24L087L49q40l543K180N411n071k323L832J366j462k106j108O280
1429C915m97q210L793O209l469n583L552M908l683m399M718J526k473K14k302
1444a781L408K286o637J156M353j775o72k747J363P382p875l975R694j262o249
1459c331J131L363J837n147j595O932k138l367K017j716L619N2o186L416M699
1474C586m534j855J029L240J536q283K072R212o503n457P419J040l663r49O19
1489a491M002k313l110L255J06M24L46n125M690M426q503P43N281o10j601m412
1505c892M829O184j1017j68J0627o042k743L191j254L513k683l811N585j12k383
1520a76M06k479N298L42q303M253N293m784k632K053L909j558o781M879M777o455
$$ plain form
1413 2731 -2261 -2137 950 1299 459 -3084 -904 4507 -564 -2887 945 2311 849 -1257 -2365 3915
1429 3915 3418 -4792 -999 5210 1741 -3842 -290 4618 935 -3464 1254 2780 307 521 -1781
1444 -1781 1627 3913 -2724 -1568 2785 1010 338 -2409 -1046 6336 -1539 -5514 4180 2918 -3331
1459 -3331 -2200 1163 3000 -2147 -3742 3190 1052 -2315 -298 -2014 1605 1657 -4529 -1113 3586
1474 3586 -948 -2803 -1774 1466 3002 -5281 -3209 6003 -500 -5957 1462 2502 -1161 -2110 -1491
1489 -1491 2511 198 -2912 343 449 873 1219 -3906 784 5210 -3293 -2550 2731 2121 520 -3892
1505 -3892 937 7121 -3896 -4064 6563 521 -2222 969 -285 3228 545 -3266 2319 2207 -176
1520 -176 230 -2249 3049 3391 -4912 -659 4634 -150 -2782 -729 3180 1622 -5159 -280 4497 -1958
1536a958l05K933l99N05j661k037M636j66l825K82J957K476l521l499O309K027
1552C754p537R00N588j597l091r44M597P98n502J253L546k038M32j251j024N169
1568C053k487m043L770K035j427l119P01N912l146n757N754K598m170j559J806
1583g9L168k252l195L232J020j510k13j300K206K263n375O68L844l73k912j127
1599a935L439K081n340j164O300j838l720R61K539M00l029r31L329K57k901L23
1615a229N50K132j063l647K864L458m405j629L051R54m07m011K094M503m139k473
1631c397L645Q75j265j669j33M136j689l322K599J503m47j816r85L959M23n496
1647c079K249K997j314j536j289L430J580n052P5M668j432j840K16Q39K372l421
$$ plain form
1536 -1958 -2263 670 271 776 -885 -2922 1714 1548 -2277 -1995 -38 2438 -1083 -4582 1727 3754
1552 3754 -3783 -2883 2705 1108 -1983 -2927 1670 2468 -3034 -1781 1765 -273 159 -1092 -2116 3053
1568 3053 566 -3477 293 2328 901 -2218 -1517 4395 1249 -4508 1246 3844 -326 -1885 -79
1583 -79 3089 837 -2358 874 1894 384 171 -1129 1077 3340 -2035 -1367 2477 2104 -808 -1935
1599 -1935 1504 3585 -1755 -2919 3381 1543 -2177 -1216 1323 1723 -1306 -2237 1092 1349 -1552 -1229
1615 -1229 -679 1453 390 -3257 -393 3065 -1340 -2969 82 1036 629 -3382 -1288 3215 -924 -3397
1631 -3397 248 1123 -142 -1811 -1944 2192 503 -2819 -220 1283 836 -980 -1965 1994 2417 -3079
1647 -3079 -830 2167 853 -683 -1972 1458 3038 -2014 -1939 2729 1297 -543 -327 512 2884 -537
1663e37j780M542L50l386m0J583J710j913l022L250J925l039j326J732J851r21
1679I79l600K260L329l484j613J783J817m29l395J116L634k063k966K273R72K28
1695H41k514q11M160o48l284P96K511m35j543j696L752R22m706J176K626m03j854
1712a110q90K200J834l362p84L479l92j511r54J288K221j756k756K851K245k474
1728A29k075J497L436k922k668L614J576k519j060Q61K075o4l955K166K762k455
1744C98r96J18J358J485l197j012M693j366k970O98J629J304k991j454M097L68
1760B162m341J321J740J71j480k011K941J146k704p65K292L64j033k284J742K897
1776B158k991j850K142K385k077k081J651K994k603k624K956P28o91j227j98L024
$$ plain form
1663 -537 -2317 2225 2575 -811 -851 732 2442 529 -2493 757 2682 -357 -1683 49 1900 979
1679 979 -2621 -361 2968 -516 -2129 -346 1471 1042 -2353 -1237 2397 334 -2632 -359 613 841
1695 841 -1673 -2484 1676 1028 -2256 -1460 1051 616 -927 -2623 1129 2051 -2655 -1479 1147 744 -1110
1712 -1110 -2000 200 2034 -1328 -2112 1367 975 -536 -1490 -202 2019 263 -2493 358 2603 129
1728 129 -1946 -449 2987 65 -2603 1011 2587 68 -992 -131 1944 1880 -2075 91 2853 398
1744 398 -598 -480 878 2363 -834 -1846 2847 1481 -1489 -791 838 2142 -849 -2303 1794 2162
1760 2162 -2179 -858 882 1053 -427 -2438 503 1649 -1055 -1820 472 836 -197 -2481 -739 2158
1776 2158 -833 -2683 -541 1844 -233 -2314 -663 2331 -272 -2896 60 788 97 -1130 -1328 1696
1792A696n02l428J586K408j525p89r02K642J213m011O3L589m98k545J93J889J156
1809B235l286n09L542m92k452M80J109J463j566k521L280J178l279j62J445J231
1825A696j116k549J870K600k902r61J584J170q20k831J830K340j874j307J160
1840a10L96O45k366o56L996j353k923J694J529n07j546p62K492J089m013R27K620
1857A152l38k492M06K072K14k488m0K344l84q21r38J272K006k266j986L164J023
1874A900k645j85Q17K026j183k975K858J633k720q38K136N69m81k277J507J945
1890B087j544q55l66K100M55l383P03L629j973k024R94R26J183l255k87M087j281
1907A196l269K152J120n05j246p24K252j59j419n11R70J350j319k141K033K339
$$ plain form
1792 1696 1194 -2234 -648 1760 235 -554 -1456 1186 2399 -1612 -1549 2040 1542 -1003 -810 1079 2235
1809 2235 -1051 -1560 1982 1490 -962 -482 627 2090 524 -1997 1283 2461 -818 -980 465 1696
1825 1696 580 -1969 -99 2501 -401 -1362 222 1392 572 -2259 -429 1911 37 -1270 -110
1840 -110 286 931 -1435 -2091 1905 552 -2371 -677 852 345 -1201 -1963 529 1618 -2395 -1468 1152
1857 1152 814 -1678 -1272 800 1014 -1474 -1514 830 446 -375 -1313 -41 1965 -301 -2287 877 1900
1874 1900 -745 -930 -113 1913 730 -2245 613 2246 -474 -1312 824 1393 912 -1365 142 2087
1890 2087 543 -312 -678 1422 1877 -1506 -803 2826 853 -1171 -177 749 1932 -1323 -1610 2477 1196
1907 1196 -2073 79 1199 694 -552 -1276 976 817 -602 -1113 -143 1207 -112 -2253 -220 2119
1923B119l598n44K279O90j383j826J754K685l072j753L841o24j415K40l99J857
1939H51k26k617J498J480q93n82j177K713P82m515K071L193k514j177N53J636
1955A076J225m291Q70M379l381n43J388j035K068j096k721L331Q99k598r0O50
1971A31K023j720l049L931J652m331K88K360k68o89k042J950J783l299K36J687
1987F43r74J133j022k353M154J15m459K155J970r51j829m41L441n28m499K803
2003f42K483k948L72m3P61R89k536M23K149j373R90j544o29M325l079l038M926
2020A586J72l049J30J510J772k571k078M404n76k670J308P01l53O32j532L82J705
2037A473j000m64r06K108J221m027J19M799k296l553K871J233p12k098R05K550
$$ plain form
1923 2119 -1479 -2023 256 946 -437 -2263 -509 2176 -896 -2649 1192 568 -847 -607 -1006 851
1939 851 625 -1992 -494 986 93 -489 -1666 1047 1829 -2686 -615 2578 64 -1113 -560 1076
1955 1076 2301 -1990 -1120 3259 -122 -665 723 -312 1756 660 -2061 1270 2169 -429 -519 131
1971 131 2154 434 -2615 1316 2968 -1363 -1075 1285 1017 328 -1714 236 2019 -1280 -1044 643
1987 643 -331 802 -220 -2573 1581 1696 -2763 -608 1362 411 -1418 -1859 1582 1054 -3445 -642
2003 -642 1841 -1107 -735 -778 -17 972 -1564 -1141 1008 -365 625 -919 -1548 2777 -302 -3340 1586
2020 1586 1758 -1291 -1161 349 2121 -450 -2528 1876 1300 -1370 -62 639 286 918 -614 -232 1473
2037 1473 473 9 -897 1211 2432 -1595 -1476 3323 1027 -2526 345 1578 866 -1232 -327 2223
2053B223j994j371J724j38o37Q20j948J354J714k728oJ163J121j193k426K315
2069gK810m582l79L939j412j466L6J109P94j683o90K325j163L24k26j191K618
2086A156j67l004J293J866n50j737j26L348j028l883L311J503k764l58J241O67
2102G68n09p91L09J498j440O25p78J44K545k343j869L058Q55k753J65J447Q80
2119A811k028j767L795l75l005J792Q87p14L51j405P96J340j847j09M36K63R05
2136A126k222k11L545j907k758L059R0q91j187N47K319j700k128K813J26j589
2152i68J044j449J742M80k304P31J316n39k91j108J196K000l610P5L026j011j355
2169a025M76R51M07j317q74K773p64j362R43j86Q17K03k348J443J448j895l93
$$ plain form
2053 2223 229 -1142 582 444 -193 627 -1321 33 1747 -981 -987 176 1297 104 -2322 -7
2069 -7 2803 -1779 -2158 1781 369 -1097 -1061 48 842 -841 -1531 794 -369 -45 -271 -1462 1156
2086 1156 989 -2015 -722 1144 594 -1143 -1269 2079 1051 -2832 479 1982 -782 -1140 101 768
2102 768 259 -532 -223 1275 -165 460 -318 -174 2371 28 -1841 1217 2072 -681 -516 931 1811
2119 1811 -217 -1984 1811 1436 -1569 223 1110 396 747 -658 138 1478 -369 -478 -42 221 1126
2136 1126 -1096 -1307 2238 331 -2427 632 722 -169 -1356 -809 1510 -190 -2318 495 621 -968
2152 -968 76 -1373 369 849 -1455 -724 592 53 -238 -1346 -150 1850 -1760 -1685 1341 330 -1025
2169 -1025 -549 402 809 -508 -1382 1391 627 -735 208 22 839 1042 -1306 137 1585 -310 -703
2186g03J073N38J83k296J015K452k211j213K246j30n52r02J09K289j517j234R83
2203A30N69r2p45q88J866M65k365O41J176m94n73o10J429R86k608Q7K270r69q63
2222e88l16R97Q26j597q95J948K21j237k40L17J355j005j568J898Q54j591r30
2239a551J436J135n54k218J604J482j987l91R83O11l34r82J78J881p04j675P47
2256c39J199o4j592J14J984k32k049N91J481k29q62j070K242J17k105K78J702
$$ plain form
2186 -703 370 908 1091 -1205 -190 2262 51 -1162 1084 954 402 -500 -391 1898 381 -853 130
2203 130 699 607 -138 -1026 840 1305 -1060 -419 757 263 -310 -920 509 1495 -1113 -1026 1244 275 -588
2222 -588 -904 93 919 -678 -1573 375 596 -641 -881 -564 791 -214 -1782 116 970 -621 -1551
2239 -1551 -115 1020 466 -1752 -148 1334 -653 -1044 -61 550 216 -766 -588 1293 589 -1086 -339
2256 -339 860 796 -796 -682 1302 1070 -979 -388 1093 864 2 -1068 1174 1291 -814 -536 1166
$$ [...]
8191h7
##END NTUPLES=NMR FID
##END=
