##TITLE=1H_Pr Am-3Ph
 200.13MHz,CDCl3,
 8 sc
 
 4.4.2025
##JCAMPDX= 6.0         $$ Bruker NMR JCAMP-DX V2.0
##DATA TYPE= NMR FID
##DATA CLASS= NTUPLES
##ORIGIN= UXNMR, Bruker Analytische Messtechnik GmbH
##OWNER= pz
$$ XWIN-NMR		Version 3.5
$$ Fri Apr  4 14:05:51 2025 Russian Standard Time (UT+4h)  she@DPX200
##.OBSERVE FREQUENCY= 200.1313
##.OBSERVE NUCLEUS= ^1H
##.DELAY= (6, 6)
##.ACQUISITION MODE= SIMULTANEOUS
##.ACQUISITION SCHEME= undefined
##.AVERAGES= 8
##.DIGITISER RES= 18
##SPECTROMETER/DATA SYSTEM= spect
##.PULSE SEQUENCE= zg30
##.SOLVENT NAME= CDCl3
##.SHIFT REFERENCE= (INTERNAL, CDCl3, 0, 14.3821)
##AUDIT TRAIL= $$ (NUMBER, WHEN, WHO, WHERE, WHAT)
$$ ##TITLE= Audit trail, XWIN-NMR		Version 3.5
$$ ##JCAMPDX= 5.01
$$ ##ORIGIN= Bruker BioSpin GmbH
$$ ##OWNER= she
$$ F:/spectra/data/she/nmr/H-C/1/audita.txt
$$ ##AUDIT TRAIL=  $$ (NUMBER, WHEN, WHO, WHERE, WHAT)
(   1,<2025-04-04 14:04:31.89 +0400>,<she>,<DPX200>,
      <created by zg, POWCHK disabled, PULCHK disabled
       configuration hash MD5:
       00 E9 B6 7A A2 85 ED C7 34 08 36 98 17 FE 4E 26
       data hash MD5: 16K
       F9 C2 C6 29 42 46 D7 3C 33 E5 2B A2 AC F6 5A 41>)
$$ ##END=
$$ 
$$ hash MD5
$$ F4 F7 1F 37 90 45 52 2E CB 0F 21 7F 36 1C 4A C1
##$RELAX= 
##$RELAX= 
##$RELAX= 
##$RELAX= 
##$RELAX= 
##$RELAX= 
$$ Bruker specific parameters
$$ --------------------------
##$DU= <F:/spectra>
##$EXPNO= 1
##$NAME= <H-C>
##$PROCNO= 1
##$TYPE= <nmr>
##$USER= <she>
##$AMP= (0..31)
100 100 100 100 100 100 100 100 100 100 100 100 100 100 100 100 100 100 
100 100 100 100 100 100 100 100 100 100 100 100 100 100 
##$AQSEQ= 0
##$AQ_mod= 1
##$AUNM= <au_zg>
##$AUTOPOS= <>
##$BF1= 200.13
##$BF2= 200.13
##$BF3= 200.13
##$BF4= 200.13
##$BF5= 200.13
##$BF6= 200.13
##$BF7= 200.13
##$BF8= 200.13
##$BYTORDA= 1
##$CFDGTYP= 0
##$CFRGTYP= 5
##$CHEMSTR= <none>
##$CNST= (0..31)
1 1 145 1 1 1 1 1 1 1 1 1 1 1 1 1 1 1 1 1 1 1 1 1 1 1 1 1 1 1 1 1 
##$CPDPRG= <>
##$CPDPRG1= <>
##$CPDPRG2= <>
##$CPDPRG3= <>
##$CPDPRG4= <mlev>
##$CPDPRG5= <mlev>
##$CPDPRG6= <mlev>
##$CPDPRG7= <mlev>
##$CPDPRG8= <mlev>
##$CPDPRGB= <>
##$CPDPRGT= <>
##$D= (0..31)
0 0.7 0 0 0 0 0 0 0 0 0 0.03 0 0 0 0 0 0 0 0 0 0 0 0 0 0 0 0 0 0 0 0 
##$DATE= 1743761071
##$DBL= (0..7)
120 120 120 120 120 120 120 120 
##$DBP= (0..7)
150 150 150 150 150 150 150 150 
##$DBP07= 0
##$DBPNAM0= <>
##$DBPNAM1= <>
##$DBPNAM2= <>
##$DBPNAM3= <>
##$DBPNAM4= <>
##$DBPNAM5= <>
##$DBPNAM6= <>
##$DBPNAM7= <>
##$DBPOAL= (0..7)
0.5 0.5 0.5 0.5 0.5 0.5 0.5 0.5 
##$DBPOFFS= (0..7)
0 0 0 0 0 0 0 0 
##$DE= 6
##$DECBNUC= <off>
##$DECIM= 32
##$DECNUC= <off>
##$DECSTAT= 4
##$DIGMOD= 1
##$DIGTYP= 9
##$DL= (0..7)
0 120 120 120 120 120 120 120 
##$DP= (0..7)
150 150 150 150 150 150 150 150 
##$DP07= 0
##$DPNAME0= <>
##$DPNAME1= <>
##$DPNAME2= <>
##$DPNAME3= <>
##$DPNAME4= <>
##$DPNAME5= <>
##$DPNAME6= <>
##$DPNAME7= <>
##$DPOAL= (0..7)
0.5 0.5 0.5 0.5 0.5 0.5 0.5 0.5 
##$DPOFFS= (0..7)
0 0 0 0 0 0 0 0 
##$DQDMODE= 0
##$DR= 18
##$DS= 0
##$DSLIST= <SSSSSSSSSSSSSSS>
$$ [...]
##$SUBNAM0= <"">
##$SUBNAM1= <"">
##$SUBNAM2= <"">
##$SUBNAM3= <"">
##$SUBNAM4= <"">
##$SUBNAM5= <"">
##$SUBNAM6= <"">
##$SUBNAM7= <"">
##$SUBNAM8= <"">
##$SUBNAM9= <"">
##$SW= 18.0517328524113
##$SWIBOX= (0..15)
0 0 2 0 0 0 0 0 0 0 0 0 0 0 0 0 
##$SW_h= 3612.71676300578
##$TD= 16384
##$TD0= 1
##$TE= 0
##$TE2= 300
##$TE3= 300
##$TEG= 300
##$TL= (0..7)
0 120 120 120 120 120 120 120 
##$TP= (0..7)
150 150 150 150 150 150 150 150 
##$TP07= 0
##$TPNAME0= <>
##$TPNAME1= <>
##$TPNAME2= <>
##$TPNAME3= <>
##$TPNAME4= <>
##$TPNAME5= <>
##$TPNAME6= <>
##$TPNAME7= <>
##$TPOAL= (0..7)
0.5 0.5 0.5 0.5 0.5 0.5 0.5 0.5 
##$TPOFFS= (0..7)
0 0 0 0 0 0 0 0 
##$TUNHIN= 0
##$TUNHOUT= 0
##$TUNXOUT= 0
##$USERA1= <user>
##$USERA2= <user>
##$USERA3= <user>
##$USERA4= <user>
##$USERA5= <user>
##$V9= 5
##$VALIST= <valist>
##$VCLIST= <CCCCCCCCCCCCCCC>
##$VD= 0
##$VDLIST= <DDDDDDDDDDDDDDD>
##$VPLIST= <PPPPPPPPPPPPPPP>
##$VTLIST= <TTTTTTTTTTTTTTT>
##$WBST= 1024
##$WBSW= 4
##$XGAIN= (0..3)
0 0 0 0 
##$XL= 0
##$YL= 0
##$YMAX_a= 138426
##$YMIN_a= -172910
##$ZGOPTNS= <>
##$ZL1= 120
##$ZL2= 120
##$ZL3= 120
##$ZL4= 120
##$ABSF1= 10
##$ABSF2= 0
##$ABSG= 5
##$ABSL= 3
##$ALPHA= 0
##$AQORDER= 0
##$ASSFAC= 0
##$ASSFACI= 0
##$ASSFACX= 0
##$ASSWID= 0
##$AUNMP= <proc_1d>
##$AZFE= 0.1
##$AZFW= 0.1
##$BCFW= 1
##$BC_mod= 2
##$BYTORDP= 1
##$COROFFS= 0
##$CY= -3
##$DATMOD= 1
##$DC= 2
##$DFILT= <>
##$DTYPP= 0
##$F1P= 0
##$F2P= 0
##$FCOR= 0.5
##$FTSIZE= 0
##$FT_mod= 4
##$GAMMA= 1
##$GB= 0.15
##$INTBC= 1
##$INTSCL= 1
##$ISEN= 128
##$LB= 0.25
##$LEV0= 0
##$LPBIN= 0
##$MAXI= 10000
##$MC2= 0
##$MEAN= 0
##$ME_mod= 0
##$MI= 1.114404
##$NCOEF= 0
##$NC_proc= 0
##$NLEV= 6
##$NOISF1= 3.799351
##$NOISF2= 2.8
##$NSP= 1
##$NTH_PI= 0
##$NZP= 0
##$OFFSET= 14.38212
##$PC= 1
##$PHC0= -829.1761
##$PHC1= 10.59221
##$PH_mod= 1
##$PKNL= yes
##$PPARMOD= 0
##$PSCAL= 0
##$PSIGN= 0
##$REVERSE= no
##$SF= 200.129724274929
##$SI= 16384
##$SIGF1= 3
##$SIGF2= 2
##$SINO= 400
##$SIOLD= 16384
##$SREGLST= <1H.CDCl3>
##$SSB= 0
##$STSI= 0
##$STSR= 0
##$SW_p= 3205.1282051282
##$SYMM= 0
##$S_DEV= 0
##$TDeff= 0
##$TDoff= 0
##$TI= <>
##$TILT= no
##$TM1= 0
##$TM2= 0
##$TOPLEV= 0
##$USERP1= <user>
##$USERP2= <user>
##$USERP3= <user>
##$USERP4= <user>
##$USERP5= <user>
##$WDW= 1
##$XDIM= 8192
##$YMAX_p= 0
##$YMIN_p= 0
$$ End of Bruker specific parameters
$$ ---------------------------------
##NTUPLES= NMR FID
##VAR_NAME=  TIME,          FID/REAL,        FID/IMAG
##SYMBOL=    X,             R,               I
##VAR_TYPE=  INDEPENDENT,   DEPENDENT,       DEPENDENT
##VAR_FORM=  AFFN,          ASDF,            ASDF
##VAR_DIM=   8192,          8192,            8192
##UNITS=     SECONDS,       ARBITRARY UNITS, ARBITRARY UNITS
##FACTOR=    0.0002768,     1,               1
##FIRST=     0,             0,               0
##LAST=      2.2672688,     0,               0
##MIN=       0,             -172910,         0
##MAX=       2.2672688,     138426,          0
$$ Real data points
##PAGE= N=1
##DATA TABLE= (X++(R..R)), XYDATA
0@%%%%%%%%%%%%%%%%%%%%%pJ5j6J6j6J6j8K4l0L2l6M3m7N2n9O7p5Q3r4J03j12
42e9J26j42J58j73J90k11K33k56K81l10L44l79M19m67N19n79O49p32Q34r61J123
63F07j339J643k108K894m474Q846m4168j34811J21491J78619q0764j22764J1526
76f4802O3634J4126k9981K9410m1861m1020L4621O8118Q073r1350j0045M9095
88a1982L9403j7299l1909K4211q552J3348K3084R931l5091m1390O5232L7428m2044
101B4370n2258L2293M8360n1340j9453K6912J4772l6916p140N0365l1246l8723
113d0004K6788N0618l3804o5044N5010N9314l6603q2549K6557R0999k2146o8412
125c9276q680O7711Q809n7356K98L0824Q469l2569J3509L1439k1037j7866Q953
$$ plain form
0 0 0 0 0 0 0 0 0 0 0 0 0 0 0 0 0 0 0 0 0 0 0 -7 8 -8 8 -8 8 -10 14 -16 16 -20 23 -24 28 -31 36 -39 44 -50 53 -59
42 -59 67 -75 83 -90 100 -111 122 -134 147 -163 181 -198 221 -246 273 -306 343 -389 445 -516 607
63 607 -732 911 -1197 1697 -2777 6069 -38099 -172910 -51419 127200 46436 -76328 -64802
76 -64802 -1168 12958 -17023 12387 -29474 -70494 -35873 32245 40318 -51032 -61077 -11982
88 -11982 27421 10122 -21787 2424 -6128 7220 30304 40235 5144 -36246 28986 66414 24370
101 24370 -27888 4405 52765 1425 -18028 8884 23656 -13260 -20400 29965 -1281 -40004
113 -40004 -13216 37402 3598 -61446 -6436 52878 16275 -66274 -39717 51282 29136 -39276
125 -39276 -47956 19755 28564 -28792 -28494 2330 10799 -21770 -8261 23178 2141 -15725 -6772
138f772L1729j1320j3316J5388r446o570J0250K4674k4385l7844K3912L0650p560
151A9390m4382N395L0059p105j1659L98J5717j7801j3500K5127J6999j2203k6827
164b0392J5678J4992r770j635M280j979k5799J6071L9451j4711n0141j0005N9289
177A5329K2284l9021k9880J8797L4734p472j2285o328l3R346R831P319k1672j4765
191a3816J0603J6574j178j8559M05J47Q54M920K951o123j8366J3545K4858l696
205A3119k7031o931K8976J0162j4347j4542O925J3002m205l474p929k144O040
218b379Q154J33j7260k292J4059J0751j0903j3499J2552J1345k114j1349K050
231g52J0154n414k059L054J704r251l274R853Qo890o397N498L577l540J953k484
$$ plain form
138 -6772 24957 13637 321 15709 6263 -307 9943 34617 10232 -27612 -3700 26950 19390
151 19390 -24992 -19597 10462 3357 -8302 -7904 7813 -9988 -23488 1639 18638 6435 -20392
164 -20392 -4714 10278 508 -1127 3153 1174 -24625 -8554 30897 16186 -33955 -43960 15329
177 15329 37613 -1408 -31288 -12491 22243 14771 2486 -3842 -3875 5471 15302 22621 949 -13816
191 -13816 -3213 13361 12183 -6376 -5971 -5824 -4970 -50 2901 -3222 -21588 -8043 16815 13119
205 13119 -13912 -20843 8133 18295 3948 -10594 -3669 9333 5128 1654 -6275 -8419 -2379
218 -2379 5775 5908 -11352 -13644 415 11166 263 -13236 -684 10661 8547 -2802 -752
231 -752 9402 3988 1929 4983 6687 -2564 -5838 4015 4023 -2867 -9264 -3766 -189 -3729 -1776 -4260
247d260j242K651Q934O36j2141r82J0465Q697r485r304N703N732p77q253q66L819
263f73q83Ln26P60l615J095N018O22j210j327M503n15k619L866O63l018l643M788
281C289L119p344n634K989P442m543n600J161L011J838k837J137Q21P43L125J092
297C809j889l520L534L782j895l852j492M240j776l699J48J290j24k441K131J720
313c4j826j907K452M965j553j312O40J356M22j404J219j553j324R13J066k632
329e12m248J862J941r6k506n21L412k81q26O85J938J177o67J126K74l67j575J047
347A863J210k343q04j8o08j469n44J487o40j201Q93K419q36j739J763K494J685
364C612j462j571J283N69P95j199j933q31M74Q81j166k221k379K387K696j145
$$ plain form
247 -4260 -5502 -2851 6083 6719 -5422 -6404 4061 12758 3273 -6031 -328 5404 4627 -3626 -4492 -673
263 -673 -1556 -1553 -2079 -1319 -4934 -3839 1179 1801 591 -736 3767 3252 633 4499 5162 2144 -1499 3289
281 3289 6408 -936 -6570 -3581 3861 -682 -6282 -5121 -2110 -272 -3109 -1972 -1151 -408 2717 3809
297 3809 1920 -1600 1934 5716 3821 -31 -1523 2717 941 -2758 -2610 -1320 -1444 -3885 -1754 -34
313 -34 -1860 -3767 -1315 3650 2097 785 1425 2781 3203 1799 3018 1465 141 1054 2120 -512
329 -512 -4760 -2898 -957 -1053 -3559 -4080 -668 -949 -1775 -1090 848 2025 1358 2484 2758 2391 816 1863
347 1863 3073 730 -74 -92 -700 -2169 -2713 -1226 -1866 -3067 -2174 245 -591 -2330 -567 1927 3612
364 3612 2150 579 1862 2431 3226 2027 94 -737 -263 618 -548 -2769 -5148 -2761 -65 -1210
380a210r44n59J483J569J073Q94r50p03J201K277j017k840o35O41J763j249k263
397a469j597j21J558P16o77j082O97J652J139m31n68J816J012q37K94Q63m14k660
415a09l63J663K06k122j833k46p0J570J119j993j247J299L002J274j381j513L92
432c52L410K612k028m862l20L712N89j430k495k098K3K389J978k950l621K265
448c178M116J017j057j825j839L339N064m30m933j177L515J16l384R2J555j489
464d98k199J456N16j136j255j064J698L584K500k647l772J745L520N31J82J6l374
481a97r72M449J635n576n895K643N781Q23l329m236j650M714N772k103m897O63
497b375M058K348m9k128l938p25P312L922p579p472L229N852l52m199k896J050
$$ plain form
380 -1210 -2154 -2713 -1230 339 1412 2306 1356 653 1854 4131 3114 274 -361 280 2043 794 -1469
397 -1469 -3066 -3187 -1629 -913 -1590 -2672 -1975 -323 816 385 -183 1633 2645 1808 2102 2965 2551 -109
415 -109 -472 1191 1397 -725 -2558 -2804 -2874 -1304 -185 -2178 -3425 -2126 876 2150 769 -744 -352
432 -352 3058 5670 3642 -1220 -1540 2172 2761 1331 -1164 -3262 -3239 -850 1128 -1822 -5443 -3178
448 -3178 938 1955 898 -927 -2766 573 5637 5207 274 -903 2612 2728 -656 -564 991 -498
464 -498 -2697 -1241 -725 -1861 -3116 -4180 -2482 1102 3602 955 -2817 -1072 2448 2979 3161 3177 -197
481 -197 -1169 3280 4915 -661 -6556 -3913 1868 2691 -638 -4874 -6524 -1810 3962 1859 -3038 -2375
497 -2375 1683 4031 3982 1854 -2084 -2809 4503 8425 846 -6626 -3397 2455 2103 -2096 -4992 -3942
513c942M048J856l240l087L076L539j289O58K304k168l360K651L356k082l862
528a542P55J893j134r26m55j522K73J710q79J05L097m88m083J271O653N98n999
545f73j408M599P91j178K26k387l458J920M216j267n344j810L285M039J108l690
561a031m383K566P073L11n244n72L640R02j444Mn40k312p53K565N00j576j469
578a763j879M08L198J059l375q59L688K340k390q89K420J7k161J449K791q78m012
595h36k259K701K335j526k905p89J458J783j22j641j296N75M098L215k516m361
611b086K48M228K065j956l587l3L094J368k890m600l29L411J886o59j527j274
627b641L55K286J048q86l29P77J650J128j96l049k780K589M261k072m993Q57K927
$$ plain form
513 -3942 106 1962 -1278 -4365 -1289 2250 961 1619 3923 1755 -1605 1046 4402 2320 -1542
528 -1542 -787 1106 -28 -954 -1409 -2931 -2658 -948 -1827 -1722 1375 887 -3196 -1925 4728 5326 -673
545 -673 -2081 2518 3309 2131 2357 -30 -3488 -1568 2648 1381 -3963 -5773 -2488 1551 2659 -1031
561 -1031 -5414 -2848 4225 4536 -708 -1280 2360 3262 1818 1822 1282 -1030 -1783 782 1282 -294 -1763
578 -1763 -3642 -3234 -36 1023 -2352 -3211 477 2817 427 -462 1958 1975 -186 1263 4054 3176 -836
595 -836 -3095 -394 1941 415 -2490 -3279 -1821 -38 -160 -1801 -3097 -2522 1576 4791 2275 -2086
611 -2086 -1838 2390 4455 2499 -1088 -1121 1973 3341 451 -4149 -4478 -1067 819 160 -1367 -2641
627 -2641 -2286 0 1048 162 -167 610 2260 3388 3192 143 -2637 -48 4213 2141 -2852 -1995 932
644I32j561k652Q20J769l17L86J039q96n99J902R87j306J68J637L62j544j055
661G2k70M57O68m07k155l96J414n78j153J033O52m61P16J892m40j992R48K158
679B158m29m45P98j021k071J588J504k432k564J492K089j422j964Q21R20M25M81
696g2r2L8R15O4j16O53O04p52p37N49K2j277n00N98p58o23J200l15k321M58K695
717B33L52j714K85K291J59j122N71K84k36L74K35q10j374J29M92n11j012K3K25
736a126j25K46J37j5O80M0K06J001N30j028j74J463N43j648j233J162K74j266
754c33p67J06k47n7N12j4p62J3J490O29q87K30J142M35m59j82M56J40o89m55Q6
775C87k03p95n61L52K13m21n86M58K90J67M92K26K22K52O93L07n27m73Q46K42
$$ plain form
644 932 -629 -3281 -2461 -692 -1009 -623 416 -480 -1079 823 1810 504 672 2309 2671 1127 72
661 72 -198 259 927 520 -1635 -2031 -617 -1195 -2348 -1315 -663 -1124 -408 1484 1044 -948 0 2158
679 2158 1729 1284 2082 1061 -1010 578 2082 -350 -2914 -1422 667 -755 -2719 -1898 -978 -553 -72
696 -72 -164 -126 789 853 737 1390 1994 1242 505 1054 1076 -201 -701 -103 -861 -1484 -284 -599 -2920 -2462 233
717 233 585 -1129 -844 1447 1606 484 1055 1339 1103 1477 1712 902 -472 -343 149 -362 -1374 -1351 -1126
736 -1126 -1251 -1005 -868 -883 -203 -163 43 1044 1574 546 372 1835 2378 730 -503 659 933 -333
754 -333 -1100 -994 -1241 -1298 -786 -800 -1562 -1549 -59 570 -317 -87 1055 1490 1031 849 1305 1445 756 301 387
775 387 184 -611 -1172 -820 -607 -1028 -1614 -1156 -866 -699 -207 19 241 493 1186 1493 966 493 1339 1581
795A581p95p57L4k04k48q48K46J07m21L3N70K16q7L93L92O46J24k07L51q2l9K56
817A261k18q36j53M5j21r71q83O44O54j82m16k8O21P00p4K08M05K17K70K75l32
838A086k92n0j9k18o41k60k35n90M8K51L1j58L8K07N73L88j39M20N52p5L10r1
860A136k0l02o1l50O8o16n47q0k99N2J41q7Oj23M27R35r4J58K09L88M16N1p58
883F50J52J12n22k0l72o63k88K47k07j36l5J82l2K13Q15K25l67M82N09L59O4m50
905I18k26j50P0o2l80r55J27J61k96M5j29m35L47Q12K40m65n0N68Q78J3L43k82
927A092q52N67O54j094j125L94K84k69l14j18o79n71J245R70n36k40P94J63K92
946F57N21k69n51M31N41l51q82J7J98j212J14Q20o22q76J74N67L22j68M00J9n3
$$ plain form
795 1581 786 29 63 -141 -389 -1237 -991 -884 -1305 -1272 -702 -486 -573 -180 212 858 982 775 1126 1044 1005 1261
817 1261 1043 207 54 99 -22 -993 -1876 -1232 -578 -760 -1176 -1204 -583 117 43 251 656 873 1143 1418 1086
838 1086 794 744 725 507 -134 -394 -629 -1219 -1171 -920 -889 -1047 -1009 -802 -229 159 20 440 992 917 1227 1136
860 1136 1116 814 753 403 471 -145 -692 -772 -1071 -1019 -878 -965 -959 -1082 -655 280 186 344 553 941 1357 1408 650
883 650 802 914 392 372 0 -663 -951 -704 -911 -1047 -1082 -900 -932 -719 96 321 -46 436 945 1304 1368 918
905 918 692 542 612 550 170 -785 -658 -497 -793 -748 -877 -1312 -965 -153 87 -378 -428 140 1018 1031 1374 1092
927 1092 240 807 1461 367 -758 -364 -80 -349 -663 -781 -1460 -2031 -786 184 -352 -592 202 365 657
946 657 1178 909 358 789 1330 979 97 114 312 -900 -786 34 -588 -1464 -1290 -723 -401 -569 -169 -150 -203
967b03J016O12o36k22P04l09l86M75m68j252k30J034K35j424o38P42K40J36K98
986b76k03J53Q09N21k60k68p0L71K79L26k49j236l28O55l52r05J33J77J96J13
1006d14m36j65J77O71M67J26N93L18q74o5N35O4p82M7M27k8r84m04r0l79k24P90
1028f30L23M20j35j001M49J038M46q60K82J071L43p15n15o29m42O40L32m70n68
1047f21j40j97j91L91k08j00N40J404K06j142k74R94O7N2K34j55l63n7m03l77
1067c40l95J95P3k48M99k89q16L04Q69k2k13J102N20o10n56P62kl88J39Q4o52
1088A6O8L33j118o75P29N22p83NO26Nl90O45P83q57rJ178P8p40L70J23n54m10
1110e5M51o15j006Q40M96p62n54J072l16q58J072O85n15k7J138K22r01Q7O19p60
$$ plain form
967 -203 813 1425 789 567 1271 962 576 1051 583 -669 -899 135 370 -1054 -1692 -950 -710 -574 -276
986 -276 -479 -326 483 1004 744 476 406 777 1056 1382 1133 -103 -431 224 -128 -1033 -900 -723 -527 -414
1006 -414 -850 -1015 -838 -167 300 426 1019 1337 463 398 933 997 215 262 689 661 -323 -727 -817 -1196 -1420 -630
1028 -630 -307 113 -22 -1023 -574 464 910 50 332 1403 1746 1031 516 -113 -555 85 417 -53 -621
1047 -621 -761 -958 -1149 -758 -966 -1066 -526 878 1084 -58 -332 662 729 781 1015 860 497 440 37 -340
1067 -340 -735 -540 -467 -715 -216 -505 -1321 -1017 -148 -170 -383 719 1239 629 73 835 833 445 584 668 16
1088 16 84 417 -701 -1376 -647 -125 -908 -903 -277 -272 -662 -17 766 -91 -100 1078 1156 416 786 909 355 -55
1110 -55 396 -219 -1225 -385 111 -651 -1205 -133 -449 -1307 -235 450 -65 -92 1046 1268 367 454 1073 313
1130C13k77O74q9q17l8jp93l47R17J38o71M81P53o18j80J035j20j34O68M59m85
1151H68q02M31j2p93K18N03p37m25L38j13r71N20P09J31k32O23L54m65k98J017
1171H64r7j59M53r8o23k14j63l25j7P0j5k02J68j72l75N3O44K05o5N32L41k02
1193F03j87M54k3o21J74K48m07n44jm3k79LJ42k51J49M0J45J10J98M13l1P6N00
1216H68k34q7P9j27k32q1Nm75j60J20J32n06j10K59J49k54K39N12L5j89K27M63
1238F33K8k23m2K23k47m9k9m31J42l65q4k24k4J02J43J04Q3M7L90K62k91L02L41
1261G91o1k81j3K12k62l56jj42m23j23K06j13j16P8P7K41K65n0J53L05J13P4j7
1284E57J41k18j8q6O7m98l33K98j87l92j5J32N9L5M0J76O7p3M90O4J02M1J96J6
$$ plain form
1130 313 36 710 621 -196 -234 -235 -1028 -1375 -458 -320 -991 -510 243 -375 -555 480 360 226 894 1353 868
1151 868 66 497 485 -308 -90 413 -324 -749 -411 -524 -1495 -975 -266 -135 -367 256 610 145 -153 864
1171 864 767 608 1061 963 340 126 -37 -362 -379 -309 -324 -526 -358 -530 -905 -852 -208 -3 -68 464 805 603
1193 603 416 870 847 226 400 648 241 -303 -304 -347 -626 -623 -481 -732 -583 -543 -398 -288 -90 323 292 368 868
1216 868 634 547 626 499 267 186 191 -284 -444 -324 -192 -698 -808 -549 -400 -654 -415 97 132 -57 170 633
1238 633 661 438 396 619 372 323 294 -137 5 -360 -444 -668 -692 -590 -447 -343 -260 -213 177 439 148 450 791
1261 791 730 449 436 648 386 30 29 -113 -536 -659 -453 -566 -682 -604 -527 -286 -21 -71 82 387 500 574 557
1284 557 698 480 462 376 443 -55 -388 -90 -277 -669 -684 -552 -493 -458 -418 -242 -175 -248 242 306 408 449 645 661
1308F61l3l33L6j82j79j79n4k94M6j07R6j1N8J20L09NK6K14L44J00j27N7J68k47
1332D94l90R6j3m52k81J00k00K33j91J38K0m6Q6L64M8L10j03K75R9k7m0j76N9
1355D03j74r7k21j20j21k52L04k04j44J73R8PJ94K30N4J62R2K40J8q1k74J57j82
1378B62l02P8k40l4l53J4L0j36O2J50M8L78P6J6L19J64Jj17J17J18M2m84j20K3
1402A12m04K1M3l87K1J08m2M1L82k62J73J58L58J65p4K38j52M0j45M6l5m39J17
1425H3m7j59l08j75m4q1K67L50j68J91J99J71J22R5j08q3L06q5j64j98k22J40
1447H2j28j82k7k86q4N6K9O3M3L27p3K72K78Ll2P9Nn4K55n7n43P3j14j28l19m2
1473e04R4p2N0Q2l8j49N05J29m0K40L31k29pJ02j23l8l01K59j66l91P9j3m60j9
$$ plain form
1308 661 628 295 331 149 -30 -209 -263 -557 -511 -618 -522 -533 -475 -355 -46 -41 -15 199 543 643 516 573 741 494
1332 494 104 200 187 -265 -546 -446 -646 -413 -604 -466 -446 -492 -406 -42 6 316 213 488 587 560 520 344 403
1355 403 229 132 -89 -209 -330 -582 -278 -482 -626 -453 -355 -348 -154 76 130 292 384 624 642 561 287 444 262
1378 262 -40 38 -202 -236 -589 -575 -545 -681 -619 -469 -421 -43 33 49 368 532 533 416 533 651 693 209 89 112
1402 112 -292 -271 -228 -615 -594 -486 -528 -487 -105 -367 -194 -36 322 487 413 651 499 539 394 440 405 -34 83
1425 83 36 -123 -431 -606 -650 -731 -464 -114 -282 -91 108 279 401 496 388 305 611 526 362 164 -58 82
1447 82 -46 -228 -255 -541 -625 -569 -540 -477 -434 -107 -180 92 370 373 341 420 425 371 626 569 26 99 -15 -143 -462 -504
1473 -504 -410 -482 -432 -350 -388 -537 -32 97 57 297 628 399 392 494 371 333 32 291 125 -266 -187 -200 -660 -679
1497f79M28j26j51L27O9j44J86P07j95l67N47J79n45K9K21k84m34J55lk75k60
1518f15K63J4m07L72M17m00L7O85m7k53M80K45l72j20K07k49k93J68K47m94j50
1539b65o6j46k60K38L26j78J56N15q1l20K70K86j96L8L29n5m19J00k4n42j66L71
1561h9n6k05K2K10m55r8M48Q6mL01L98m17q4L65N6j81J64K58n14k33k5l17k84
1584f54L36K76k79j01J63L9l64M31K87m0L21L44j08m45N3K55m12j5J99P6n99o2
1606b99J61n84J85L9M00m85L80K03j33O5L34J57K9K1J77k25m68K91j15m89L85
1627B9j49k05j55j18K42j96K38K96K1j14L38R3k45K26K4J54k15J15n3r5j35k67
1649a71K3j61Q0j73j13K86j01MK24O0R7K26l11M54K7l9P4k01j36L2j49j02J98
$$ plain form
1497 -679 -251 -377 -528 -201 -132 -276 -90 617 422 55 602 781 236 265 486 202 -232 -77 -80 -355 -615
1518 -615 -352 -338 -745 -373 44 -356 -319 366 319 66 546 791 419 299 506 257 -36 132 379 -115 -265
1539 -265 -331 -477 -737 -499 -173 -351 -195 320 239 -81 189 475 279 317 646 591 172 272 248 -294 -460 -89
1561 -89 -145 -350 -328 -118 -573 -671 -223 -137 -141 160 558 141 57 422 478 297 461 719 205 -28 -53 -370 -654
1584 -654 -318 -42 -321 -422 -259 -220 -584 -153 134 94 415 759 651 206 259 514 102 87 286 362 -237 -299
1606 -299 -138 -722 -537 -498 -98 -583 -203 0 -133 -68 266 423 452 473 650 425 -43 248 133 -356 29
1627 29 -120 -325 -480 -598 -356 -552 -314 -18 3 -111 227 320 75 301 325 479 264 379 326 231 96 -171
1649 -171 -148 -309 -229 -402 -515 -229 -330 -326 -102 -42 55 281 -30 424 451 412 486 285 149 181 32 -70 128
1672A28l84k24J99j33j06m3L08Q1K10QQ1m9J42J27r3J47J37O0n35j68K61k21k87
1695c54J10N7k39P1J88k65n7L20K45L1k5K91R7j51p8J22k5l53K06N0k65j3n7k53
1719c47j08J04r9L1K34J74J8j17K30J57k4K06J06n2l19J92j52j18j18J47j65k90
1741c10J22n6j02n5J14L6R3N6K63J0M0J73j46J26O0j4k21j35K56o09J43r4j12
1764c62m1P5L8K6j99M27R3N5j6P1R2J71k39K51j60r1P2j93j71N6n8j57j2l0J1
1789b91n6j7K66J9J86q9J71k2J32J07k55K22q0j93j46K96m14j43L3o6J33k19J65
1812b61p4J8K4K22J19J62J7N2N3J47k57J19k01k3j16k8n8j7j86%L2j20K91l70
1836d55J53L89o3R4J81j40J09q3l3J16j86J07n0k47J50k93j27O1K01k52Q2n9K46
$$ plain form
1672 128 -256 -480 -281 -414 -520 -563 -255 -174 36 44 125 76 218 345 252 399 536 596 61 -107 154 -67 -354
1695 -354 -244 -187 -426 -355 -167 -432 -489 -169 76 107 82 373 470 319 241 363 338 -15 191 241 -24 -37 -94 -347
1719 -347 -455 -351 -450 -419 -185 -11 7 -110 120 277 253 459 565 513 194 386 234 116 -2 145 -20 -310
1741 -310 -188 -244 -346 -401 -287 -251 -158 -102 161 171 211 384 238 364 424 410 189 54 310 -299 -156 -250 -362
1764 -362 -403 -328 -290 -264 -463 -36 57 112 96 167 259 430 191 442 282 191 263 70 -101 -45 -103 -260 -272 -302 -291
1789 -291 -347 -364 -98 -79 107 18 189 167 299 406 151 373 293 100 -46 250 -164 -307 -274 -340 -207 -426 -261
1812 -261 -335 -317 -293 -71 48 210 227 279 332 479 222 341 140 117 1 -27 -85 -102 -288 -288 -256 -376 -85 -455
1836 -455 -302 87 24 118 299 159 268 185 152 268 82 189 139 -108 42 -251 -378 -317 -116 -368 -286 -345 -99
1859i9L2L0K29L8P9j53K27j83J25l6l52K74k80m3n2O6k18o3J1K1Q1nP5L16o6R1
1885A45J69j29J16K6j49J07q6p1l9N3l20J07j04M7j50p0K65k21oL38j19L07rO
1909B13J42J71l11P5P9l47J39j17r5r8n1q2o3K72j41q7K23j04J13J46O4J46j05
1932A82mJ04j48K88n6k17j83p4M2j29j05l3J55k53K46j4J34r9K10J24q5J11J87
1955C83r2QQ5k57p4Q3J12m19j14J31k1j04j2P5j04O8K03J58o2J64J25n2m3J12
1979C53l8j66n1J52j59k44k9jl37M7K15J84q4J18P5k57J92K43N7j12J64K06j07
2002D21k71J14Q8n61J82Q7j83l82L36r8l24L37J34o2K44M3P9j47K60J42p9k79
2024H1J64K17m72J03p4j98l75L12Nnn7KJ93k78L17R1J21LL81l07L5qp1j5j07K3
$$ plain form
1859 -99 -67 -37 192 230 309 156 383 200 325 289 -63 211 -69 -112 -164 -98 -316 -379 -368 -347 -266 -271 -196 120 54 145
1885 145 314 185 301 327 178 285 199 128 89 142 -178 -71 -175 -128 -278 -348 -83 -304 -310 28 -91 216 207 213
1909 213 355 526 215 290 369 22 161 44 -51 -149 -200 -282 -345 -73 -214 -301 -78 -182 -69 77 141 287 182
1932 182 178 282 134 422 366 149 -34 -108 -66 -195 -300 -333 -178 -431 -185 -199 -65 -164 46 170 85 196 383
1955 383 291 299 384 127 53 136 248 -171 -285 -154 -175 -279 -291 -216 -320 -252 -49 109 47 211 336 284 241 353
1979 353 315 149 98 250 91 -153 -182 -183 -520 -473 -258 -74 -158 -40 35 -222 -30 213 270 158 322 528 421
2002 421 150 264 352 -209 -27 60 -123 -505 -169 -267 -591 -254 -120 -182 62 105 184 37 297 439 360 81
2024 81 245 462 -10 93 19 -179 -554 -242 -237 -242 -299 -297 -104 -382 -65 26 147 150 531 224 259 251 180 165 58 81
2050H1oj05j98q7K9J9q5K37j06L2Q4J06J37k18K25O7o1K0K67j56k34J44k00j76
2074a84J3M8L5q3j06N3j23J25O3M5K62j24J59L0j42N4J35j30qK01m08LJ8j1k18
2099b93k8N7J79q4R6J5j3O8M5j30J88K88q2k81k3J91k46Qk0R5j82K12j66k67p
2124c80K05r2l9J76K63k42o9K66O4j56K98J8j00J6j54k1l41K1K25k5k25K58J2
2147b2k80j7K11r7J12J32K19k28J22L53l00nR3r9k59r6J64j41k43O7L44k90R2
2170a68K57j83m4K73q4L5k1J48K39m96L09j26m1M3j40n9k00J16K7j05r6K29L1
2193e6j76J75J20j60K17J74j4k02J41J8n9m7J31j90k06K88n8k06n9K4Ll7k11L82
2217hk09J30J38J7L3J33R9l4j20J45j05o6m2p1J1j71k46R8L1J11jj0K64k15N6
$$ plain form
2050 81 75 -30 -228 -315 -286 -267 -352 -115 -221 -189 -105 1 138 -80 145 212 151 171 438 282 48 192 -8 -184
2074 -184 -171 -123 -88 -171 -277 -224 -347 -222 -159 -114 148 24 183 213 71 125 260 130 122 323 -85 -82 -64 -75 -293
2099 -293 -321 -264 -85 -169 -73 -58 -71 -3 42 -88 100 388 306 25 2 193 -53 -45 -65 30 -152 60 -106 -373 -380
2124 -380 -175 -267 -306 -130 133 -109 -178 88 152 -4 294 312 212 228 74 53 -288 -267 -42 -67 -292 -34 -22
2147 -22 -302 -319 -108 -205 -93 39 258 30 152 505 205 200 293 194 -65 -161 3 -138 -381 -314 30 -260 -168
2170 -168 89 -94 -138 135 51 86 65 213 452 -44 265 139 98 141 1 -58 -258 -142 -115 -220 -316 -87 -56
2193 -56 -232 -57 63 -97 120 294 280 78 219 237 178 131 262 72 -134 154 96 -110 -169 -145 -142 -179 -390 -8
2217 -8 -217 -87 51 68 101 234 333 299 179 324 219 153 111 40 51 -120 -366 -268 -237 -126 -127 -137 127 -88 -32
2242c2QJ14J52j29O0n3J04lj66J08j47M8l09M5J2j83K09Rr2J18L9k5O3K14l9k1
2268A04J16Rq4k24J19J17k82J11m8j35J24p5J8J56q7m6Q4k1L29rk52K25M8o8J5
2293B44k15J37j76k8L2k62J87n4Pj93N0n6K2K66l0k9K92l5Q1oL0j8Mj77J46j16
2319A03J0q4p0q8k5j00K30j26k07L10R4J54l1J39l25J37J9J20l1j00j17j4N6j01
2343d7o6j9j0r4L2N5q5J11R3j16J56N3J37N6p2M4j02O7p8J5p4k31K26l6m0q7J25
2370A3j74P7j29K10P4k14K62q4m4J78J7j39J52j23q5K37j07m8Qk70O9O5O8q0r7
2395a64R4m7K72j82R3J30M9j73k9J96j66o7Q4k11pK0k77J95M0J13r8o9l7K87k34
2420a88J18L16j14J53K2j71J09j4n6m6K6j37m7k76N8J46j04R2M8P1j11j38R3J24
$$ plain form
2242 -32 -24 90 242 113 173 120 224 221 55 163 16 64 -245 -200 -188 -371 -162 -153 -245 -127 -88 -113 -50 164 125 104
2268 104 220 229 145 -79 40 157 -125 -14 -62 -197 -73 -148 -130 26 -61 -107 -23 -44 285 276 24 249 297 229 244
2293 244 29 166 -10 -38 -6 -268 -81 -135 -128 -321 -271 -327 -305 -39 -69 -98 194 159 240 234 264 246 250 73 219 103
2319 103 113 29 -41 -129 -154 -254 -24 -150 -357 -47 47 201 170 309 -16 121 140 260 229 129 12 -2 54 -47
2343 -47 -113 -132 -142 -236 -204 -149 -234 -123 -30 -146 10 63 200 256 184 228 126 193 115 130 56 -175 51 15 -25 -112 13
2370 13 -161 -84 -213 -3 71 -143 119 35 -9 169 186 47 199 76 -9 228 121 73 81 -189 -120 -55 13 -67 -164
2395 -164 -70 -117 155 -27 66 196 245 72 43 239 73 6 90 -121 -128 -108 -385 -190 -150 -37 -135 -204 -241 46 -188
2420 -188 -70 246 132 285 307 136 245 231 175 129 155 18 -29 -305 -247 -101 -205 -113 -65 6 -105 -243 -150 -26
2444b6J37n9K17r7jK8j54O6j16m2l2j07o6J88p9O9rp2J03l7K48j81M9R7r7J92
2470B19n6K2Kj78J34j71J19k21l2K2J13q2j13J9R5L4p3M1J18l5J47J3O6p0n3l4
2496D6J9k5lj18Q0j43n2O4j78JK03J93j59p7M7K01P6o4P4k9q3Q1l0r0l6J60j59
2523aj81J49k51K43k35p9J75jK50m5J01k15K77r7K7N0n2k8pJ11k13r6j32L60j94
2548h4k6N7J46l41J46K85j92PK84k4j16J79m4k57J16l1N0k50k4L05k22j81M6K57
2572H6k48J97L2j39J2J45j20J4P9K51j52q0J59j43j65J03l8L3j04r2n5R0j28J40
2596a23J09j39K30Q4k28J00J58Q5l40L43n1k88R5mj02j87J20K73k03p6J90j11
2618f5Qj05L0J56l9M3K70j03n2r5K20k42Q2J27l98K00O8M7l93K55k94K45j08Q0
$$ plain form
2444 -26 111 52 269 172 171 199 45 111 -5 -47 -79 -186 -252 -64 -143 -74 -83 -155 -52 -89 159 -22 27 124 27 219
2470 219 163 185 187 9 143 -28 91 -130 -162 -140 -27 -109 -222 -203 -108 -74 -147 -106 12 -23 124 137 203 133 80 46
2496 46 65 40 37 -81 -1 -144 -196 -132 -310 -309 -106 87 -72 -149 -102 99 175 111 185 156 73 154 124 34 -2 158 -1
2523 -1 -182 -33 -284 -41 -276 -355 -180 -181 69 24 125 -90 187 90 117 167 115 87 80 191 -22 -118 -250 110 -84
2548 -84 -110 -53 93 -248 -102 183 -9 -2 282 258 142 321 277 20 136 105 155 -95 -119 186 -36 -217 -171 86
2572 86 -162 35 67 -72 -60 85 -35 -21 58 309 157 77 236 93 -72 31 -7 26 -78 -170 -225 -135 -263 -123
2596 -123 -14 -153 77 161 -67 33 191 276 -64 279 228 -60 35 31 -71 -258 -138 135 -68 -144 46 -65
2618 -65 -57 -162 -132 24 -15 28 298 195 143 48 268 26 108 235 -163 37 105 152 -241 14 -280 -35 -143 -63
2642f3r2J11P5k8J07q8R0J28k84K6J51j00k32J33P6l47M28j66J31j43J22j96p4
2665b35J25J28J10j96K88j47j47M29j31j19p1J15k3j54j59K55l40J48l1Qq8R0
2687a45mJ06K6L9j15J38J10q4O6j14J72r3k3j73O4j43J24k3r9J11J37k71J47M8
2711AJ06k1j00o5p1J31o5o0J61J39j38o5o7K58j69n7R1j77j10K99Q7k04K06j70
2735f0J54R2j82P0l9R4o5R3k07n2L4O7r5o3k05J39J42j04K24l7J8j4J39j66J17
2760I4r2o2J65J11o9l5j36j61J13K54l18j6N2j8J02m9M2K23k34mJ04mM3k9k1O8
2786A23p5M2Q2q7o0j17J07k8k8J21o6J24j69O2j40J08j7k9J15lJ08o5l4j12po0
2812a05L24l40j08K20j65J86j11J11k7M0j84Q6K13j30Q3Q3OLk43J04n5j71J04
$$ plain form
2642 -63 -155 -44 31 3 110 22 112 240 -44 -18 133 33 -199 -66 10 -337 91 -75 56 -87 35 -161 -235
2665 -235 -110 18 128 -68 220 73 -74 355 224 105 34 149 126 -28 -187 68 -272 -124 -155 -147 -235 -145
2687 -145 -149 -43 -17 22 -93 45 155 71 137 23 195 102 79 -94 -30 -173 -49 -72 -171 -60 77 -194 -47 1
2711 1 107 86 -14 -79 -150 -19 -84 -144 17 156 18 -47 -114 144 -25 -82 9 -168 -278 21 108 -96 110 -60
2735 -60 94 186 4 74 35 129 64 157 -50 -102 -68 -1 -96 -159 -364 -225 -83 -187 37 0 18 4 143 -23 94
2760 94 2 -60 105 216 147 112 -24 -185 -72 182 -136 -152 -100 -118 -16 -65 -23 200 -34 -38 66 62 105 76 55 123
2786 123 48 90 172 85 25 -92 15 -13 -41 80 14 138 -31 31 -109 -1 -18 -47 68 65 173 108 74 -38 -45 -105
2812 -105 219 -121 -229 -9 -174 12 -99 12 -15 25 -159 -73 140 10 93 176 182 185 -58 46 -9 -180 -76
2835g6J01K0j51j76J20J79n6l8j50J88J34m3j63K69j10N2k02J40J88k09j07rJ70
2858G1r9M9j17J67q9j17K5P3j51P9J78K25k47O6K2Kl1p4N3k1l3J02k57M1Q3p8
2884g8n9j56L29l12K60r5J81j97J42q0J83Nn9J14j56P1j18O2J2J9o4j26J29J62
2908A69k66J78j76o1K39j85R6J35l7q4J68N2l89K57K8o3k22J96j71J42K4k42J13
2931i9L9R8j43o0J29J11Q0q5k4L3R6m4qj26j5N0l13J65P0J02j44N8p4K01j34j0
2957d7j2J6l0J5J21p0Q1L7k1p9Q8k3M2q1m0j80o0J51K00j16L5MJ18k05J80k64
2983a40O1L36j90J10l9j75K00p3j88K13q1j3j13K6q2K0k9J4R8N0J14j57j8J55
3007I9ML6K7j60Rp6J57J08j49l33K83Rk13K43j50L4o5J78j23N9O4P6pk48J48m6
$$ plain form
2835 -76 25 45 -106 -282 -162 17 -39 -77 -227 -39 95 52 -111 158 48 100 -102 38 226 17 -90 -99 71
2858 71 -28 21 -96 71 -18 -135 -110 -37 -188 -109 69 294 47 113 135 137 106 32 85 64 31 133 -124 -83 0 -78
2884 -78 -137 -293 36 -276 -16 -111 70 -127 15 -65 118 123 64 178 22 93 -25 37 49 68 4 -122 7 169
2908 169 -97 81 -95 -156 83 -102 -6 129 92 8 176 228 -161 96 124 61 -161 35 -136 6 30 -212 -99
2931 -99 -60 38 -105 -165 -36 75 155 70 46 79 175 131 123 -3 -18 32 -281 -116 -46 56 -88 -30 -104 97 -37 -47
2957 -47 -59 -43 -73 -58 63 -7 74 111 90 11 99 76 118 37 -3 -183 -243 -92 108 -8 27 31 149 -56 124 -140
2983 -140 -79 257 67 177 138 -37 163 90 -98 115 34 21 -92 -66 -148 -128 -157 -143 -45 5 119 -38 -56 99
3007 99 103 139 166 6 15 -61 96 204 55 -278 5 14 -199 44 -106 -72 -137 41 -82 -23 41 117 110 -138 10 -36
3033c6J34k15K63k61J31N9k27K32O0r0k01J11N7k81J10J64O8j51J38%J49n4k25
3056f5M57k66Kk31M9k63K11J38j01q1J07J60k90J34O2k2j05Q1l6J46j14J04M0
3079A17J7Qn8j9j34J8p3P8M0K4K5M4j35n4K3k3K50j00o3m0K5L5j0J67j35r2Q1
3106A6p2l0J1J20j32l5J43j2j10J75O0r8j45J96N7j58J66J08k66Nj5j58P0K4P7
3131cJ9k40J89J13j87R8R0j51J54r7K6j0M5J58l86K67n5K2O2Lj53k9L6J56k55
3156a28J81k47P2P5qJ39j11o9R0Q9Q0q8K6L3L6k63J40o9r3Q4l2L7m6j10K75k9
3182F4k4oL3J03j63J89j30N8N6k31LM6J7J8O5n0k27q5K05L1l5m3N9J58n2j0k7
3209B2Q8j74K21m0L3j85N3j13J00O7m5k22R7J62P6k51J66k31J35KJ19r3R1m7J95
$$ plain form
3033 -36 98 -117 146 -115 16 75 -152 80 140 50 -151 -40 17 -264 -154 10 78 -73 65 65 214 160 -65
3056 -65 392 126 128 -103 -54 -317 -106 32 -69 -150 -43 117 -173 -39 23 1 -104 -23 -59 87 -27 77 117
3079 117 134 142 84 65 -69 -51 -124 -46 -6 18 43 87 -48 -102 -79 -102 148 48 -15 -55 -30 5 -5 162 27 -65 16
3106 16 -56 -86 -75 45 -87 -122 21 9 -101 74 134 36 -109 87 144 -14 152 260 -6 -1 -16 -174 -104 -80 -3
3131 -3 16 -224 -35 78 -109 -11 79 -72 82 -15 11 1 46 204 -182 85 30 52 114 117 -36 -65 -29 127 -128
3156 -128 53 -194 -122 -47 -55 84 -27 -96 -6 83 163 75 101 134 170 -93 47 -22 -115 -31 -63 -26 -72 -182 93 64
3182 64 40 34 67 170 7 196 66 124 180 -51 -48 -2 15 33 98 48 -179 -264 -59 -28 -63 -106 -47 111 59 49 22
3209 22 110 -64 157 117 150 -35 18 -95 5 72 27 -195 -98 64 140 -111 55 -176 -41 -39 80 -13 78 31 226
3234B26j46OJ18j02j84j33J47j6J08p1M0Q5k41O9K2n6Q3J02N4o4J4p8K4K29j27
3259A09J07k46k9J32j88J59j37%J3n8J15J70k31J98j57K5J45n7j21J00J3j1J47
3282A98o9j91P6jn0j14R8P2J2PLO8q4J87j65l8J30K5j46K2Pj45P3j04RJ33n6L8
3310eK1p3K8J9r1R0m3K3L1j6J38o1j27N7N2N9K7j58j4jJ79j05Kj36p1K2J84j50
3338a19K28k28L61l27L6J80k06J75l1n5J82j00j44J31m1n3K4n1mk0L1J7R1qj0
3363E9J3q8O2o9l6P4J34j09q9J00lj16J05kl8J02l1j73L3K15qk24J74m6j4M8N3
3390A26l4k6RJ01o7o8m4J5j47J68k0m1J3M1o6L1O8j81L9Q0m2K4m5J31J24r9o5
3417B5qm4M8n1Q9j42m5K23k61K1K6R8K5Q9Q5k07j00J98n8k6J39j53m6J00j8O1
$$ plain form
3234 226 80 86 204 102 -82 -215 -68 -84 24 -47 -7 78 -163 -94 -72 -128 -45 57 111 47 61 -17 7 236 109
3259 109 216 -30 -59 73 -115 44 -93 -93 -80 -138 -23 147 -84 114 -43 -18 127 70 -51 49 62 51 198
3282 198 129 -62 14 13 -37 -151 -53 19 31 38 41 109 25 212 47 9 139 164 18 40 47 -98 -25 -129 -120 13 -43 -5
3310 -5 16 -57 -29 -10 -101 -11 -54 -31 0 -16 122 61 -66 -9 43 102 129 -29 -43 -44 135 30 32 -104 -175 -153 31 -119
3338 -119 109 -119 242 -85 -49 131 -75 100 69 14 196 96 -48 83 42 -11 13 -38 -42 -62 -31 -14 77 69 59
3363 59 72 -16 46 -23 -59 15 149 40 -49 51 48 -68 37 35 -3 99 68 -105 -72 143 135 -89 85 39 25 73 126
3390 126 92 66 75 176 109 41 -3 12 -135 33 13 -28 -15 26 -40 -9 59 -122 -83 -3 -45 -21 -66 65 189 90 25
3417 25 17 -27 21 -30 59 -83 -128 95 -166 -145 -119 -21 4 93 178 -29 -129 69 11 -15 124 -29 -75 25 7 68
3443F8j2j60K00k97N2J91j54R6q0L0J29K1j18K89j88kJ7n1n6P5L2M2q2r9M2K4
3469IQ0j45J63l9j58J43m8k01J64J10j23p9J31j1q4J18J11j56L3l5j2n4M6Nq9
3494a21J2R7j51J79l3Q9o6M8o8K3N9n7Mj7j19J03O2R2r6N1o0Om1r0L2J47k31J41
3522eJ34j95L8PQ0r1rN5%K3n9mP8q7nM3m6K13o5j77J31n6m1N8r7J03o2j9J44j44
3552e5O8p1j8J88j24j93J69k1J65j92J03j91K25j9M9j41J52r1J06j2R1k80K16
3575A24J10j93m8p9P2L1K0Mj43M8N2r2J83j02J08J38r2J55l20k4K03n1q8o0j25
3600a69J93N0l8o8q0O4j4M0j08O7j8R0mk6J06o6j39K12K4k36J12Q9m0p3l7L5k2
3627e6J67o4m2M1n8N4p2q9J49o0J91j99mK72m26J36n8kJ79j77m4K62j62Nj4J9
$$ plain form
3443 68 56 -104 96 -201 -149 42 -112 -16 -96 -66 63 84 -34 255 67 65 82 31 -25 50 82 124 42 -57 -15 9
3469 9 89 -56 107 68 -90 53 5 -196 -32 78 -45 -124 7 -4 -88 30 141 -15 18 -17 -29 -83 -37 -32 -121
3494 -121 -109 -12 -163 16 -17 72 6 54 -14 9 68 11 15 -2 -121 -18 44 136 40 91 31 37 -4 -94 -62 85 -146 -5
3522 -5 129 -66 -28 -21 59 -32 -41 14 14 37 -22 -26 52 -35 -40 3 -43 170 105 -72 59 3 -38 20 -77 26 -36 -55 89 -55
3552 -55 13 -58 -76 112 -12 -205 -36 -57 108 -84 19 -172 53 34 83 -58 94 3 109 97 188 -92 124
3575 124 234 41 -7 -86 -14 17 37 41 -102 -54 -2 -94 89 -13 95 233 141 296 -24 -48 155 104 16 -44 -169
3600 -169 24 74 36 -32 -112 -48 -62 -22 -130 -63 -81 9 5 -21 85 19 -120 92 116 -120 -8 81 41 -32 -69 -34 -56
3627 -56 111 47 5 46 -12 42 -30 -119 30 -30 161 -38 -42 230 -196 -60 -118 -120 59 -118 -162 100 -62 -57 -71 -52
3653e2J00j00N1l8L9J0J58j53m9J70j94k0K8Q7K7n9J10j4p6j93J92j72J40R3j57
3678g2K02j67L6q5K64o3j69J5L5J28j62M3OM5j10q2K30k39P8J57k94K38O2k18
3702a22L6O4j18K10m4JJ74k64O2P1J22j5k28k0J81r0o9o7l4jK20N4j88M5j28q9
3728b37R3J27M1QJ4N7Pk15K92j42k27K1J20N1j02o7J88j22J31l7k5K37K2k07q2
3753e4K75j33q9%lj41J02l5J48l3q7Q0j13j9l7K05Q5r2o9J65j36l7J25k44O9J00
3779C2j1J0M0p6qj24Q5m6L9L5J51n2j15J74k46J96j34J37j23r6J72j5J1L4m8J84
3805B06k21J28j17J23j38j34J15q1q8J15l1J23J91pj54r9J6O0j30Q7M4Kj7Kj22
3830a27P8J29m4k9P6n2J3q2J18r6o8L5L1m6r7J16J5R6j36J7J26j32k8k1J09jR2
$$ plain form
3653 -52 48 -52 -1 -39 0 10 168 15 -34 136 -58 -78 -50 37 64 5 115 101 25 -168 24 -148 -8 85 -72
3678 -72 130 -37 -1 -86 178 115 -54 -39 -4 124 -38 5 11 56 -54 -136 94 -145 -67 90 -204 34 96 -122
3702 -122 -86 -22 -140 70 26 27 201 -63 -1 70 192 177 -51 -71 110 20 -49 -116 -150 -151 69 123 -65 -20 -148 -237
3728 -237 -144 -17 24 32 46 103 110 -105 187 45 -182 -161 -41 10 -92 -159 29 -93 38 1 -24 213 235 28 -54
3753 -54 221 88 -1 -1 -4 -145 -43 -78 70 37 -50 30 -83 -102 -139 66 151 59 -10 155 19 -18 107 -137 -68 32
3779 32 21 31 71 -5 -13 -137 -52 -98 -59 -24 127 75 -40 134 -112 84 -50 87 -36 -132 40 25 36 70 22 206
3805 206 -15 113 -4 119 -19 -153 -38 -119 -207 -92 -123 0 191 184 30 -69 -53 7 -123 -36 8 10 -7 -5 -127
3830 -127 -49 80 36 7 83 31 44 -38 80 -16 -84 -49 -18 -64 -161 -45 -30 66 -70 -53 73 -59 -87 -108 1 0 92
3857I2j60M8j3M1j12J34P0o9nJ12r0j96N7l2R8Oj31J30k27J76Q1k43M64m44J09
3882a04N3M5l9j00J22p6R1J64l3o1n0Nj46K38r6j51L4K33jj61N5K62l78J14L3
3907E3j07j31K62j45O1j9l1j19R0R9rN7K1o0Q8j25j10J72Q4m1j98R9O2j14M7N
3933ir8J19rM4r0m7J76j49J05Kj40K41r2Jj34J45r3m0J61M6j91J70j56J50q4k6
3959Bj36K82j5j11n0N9k2l2K9j15J96j13j1J84j72J88l07RL45p8k95J98L0m0j18
3984i3O7L0Np4R7p2r0Lm5L71j51r2J70j44J9l4L5oJ48k7Mj19M9l7j77K78p8k3
4012A4P9k2j35N0j1R0k05P0K44j22P4j84J45k50J69P5n9J24j82l0o1J67l8Q7j42
4037e3r9L70k35Q7M4j8k04O7O0j5P9J60k27Kj12L6J26j20J46l59L31N0L4k35K53
$$ plain form
3857 92 -68 -20 -33 8 -104 30 100 31 26 138 48 -148 -91 -123 -25 -19 -150 -20 -247 -71 10 -233 231 -213 -104
3882 -104 -51 -6 -45 -145 -23 -99 -8 156 123 62 12 17 -129 109 13 -138 -104 129 128 -33 22 284 -94 20 53
3907 53 -54 -185 77 -68 -7 -26 -57 -176 -86 13 4 61 82 22 110 -15 -125 47 131 90 -108 -9 53 -61 -14 -9
3933 -9 -107 12 3 47 -43 -90 86 -63 42 44 -96 145 53 54 -80 65 -28 -68 93 139 -52 118 -38 112 28 2
3959 2 -134 148 133 22 -28 31 9 -23 6 -109 87 -26 -37 147 -25 163 -144 -135 210 132 -163 35 65 25 -93
3984 -93 -26 4 9 -65 32 -40 -130 -127 -172 199 48 -44 126 -18 1 -33 2 -4 144 117 121 2 51 14 -163 115 37 14
4012 14 93 71 -64 -14 -25 65 -140 -70 174 52 126 -58 87 -163 6 81 22 146 -36 -66 -127 40 2 89 -53
4037 -53 -152 218 -17 70 114 96 -108 -41 19 4 83 243 16 18 -94 -58 68 -52 94 -265 66 116 150 -85 168
4062A68j45j64J42k5o6Q6k15J95K5qJ0j30R2j89L22j46R6p9K3J1p9J16oj78L11
4087A67k41L0K3n0J98j76J2L2P4j82J52Jj70J20L2n3m8p5K74p1J9m7J07J4r8L8
4113H2j85K1j58Q6K18r3l4rJ96j57N1n6J39J63k98O8p5J39o4J3P1k13J41q0o0
4138i4q2J42j77L68j85p8K1J64k14l7O5n9L28l09K53j87pN7J65k43P1K4N7J56
4162A99p9Q9k64Q5j77K17nj32J49j12Q3J31j15q8M2Q2k44L33j25r9j0K8O7P1j65
4187c9J07j20P6m4p9J61k09J31M5o5K32k90J46j48J41p2m5j41K06Q0j18l0j22
4210a97K33k3P2j07R4q7J8l2kO4Kj7k43J51J68N2j45p3J57j49p4J67J4r6k5J53
4236G5J11j18n3j60J22m2o7R1J93k14L3j2j74K65k23J26j38J11K0J17n8J1j24
$$ plain form
4062 168 23 -141 1 -24 -90 -4 -219 -24 1 -7 3 -127 -35 -224 98 -48 48 -31 -8 3 -76 40 34 -144 167
4087 167 -74 -44 -21 -71 127 -49 -37 -5 69 -113 39 40 -130 -10 22 -31 -79 -154 120 49 68 21 128 142 44 82
4113 82 -103 -82 -240 -154 64 -29 -63 -72 124 -33 18 -38 101 264 -34 34 -41 98 34 47 118 -95 46 -34 -94
4138 -94 -176 -34 -211 157 -28 -106 -85 79 -135 -172 -107 -166 162 -147 106 -81 -88 -31 134 -109 -38 -14 43 199
4162 199 120 209 -55 30 -147 70 65 -67 82 -30 53 184 69 -19 23 105 -139 194 69 -30 -40 -12 55 126 -39
4187 -39 68 -52 24 -20 -99 62 -147 -16 29 -36 196 -94 52 -96 45 -27 -72 -213 -7 73 -45 -75 -197
4210 -197 36 13 85 -22 72 -15 3 -29 -31 33 35 18 -225 -74 94 146 1 -72 85 -64 -138 29 43 -53 -78 75
4236 75 186 68 15 -145 -23 -65 -132 -41 152 -62 -29 -41 -215 50 -173 -47 -185 -74 -54 63 5 16 -108
4259a08m3J86L4j06J31j6rM2j41J3l7N1m9J98j16k1p2L08l03J75j3Nj30J1P9j64
4285i5J11o2K8M6k5m5Jk1J09k34J98n2Q0j07P8j46J20o3O1J66p4O7j36l6n9J55
4311F5n1m3J59k52J52o7k9J47r3J26l9n7n2K25j46J5j50l2J94j71PJ44j30J61
4335H3j8l9J41k06J7K6L4K3j98J49K6Q6j83N8j27J20n0JJ84l17K93n3k25J81m0
4360c4P9r8R1j34J39k2j02J58Kq3LJ1J24r5l2Q2p4J05p0M9k24O6L0q9J49j91J74
4387A4r2J58J31k11j5j05J9J22j28R4Nl6M7R4j07p6k6j4J10NJ21k10J38k41K49
4412D6m2j62K74K8k16J96j89L3j6N4L1j33P7j71J65m7J07j3j87J12R6M3o0r2L5
4437c1J29n6L0j55J4m9J8J73o3j98k4K00j24K19j86P0o6j7N3r5K18j52K93k47
$$ plain form
4259 -108 -151 35 69 -37 94 78 69 111 -30 -17 -54 -3 -52 146 30 9 -63 245 -58 117 104 109 -21 -10 69 -95
4285 -95 16 -46 -18 28 3 -42 -41 -62 47 -187 11 -41 39 -68 10 -136 -16 -79 -18 148 74 141 5 -31 -90 65
4311 65 14 -29 130 -122 30 -37 -66 81 -12 114 75 18 -34 191 45 60 -90 -122 72 -99 -92 52 -78 83
4335 83 65 26 167 -39 -22 4 38 61 -137 12 38 124 -59 -1 -128 -8 -58 -57 127 -190 103 50 -175 6 -34
4360 -34 45 -53 38 -96 43 21 -81 77 79 -4 -1 10 134 39 7 89 15 120 50 99 -125 -59 -29 -118 31 -160 14
4387 14 -78 80 211 0 -15 -120 -101 21 -107 -13 -8 -44 3 97 -10 -86 -112 -126 -16 -11 110 -100 38 -203 46
4412 46 4 -158 116 144 -72 124 -65 -32 -48 6 37 -96 -19 -190 -25 -72 35 22 -165 -53 43 86 26 -66 -31
4437 -31 98 42 72 -83 -69 -118 -100 73 10 -188 -212 -12 -136 83 -103 -33 -99 -116 -63 -158 60 -92 201 -46
4461d6j6l8M2M8o6Mq7qK42M9k09J5J44n1K0o2p5L7P8m6J92pm7j51R3o8NJ12o1
4490D3l9Q9n9R4o2j45j2J32j6l6r9J48K07j85m1j53J29j09Q6rj76J27M9J21j04
4515b0J16r5K11l05J22M3j22J35j43P1j6o0pP6k4q3N4O2Q3M0j31Pl1P6p5j35o4
4542b15J79NJ33j17l7j0n9L0M2L1L7Q5j48j14J48n6j53J10L8Q6qo9J30j70J25
4567B3r9R7J27j52l2K0p4O3J32j23r8N0l5R6j7J68j06M6k06K09j6j90J06j51K54
4592I2q2n8M9Nk38L91j78K2l1k8%P6j34J12N6N2k21K45k23L7MK6j2l1n5J56K2
4619E4j38O5K1J05j49O7J3m8q2J25P2j51M7j23P2P3k2r9KJ80j52K41k06k2k2Q7
4645A0K43l06j54J23K3jK7J77j51q9J30m0q6K42r8L6p0l3J21k56J04L1L3n5J77
$$ plain form
4461 -46 -62 -100 -58 -10 -76 -72 -159 -167 75 124 -85 -70 74 23 43 -19 -94 -57 21 -25 167 160 113 -38 55 -13 -8 104 43
4490 43 4 93 34 128 66 -79 -91 41 25 -11 -110 38 245 60 19 -134 -5 -114 -28 -37 -213 -86 -37 84 -20
4515 -20 96 1 212 -93 29 72 -50 85 -58 13 -3 -63 -70 6 -18 -101 -47 15 98 138 7 14 -17 59 -16 -151 -215
4542 -215 -36 -31 102 -15 -52 -62 -121 -91 -49 -18 19 104 -44 -158 -10 -66 -219 -109 -71 15 7 -62 68 -102 23
4567 23 -76 21 148 -4 -36 -16 -90 -27 105 -18 -116 -66 -101 -5 -22 146 40 86 -120 89 73 -117 -11 -162 92
4592 92 10 -48 1 6 -232 159 -19 3 -28 -56 -56 20 -114 -2 54 106 -115 130 -93 -56 -52 -26 -38 -69 -124 32 54
4619 54 -84 -19 2 107 -42 25 38 -10 -92 33 105 -46 1 -122 -50 23 1 -98 -96 84 -68 173 -33 -55 -77 10
4645 10 253 -53 -207 -84 -61 -62 -35 142 -9 -98 32 -8 -94 148 50 86 16 -17 104 -152 -48 -17 16 -39 138
4670A38j06L5j07q0J09j88J59j30J94k5o0QO5j05j88L26j9n2J64l3k21K8j10J12
4694h6P4l7j5j15O5j6J50J6k7J25j61J36j38J68k05RJ37j14Kj60Q2Q5K25l30L56
4719B26k73J49M1j95j8j8J04J08n0j42J76j81R3k21L05r0j7l5J52p5K5J7n3Q5
4743A13p0o0p9P8M1m7j33N6J08r8Q6P2k8j52K81L5k32J01n0j51J70j01j28J43
4767d5J76L1j04J4N1N8j34k7j56J36j32Q9J19o5J74j61J5j98J39R3j27J2k7K36
4791A67k07Rk14K14N1j5m8J89k8k46J25oM3r7k73K79k7J10k3R1p2r0Q0j69L17
4816A60k79RQ6j8J28k07R0m1Q4L5M3m4j13k1K3j5J11j31L70k77l7J11n4j86N3
4841a20Q8R1j40J88k9k17Q1R0k34J47O8p0L3N0j14K8J03J8k23N4J09k02J88K0
$$ plain form
4670 138 32 67 -40 -120 -11 -199 -40 -170 24 -1 -61 -53 12 -93 -281 45 26 -26 138 105 -116 -88 -198 -86
4694 -86 -12 -49 -64 -179 -114 -130 20 36 9 134 -27 109 -29 139 -66 -57 80 -34 -32 -192 -110 -25 200 -130 226
4719 226 -47 102 143 -52 -70 -88 16 124 74 -68 108 -73 20 -201 104 14 -3 -38 114 39 64 81 28 113
4743 113 43 -17 -96 -18 23 -24 -157 -101 7 -91 -5 67 39 -113 168 203 -29 72 22 -129 41 -60 -188 -45
4767 -45 131 162 58 72 123 181 47 20 -136 0 -132 -43 76 11 185 24 39 -159 -20 73 -54 -42 -69 167
4791 167 -40 -31 -245 -31 20 5 -43 146 118 -128 -3 -9 34 -63 -336 -57 -84 26 3 94 22 -68 12 -157 160
4816 160 -119 -110 -24 -42 86 -121 -31 -72 12 47 90 46 -67 -88 -65 -80 31 -100 270 -7 -44 67 13 -173 -120
4841 -120 -32 59 -81 107 78 -139 -58 32 -202 -55 13 -57 -24 26 -88 -60 43 61 -162 -108 1 -201 -13 7
4865Gk5q3K8l5m3R7l5j60K46j5o6R1J11q4m3o0J14R4p7r4j3m4K14p9J07j70J27
4892A10j95j1P7O5P8j01K2l5J52p9q1Pj0M2j01L5N4J8J0k39K47n5n7K32q7j60
4918f2J05o3O1J09r8L0j42J43j05Q3j16P6qJ19m5j01J32j03Q3q7j4L2j19R3O9
4943G2j8q5P6m1j30K31k73K05o2J31m2j74K54j86M3j51J38j4J00l8K0M6k11J41
4967C2J02j17k0R4r9j4K13j32j54J44j41LJ40n3m4K14k32K31r0r7n2l5J58j84
4991a33N2K6J05N4j97J1K7km2K5J07r8J65N7m6n1p1n1Q3J05j22J46j05j45n9K07
5017D8J57j86j16J15k4q5O8Q1r2J88k74K00K0j46j67N4J50j46J22kQ8j48rK06
5041A02j0j15K2j9N6k24K08J14j40o4J12j73N9R8K00l48J88j30k5O5m3r3M9P1
$$ plain form
4865 7 -18 -101 -73 -108 -151 -54 -89 -249 -3 -18 -84 7 118 34 -9 -69 45 139 62 -32 -45 -89 125 46 153 -17 110
4892 110 -85 -96 -19 46 124 23 45 10 162 83 2 9 -1 41 -60 -25 29 47 57 -182 65 10 -47 185 98 -62
4918 -62 43 -20 41 150 52 82 -60 83 -22 61 -55 21 13 132 87 -14 118 15 98 11 -3 29 -90 3 72
4943 72 54 -31 45 4 -126 105 -168 37 -25 106 64 -110 144 -42 1 -150 -12 -26 74 36 56 102 -109 32
4967 32 134 17 -3 91 -8 -22 191 59 -95 49 -92 -89 51 -2 -46 168 -64 167 77 -20 -72 -107 51 -133
4991 -133 -81 -55 50 104 -93 -82 -55 -57 -99 -74 33 -65 100 157 111 60 -11 -62 21 126 4 150 45 -100 -159 48
5017 48 205 19 -97 18 -6 -91 -23 58 -34 154 -120 80 100 -46 -213 -159 -9 -155 -33 -35 53 -95 -104 102
5041 102 92 -23 -1 -20 36 -188 20 134 -6 -70 42 -131 -72 26 226 -122 66 -64 -89 -24 -67 -160 -111 -40
5065d0J09p6%P6k44O0J19j54p1K11n5N2J22k06M1J28j71J15J11k14O7P4J60j47
5089F7p0k0J06k16pP0R6m3o6J2j5J56r2J59r7l3L7q4j2J44j26n6R5J13j21Q5p
5116G5j4m3n1J44j5j37O1JjM2j14J20J03j49Q7j26j20K45j12OJ30J49k57j44J10
5141a0Pj3M9j53J99K0m2J3L0K7k27J02L5O2J2j46o6O9nj4l8j0R7O9J4Oj31J89
5169A45j78K8R6Oj27P6o5J69j94O2j88J00J1o8P0J41j54J73p5pj54k2Q3J96k21
5194i7j20K78N1j01o0L4l3J10k00J20j03J07J7J46p9M9j99J05L7k7k41J69K23
5217A86k5q3n2j58J13J03q5k8l1K4r2K00j51k7O6J35j15M9r1P4k02K24j05O4M2
5242C5Rp6K19j13j04K02l88K59k3j74J60o7J11o2p8l3Q9N2j43K56l28J50L3M5
$$ plain form
5065 -40 69 -7 -7 69 -175 -115 4 -150 -221 -10 -65 -13 109 -97 -56 72 -99 16 127 -87 -20 54 214 67
5089 67 -3 -23 83 -133 -140 -70 26 -17 -83 -71 -86 70 -22 137 40 7 44 -40 -52 92 -34 -90 5 118 -3 82 75
5116 75 61 18 -33 111 96 -41 20 21 20 62 -52 68 171 22 109 -17 -137 108 -4 2 132 281 24 -120 -10
5141 -10 -3 -16 33 -120 79 99 57 70 100 127 -100 2 37 99 111 -35 -101 -32 -37 -51 -89 -99 -2 67 81 87 -44 145
5169 145 -33 -5 91 97 -30 46 -19 150 -44 18 -170 -70 -59 -127 -57 84 -70 103 28 21 -133 -155 -72 124 -97
5194 -97 -217 61 112 11 -49 -15 -48 62 -138 -18 -121 -14 3 149 70 119 -80 25 62 35 -206 -37 186
5217 186 161 78 26 -132 -19 84 -1 -29 -60 -36 -128 72 -79 -106 -40 95 -20 29 -62 12 -190 34 -71 -7 35
5242 35 44 -32 187 74 -30 172 -216 43 20 -154 6 -61 50 -12 -90 -123 -34 18 -125 131 -197 -47 -14 31
5266C1j51k0J42J25j87r3J29j32K59j72RpJ29o9l9r5J80p9J61p7J66l61L03j08
5290D4j79J49k1Q8n5q6J70m3j96J71O6m4j23J15q4j63J83kq2j30M05k66qP5Q1
5315F5p7N2K9p2M1j33J79M7j61n6K27p4j64J19J28j85R7jo0J3j09O7J20k63L44
5340A73k38R6K7j29J25q3R3k3O%p2j5J28j50Q2j18Q2K8q9J70K4k63J00qJ14J11
5366A71j46J75j02j01K03l42J48j36K6K63j28j6j64J30j0M2k8NQ1j29l5Q2O0k13
5390a64L30k60J13Q2m7k75K71P8K8j51j78R0J30K8j83J80j44k6J48p8J33l5j11
5413d1Q3j04J3J14k00J81O3k94K58j48O7j8K08j12j25k2N0J93j98P5j7j70K31
5436H7mk5J7q4K3m2O7O1m4pn0q4J3kJ12P7l46L71j7l1N2k17K26j69O3p6L8Q3j60
$$ plain form
5266 31 -120 -140 2 127 -60 -153 -24 -156 103 -69 -60 -67 62 -7 -46 -141 39 -40 121 44 210 -151 152 44
5290 44 -135 14 -7 81 26 -60 110 67 -129 42 108 64 -59 56 -28 -191 -8 -10 -92 -222 183 -83 -91 -16 65
5315 65 -12 40 69 -3 38 -95 84 131 -30 -86 141 67 -97 22 150 -35 62 61 1 14 -95 -28 92 -171 173
5340 173 -65 31 58 -71 54 -29 64 41 47 47 -25 -40 88 -62 20 -98 -16 12 -77 93 117 -146 -46 -54 60 171
5366 171 25 200 98 -3 200 -142 6 -130 -104 159 31 15 -149 -19 -29 13 -15 -10 71 -58 -93 -11 49 -164
5390 -164 166 -94 19 101 54 -221 50 128 156 5 -173 -83 47 75 -108 72 -72 -98 50 -28 105 70 -41
5413 -41 42 -62 -49 65 -135 46 109 -185 73 -75 -8 -26 182 70 -55 -77 -27 166 -32 43 26 -144 87
5436 87 83 58 75 -9 14 -28 39 100 56 49 -1 -85 -72 -74 38 115 -231 140 123 92 144 -73 153 -16 47 -29 9 92 -68
5465f8m6O5K68k44L3M0j7r6M2n0J81o2n2J10j07J6j55l6K17P3p8K8M1j51j43Q3
5491a08r5L29k23q8K32k07J73Krk7q5k8K70j12J91j67j8J32j99j6k5l9K2J35r8
5516e8OO9P0j27K01j42p7n5K01j62K10n1J2M2j48K11k2k06l3L1R0j04Q3k3LM6
5542F7j49J75q3n5J32o1j51K17qrMK0q5m4K6j8o3K37k18kL2J39p7p3P1L8k6j87
5570a51J03J47j47P6p3K33j05l8j4n0R8o6%J44r8j2MP2j95J67K4j35p6J37o4R7
5596G8O1k28NK0k3J11Q7k17Q4L6m1J14j36%M9j2Q8p6rK3%K2J11k25J97r2J06j06
5624B7l7O1k16K59j41J71k26J94pQ9j67k8m3L9R4q8P9j93p5J17J21m7K1p8J91
5649A17j37l1J33n1j04P4k9r8P1N1j34J99j9j22J1m1L6N8M3j04P2mo0J16n1J59
$$ plain form
5465 -68 -114 -49 219 -25 8 48 31 -65 -23 -73 108 46 -6 104 -3 13 -142 -178 39 112 34 62 103 -48 -191 -108
5491 -108 -203 126 -97 -185 47 -160 13 15 6 -21 -106 -134 136 24 215 48 30 162 -37 -53 -78 -117 -95 40 -58
5516 -58 -52 17 87 -40 161 19 -58 -113 88 -74 136 85 97 139 -9 202 180 -26 -59 -28 62 -42 41 18 21 67
5542 67 -82 93 10 -45 87 26 -125 92 84 75 79 99 14 -30 -4 -22 -85 152 -66 -68 -36 103 26 -47 24 62 36 -151
5570 -151 -48 99 -48 28 -45 188 83 45 31 -19 79 13 13 157 59 47 51 123 -72 95 119 -16 -92 45 -19 78
5596 78 139 -89 -84 -64 -87 24 111 -106 -22 14 -27 87 -49 -49 0 -12 76 0 -9 14 14 36 147 -78 119 27 133 27
5624 27 -10 51 -165 94 -47 124 -102 92 85 174 7 -21 -64 -25 69 -19 60 -133 -208 -91 30 -17 4 -74 117
5649 117 -20 -51 82 31 -73 1 -28 -126 -55 -4 -138 61 42 -80 -69 -110 -74 -16 27 -77 -5 -9 -69 47 -4 155
5675A55k24L0P1J66k11J03m6j47O1M6M9j56J13M3p6Km3l8Qj9J33k2q4j50L1K72
5701F7j74K6L5J2J44k56K4L07l30J75l4m2J1m7J10k07K87k41K21j81K1J55p0j07
5725i4k8K22P6n4Q0j03p7K3j66J96mk27Q6m5J98k74K76n2J3p0o8J14O1Q1p6K3
5751A11j74J41p9K18l13M0j4J7J22j39o3J13K8m3L0J37j29P4J21j00n1k1p2J06
5775F0j6j58J33q4J88j48K11k38O8mM9k16K60k1j68J46Oj6n1q3O4Q8r8m3J15m8
5801do4L2LJ01p0j05J80k94L87j94R0j76M4J28j02L7J91j92rm4j8K13j0p1L0N0
5827A33j48J6p5J4O3J61o1j00or6J61n2R3o9o6KQ5J5N7n1k48K18j11J25q4N2k
5854B6q1l2n4j10J98Q7p4N9k24J79Q0Ok2l6l5o4K25J39k15j2j7L2j19J28m7L3
$$ plain form
5675 155 -69 -39 32 198 -13 90 44 -103 -42 4 53 -103 10 53 -23 -21 -64 -102 -94 -113 20 -2 -86 -236 -205 67
5701 67 -107 -81 -46 -34 110 -146 -122 185 -145 30 -4 -46 -35 -82 28 -179 108 -133 88 -93 -72 83 13 -94
5725 -94 -122 100 176 122 202 99 22 45 -121 75 71 -156 -70 -115 83 -191 85 33 46 -24 -92 22 83 164 88 111
5751 111 -63 78 -1 217 -96 -56 -70 -53 69 -70 -133 -20 8 -35 -5 132 3 77 198 98 47 26 -46 60
5775 60 44 -114 19 -65 123 -25 186 -52 16 12 61 -155 105 84 -84 62 68 52 1 -82 -18 70 -28 -71 44 -4
5801 -4 -68 -36 -33 68 -2 -107 73 -221 166 -28 62 -114 -70 58 -44 -7 184 -8 -17 -61 -79 134 124 53 83 133
5827 133 -15 1 -74 -60 3 164 103 3 -3 -99 62 10 103 34 -32 -30 55 70 127 76 -172 46 -65 60 -24 28 26
5854 26 -55 -87 -141 -251 -53 34 -40 19 -205 -26 54 60 38 2 -33 -97 128 267 52 40 23 55 -64 64 17 50
5880E0p3O1m4O4L2n0j04J93o5j17R7J7m6j92O4J65m5p3J67mm5J8l5j3K22l44o9
5907a69L33k79K6J22o2o0P2J0j12J67j43P0R9q6K10k36K30m1j03k24L32k29K51
5930A78l13K69o6q5j22j3J24K8J81k38K38l64K7K27l9k5j11J78k2j58J17J5p5
5953d9J10o2K8j00J02rj88K59N3j34k8p4J26o2j18P4m5k4K14l08K75P9j49M9O9
5978H8l1j12J73j27O9j23K06m01K87j77J16o7J0N4n6J94l4P4j30j07P9K12j67
6001C0m9n7K48k43q9R3J14N6k60m5J95j45J87n4K19j32j16m5K34l34M0J79j4N5
6025F7j43J09nN3j08j15K30k89J69k8J7OQ2J07j49R3j91p3J33K34j54j49j9J24
6049AQ9j36j00K98k57l9R0M8j15K36q0n8K1Pm9J89j30p3J16k19Q2J83j71O4N8
$$ plain form
5880 50 -23 38 -6 58 90 40 -64 129 64 -53 44 61 15 -177 -113 52 7 -66 101 97 52 70 35 22 244 -100 -169
5907 -169 164 -115 -89 33 -29 -89 -17 -7 -119 48 -95 -25 74 -12 198 -38 192 151 48 -176 156 -73 178
5930 178 -135 134 68 -17 -139 -152 -28 0 181 -57 181 -183 -156 71 32 7 -104 74 52 -106 11 26 -49
5953 -49 61 -1 27 -73 29 20 -168 91 144 10 -18 -92 34 -28 -146 -72 -117 -141 73 -235 40 119 -30 19 88
5978 88 57 -55 118 -9 60 -63 143 -258 29 -148 -32 -99 -89 -35 -91 103 69 143 13 -94 -15 197 30
6001 30 -19 -76 172 -71 -160 -67 47 103 -157 -202 -7 -152 35 -19 200 68 -48 -93 141 -193 -153 26 12 67
6025 67 -76 33 28 81 -27 -142 88 -201 -32 -60 -43 -37 45 152 3 96 -95 -168 -35 199 45 -104 -123 1
6049 1 90 -46 -146 152 -105 -144 -54 -6 -121 115 35 -23 -2 5 -44 145 15 -58 58 -161 -79 104 -67 -3 55
6074E5L9j32j7m5L8O4o4J24o0J02j01o4R7l4J4l2M5j16K19j52R6j0Jk02J50j03
6100h8Q4O6j40J66r6P3j55J5J89kk23M1N2nK3Nm4N7J04r0j41J22k37L01j53o3
6126a39K03j06R8k4o8J33n7j58R0J4RN4j56J96r1q7M2J21n6l3P8n6o8m0K72j10
6152F1N0j30P3J17k50L4L44m68P7Q4j78J40o0m6L6J48j29J7J41J4o4N1R1j46l9
6177c2K05k41J39Q5j52qJ52j48J89j71L1j26m3k1K06m9qR9k7J06k38J12j4l1l2
6202a7j12P5J12K2j79J48m5j28R2J32j08J16j30M5j11M5J52j65J36m6n8J87Oj27
6226D2j0Ok1j88L29j68K28k27J01j23N4r0l8K18O9q5m4j28j8K15n8j18p1KK25
6251A02q4o9J17j70K56j91L6j9L0lJ8l9J41j57J08m4j48N8R9k4k3M0k03Q4J13
$$ plain form
6074 55 94 -38 -55 -100 -62 2 -62 62 2 104 3 -61 36 2 16 -16 29 -87 132 -20 76 66 67 -135 15 -88
6100 -88 -4 62 -78 88 -8 65 -90 -75 114 112 -111 -70 -18 -23 0 5 -39 18 122 32 -109 13 -224 77 -76 -139
6126 -139 64 -42 56 32 -36 97 40 -118 -28 -14 -5 49 -107 89 -2 -89 -47 74 18 -15 63 7 -61 -101 171 61
6152 61 111 -19 54 171 -79 -45 299 -169 -92 -8 -186 -46 -106 -152 -116 32 -97 -80 61 75 11 62 153 7 -32
6177 -32 173 -68 71 156 4 -4 148 0 189 18 49 -77 -120 -141 65 16 8 107 80 186 -52 60 46 15 -17
6202 -17 -129 -54 58 80 -99 49 4 -124 -32 100 -8 108 -22 23 -88 -43 109 -56 80 34 -24 163 169 42
6226 42 32 38 17 -171 158 -10 218 -9 92 -31 23 -67 -105 113 182 97 53 -75 -93 122 64 -54 -125 -123 102
6251 102 18 -51 66 -104 152 -39 -3 -22 8 5 23 -16 125 -32 76 32 -116 -58 41 17 -6 34 -169 -85 28
6276B8q9K29r9r2J54p2J20k13rr5J28P8k01J86j03J16J1k9j37o3K44j33r8K9R9
6301a1J79l1l4j54R3j41Q2P7o5O5R1k4P3pj09l1j10%n6K57k55M4O9N0r3K28m0
6328A47k37j33K96j31K10k08J26j00K9N3k6j13N2J33j23Nj36J61j12K17p0K2N3
6351A15j53J68O5k02o2P8j08R4R7k12N9J0l8J53K2j24p7L7j9L4K5n1J66j10J58
6376A25j35%m9l7K8J71k68R9J68j58P3N2k34J58j93K24Q5k13J31j10O5n0m4K71
6400A59l41J1K67o6k37P1M1J58j51K76j34r4J76k4R6j75m5KJ13R7j22m6j30l5
6424a33J30l5P5J0O6j13m7Pj71J43Q7j71Q1J99j98OO1k84L24j46J97j50J60R0
6448A88j52j23J75j34j08Q6OK41j47q5mJ96P6j57qL8j83J37j4J21j18Rn3R1n2
$$ plain form
6276 28 -61 168 69 -23 131 59 179 -34 -43 -138 -10 68 -133 53 -50 66 77 48 -89 -152 92 -41 -139 -110 -11
6301 -11 168 137 103 -51 42 -99 -17 60 -5 60 151 127 200 193 84 53 -57 -57 -113 144 -111 -67 2 52 -41 187 147
6328 147 -90 -223 73 -58 152 -56 70 -30 -1 52 26 -87 -35 98 -25 -20 -156 5 -107 110 40 62 115
6351 115 -38 130 195 -7 -69 9 -99 -5 92 -120 -61 -51 -89 64 86 -38 -115 -78 -97 -63 -38 -89 77 -33 125
6376 125 -10 -10 -59 -96 -68 103 -165 -66 102 -56 17 69 -165 -7 -200 24 109 -104 27 -83 -18 -68 -112 159
6400 159 -182 -171 96 30 -207 -136 -95 63 -88 188 54 -40 136 112 208 33 -12 -10 103 200 78 32 -98 -133
6424 -133 -3 -38 37 47 113 0 -47 -40 -211 -68 19 -152 -71 128 -70 -64 -3 -287 37 -109 88 -62 98 188
6448 188 36 -87 88 -46 -154 -68 -62 179 32 -53 -57 139 215 58 50 88 -95 42 28 149 31 40 -13 78 26
6473B6Pn9J00k7m5k6m3P6k7k6K48j80j2M7r1m6j06M09j30j25k9K82j31p4n0o3
6499i5J84n3r3LKQ2n5J04M5r5K0J7j23J10N3j57J2J16j94J59p5J42r8k9j25J37
6525fn1J8J40n2l5J7P4k00O1M5k3OJ53k09J9m1j48K02k8J16j40N0J9j60J73O9
6551F9r8J81J4k59P1n2K50k42L7J48l11J41Q5j24N6J59j85r1K28j18L7R6n6m7
6575a1J50j44J33j59M5j39K4L6O9J89l60J25L2j8nL8J06k14M0q3J86o7p5J94j77
6600h5M3R2J38j92p0J27m6m8J46pj25jn4J12Q2k00J7M8j6J8P8j29K2k4K0Q1J73
6627B00j5j83K6m3pK08k09R9q2k4k2k8J08r8J22j76Q3O7j51q9J56P0L0r1R2L0
6653G3j3Qj17J58j55J5L5Q2j88J41kj13L3L5mM7J62p3k32j4J69J30j92J11o2j2
$$ plain form
6473 26 33 -26 74 47 2 -24 -67 9 -18 -44 204 24 12 59 -32 -78 -184 225 95 -30 -59 223 92 18 -32 -95
6499 -95 89 36 -57 -54 -52 30 -25 79 124 29 49 66 -57 53 106 -51 -39 77 -117 42 -33 109 11 -18 -143 -6
6525 -6 -57 -39 101 49 14 31 105 -95 -34 11 -12 -6 147 -62 -43 -84 -232 -30 -58 58 -82 -32 -13 -173 0 69
6551 69 -29 152 166 -93 -22 -74 176 -66 -29 119 -192 -51 34 -90 -34 125 -60 -151 77 -41 -4 92 36 -11
6575 -11 139 -5 128 -31 14 -125 -101 -65 4 193 -167 -42 -10 -28 -33 5 111 -103 -63 -146 40 -27 -102 92 -85
6600 -85 -42 50 188 -4 -74 53 7 -41 105 98 -27 -28 -82 30 112 -88 -71 -23 -39 -21 57 -72 -50 -74 -54 27 200
6627 200 185 2 28 -15 -22 186 -23 76 -6 -30 -52 -80 28 -70 52 -124 -41 26 -125 -214 -58 12 42 -49 43 73
6653 73 60 68 -49 109 -46 -31 4 86 -102 39 37 -76 -43 -8 -12 35 197 124 -108 -122 47 177 -15 96 34 22
6679B2j41L6K18k07m9J07J6J33j41J12l5o4J01k03K05q3jj44J31J09j72J39o7
6702B2J69j59L2r3K07k32J10l7rk1N7N0q0KJ11k69L29k28l2L0j15R1J80j07J29
6727A37o3m7j15P0Q7j49L1j6J7P3j30J21R7j73J40J0j13R8r0M2P1j89K4J25j5
6752D3j92K8J16N9j32J30j28O9K1n8J12j7k10J23J64k11P2J28j55J7q0J85J0l4
6776F0m6N3r8J0L5K1p3p6K02j49J35l0q4J97k00J33j35N8L7J8j4j47K11o2j06
6801e0J01mj6j10J75R6j98J07j04J10j58kK7%J19o5R6j25k20K89Mk7Q8l9O0j15
6827C9p4Q3n4J18pr1j65k0K93r7J48q0j77p5J31K8r4l8J50J31j66K1j06O9O2J88
6853B17j78j31M5j23K13rj62J43q8j10K30m8k9j3J50j17l3Q2j4J58j91j0mj39
$$ plain form
6679 22 -119 -83 135 -72 -121 -14 2 135 -6 106 71 7 108 -95 110 27 26 -118 13 122 -50 89 22
6702 22 191 32 64 -29 178 -54 56 19 10 -11 46 96 16 18 129 -140 189 -39 -71 -41 -156 -65 115 8 137
6727 137 74 27 -88 -18 69 -80 -49 -65 -48 25 -105 16 113 -60 80 90 -23 75 -15 27 98 -91 -67 58 43
6752 43 -149 -121 -5 54 -78 52 -76 -7 14 -44 68 51 -159 -36 128 -83 -11 117 -38 -21 -101 84 94 60
6776 60 14 67 -31 -21 14 35 -38 -114 88 -61 74 44 -40 157 -43 90 -45 13 50 68 54 -93 118 56 -50
6801 -50 51 47 31 -79 96 192 -6 101 -3 107 -51 -53 -26 -26 93 28 124 -1 -221 68 72 45 133 94 154 39
6827 39 -35 48 -6 112 105 14 -151 -171 122 25 173 93 -84 -159 -28 0 -94 -132 18 149 -17 4 -102 -33 29 217
6853 217 39 -92 -47 -170 43 34 -128 15 -73 -183 47 -1 -30 -43 107 -10 -43 39 25 183 -8 -18 -22 -161
6877a61K60k41J08K1J06j79M2J28j62K4k2J36N8j34LO0j60J84k3j03j5K13l81
6900b38L46q2R8l00K46j29J57j57n0J43R4j15J8j62N9Q0j00J44P2j42j12K33j1
6923I2j18o5J31J15j10j78L28k75k8J33N4j50M7J92j45O0j95K25r0J8J90j08j86
6946f3m1k2J17J21K0j70J41k35J8J91p0j30J09J95k35M0j32J02LL3O6q8n4K75
6970A91k04j42K28j05q8R4J1o9o1K74j70J05j14%J02Lj32K53p1r9p6L8n4J29J0
6995E3r5n5j5N6J66p5r0J02P1j83o8k9J06J72j02m4M2l2j3J35j99L8j20L08k37
7020a08L5K5J49r5O4k2K0n7L7j4n3M9q8Q1K8K37k32j9j31k4J23l1q1K05k96K35
7046C7k8rj05J52k82K29K7j41k7J07L7J3j16J40l4M2j04LJ46j09q8N9P4Q8m2n3
$$ plain form
6877 -161 99 -142 -34 -13 93 -86 -44 84 -78 -54 -76 60 118 -16 -13 47 -113 71 48 -55 -70 143 -238
6900 -238 108 26 124 -176 70 -59 98 -59 -109 34 128 13 31 -131 -72 8 -92 52 124 -18 -130 103 92
6923 92 -26 -91 40 155 45 -133 195 -80 -108 25 79 -71 -24 168 23 83 -112 113 23 41 231 123 -63
6946 -63 -104 -126 -9 112 132 -38 103 -132 -114 77 7 -123 -14 181 -54 -14 -146 -44 -41 -8 58 -30 -84 191
6970 191 -13 -155 73 -32 -120 -26 -15 -84 -145 129 -41 64 -50 -50 52 55 -77 176 105 6 -70 -32 -86 43 53
6995 53 -42 -97 -112 -56 110 35 -55 47 118 -65 -133 -162 -56 116 14 -30 12 -20 -33 102 -97 -59 -179 129 -108
7020 -108 -73 -48 101 6 70 48 68 11 48 34 -19 30 -58 23 51 288 56 37 -94 -118 5 -26 -107 98 -198 37
7046 37 9 0 -105 47 -235 -6 21 -120 -147 -40 -3 10 -106 34 0 42 -62 -59 87 -22 -110 -51 23 111 69 16
7072A6J4J40k77J59k0Mr2O4J51j10J58q4pj10R5j62J58j69p8J55O3p6M2k09J85
7097A0j11k6L11j68OM5J05k25P0j35L59n0l62N5M6K36q2j12j04J65r9J60j91N0
7121d7L6r3rJ8O8L8%P5J23j52j73J8K3o4K63j33p1J34l9L1j47J25j00l7J2K0J7
7148f4J66j34o3O2p9K70j81p5O0J54j80J41m3Q5k21J03L5P5Ml7j38m7R3J44k4
7173A06j26J07RK3j82n1M1Q7l2o2K8m9K52j69o0k3L5J94k46L7r5O1mK58n5o5P
7200B6j8M2j49K8j40J28L1N7mNRJ26q0n3L3p0R3m0q9L0q3J89N3j77N5qj1O4L3
7229H0o2o1J20R3j42p2N9m7J71k56M8j10m3J93rN0j53L23k69J77rq8K3j05J38
7254D9j78O5n6J40N6j92M6P8l5j25J22N3o9J18J42j80J2r4n3J30p2J85l12J0K87
$$ plain form
7072 16 30 170 -107 52 32 36 -56 8 159 49 207 123 116 6 101 -61 97 -72 -150 5 68 -8 34 -175 10
7097 10 -101 -127 184 16 22 67 172 -53 17 -118 241 191 -171 -116 -70 166 84 -28 -132 33 -66 94 -97 -47
7121 -47 -11 -104 -113 -95 -27 11 11 86 209 57 -116 -98 -75 -139 124 -9 -80 54 15 46 -101 24 -76 -113 -101 -81 -64
7148 -64 102 -32 -95 -33 -112 158 -23 -98 -38 116 -64 77 34 119 -102 1 36 111 115 78 -60 -107 -14 130 106
7173 106 -20 87 96 119 -63 -114 -73 14 -18 -80 -52 -101 151 -18 -78 -101 -66 128 -118 -81 -176 -115 -119 139 84 19 26
7200 26 8 50 -99 -71 -211 -83 -52 5 1 6 15 141 61 8 41 -29 64 24 -65 -35 -118 71 124 -53 2 -6 -17 47 80
7229 80 18 -43 77 170 28 -44 15 -32 139 -117 -69 -179 -222 -29 -38 12 -141 182 -87 90 81 -7 16 -89 49
7254 49 -129 -64 -120 20 76 -116 -70 8 -27 -152 -30 23 -46 72 214 34 46 -48 -101 29 -43 142 -170 -160 127
7279A27K6j21q2j15J38k6R3J10k43J03L36j98l01J63o2Q3J01j57j3K6N1rQ5p6
7303C9j8R7j25J24j95K76k22j13J14OJJ5K8j24K01l6k15J82L2j80k6M4N9O7l9
7328hN8k3j06P3Q6j29OL7o9JO1J56j99m5K03j54O3K3M2j92j7J22K5O1j51J19q9
7355d6n6K88p1k30K9J40j08k6J4k8K22j14j38K07l5N0q7o8J8mj8Q2k6P0k1j68
7381a24R7RK69j20r4O7r7j6j23J67q0K7Q9j41p7J68k9K2m4R3l8n0O0k2r1J38K
7408F2n2n1R8k6m0j35K29k57K26M8m7J2r1N2n1N3Q2k40R4J65j17J29k66J30j56
7433a49K50j00j57K39j32J94j95J19O7j06J44q3l8k09K23j74N5J61q3j37R6O7
7455E2K3j22j9J7j17K49L1l18K58o7J71j58Q8j24J21Q0l76K12J18o1j27J83j80
$$ plain form
7279 127 153 32 -50 -165 -27 -53 40 150 -93 10 346 148 -153 10 -52 31 132 -25 -38 -12 39 30 115 39
7303 39 21 118 -7 117 -78 198 -24 -137 -23 -17 -16 -1 27 -97 104 68 -147 35 67 -113 -139 -95 -36 31 -8
7328 -8 50 27 -79 -6 80 -49 -43 -6 -75 -74 -13 143 -56 -101 102 -52 11 34 76 -116 -133 -11 14 75 -76 43 -46
7355 -46 -102 186 115 -115 -86 54 -54 -80 -66 -94 128 14 -124 83 48 98 11 -57 -39 -43 -61 21 -5 65 44 -124
7381 -124 -27 -18 251 131 37 104 7 -9 -132 35 -45 -18 71 -70 -147 21 -8 14 -30 63 25 -25 35 13 -78 60 62
7408 62 10 -41 57 31 -9 -144 85 -172 54 102 55 67 -24 28 -23 30 112 -128 -34 131 14 143 -123 7 -149
7433 -149 101 1 -156 83 -49 145 -50 69 136 30 174 91 53 -156 67 -107 -52 109 26 -111 -15 52
7455 52 75 -47 -66 -49 -166 83 114 -204 54 -13 158 0 88 -36 85 165 -211 1 119 58 -69 114 -66
7478f6j05J27J5l5l3j0O4L6L1r7R6k8Q8k06J53j4J31l04K14j8p0P2j71J21J53
7503A44r7j04O8j11J48ok9M6j08K8R6j72K88j46r8M3m9J31p2n5Lj43oJ00R7J87
7529A83r2q5r5J33k4L3lN4k5Q1k42L02j81j17J38K1o7j01J65j31K36j09p9r9J95
7554I1j78O6p8J75m1j16n6J91r3L9j28K62k03k6J20j74J2J11Nj48J26N2R4o5n7
7579a9M5l0K20k31l6O3l7Q5k3J11j87r4J08K5m4J64k47O6J20m22M00N3j91K26
7603A25l16R5r8J64j32M9O8J06j90rL5j2p6J13R1L7j46K26nk31J80J05q2k06J42
7628C3k82L51k6j63J11J06k08j39J63l8J09k8N8L6j55J10J10l94K36m7J31n3r6
7651g5K04mp4Qj56J53k6j47J53J6k21L01K7k21J30k51J35L7J31j48J21k1j94J17
$$ plain form
7478 -66 -171 -44 -29 -64 -97 -107 -43 -7 24 -73 23 -5 83 -123 30 16 147 -157 57 39 -31 41 -130 -9 144
7503 144 47 -57 11 -100 48 42 13 59 -49 -21 75 -97 191 45 -53 -10 -59 72 0 -55 -52 -195 -201 -101 -4 183
7529 183 91 6 -89 44 20 53 50 104 79 160 -82 220 39 -78 60 81 14 -87 78 -53 183 74 -5 -104 91
7554 91 -87 -21 -99 76 35 -81 -137 54 -39 0 -128 134 -69 -95 25 -149 -137 -26 -21 -169 -43 9 103 38 -19
7579 -19 26 -4 216 -15 -51 12 -25 60 37 148 -39 -133 -25 0 -44 120 -127 -61 59 -363 37 90 -101 125
7603 125 -191 -96 -194 -30 -162 -113 -45 61 -129 -138 -103 -115 -191 -78 13 50 -96 130 125 -106 74 179 97 -109 33
7628 33 -249 102 76 -87 24 130 -78 -217 -54 -92 17 -11 47 83 -72 38 148 -246 -10 -57 74 21 -75
7651 -75 129 125 51 59 -97 56 30 -117 36 52 -169 132 159 -62 68 -183 -48 -11 120 -28 93 72 -122 -5
7675eLJ4Qq8Q2q4r0K58j34M5%O2K6k0Lq7kR8k2Jj64J25j55M4Q3P0r8O6q8J2P8
7706D1k4j09Q3J18j34k4M6p2O7rQ0j2q2L2o9p0l2N7J31K1n6J03l3n2J3m0L2l8
7734c2n6J29j38o8K61qrj09K42k01l0J07N0j28M6l7k6j08m7Q9O0P6j73M6J12J4
7760F2J3p3J40j11J63l47K16j2R2j07l6p6L74l39Q0K5m5J13j87J12N1j68N0J77
7784A67k52L7J02P4k29J72p0P5N3k08Mn8K21l3j63R5J0J39k47J03r4J77l2L2r3
7809a8j9J15Noj4O6j11q4J37R9j72o5J46J3P3k09K4N7Q7qk04J67k83K26R6oOk65
7837a47N1J70j40k6K05r2K4K7k6j09L3j5l6O1M2j64J64p2N4K8J13m4j58o8L5N3
7863c7K6r2J67Mk7j18Q5M5k75O3K16j05J79m1j27M4j6K23k56J6l7Q8j1N%j93O4
$$ plain form
7675 -5 -2 12 20 -68 14 -70 -160 98 -36 9 9 71 97 77 80 -7 -9 89 67 68 -96 29 -126 -82 1 71 -27 39 -49 -37 41
7706 41 17 -92 -9 109 -25 -49 -3 -75 -8 -17 63 51 -31 1 -68 -138 -170 -113 18 39 -17 86 53 1 14 -26 6 -32
7734 -32 -88 41 -97 -165 96 88 79 -30 212 11 -19 88 138 10 56 19 -7 -115 -162 -73 -13 63 -110 -64 48 62
7760 62 75 2 142 31 194 -153 63 51 143 36 0 -76 298 -41 39 64 19 132 -55 57 108 -60 -10 167
7784 167 -85 -48 54 128 -101 71 1 76 129 -79 -75 -133 88 55 -108 -13 -3 136 -111 -8 -102 75 43 75 -18
7809 -18 -37 78 83 77 63 129 18 -66 71 170 -2 -67 79 92 165 -44 -20 37 124 116 -88 79 -204 22 118 112 118 -147
7837 -147 -96 74 -66 -92 113 21 45 72 46 -63 -30 -45 -81 -20 22 -142 22 -50 4 32 145 101 -57 -125 -90 -37
7863 -37 -11 -103 64 68 41 -77 8 53 -222 -159 57 -48 131 90 -37 7 -9 214 -42 -26 -63 25 14 19 19 -174 -110
7890a10J87k07J37Rj9%J66k5l42j06J85J78r2L2J51l34J68J13j25J01r0P0n0N5
7914E2k39K69J25j68o0J17q0m2L7pok8k9n2J20P3j46O0n5J79k50N8J04K7m5m5
7940c1J23j51N5J40j58j28m6J81m7L0l3R1M2n1K7J5j71J34n8J69j46j09L4r1J08
7965g1P4j07K9J46l7K7j60R5j11J92j07M0n5QR4q8J05J6j16K7O1j12jq9K27j47
7991f0P4lj12O4O0m9M2Q0j64K7O7J68q7J1p5k8p8P8l4M1k50J54Oj57J65K17j58
8018aKJ4k14K41p4L0O0l7J3l5j6n0L8M9M4k1M3j43J20j14J65o4o8J2j21L82m64
8045b09L57m3j90J58Nj76K03o0r8J30j59l2K15l7o1J53k32J08k27J05N8m5L7Q2
8069D2k60K56J3oR4k80J84L8Kk79K99j10M1k9J76j80j08R5O5p6J0J2J5J05j73
$$ plain form
7890 -110 77 -130 7 16 -3 -3 163 138 -204 -310 -125 53 -39 -7 144 -190 -22 91 -34 67 -23 47 -3 52
7914 52 -187 82 207 39 -21 96 16 -26 11 4 -2 -30 -59 -111 9 82 -64 -4 -59 120 -130 -72 32 59 14 -31
7940 -31 92 -59 -4 136 -22 -150 -196 -15 -62 -32 -65 26 68 17 44 59 -112 22 -36 133 -13 -122 -88 -179 -71
7965 -71 3 -104 -75 71 34 61 -99 -4 -115 77 -30 10 -45 -37 57 -31 74 90 -26 1 62 -50 -51 -140 87 -60
7991 -60 14 11 -101 -37 23 -26 16 96 -68 -41 26 194 107 118 43 15 -63 15 -19 22 -228 -74 -68 -225 -60 157 -1
8018 -1 1 15 -199 42 -32 -2 58 21 34 -1 -17 -67 -29 20 64 43 86 -57 63 -51 114 50 -18 -6 -127 255 -209
8045 -209 148 105 -85 73 78 -98 105 45 -53 77 -82 -114 101 64 3 156 -76 32 -195 -90 -32 -77 -40 42
8069 42 -218 38 51 45 139 -141 43 81 83 -196 103 -7 34 5 181 1 -107 -12 53 -23 -13 -1 14 119 -54
8094e4J47qq3pJ42k36J48l9rJ16l57K25r5J43o5Q1j93J06P3j21j6P8K28k26L0
8119Hp6P7M5l0j4j67K21J00k46L6N8J9M2J68k90L5Q6n8l9m0l9K5oR9j63J73J5
8146C9o9L0J62k92J11k1r0R8p5J70l6J4o4K1Q4j42J27n1k22K77j60J5K7J50j57
8171e4j9kP0m1l6J9K26l16L33l01J90j47P2ql5j7J73r1l6R
$$ plain form
8094 -54 93 85 2 -5 137 -99 49 10 1 117 -240 -15 -110 33 -32 49 -144 -38 35 -86 -102 -24 204 -22 8
8119 8 -68 9 54 24 10 -157 64 164 -82 -46 12 31 73 241 -49 -14 72 14 -25 -65 -104 -79 -85 14 -149 24 39
8146 39 -30 0 162 -130 -19 -40 -130 -32 -107 63 27 41 -23 -2 82 -60 67 16 -206 71 -89 -74 -47 103 -54
8171 -54 -73 -75 -5 -46 -82 -63 163 -153 180 -121 69 -78 -6 -14 -49 -66 107 16 -20 -11
8191a1
$$ Imaginary data points
##PAGE= N=2
##DATA TABLE= (X++(I..I)), XYDATA
0@%%%%%%%%%%%%Qj6J6j6J6k4L2m0M8n6O4p2Q8j04J20j40J64j90K15k42K79l18
34a68L58m04M53n08N70o36P08p88Q74r68J071j183J306j439J586j748J925k120
52a111K336k575K842l145L489l880M329m858N487o251P202q422J0055j2358J5879
67I019k2006L5673j24155M4720J95175j15086j24474J2978J32023k4404j8753
78G10l493l725j8129K7748P7168l1897p7177q276N8666M9337n6275j8309J317
91b335J5682j001J989J4573m7462r375M5050L7244m4700o4094N5356L4680l0414
104E193l7144L0743K6156n1580K578L0343p540m1742J9139N8044m7922m5071L8399
117b0404O6045l6669p9345M9876P6638j3952q3638M945Q0121n04m8765j6824M7919
$$ plain form
0 0 0 0 0 0 0 0 0 0 0 0 0 0 8 -8 8 -8 8 -16 16 -24 24 -32 32 -40 48 -56 64 -76 88 -102 113 -129 150 -168
34 -168 190 -214 239 -269 301 -335 373 -415 459 -509 562 -621 685 -754 832 -916 1009 -1111
52 -1111 1225 -1350 1492 -1653 1836 -2044 2285 -2573 2914 -3337 3865 -4557 5498 -6860 9019
67 9019 -12987 22686 -101469 -56749 138426 23340 -101134 -88156 43867 19463 710
78 710 -2783 -6508 -24637 3111 80279 48382 -28795 -37071 21595 70932 14657 -3652 -2335
91 -2335 13347 12346 14335 28908 -18554 -27929 17121 54365 9665 -54429 927 35607 5193
104 5193 -31951 -1208 24948 -26632 -24054 6289 -1251 -42993 -23854 34190 -13732 -58803 -20404
117 -20404 45641 8972 -70373 -20497 56141 42189 -41449 -36504 43617 43113 -5652 -22476 25443
130B5443K522l8968J1906J8659o964l3885J5901K7811j9086j2797K639J2809j2751
143f761J0042K0561k7965k0867J6222M0981j7029m2551J1869K5787J394k9020
155a7337N178J3894j4223n423J3637K2040k4101k1094K0000J7970j238j4127J2697
168G873j977j5664J5688K6293r234n2638N636N4776J1027m6896l5944L5381K9834
181B4155j1700k3599n553J2154L444J2249k496j5577p666J1492K2622j0720j5132
194f327n38P411M381l900L349j1797j0049J1254J9112m381l1388K908K6295R503
208A5833j8430j4593J7141J2223j343r383l586K938L824R740o805j2006k665J1931
222D819Q168j8198r619R929J3959n940j4529N347P482j41n787N789N204q482R34
$$ plain form
130 25443 27965 -11003 903 19562 12598 -21287 -5386 22425 3339 -9458 -6819 5990 -6761
143 -6761 3281 23842 -4123 -24990 -8768 32213 15184 -27367 -15498 10289 11683 -17337
155 -17337 -12159 1735 -12488 -17911 -4274 17766 -6335 -27429 -7429 10541 9303 -4824 7873
168 7873 5896 -9768 5920 32213 22979 -29659 -24023 30753 41780 -5116 -41060 -5679 24155
181 24155 12455 -11144 -16697 -4543 -1099 11150 8654 -6923 -14589 -3097 19525 8805 -6327
194 -6327 -6865 546 4927 1027 4376 -7421 -17470 -6216 12896 8515 -22873 -19965 6330 15833
208 15833 -2597 -17190 -49 12174 10831 1448 -2138 800 4624 14364 7559 -4447 -7112 4819
222 4819 12987 -5211 -14830 -4901 9058 3118 -11411 -6064 1418 1277 -4510 1279 6483 -1999 -1065
237a065O055K980r150m783Q653J840l090n011l01k201J329Q109l530p495j615
252i275J1983O365j1221n177P159J0791l208p669O29L301J728l980Q09m65l928
267b158N97Q79M57m786m28M243k0j071M72L477l371j458O618L176l739o601N659
284A946N942n595n816Q82N720j694l922j490O5J566J89K469k600j624M033K766
300B837n69l809K245M560Q5l399j273K964k308j660O70O33j580m141K205K103
316d37k151k038J362L618o16Q1L09R1N55J248K907k342k768J747J537j226l851
333a974K41J974J32l198r88K004p48L9N58J607Q26j141J838J053m76p6J427O14
351C712j649m37l18p82j677n7J711j997k146M99J707K69j628J32J792K369J05
$$ plain form
237 -1065 4990 7970 -1180 -5963 2690 4530 1440 -3571 -3872 -6073 -4744 3365 -165 -7660 -9275
252 -9275 2708 9073 -2148 -7325 -166 10625 7417 -252 377 3678 5406 1426 2235 1770 -2158
267 -2158 -1561 -682 -225 -5011 -5439 -1196 -1216 -2287 -1815 1662 -1709 -3167 3451 6627 2888 -3713 1946
284 1946 7888 2293 -3523 -2641 3079 1385 -2537 -4027 -3962 -2396 -2207 262 -2338 -3962 71 2837
300 2837 2268 -1541 704 5264 5349 1950 677 3641 1333 -327 343 976 -604 -4745 -2540 -437
316 -437 -2588 -4626 -3264 354 -262 -181 128 219 774 2022 4929 2587 -181 1566 3103 1877 -1974
333 -1974 -1733 241 373 -2825 -3813 -1809 -2557 -2518 -1960 -353 473 -668 1170 2223 1747 1671 3098 3712
351 3712 2063 1626 1308 526 -1151 -1208 503 -1494 -3640 -3141 -1434 -1165 -2793 -2661 -869 1500 1605
368A605o47o27P8K670N57m88k132j485J678P11j744k906K73R83M31k59j339j20
386b761k81K196L003q21j570n0K510J331o28j558n26Q45L35m89k161k047Q19Q93
404i60L63j439j139Q37R13j55M81K303K00j137L52K003P71j820r07P94J28L12
422A900o71k767k072J578K216m14k298j892J527L088J819j722l404K052M935J091
438D966k804k094o0R92K541L06l863l940J663L566q35k845j726MK705L672j126
455A122m796M98N314J682k934j4K702j601j801J652O48j808k008o44O12J949M61
472A034l580l070K162M164l46r52M61j149O87M529J729n464m067M487N822r97
488E450n748l320O2L656L433m109n633J563N063J167j911k108j530J863P006K835
$$ plain form
368 1605 958 331 409 3079 3636 3148 1016 -469 1209 1920 176 -2730 -2457 -1474 -1043 -1302 -2641 -2761
386 -2761 -3042 -846 2157 1336 -234 -284 2226 3557 2929 1371 845 1690 2025 1536 -625 -2672 -1853 -960
404 -960 -597 -2036 -3175 -2338 -1425 -1580 -1099 1204 1404 267 619 2622 3393 1573 666 1460 1588 1900
422 1900 1229 -1538 -3610 -2032 184 -230 -2528 -4420 -2893 195 2014 292 -3112 -1060 3875 4966
438 4966 2162 68 8 1000 3541 3847 -16 -3956 -2293 1273 438 -2407 -4133 -4129 -1424 2248 1122
455 1122 -3674 -3176 2138 3820 886 872 3574 1973 172 1824 2472 664 -1344 -1988 -1376 573 1034
472 1034 -2546 -5616 -3454 710 364 -588 -127 -1276 -589 3940 5669 205 -3862 625 6447 5450
488 5450 -298 -3618 -3556 100 3533 -576 -6209 -4646 417 1584 -327 -2435 -3965 -2102 4904 7739
504G739p203n855N553O589k203n223j977K291L245n37m953l127K898L492j417
519f88j198J862j134k702L367M175j714k919K143K801j105j860m79o25r0J614
535A448r86j824J203j233l684J167N941M10o382l65N661J820k435J67k47j057
551c96K428L548k561n428p16M374K614j939m639l588K694O003o69o061N2N134
567H50J293k039l64R91p04O63L072M63k669j950r75P40K267j62l477j319K842
584d78J166l148j335K889J050j282J236K807j144l167p5L974K539k294l171l16
600g49J509N17j154k255r17J115K762J041l862l866K275N278J773k602k695J365
616d65L586Q37k812k922J261L681P98k834k720j131O63J908J18j781p19R98J346
$$ plain form
504 7739 536 -5319 234 6823 4620 -603 -2580 -289 2956 2419 -2534 -5661 -2763 729 -688
519 -688 -1886 -24 -1158 -3860 -493 3682 1968 -951 1192 3993 2888 1028 549 -76 -166 1448
535 1448 462 -1362 -159 -1392 -5076 -3909 2032 2442 -3940 -4305 1356 3176 741 908 661 -396
551 -396 2032 5580 3019 -2409 -3125 1249 3863 1924 -2715 -6303 -3609 2394 1725 -4336 -4284 850
567 850 2143 104 -260 731 27 690 3762 4225 1556 -394 -1369 -629 1638 1476 -2001 -3320 -478
584 -478 688 -2460 -3795 -906 144 -1138 98 2905 1761 -1406 -1481 2493 5032 2738 -433 -749
600 -749 760 1277 123 -2132 -3049 -1934 828 1869 -1993 -5859 -3584 1694 3467 865 -1830 -465
616 -465 3121 3958 1146 -1776 -515 3166 3964 1130 -1590 -2721 -2058 -150 -32 -1813 -2532 -1534 -188
633a88P60o22j423o81L325M079k292m666J588L656j300l158M54J491q58j249K78
650h06q27r26J384O66j384M13J914M41j022mP92J138O07l83j569j84J453m81j887
669f65r9M74j121J21R35p53j980R54K334o2q94J182L20r28J449J893k139j853
687h32J961K264j959k497K54P86l83o57m00l62Q01K13m81N40P52j68j2J279O56
706A755n71n05Q70j01q12P66l55k522Q8J924n07k406j25K260K71j871M39J064
724c38p7Q22Q60p7p22N70Q84m58r17J35L31n52m01o67o54M1j15l44Q50N09j129
745a449K14J428Q64j008n08J867R45j289n47O10j64l94Q5n21r12m38O94K3j204
764a704j95J109M48l78L3M17P57K45k67R55J91o37PJ66j50n43q43O7J21o74j45
$$ plain form
633 -188 572 -50 -1473 -2154 1171 5250 2958 -1708 -120 3536 2236 -922 -468 1023 165 -1084 -806
650 -806 -1633 -2559 -1175 -509 -1893 -1480 434 875 -147 -151 641 1779 2386 2003 434 250 1703 1222 -665
669 -665 -764 -290 -1411 -1290 -355 -1108 -3088 -2134 200 138 -756 426 746 -182 1267 3160 1021 -832
687 -832 1129 3393 1434 -1063 -809 -23 -406 -1063 -1463 -1825 -1024 -811 -1292 -752 0 -168 -180 1099 1755
706 1755 1184 679 1549 1448 636 1402 1047 -1475 -1387 537 30 -2376 -2501 -241 30 -1841 -1402 -338
724 -338 -415 407 1267 1190 468 1038 1922 1464 547 682 1013 461 60 -607 -1261 -1220 -1335 -1679 -829 -320 -1449
745 -1449 -1235 193 1057 49 -459 1408 2353 1064 517 1127 963 569 654 133 -779 -1217 -523 -500 -1704
764 -1704 -1899 -790 -342 -720 -687 -270 487 732 465 1420 1611 974 981 1147 997 454 -389 -322 -201 -875 -1020
785a020j46m04L15M85M34k63k46J113J073p00l07Q84L47l4p30j61J96p43m81K85
805a03n14n10j35K46J5LJ8L47O08O8M73K27k18L84N93J17n01j012M71L80p96q85
827g24KM8L6n27k66L08LO68J79j9K41M35L13N01o4j76N7jn43J35l19o02m76J81
851f10jk42n75J24O92j15J90L51N51r9M47L23j1jq5K72m15k68r5m94n00m50J77
874h34K03l67m16K51L10N18J72K6L00O62o9J53K17l28L3K44j67m74n26k81o3l01
896g37J48Mp47r9P58K38m1K27R1P10L72M16k97m77K86M62n11j66l97n94k54M42
918a66j68j066l01P45N08k47K50kp4Q44J207p59o08O61N51j93m75J8o41q00O42
939g4M64j152p83N86L69k90M9J72j9N18R31N6k64M0P39p08m6P92o82r40L9N89
$$ plain form
785 -1020 -1166 -1570 -1255 -770 -336 -599 -845 268 1341 641 334 1218 1565 1531 801 640 836 93 -388 -103
805 -103 -617 -1127 -1262 -1016 -1001 -998 -980 -633 -25 43 516 743 525 909 1502 1619 1118 106 577 957 161 -724
827 -724 -722 -674 -638 -1165 -1431 -1123 -1120 -452 -273 -292 -51 384 697 1198 1134 958 1015 1014 471 606 287 -315 -791 -610
851 -610 -611 -853 -1428 -1304 -612 -727 -537 -186 365 266 713 1036 1025 1024 939 1211 796 528 433 -61 -561 -1011 -834
874 -834 -631 -998 -1414 -1163 -853 -335 -163 -137 163 825 756 909 1126 798 831 1075 908 434 -92 -373 -436 -737
896 -737 -589 -585 -1332 -1431 -673 -435 -476 -249 -158 552 924 1340 1043 566 852 1314 803 637 240 -354 -608 -166
918 -166 -334 -1400 -1701 -956 -448 -695 -445 -447 -521 323 1530 771 163 824 1375 1182 707 725 84 -716 -74
939 -74 390 -762 -1545 -959 -590 -880 -831 -659 -678 -160 771 827 563 603 1342 634 588 1380 698 -242 -203 386
961C86n59o16l19R9k11M16O32o93j56R91K61J54N53p4o35J66J138K36j663o36
981e30R40l14l70m64l49L6M80O1m99l15N60P15L72M02p4m74J09J045j34p71m5
1002C81M69l6o40p00l89r9L04J80l27K45K57n29R0Q00L44j69N74N32K05p41m39
1023C12J01l47K25K81j21m01p83q54j52J145K1l13K67Q58L94p57m88O51M10N78
1043A027P19m13q37Qk22k80J49m66k96J50L49m05j088p3R44P32n5N56oo6K19k9
1065F17mJ18L68j37l68j30j90j032k87Q50k69o23M24N09o33k41P79M01M2J24O35
1086I53k44j56O00p25o47R94N8o00p66N08q7j009J54O38o31l05J193L33o82M18
1106cO23j26j37O52l84m46P32N23j066q03N56k45r07L14P35q13m46J044K14j107
$$ plain form
961 386 -173 -789 -1108 -1009 -1220 -804 -172 -865 -1021 -30 231 385 938 864 229 395 1533 1769 106 -530
981 -530 410 96 -274 -738 -1087 -1051 -571 -510 -1009 -1324 -764 -49 323 725 651 177 286 1331 1197 426 381
1002 381 850 814 174 -526 -915 -1014 -710 -530 -857 -612 -355 -884 -794 6 350 181 755 1287 1492 751 312
1023 312 413 66 291 572 451 50 -733 -1587 -1739 -594 -573 -886 -619 239 633 -124 -612 39 449 1027
1043 1027 1746 1333 496 504 282 2 151 -315 -611 -461 -112 -517 -1605 -1678 -734 -2 -57 499 493 427 646 617
1065 617 613 731 1099 962 594 464 274 -758 -1045 -195 -464 -1087 -663 -154 -787 -1028 -249 152 194 318 953
1086 953 709 553 1153 428 -219 775 833 233 -533 -25 -112 -1121 -967 -329 -960 -1265 -72 261 -421 -3
1106 -3 620 494 357 1009 625 179 911 1434 368 -435 121 -124 -1031 -717 18 -795 -1241 -197 17 -1090
1126a090K87J346k34l16R55K04j015M92L23o19l97O01L13j208k16L41n19n91O63
1145f80K09m77O43O11l83k08O48K51j67J77N23k12n70K07Q2j101J93N53m96p36
1165i33K24J30n01N4Q00N4j38N29L97l61j58M10J67n2K25l01k20n4m4m56p47O61
1187c14Nl93K90k4j88Q7L66K39n7L75L97Q1m77J10K11k84J28l8l74m04j5l01n2
1210f32l0NQ9R2J91lJ18L64K74k23M27K49l87N1L5J46o14k22K22k16n26J7K46
1233c27l92j77Q5L78K39k08K73M16rJ14J26J78j6Mk97N2j44m15k6j77l01j61L40
1256d45k28j22K76M16P9j25J19M16N0J38m7K21j09l19M1Ml97j88L2p8m16J45k30
1279g67K95k2O3L34J31M7p2L76K20k8K4K80j61l98o2o8n1l68j45J1r8j7k13L27
$$ plain form
1126 -1090 -803 543 309 -7 948 1152 137 629 952 333 -64 537 850 -358 -574 -233 -752 -1343 -680
1145 -680 -471 -948 -305 306 -77 -285 363 614 447 624 1147 935 365 572 654 -447 -254 299 -197 -933
1165 -933 -709 -579 -1080 -1026 -226 -172 -310 219 616 255 97 507 674 622 847 546 326 272 228 -228 -975 -314
1187 -314 -309 -702 -412 -436 -624 -537 -171 68 11 386 783 864 387 497 708 424 552 514 140 -264 -279 -580 -632
1210 -632 -662 -657 -568 -476 -285 -288 -170 194 468 245 672 921 534 585 620 766 152 -70 152 -64 -590 -573 -327
1233 -327 -719 -896 -811 -433 -194 -402 -129 287 278 392 518 696 680 684 387 439 295 -120 -146 -323 -624 -785 -445
1256 -445 -673 -795 -519 -103 -24 -149 -30 386 436 574 527 748 639 320 361 365 -32 -220 -188 -266 -682 -537 -767
1279 -767 -472 -494 -431 -97 34 81 9 385 605 577 601 881 720 322 260 192 141 -227 -372 -361 -459 -476 -689 -362
1303c62j82N5N48j5n3L31J09J93J9kj01p6j4l61k12K4k77n5j07N4j21j6L12o7
1327c76n0L64J97M75l08J48J43p3q7M5j27m7j96j91pk37k53MK44k99O5K02R6J40
1351a28O9J80J76J29J4J4K01j92j35K57k77l02k34J66m50O0jL8n2o4K58J92p7
1374a58K66K79npK48j71%N8j0l66n3l50J7k2j50J1j52M1L43k41Q4M14j01J32J07
1399B14K68M5q7O7K12l68k96O9j05j07j66m7k61P3m3K38j30J0L37M7O9M72l00
1422B11M8L90j29O8k47j12ok41k1j74k71J16n2j32Q0P9J32R9L0L52Q0J01N8N8
1446E17J4r6K6k62m9J29j78l29j24o4j22N3K19j53lL6L41oL18O8L7k2L14l36p8
1471B50J64j01j52j2k99j59j85j86M42j81rK11P6p0K11J11M3P9K72J70l98OL69
$$ plain form
1303 -362 -544 -489 59 44 -9 322 431 624 643 641 540 464 450 89 -123 -99 -376 -431 -538 -484 -605 -621 -309 -376
1327 -376 -426 -62 135 610 302 450 593 520 433 478 351 304 108 -83 -90 -327 -580 -576 -332 -631 -566 -364 -268 -128
1351 -128 -59 121 297 426 440 454 655 463 328 585 308 6 -228 -62 -512 -452 -453 -415 -467 -531 -273 -81 -158
1374 -158 108 387 382 375 623 452 452 510 500 134 81 -269 -252 -274 -424 -413 -565 -524 -181 -422 -338 76 -25 107 214
1399 214 482 527 440 507 719 351 55 124 19 -88 -254 -301 -562 -489 -532 -294 -424 -414 -77 -30 39 511 211
1422 211 259 649 520 588 341 229 223 -18 -39 -213 -484 -368 -420 -552 -472 -393 -261 -162 -132 220 300 401 459 517
1446 517 531 435 461 199 150 279 101 -228 -352 -416 -538 -485 -266 -419 -422 -386 -45 -51 267 335 372 350 664 328 250
1471 250 414 313 161 149 -150 -309 -494 -680 -238 -419 -428 -217 -141 -211 0 111 154 233 505 675 277 283 652
1494F52m69k13K86k22l48k2J01k46l90M18J42lJ02J93q7M3M70N5k38N6M04l28
1516C56l00M06l55l15L8J01m43k25M84o8k19L20L18j72n7L60J77k38K85L19l18
1537D54k72L26j41n51J74K13m75j24J95o2m86N2N99m18K33O32N6m43L09L86k19
1558D38j07K68K7m10k06J67m81k97N28p6l07L03k22j71n2M15L45k49L10L97k27
1579C93j99K70j4k70K09L29n08j92n0j85m88J53K29R6k25L89n0l03L17K85j30
1600E6K90J87Q7l46r6K19k80o3J10J0m56k38K22l47P7K50J43j3o2M25k03n5L94
1623C11m5K7K04J15l04m08L70j42j27l2o4k77j42R8n7J17p2J66J40J51J48J16
1645B93J02m6p5P4r8J47j11j52q6q0j57j7q8l2o9K21n8P5K5K7O8K40K79l05J56
$$ plain form
1494 652 183 -30 256 34 -314 -336 -235 -481 -871 -453 -311 -314 -212 -19 -106 -63 407 462 224 280 684 356
1516 356 56 462 107 -208 -170 -69 -512 -737 -253 -321 -540 -220 98 -74 -131 229 406 168 453 772 454
1537 454 182 508 367 -184 -10 203 -272 -396 -201 -263 -749 -697 -98 -516 -283 349 405 -38 271 657 438
1558 438 331 599 626 216 10 177 -304 -601 -73 -149 -456 -153 -375 -546 -598 -183 162 -87 223 620 393
1579 393 194 464 450 180 389 718 210 18 -32 -217 -705 -552 -323 -227 -452 -63 -113 -416 -99 186 56
1600 56 346 533 620 274 178 397 117 54 164 174 -282 -520 -298 -645 -568 -318 -175 -188 -250 175 -28 -83 311
1623 311 266 293 497 612 308 -100 270 128 1 -31 -95 -372 -514 -416 -473 -356 -428 -262 -122 29 177 293
1645 293 395 349 274 348 250 397 286 134 48 -32 -189 -206 -294 -326 -395 -174 -232 -157 -132 -105 -37 203 482 177 333
1670C33PJ73l76K01l36j10LJ16k83j37Qj3J72j96K89L0Q0M5L12k02O6J74J53j97
1694C12j5J01j40m78L66j08k83p0o4n7j9J99J21k51L03J73J13J43o7J80k02O3
1716C20m7J70l44J4J89n45J02j04n9l33K76J12k9jK10J78q6M3L96j92P7L8j37
1739B48K7Nn6k47M7r7k67K02k60K35j86J72J19R6j95J65K11mJ43J39j08r5J93
1762D87k82k9j62p5J36m33RQ3j91J19P5n9M4J45J54N7L1J04K1Q8L9m7l9j17p4
1787H4j76j78P3Jj02P8q9j51P4P6Q4J61K21N4N8k0Q3M9r2j4j59K3j53j05j78O2
1813b36J0j80p8O1J69pN9j38M78O4r9P7R6P3o0K3L0j24q2k75j4j5p2M7l5j86J03
1840c11J8J40J62k1J52q2K72k1R1j25N3N6k53O5j13r7r5j26O9k00R1L6m5m8K68
$$ plain form
1670 333 340 513 137 338 2 -108 -105 11 -272 -409 -401 -414 -242 -438 -149 -119 -39 6 318 116 182 356 509 312
1694 312 297 398 258 -220 146 38 -245 -315 -379 -436 -455 -256 -135 -386 -83 90 203 346 279 459 257 320
1716 320 273 443 99 113 302 -243 -141 -245 -304 -637 -361 -249 -278 -279 -69 109 23 66 462 270 347 385 248
1739 248 275 280 224 -23 24 -73 -340 -138 -398 -163 -349 -177 -58 38 -157 8 219 215 358 497 389 294 487
1762 487 205 176 14 -61 75 -358 -349 -266 -457 -338 -263 -322 -278 -133 21 78 109 213 234 322 361 314 275 158 84
1787 84 -92 -270 -197 -196 -298 -220 -309 -460 -386 -310 -226 -65 156 210 268 248 331 380 288 274 115 138 -15 -120 -298 -236
1813 -236 -226 -406 -484 -423 -254 -261 -202 -340 138 202 103 180 276 349 289 312 342 218 136 -139 -153 -168 -240 -193 -228 -414 -311
1840 -311 -293 -153 9 -12 140 58 330 309 400 275 328 384 131 196 83 -14 -109 -235 -166 -366 -275 -239 -284 -332 -64
1865f4K4J94r0M5L02q0j65J17K2j01l2j27Q7k05q2J08l50Q6J04m8l9P3K6J04L63
1890B72j66JJ10l4P3m7K9j51O6o6j28j15l4j25q3K8Q4pJ10J54L5j6K77J1J37j30
1916B85J28P7j58k6k03r2k19J85j55r8o1kO5m3O7r7L61J01p5J20O0rJ35J96l05
1941B37j17J93k51j01j17Q9k80R3lo4O7k3%J44N8L68k2l23K33J15M3j38J33m1
1965B93l25m3Q6j48k98J22K89l10j8K18n9l0K24P1J01p9K03J34k60R5Q2j89KK06
1989C67k62k09r4J32l95J53p2J44J88KR8l6j43L33pJ0K25J65l90k16K15j55o4
2012a1k29K96k61k87M26j75q6p7J39K16J22j7J8n1J62O9J16j72J76N4l46N3k94
2035a59Nk18J56J40k56o2K92k70J47K27M8L8J25P9Qq8J53j12j41O5n6q6j61j06
$$ plain form
1865 -64 -40 154 64 109 411 331 166 283 305 204 172 45 132 -73 -155 -47 -397 -311 -207 -255 -294 -221 -195 -91 272
1890 272 106 107 217 183 256 209 238 87 153 87 -41 -156 -190 -315 -398 -370 -286 -293 -183 -29 6 -10 267 278 415 285
1916 285 413 490 332 306 103 11 -208 -23 -178 -276 -337 -339 -274 -317 -250 -347 14 115 40 160 220 211 346 542 237
1941 237 120 313 62 -39 -156 -67 -347 -254 -257 -321 -254 -277 -277 -133 -75 293 271 -52 181 296 339 201 334 293
1965 293 -32 -75 11 -137 -435 -313 -24 -334 -352 -134 -193 -223 1 72 173 94 297 431 171 266 348 159 161 367
1989 367 105 -104 -198 -66 -461 -308 -380 -236 -48 -46 52 16 -127 206 199 209 434 599 209 -7 208 53 -11
2012 -11 -240 56 -205 -492 -66 -241 -327 -404 -265 -49 73 56 74 23 185 254 370 198 374 428 82 135 -159
2035 -159 -154 -372 -216 -76 -332 -394 -102 -372 -225 2 50 88 213 292 300 212 365 253 112 177 121 35 -126 -232
2059b32J01j27L7M6mR9P0l5j31J33K60j67J57l7j8J28j41n3Q5m1j96o5%j68K8
2084b71l9lK33k84K17J13n2K42p5J75n4M4N2j40j40R1L0k79J00m9j45j84J36j9
2108c01J33K60j01P4j88J02J65l5L26m4j29j95J11k22j13K01m8k48R9M9l18KK02
2131b18J14rJ66J85k27m4MP8j5J25J74j1k55R5j28j69j35K15j45j93K85P4j45
2154a79r2L02j03K3O7J89k9q7J49J55l52J38J07k94j51L36k04l40J30O6k6M5P4
2177g6j7o4J35K00j64k3K70J32m43K81J4n3j87J28j38j44J02o4n8j94J43J75j07
2200a52J63O1J24j41J44N3j70l1K39k90k2J58L7k02j7J45l13j16J12J1J5k28M36
2223A6J1p3O3mk5J10J38l5o3J3r9N9q6j60J96r6j63Q0J9j37K2K14O5q5J39k9n4
$$ plain form
2059 -232 -131 -258 -221 -175 -179 -80 -10 -45 -176 -43 217 50 207 170 152 280 139 86 171 130 -66 -131 -131 -299 -271
2084 -271 -310 -313 -80 -364 -147 -34 -86 156 81 256 202 246 298 158 18 109 139 -140 -40 -89 -234 -418 -282 -301
2108 -301 -168 92 -9 65 -123 -21 144 109 435 391 262 67 178 -44 -157 44 -4 -252 -153 -104 -422 -420 -218
2131 -218 -104 -113 53 238 11 -33 -29 49 34 159 333 322 67 162 34 -135 -270 -55 -200 -393 -108 -34 -179
2154 -179 -271 31 -72 -49 18 207 178 91 240 395 43 181 288 -6 -157 179 -25 -365 -235 -169 -195 -150 -76
2177 -76 -93 -157 -22 178 14 -9 261 393 -50 231 245 192 5 133 -5 -149 -47 -111 -169 -363 -220 -45 -152
2200 -152 11 72 196 55 199 252 82 51 290 0 -22 136 173 -29 -46 99 -214 -330 -218 -207 -192 -420 16
2223 16 27 -46 17 13 -12 98 236 201 138 151 52 111 25 -135 61 -35 -198 -118 -99 -236 -214 0 65 -20 119 90 36
2250C6Q9K15j32N3m6R2j65K2k96O9J42j83k10L6K06j37j27J51J60r4R5M04j72
2273B08J3L9J00k79L07j91j20j29p5k24J85l4m6J25j16K27j21L2J11L5p6J59J45
2296B75k17K7J50M7r3j36j9l1L6j67k4o6j10K29qP2J76j74L2j06K12K3j20K75
2320B83j07j20l0Rk03J22J7j38N5j04J16O4j84mL5J21J20L0Q4k1k9J21k69J10
2344G8N8j15N3j24O0j66o1l2j06J88Q8lO5Kr4j26M40n9r2K6R7M2j3j01PJ07l47
2371a28j79J84M2k46P7J30k26K11P5Mj37K54J45j14J15M5K5j58p9Rj66O2m0j25
2395b20LM8n5K9q8J32J19j39K38J00K8k9Q0k33K13j35Q8j13m5M6n2o4K6j85j64
2420c72K80q1m1M7J76o7P3J54Mj1l3j50Q5p3K16rr4j53J01j89l3J02j36J0o6K39
$$ plain form
2250 36 125 340 208 261 215 307 142 164 -132 -63 79 -104 -314 -278 -72 -209 -336 -185 -25 -119 -24 380 208
2273 208 221 260 360 81 388 197 77 -52 -127 -351 -166 -200 -246 -121 -237 -10 -131 -99 12 47 -29 130 275
2296 275 58 85 235 282 189 53 34 3 39 -128 -152 -218 -328 -99 -107 -35 141 -33 -1 -107 105 128 8 283
2320 283 176 56 26 35 -168 -46 -29 -167 -112 -216 -100 -36 -220 -224 -189 -68 52 82 166 145 116 237 -32 78
2344 78 136 21 74 -50 10 -156 -217 -249 -355 -167 -79 -82 -17 -15 -109 -235 205 146 54 80 177 219 206 105 112 219 -128
2371 -128 -307 -123 -81 -327 -250 -120 -346 -135 -60 -56 -193 61 206 92 207 252 277 119 40 49 -117 -55 -95 -220
2395 -220 -217 -169 -224 -195 -283 -151 -32 -171 67 167 195 166 246 13 226 91 179 66 21 67 15 -49 -23 -208 -372
2420 -372 -92 -173 -214 -167 9 -58 15 169 173 162 129 -21 64 -9 207 198 104 -49 52 -137 -170 -68 -204 -194 -260 -21
2446b1j03J72P2m4j73K85p5R9J1j76K09k46J62j48p6m6j04J4M9q4J42q7%J88n4
2471c4m7J37r0M06p0j69Rk21J77j59KN1j33L4k9j47J52o2K05OP1j10j02J1J95
2496H3M7l5O9O0j20j64J09K9j16j06K1oM4k5K8J30n1Lo0q4L03lj21J36M3j78P9
2523A15P5j17j48L7l8M9mj20m6K44k39J32o5j12K39K83k09p7K17k1r5M1J79j46
2547A74k9j25n3M5j71nJ64k6n3Kj66J85O2J94l90J68K03j35M6M8J48j47n6J27
2571B10o9j81Qqk43K83n3M9j79J09N1k0Q8L0J00p9P5j04J99k13L4R0k45P8jo7
2597e8M1m0k88P6J55l2N2K47j4o2j28L51Lk47L2L17j78k74LK19l23L4q9J3K31
2622D1j32J26j27NK29k11J23j47K30l9J03o5j6j4j41P2Mj01Q4j7j91N4m0q6L5
$$ plain form
2446 -21 -124 48 120 76 -97 188 113 212 223 47 256 10 172 24 -52 -98 -202 -188 -139 -223 -81 -168 -168 20 -34
2471 -34 -81 56 -34 372 302 133 142 -79 98 -61 -59 -8 -141 -107 -136 -283 -131 -193 12 18 89 -21 -123 -112 83
2496 83 130 95 164 224 104 -60 49 78 -38 -144 -123 -129 -85 -110 -82 48 -3 0 -60 -144 159 156 35 171 214 36 115
2523 115 190 73 -75 -38 -76 -27 -31 -151 -197 47 -192 -60 -125 -237 2 285 76 -1 216 195 100 141 320 174
2547 174 145 20 -33 12 -159 -164 0 -26 -79 -77 -243 -58 4 198 -192 -24 179 44 90 138 286 139 83 210
2571 210 141 -40 -32 -40 -283 0 -53 -4 -183 -74 -23 -43 45 75 175 96 171 67 266 53 87 177 -68 10 9 -58
2597 -58 -17 -57 -345 -269 -114 -146 -94 153 139 77 -51 300 303 56 88 405 227 -47 -44 175 -148 -114 -203 -190 41
2622 41 -91 35 -92 -87 142 -69 54 -93 137 98 201 136 120 106 -35 37 41 -60 24 7 -184 -130 -170 -256 -221
2647b21J12K13k49J36k8M3N5J16j6l8K5L8k04n0JQ2q1j43K87j26m0m4N2Pm8L9
2673h2K87p3Qk35K02Q1j64Q5j6k86J19k9j3K5R9j22M6KQ0j53R5qP4j34J46J76
2699B10j6r1k04K16J17j07o5k9P7k9k11l5J60m5k7j1K4O1Q3p0L0J93j33n2kJ24
2725A68n3k58J01j15J55J33m88K98l7J5m9N8j07K33r6R7n5J48J31n6j72J22m1
2748A32m1P0k15P3j30M6j4M5j55J5L06k43l0J26J7r4K66j39J02j57J35qm3M0n2
2773E2K7j38Mj2j60K13j83K9o4K37p4J21R9O4q4k2R6k84J94j24J8m1K33p0q5j34
2799h8J12j59K1J33j21j11J58R9j21J54m4Pj6J16o1L0N7Q0k12J70j68J9q7j31
2823a63P4k2K2p2K17K7j37J33l8P3j43K04Kk61K46q9M2P0k06j59M3L4L6m6OR2
$$ plain form
2647 -221 -109 104 -145 -9 -37 6 61 177 161 123 148 186 -18 -68 -67 15 -66 -209 78 -48 -88 -132 -80 -73 -121 -82
2673 -82 205 132 140 -95 107 188 24 109 93 -193 -74 -103 -116 -91 8 -114 -68 -66 14 -139 -44 -52 22 -112 34 210
2699 210 194 103 -101 115 232 125 60 31 108 79 -132 -167 -7 -52 -79 -90 -66 -5 78 8 38 231 98 46 44 168
2725 168 115 -143 -42 -157 -2 131 -357 -59 -96 -81 -130 -72 -179 54 -42 55 0 148 279 223 51 173 132
2748 132 91 161 -54 19 -111 -65 -79 -34 -189 -174 132 -111 -141 -15 2 -92 174 35 137 -20 115 107 64 104 52
2773 52 79 -59 -55 -67 -227 -14 -197 -168 -232 5 -69 52 151 215 131 109 205 -79 115 -9 9 -32 201 131 46 -88
2799 -88 24 -135 -114 19 -102 -213 -55 44 -77 77 33 40 24 140 79 109 166 246 34 204 36 55 -32 -163
2823 -163 -89 -111 -89 -161 56 83 -54 79 41 114 -29 175 177 -84 162 73 115 185 -21 -180 -137 -103 -67 -113 -107 -15
2849a5o2M0K09k39J11K6L4Ol8o2M7rk5K10k59J30k41K00r7j19o2j6J78Q8jlj45
2876a14K8K32j55L2Nk5j1M8q0k05K52R5j29j3j17O1J28q8o6J58q2J47n6J12j33
2901B4K18j50N1N0j05Q0j56q3NK0j2Q1j80M6J29j73K69k77K6K01j24R4j25K79
2925A88j21m3j9l5Kl7J39k44Q2N4q9q0M0J76j60J61k0p6J18J35o2j08N7J04q7
2950G5k18J39J53p5k71J17m4N4j8k2Q0N1q9J51k24J64R7j10k8K34q9k0l6k1j23
2975g3J62rj55J28j04l0QlJ29k36L81k07O4j43RK04P1j21k80L14J42o5k08o3R3
3000Hm4lJ15k04J40j0J65k32J02J92j28K3n5J46k59Q0pQK3J46k57J4Rm8J21n3
3026hL8j28l4M8K1N6N8p4J37k02RK28m7n6k2J0o3J75Lj91rQ4j08K0rJ09l9n3M
$$ plain form
2849 -15 -77 -37 172 -67 44 70 104 110 72 10 57 48 23 233 -26 104 -137 63 -34 -153 -215 -231 -53 35 34 31 -114
2876 -114 -86 146 -9 23 28 3 -8 40 -40 -245 7 102 -27 -40 -157 -96 32 -56 -122 36 -46 101 45 157 24
2901 24 242 92 143 193 88 168 12 -71 -66 -46 -58 23 -157 -111 18 -155 114 -163 -137 64 -60 34 -91 188
2925 188 67 24 5 -30 -28 -65 74 -170 -88 -34 -123 -203 -163 13 -147 14 -6 -82 36 171 109 1 58 162 75
2950 75 -143 -4 149 74 -197 -80 -124 -70 -88 -110 -30 21 -68 83 -141 23 120 10 -18 216 127 107 71 50 -73
2975 -73 89 80 -75 53 -51 -81 -73 -76 53 -183 198 -9 55 -88 -79 125 196 75 -205 109 251 186 -22 -85 8
3000 8 -36 -39 76 -128 12 2 167 -65 37 229 101 124 69 215 -44 36 29 37 60 206 -51 -37 -28 -76 45 -8
3026 -8 30 -98 -132 -84 -63 -7 51 -23 114 -88 -79 149 102 46 24 34 -29 146 149 -42 -51 33 -75 -55 -64 45 6 -47 -43
3055d3Q6J30pj53J56k78M7K05j79O7qL0j30K8m1M2j13QJ64j8NK7J72j71P8J30
3081B34q0j13O7p1m6J81j81L5n8N8j74L1PJ7k3J43q1K40l15J55k2P2o2j40J58
3106C2j18L4K03K7k75J14k3j1q5J7O9R4j04J7J20k48O4P1j07K44R5j20j28J23
3130A05M7r5j21P6l21K42Q6p3K5P0P9k50kK37r6p9j1J34R2Oj68M8J51J8j40k13
3156a53J49r5Q4m4J40j97J54j58J98k11L1J05K15j09j15J03O4j9o2l2M9p4j73
3179a50M8L7P0j8jk2R1j1r2r1L07j49Q9P6j58j2QJ61l6k05K07j18J74j72p4R9
3205E8k2n9q4J14nk61L30j6p9p7k7Q8J56r7j68J58k3r7O0MN3m9r8QL3R9m2m6R7
3234Hp2J37j06K27k39J93q9n2q9J22j7R7k93P6J4J3m2qK42j97%R1j20J06j27J77
$$ plain form
3055 -43 43 173 166 13 169 -109 -62 143 -36 31 23 53 -77 -49 -90 -48 -161 -153 11 -7 -2 25 197 26 104 234
3081 234 154 41 108 37 -9 172 -9 26 -32 26 -148 -117 -110 -93 -116 27 -54 186 -129 26 4 76 14 -126 32
3106 32 -86 -52 151 178 -97 17 -6 -17 -102 -85 -16 78 -26 -9 111 -137 -73 -2 -109 135 230 110 -18 105
3130 105 152 57 -64 12 -309 -67 19 -54 -29 41 120 -130 -132 105 9 -70 -81 53 145 151 -17 31 182 200 60 -153
3156 -153 -4 -99 -15 -59 81 -116 38 -120 78 -133 -102 3 218 109 -6 97 161 142 80 48 97 23 -150
3179 -150 -102 -65 5 -13 -14 -36 55 44 -48 -139 168 19 108 184 26 14 22 183 147 -58 149 31 205 33 -41 58
3205 58 36 -23 -107 7 2 -259 71 55 -24 -101 -128 -40 116 19 -149 9 -14 -111 -51 -47 6 -43 -141 -133 -100 -1 -43 -89 8
3234 8 -64 73 -33 194 -45 148 59 7 -82 40 23 120 -173 -97 -83 -70 -112 -120 122 -75 -75 16 -104 2 -125 52
3260E2J06j66k1j4j69K09q9K22k06nK13k42j33K12Q5L9k10J73j23J33j95L5K18
3283A24p3J15k9j68J18M2o7n0j52J77j1k5q0P6K3j10J7J5j08L13j89J42l23K93
3307G0k7j03K4P0r6J51Ln2L2l58L42k68K28L2j53J02o3R2r1J05mn1J31q7k2Lk54
3334b44K80mj32L7M8N8k37K56mj64P7N6KM0M4Mp8Q9j23k6K83k78L9p2J22p8J55
3361A50k23p0O6J09p4k5J44r4J71J33k64j67J09J46l5j00J78L7k08r2K12k17P9
3384c5j49K85j20j24R6N1p6L4J0K0J46M5k16K71j32O8j62J04j56j33J40K9p9n2
3408a35K05%j55M8J69j66N1m7J64k21J66Q7k82J01J38l8j14o4J73p1O7l32J70
3431h6J48q7J08K7j57NJ91r6R7j45j19J22R0n6k4RK01k90M5K6K3j73L5O6O4J87
$$ plain form
3260 52 158 -8 -29 -43 -212 -3 -92 130 -76 -81 132 -110 -243 -31 54 93 -117 56 -67 66 -129 -94 124
3283 124 51 166 137 -31 87 129 62 12 -140 37 26 1 -79 -3 20 -90 -73 -58 -166 147 -42 100 -223 70
3307 70 43 -60 -36 34 -62 89 92 40 72 -286 56 -212 16 48 -105 -3 -66 26 -65 40 36 -15 116 29 7 10 -244
3334 -244 36 32 -100 -63 -15 43 -194 62 58 -106 -29 27 29 69 113 117 39 128 5 -21 262 -16 23 -49 73 -5 150
3361 150 -73 -143 -77 32 -42 -67 77 -17 154 287 23 -144 -35 111 76 -24 154 191 -17 -109 103 -114 -35
3384 -35 -184 101 -19 -143 -47 4 -72 -38 -28 -8 138 183 -33 238 106 174 12 116 -40 -173 -33 -4 -83 -135
3408 -135 70 70 -85 -37 132 -34 17 -30 134 -87 79 166 -116 -15 123 85 -29 -93 80 9 76 -256 -86
3431 -86 62 -25 83 110 -47 -42 149 53 150 5 -114 8 98 42 18 27 228 -62 -17 9 32 -141 -106 -40 24 211
3457B11k05l4J47o6j53R1R4k03O6M4O9q4Q0n9j68K78r3Nj95J24k7M3q8L9J51n7
3483A0jj32L12M5k2j95n3O7j15J31j27K02q0j0k27J84O3m6k6j24R4J74q2N0O4
3508A56L0o8K2j40J42k17m9J01j33K35j01Qn2j24J55j75K63o1QJ61j22O4l4j28
3532e9L9Qk3n4J15l3p9j12L14j10k4K5j25N0J30j11K07j64N5J42j87Q7P4r8j69
3557a02J43M9l23K01K9R8q9m1J21k84Q9J29k8R9J26j12j82K7O4R1J1L4j25l9J76
3582A62o0j01K9l4r9K38l39L05j87Q0M2k98L07r8R6L1J7j19o5J35Q7j34j54K08
3606D9L2j36k3P3J34j81P8j05l6K50q9k41J79J26r8O9No5k11J57J65k79K45m2
3630E6m5j49L2K02k23J48J9q1M8K5m7K1m3LN8J57l24L1O4L5j02K39j65J0j05J16
$$ plain form
3457 211 6 -28 119 53 -100 -9 85 -118 -52 -8 61 -23 57 -2 -170 108 15 20 -175 -51 -78 -35 -123 -84 67 10
3483 10 9 -123 189 234 212 17 -36 31 -84 47 -80 122 42 32 -195 -11 52 6 -20 -144 -50 124 42 92 156
3508 156 186 118 140 0 142 -75 -124 -23 -156 79 -22 -14 -66 -190 -35 -210 53 -8 0 161 39 103 69 -59
3532 -59 -20 -12 -35 -89 26 -7 -86 -198 116 6 -18 7 -118 -68 62 -49 158 -6 49 191 4 91 165 67 -102
3557 -102 41 90 -233 -32 -3 95 6 -35 86 -198 -109 20 -8 91 217 105 -77 -50 14 105 116 150 25 -14 162
3582 162 102 1 30 -4 -103 135 -204 101 -86 -6 36 -262 45 -53 43 74 91 -28 -93 42 129 -5 -159 49
3606 49 81 -55 -78 -5 129 -52 26 -79 -115 135 46 -195 -16 110 12 81 86 21 -190 -33 132 -147 98 56
3630 56 11 -138 -106 96 -127 21 40 -41 7 32 -15 6 -37 -34 24 181 -143 -112 -48 -13 -115 124 -41 -31 -136 -20
3656b0J28p1l3J5k5M7o6j14K37j49J7R9m7M7l2M2k0m2l6l6P8P7K5k00LOr0K12
3684E2j31J49k00O7Q8k9J8r1J20J7q6J5j7o1J10L9j26m8l5Q6J19j37J26r8L6J47
3710A30q2jn3o7J95j91J04l4p6J6L3K1J88k05J06j19k4J92j29J14J13q4j35N0
3734F2Pl22L72o4j76J18o6J44l6j45J63k7K3j5R7j19NJ4j11k1J26j21J80j04K1
3759EJ13j91M6j9P8q0j3J16j13j25K34Rq7n0Q5P4k21K08j13J45L4j24j4J46n0
3784I3n6l2j14K31j29ll9K12J2k17J27j05M7k24J59m3K22j07K2J14j11n6P9j6
3808F6j12N2q1r4J74j08O9K7J20jo2k04J66J82j26Ln6j22J39j10O3J49o7k9j58
3833a20J51J0qj72J85J04j67R6O1O7j62q4R5N6r9o1Q3K2l6N5k10j04K62N5N3n1
$$ plain form
3656 -20 108 37 4 19 -6 41 -25 -139 98 -51 -34 65 18 65 33 75 55 13 -23 -59 19 96 121 -79 -76 -70 -160 52
3684 52 -79 70 -130 -63 25 -4 14 -77 43 60 -26 -11 -28 -89 21 60 -66 -114 -149 -63 56 -81 45 -53 -17 130
3710 130 48 47 -6 -73 122 -69 35 1 -75 -59 -26 -5 183 -22 84 -35 -59 133 4 118 231 147 12 62
3734 62 69 -253 119 55 -121 -3 -69 75 39 -106 57 30 53 38 135 16 21 35 -76 -97 29 -92 88 -16 5
3759 5 118 -73 -27 -46 32 -48 -61 55 -58 -183 51 60 -27 -77 8 82 -139 69 -44 101 135 11 -3 143 93
3784 93 37 5 -109 122 -7 -10 -49 163 175 -42 85 -20 27 -197 -38 -81 141 34 56 170 59 3 82 66
3808 66 -46 6 -75 -169 5 -103 -34 -7 113 112 50 -154 12 194 68 71 15 -107 32 -78 -15 134 67 38 -120
3833 -120 31 41 33 -139 46 150 -17 79 140 207 45 -39 56 112 13 -48 35 57 21 76 -134 -238 24 79 132 81
3859H1pj12lJ3K3N4j88J08J47r4L1q3n5J7J03n6J39k77J36j7L0m5k08L90j50o5
3885h8N8j27J41L6Q9n0P2Q8j01l61K97J07j04n4L4rj04j9J15j04O2M4kl0qo1M2
3912c7O1N3J2j3J18m57K67nlo0O7l8j43K45r1P5p3J6Q7j93Rj12J64k7K9k1pJ19
3940D2l3Q6q4j67K54o9j86J66r9J98p6O5j78J13q3O0l9Q5K00o5k43J8L1J8j49
3965a35J32J01l2l4j34J73r3l0J5P8l1l5J47j85J06r3J18j87K39j01p6M9j48R
3989a47J56q2k8J5J94m5P4j00p8K86k24J48q1o6o6K67k32l2m0j5M9Q9K2j47Q0
4014cQ1o5q5L6L3r8K95j83n4J43m4j46J14n6k1K7n8Q0J14k65K0K75j99J0J04k40
4040a85K95k23Q4Jp5R0J82j67m5L2J21P4k79J46Q8r3n1KpK7m8J15n0K49l53n3
$$ plain form
3859 81 74 -38 -41 -28 -5 49 -139 -31 116 22 53 -30 -85 -68 35 -21 118 -159 -23 -40 -10 -55 -263 127 -23 -88
3885 -88 -30 -157 -16 20 109 59 131 219 118 -243 54 161 57 3 37 28 -76 -95 20 -84 -22 22 20 -10 -18 -79 -37
3912 -37 24 77 89 76 194 -263 4 -1 -4 -64 3 -35 -178 67 -24 51 -22 -6 81 -112 -103 -215 -51 -78 -49 -70 -77 42
3940 42 9 95 11 -156 98 29 -157 9 -90 108 32 97 -81 32 -51 9 -30 55 255 190 -53 -35 -4 14 -135
3965 -135 -3 98 66 32 -102 71 -22 -52 -37 41 10 -25 122 -63 43 -50 68 -119 120 19 -57 -8 -156 -147
3989 -147 9 -73 -101 -86 108 63 137 37 -41 245 21 169 88 22 -44 223 -9 -41 -81 -96 -47 42 64 -83 -3
4014 -3 78 13 -72 -36 -3 -101 194 11 -43 100 56 -90 24 -32 -53 -26 -84 -4 110 -155 -135 140 -59 -49 55 -185
4040 -185 110 -113 -29 -28 -103 -13 169 2 -43 -11 110 184 -95 51 139 46 -5 -3 -10 17 -31 84 34 283 -70 -123
4066a23J93l6loJ23Lj01M4j13k0J41j72l2K21l9k91L27j06r6l0Q9K51k78J11n0
4091Gj69J33NM9L1K7p7q5Q6J1j59K51q4N3p4M6l2j99K60j12J50j6r4l3P4k8n5
4118c4K7n7m9K90k01J1R1n6o0J59K2j79k8N3O1qj08J9J46j29PJ09k51J29j38o
4144a80K59k94J64L9L9l9po6N7J94k14R5j1l9J2J23l8j44P7L6L7k10J04j16K44
4169A22j05m0J2R8j02J03R6k54KJ95r0j25K1L9N2j41N4J40q2j32J58J0r0n9o9
4194a87J74M3N1k02J32j07K40Oq9k0K4n7Pj34J27J29k21J95k8j85J30k8JJ32j87
4219e4K13k46J64j27N0o0N6pk55L27m0L8J4n6j07J74j35J70m5k67J39J89j8k6
4243I1j14N5k6K49j91n3R3k12Q7k0N9pm7l1Q6j12L6P1j3k8J06r1r6Q0l5l6R0p2
$$ plain form
4066 -123 70 34 31 25 148 151 50 94 -19 -39 102 -70 -102 119 80 -211 116 10 -86 -116 -27 224 -54 57 7
4091 7 -162 -29 -24 25 56 83 6 -79 7 18 -141 110 26 79 5 51 19 -180 80 -32 118 102 8 -25 49 21 -34
4118 -34 -7 -64 -113 177 -24 -13 78 22 -38 121 143 -36 -64 -11 50 42 -66 -47 99 -30 -23 86 -165 -36 -174 -180
4144 -180 79 -215 -51 -12 27 -12 -19 -85 -28 166 -48 47 36 -3 9 132 94 -50 27 63 100 -110 -6 -122 122
4169 122 17 -23 -11 87 -15 88 184 -70 -68 127 37 -88 -67 -28 24 -117 -63 77 -5 -137 21 31 -59 -118 -187
4194 -187 -13 30 81 -121 11 -96 144 150 61 41 65 8 15 -119 8 137 -84 111 83 -102 28 0 1 133 -54
4219 -54 159 -87 77 -50 0 -60 -4 -11 -266 61 21 59 73 17 -90 84 -51 119 74 -193 -54 135 117 91
4243 91 -23 32 6 255 64 11 104 -108 -21 -41 18 11 -36 -67 19 -93 -57 14 1 -27 79 -12 -108 -28 -63 -99 -9 -81
4271h1J10r0PJ17r1Jn5J71L2j76K01j30p3J65j06L4j19K43j40j40J9K71p3r2R3
4296I8j12K3kr0M1p2J10n1P2j29J66J61k33P4o7J6j22L7K28K2k61J16j16P3PR1
4322H0q3n4O0J74p3J13j26q8O0k13jj5K22j10K17k79M3p5K79j59J00j07o2R7m6
4347d6q5Q5K59p1p2p4rj4J0L7n2qR9p5l1J01m1P3J7l2j6Ml1K5q9J43j79J45j30
4376e7J81j24r6J5rJ34j28J73J94l33n1J82k9q5O6m0M6o6k00J85j64J20O4o3K25
4401A40k6k22L33j76o0Q9m2J9j29M6J08j14LJ78j91O6j37Q5J5J04k12J26K5Nl1
4426BL5l6j72K12mk1o3K3nK2l0J13m3o4M6o7J11l9o8L7J03j48J1K09Lk34J44j48
4454g1J7o5m1K46j02R2j58j56K01j8J28L1L5j90k9o1J52J02j60P4o3J24k00J10
$$ plain form
4271 -81 29 -61 -54 63 -28 -27 -82 89 121 -55 146 16 -57 108 2 36 -83 160 20 -120 -101 170 97 5 98
4296 98 -14 9 7 -83 -42 -114 -4 -55 17 -112 54 215 -18 56 -11 5 -117 -80 148 170 -91 25 -91 -18 -11 80
4322 80 -3 -57 3 177 104 217 91 3 63 -150 -151 -166 56 -54 163 -116 -73 -148 131 -28 72 -35 -97 0 -46
4347 -46 -131 -46 213 142 70 -4 -13 -27 -17 20 -32 -40 59 -16 -47 54 13 86 103 71 55 59 28 53 -36 107 -72 73 -57
4376 -57 124 0 -96 -81 -90 44 -84 89 283 -50 -101 81 52 -33 33 -7 39 -27 -227 -42 -206 -86 -22 -85 140
4401 140 114 -108 225 49 -11 78 36 55 -74 -28 80 -34 -31 147 -44 22 -115 -30 -15 89 -123 3 28 33 2
4426 2 37 1 -171 41 37 16 -47 -24 -29 -7 -37 76 33 -31 15 -52 59 20 -48 -11 92 -56 -45 164 167 -67 77 -71
4454 -71 -54 -119 -160 86 -16 76 -82 -238 -37 -55 73 104 139 -51 -80 -141 11 113 -47 27 -36 88 -112 -2
4478bK2j33J54L0m3k2L7l8m7J60j56J44k31J56k5L5r2R9J03j23Q2q9q9j1n0n4
4504a83J45N0j71K41p2k04J61L3M3j10Q7M9K4j03j1O9j7o6M9n1Q6o9p4N5Q9m7
$$ plain form
4478 -2 20 -113 41 71 28 6 43 5 -42 118 -38 106 -125 31 6 41 -51 48 151 28 110 21 -68 -79 -129 -183
4504 -183 -38 12 -159 82 10 -194 -33 0 43 -67 20 69 93 -10 -21 48 31 -35 14 -37 49 -20 -94 -39 50 3
$$ [...]
8191b0
##END NTUPLES=NMR FID
##END=
