##TITLE=1H_Pr Am-31
 CDCl3, 32 sc, 
 7.3.2019
##JCAMPDX= 6.0         $$ Bruker NMR JCAMP-DX V2.0
##DATA TYPE= NMR FID
##DATA CLASS= NTUPLES
##ORIGIN= UXNMR, Bruker Analytische Messtechnik GmbH
##OWNER= root
$$ XWIN-NMR		Version 3.5
$$ Thu Mar  7 16:28:06 2019 Russian Standard Time (UT+4h)  she@DPX200
##.OBSERVE FREQUENCY= 200.1316
##.OBSERVE NUCLEUS= ^1H
##.DELAY= (6, 6)
##.ACQUISITION MODE= SIMULTANEOUS
##.ACQUISITION SCHEME= undefined
##.AVERAGES= 8
##.DIGITISER RES= 18
##SPECTROMETER/DATA SYSTEM= spect
##.PULSE SEQUENCE= zg30
##.SOLVENT NAME= CDCl3
##.SHIFT REFERENCE= (INTERNAL, CDCl3, 0, 15.7039)
##AUDIT TRAIL= $$ (NUMBER, WHEN, WHO, WHERE, WHAT)
$$ ##TITLE= Audit trail, XWIN-NMR		Version 3.5
$$ ##JCAMPDX= 5.01
$$ ##ORIGIN= Bruker BioSpin GmbH
$$ ##OWNER= she
$$ F:/spectra/data/she/nmr/H-F/1/audita.txt
$$ ##AUDIT TRAIL=  $$ (NUMBER, WHEN, WHO, WHERE, WHAT)
(   1,<2019-03-07 16:27:01.89 +0400>,<she>,<DPX200>,
      <created by zg, POWCHK disabled, PULCHK disabled
       configuration hash MD5:
       00 E9 B6 7A A2 85 ED C7 34 08 36 98 17 FE 4E 26
       data hash MD5: 16K
       B4 A8 7B FE 9D A3 B6 0F AE D5 82 EA BB F3 55 12>)
$$ ##END=
$$ 
$$ hash MD5
$$ 27 09 C8 DB 1D 11 C7 AA 13 78 36 DD 4F 3E 49 69
##$RELAX= 
##$RELAX= 
##$RELAX= 
##$RELAX= 
##$RELAX= 
##$RELAX= 
$$ Bruker specific parameters
$$ --------------------------
##$DU= <F:/spectra>
##$EXPNO= 1
##$NAME= <H-F>
##$PROCNO= 1
##$TYPE= <nmr>
##$USER= <she>
##$AMP= (0..31)
100 100 100 100 100 100 100 100 100 100 100 100 100 100 100 100 100 100 
100 100 100 100 100 100 100 100 100 100 100 100 100 100 
##$AQSEQ= 0
##$AQ_mod= 1
##$AUNM= <au_zg>
##$AUTOPOS= <>
##$BF1= 200.13
##$BF2= 200.13
##$BF3= 200.13
##$BF4= 200.13
##$BF5= 200.13
##$BF6= 200.13
##$BF7= 200.13
##$BF8= 200.13
##$BYTORDA= 1
##$CFDGTYP= 0
##$CFRGTYP= 5
##$CHEMSTR= <none>
##$CNST= (0..31)
1 1 145 1 1 1 1 1 1 1 1 1 1 1 1 1 1 1 1 1 1 1 1 1 1 1 1 1 1 1 1 1 
##$CPDPRG= <>
##$CPDPRG1= <>
##$CPDPRG2= <>
##$CPDPRG3= <>
##$CPDPRG4= <mlev>
##$CPDPRG5= <mlev>
##$CPDPRG6= <mlev>
##$CPDPRG7= <mlev>
##$CPDPRG8= <mlev>
##$CPDPRGB= <>
##$CPDPRGT= <>
##$D= (0..31)
0 1.2 0 0 0 0 0 0 0 0 0 0.03 0 0 0 0 0 0 0 0 0 0 0 0 0 0 0 0 0 0 0 0 
##$DATE= 1551961621
##$DBL= (0..7)
120 120 120 120 120 120 120 120 
##$DBP= (0..7)
150 150 150 150 150 150 150 150 
##$DBP07= 0
##$DBPNAM0= <>
##$DBPNAM1= <>
##$DBPNAM2= <>
##$DBPNAM3= <>
##$DBPNAM4= <>
##$DBPNAM5= <>
##$DBPNAM6= <>
##$DBPNAM7= <>
##$DBPOAL= (0..7)
0.5 0.5 0.5 0.5 0.5 0.5 0.5 0.5 
##$DBPOFFS= (0..7)
0 0 0 0 0 0 0 0 
##$DE= 6
##$DECBNUC= <off>
##$DECIM= 24
##$DECNUC= <off>
##$DECSTAT= 4
##$DIGMOD= 1
##$DIGTYP= 9
##$DL= (0..7)
0 120 120 120 120 120 120 120 
##$DP= (0..7)
150 150 150 150 150 150 150 150 
##$DP07= 0
##$DPNAME0= <>
##$DPNAME1= <>
##$DPNAME2= <>
##$DPNAME3= <>
##$DPNAME4= <>
##$DPNAME5= <>
##$DPNAME6= <>
##$DPNAME7= <>
##$DPOAL= (0..7)
0.5 0.5 0.5 0.5 0.5 0.5 0.5 0.5 
##$DPOFFS= (0..7)
0 0 0 0 0 0 0 0 
##$DQDMODE= 0
##$DR= 18
##$DS= 0
##$DSLIST= <SSSSSSSSSSSSSSS>
##$DSPFIRM= 0
$$ [...]
##$SUBNAM2= <"">
##$SUBNAM3= <"">
##$SUBNAM4= <"">
##$SUBNAM5= <"">
##$SUBNAM6= <"">
##$SUBNAM7= <"">
##$SUBNAM8= <"">
##$SUBNAM9= <"">
##$SW= 24.9336934301222
##$SWIBOX= (0..15)
0 0 2 0 0 0 0 0 0 0 0 0 0 0 0 0 
##$SW_h= 4990.01996007984
##$TD= 16384
##$TD0= 1
##$TE= 0
##$TE2= 300
##$TE3= 300
##$TEG= 300
##$TL= (0..7)
0 120 120 120 120 120 120 120 
##$TP= (0..7)
150 150 150 150 150 150 150 150 
##$TP07= 0
##$TPNAME0= <>
##$TPNAME1= <>
##$TPNAME2= <>
##$TPNAME3= <>
##$TPNAME4= <>
##$TPNAME5= <>
##$TPNAME6= <>
##$TPNAME7= <>
##$TPOAL= (0..7)
0.5 0.5 0.5 0.5 0.5 0.5 0.5 0.5 
##$TPOFFS= (0..7)
0 0 0 0 0 0 0 0 
##$TUNHIN= 0
##$TUNHOUT= 0
##$TUNXOUT= 0
##$USERA1= <user>
##$USERA2= <user>
##$USERA3= <user>
##$USERA4= <user>
##$USERA5= <user>
##$V9= 5
##$VALIST= <valist>
##$VCLIST= <CCCCCCCCCCCCCCC>
##$VD= 0
##$VDLIST= <DDDDDDDDDDDDDDD>
##$VPLIST= <PPPPPPPPPPPPPPP>
##$VTLIST= <TTTTTTTTTTTTTTT>
##$WBST= 1024
##$WBSW= 4
##$XGAIN= (0..3)
0 0 0 0 
##$XL= 0
##$YL= 0
##$YMAX_a= 113812
##$YMIN_a= -212369
##$ZGOPTNS= <>
##$ZL1= 120
##$ZL2= 120
##$ZL3= 120
##$ZL4= 120
##$ABSF1= 10
##$ABSF2= 0
##$ABSG= 5
##$ABSL= 3
##$ALPHA= 0
##$AQORDER= 0
##$ASSFAC= 0
##$ASSFACI= 0
##$ASSFACX= 0
##$ASSWID= 0
##$AUNMP= <proc_1d>
##$AZFE= 0.1
##$AZFW= 0.1
##$BCFW= 1
##$BC_mod= 2
##$BYTORDP= 1
##$COROFFS= 0
##$CY= 11.3945322036743
##$DATMOD= 1
##$DC= 2
##$DFILT= <>
##$DTYPP= 0
##$F1P= 18.9103706918063
##$F2P= -1.10871071338519
##$FCOR= 0.5
##$FTSIZE= 0
##$FT_mod= 4
##$GAMMA= 1
##$GB= 0.15
##$INTBC= 1
##$INTSCL= 1
##$ISEN= 128
##$LB= 0.24
##$LEV0= 0
##$LPBIN= 0
##$MAXI= 10000
##$MC2= 0
##$MEAN= 0
##$ME_mod= 0
##$MI= 1.114404
##$NCOEF= 0
##$NC_proc= 0
##$NLEV= 6
##$NOISF1= 3.799351
##$NOISF2= 2.8
##$NSP= 1
##$NTH_PI= 0
##$NZP= 0
##$OFFSET= 15.70392
##$PC= 1
##$PHC0= -8850.051
##$PHC1= 1.800138
##$PH_mod= 1
##$PKNL= yes
##$PPARMOD= 0
##$PSCAL= 0
##$PSIGN= 0
##$REVERSE= no
##$SF= 200.130013532006
##$SI= 16384
##$SIGF1= 3
##$SIGF2= 2
##$SINO= 400
##$SIOLD= 16384
##$SREGLST= <1H.CDCl3>
##$SSB= 0
##$STSI= 0
##$STSR= 0
##$SW_p= 3612.71676300578
##$SYMM= 0
##$S_DEV= 0
##$TDeff= 0
##$TDoff= 0
##$TI= <>
##$TILT= no
##$TM1= 0
##$TM2= 0
##$TOPLEV= 0
##$USERP1= <user>
##$USERP2= <user>
##$USERP3= <user>
##$USERP4= <user>
##$USERP5= <user>
##$WDW= 1
##$XDIM= 8192
##$YMAX_p= 0
##$YMIN_p= 0
$$ End of Bruker specific parameters
$$ ---------------------------------
##NTUPLES= NMR FID
##VAR_NAME=  TIME,          FID/REAL,        FID/IMAG
##SYMBOL=    X,             R,               I
##VAR_TYPE=  INDEPENDENT,   DEPENDENT,       DEPENDENT
##VAR_FORM=  AFFN,          ASDF,            ASDF
##VAR_DIM=   8192,          8192,            8192
##UNITS=     SECONDS,       ARBITRARY UNITS, ARBITRARY UNITS
##FACTOR=    0.0002004,     1,               1
##FIRST=     0,             0,               0
##LAST=      1.6414764,     0,               0
##MIN=       0,             -212369,         0
##MAX=       1.6414764,     113812,          0
$$ Real data points
##PAGE= N=1
##DATA TABLE= (X++(R..R)), XYDATA
$$ plain form
0 0 0 0 0 0 0 0 0 -8 8 -8 10 -16 17 -24 26 -33 41 -49 57 -68 81 -96 112 -128 146 -169 192 -218 246 -277
30 -277 314 -353 397 -445 494 -552 613 -680 756 -839 930 -1028 1138 -1262 1397 -1548 1719
47 1719 -1914 2138 -2394 2698 -3057 3497 -4046 4757 -5712 7077 -9195 12954 -21635 84815
61 84815 -55387 -173924 70122 66334 21613 11377 -66731 -39029 100071 -10447 -81318
72 -81318 44057 13581 -76302 41207 24304 -84517 19211 62929 -57791 -5819 36763
83 36763 -51924 24178 89358 -71426 -62712 87542 23817 -33509 27279 -34716 -33785 87438
95 87438 9104 -81692 30660 24359 -48890 48481 30438 -91842 13550 83927 -44772 -33078
107 -33078 38408 -22959 7219 51061 -58693 -38630 68648 -13304 -37236 54852 -31360 -75322
$$ packed form
0@%%%%%%%qJ6j6J8k6L3m1N0n9P4r0J06j25J49j77K08k40K74l15L61m10M64n23
30b77N91o67P50q42R39j046J165j293J436j595J769j958K166k400K659k945L267
47A719l633M052m532N092n755O554p543Q803j0469J2789j6272K2149l4589J06450
61H4815j40202j18537K44046l788m4721j0236p8108K7702J39100j10518p0871
72h1318J25375l0476q9883J17509j6903j08821J03728M3718j20720N1972M2582
83C6763q8687P6102O5180j60784Q714J50254o3725n7326O0788o1995R31J21223
95H7438p8334r0796J12352o301p3249R7371j8043j22280J05392P0377j28699J1694
107c3078P1486o1367L0178M3842j09754K0063J07278q1952k3932R2088q6212m3962
$$ plain form
119 -75322 74277 44873 -77603 -1614 30286 -27562 34395 21783 -67919 27293 72235 -59145
131 -59145 -25993 70141 -7813 -18414 32175 -40577 -13751 83292 -19492 -70542 42992 6512
143 6512 -49559 53843 19405 -87397 3420 51534 -21557 7005 1988 -62156 31550 68046
155 68046 -62004 -25683 70485 -23489 -39990 51822 -2133 -27795 43210 -15725 -44671 56382
167 56382 17924 -52510 27073 16230 -49617 35648 41000 -59419 544 47506 -36429 -4388
179 -4388 42489 -40335 -13533 55075 -34283 -40322 55921 -5192 -50185 32131 5761 -38556
191 -38556 28188 2940 -38948 40892 15196 -64454 28177 57318 -48279 -10275 46965 -26043
203 -26043 -5134 47146 -27697 -20472 44855 -21443 -25860 53455 -10992 -51556 35576 9251
$$ packed form
119g5322J49599k9404j22476P5989L1900n7848O1957j2612q9702R5212M4942j31380
131e9145L3152R6134p7954j0601N0589p2752K6826R7043j02784n1050J13534l6480
143F512n6071J03402l4438j06802R0817M8114p3091K8562n017o4144R3706L6496
155F8046j30050L6321R6168r3974j6501R1812n3955k5662P1005n8935k8946J01053
167E6382l8458p0434P9583j0843o5847Q5265N352j00419N9963M6962q3935L2041
179d388M6877q2824K6802O8608q9358o039R6243o1113m4993Q2316k6370m4317
191c8556O6744k5248m1888P9840k5696p9650R2631K9141j05597L8004N7240p3008
203b6043K0909N2280p4843P225O5327o6298m417P9315o4447m0564Q7132k6325
$$ plain form
215 9251 -40538 32889 11482 -57015 17718 31216 -40701 14985 32746 -55897 -8941 55599
227 55599 -18889 -17036 29141 -32515 -13637 59950 -12775 -41830 37501 776 -32485 43781
239 43781 8446 -49867 30767 28446 -46229 13766 37895 -35464 -3793 26491 -29553 7417
251 7417 37949 -45405 -21935 51622 -16223 -33449 35898 -10518 -36571 36410 4689 -38475
263 -38475 27507 8613 -42614 28406 30135 -45012 4126 36271 -24500 2869 27561 -33345
275 -33345 2770 48511 -29750 -24647 45581 -10721 -30860 39857 1028 -39897 22754 7376
287 7376 -28975 27310 6500 -48658 18645 30114 -38999 2564 28761 -35777 -2870 37587
299 37587 -28763 -12022 42313 -22679 -29897 41033 3190 -24947 24748 -8766 -27899 44381
$$ packed form
215I251m9789P3427k1407o8497P4733J3498p1917N5686J7761q8643M6956O4540
227E5599p4488J853M6177o1656J8878P3587p2725k9055P9331l6725l3261P6266
239D3781l5335n8313Q0634k321p4675N9995K4129p3359L1671L0284n6044L6970
251G417L0532q3354K3470P3557o7845j7226O9347m6416k6053P2981l1721m3164
263c8475O5982j8894n1227P1020J729p5147M9138L2145o0771K7369K4692o0906
275c3345L6115M5741p8261N103P0228n6302k0139P0717l8829m0925O2651j5378
287G376l6351N6285k0810n5158O7303J1469o9113M1563K6197o4538L2907M0457
299C7587o6350J6741N4335o4992p218P0930l7843k8137M9695l3514j9133P2280
$$ plain form
311 44381 14424 -46233 14069 22993 -27185 19014 22932 -43428 2053 37737 -28400 -8009
323 -8009 34926 -28631 -24252 37462 -8071 -25384 24473 -11242 -25790 33558 -1848 -35986
335 -35986 30126 12971 -43111 17224 30904 -30666 2266 23684 -25968 7823 34676 -30915
347 -30915 -12715 39559 -11834 -17968 29848 -11952 -21832 33481 -3383 -30464 27872 3050
359 3050 -38104 23980 20903 -38701 2902 21860 -25338 5768 21685 -34272 -3852 35676
371 35676 -21403 -15346 30246 -15327 -16973 35352 -7425 -26286 32427 2525 -33197 27476
383 27476 18733 -31072 9804 15826 -24609 15392 21703 -34722 46 30488 -24983 -6763 31672
396 31672 -23041 -21295 30805 -8421 -20323 26444 -10897 -30640 31376 10304 -34905 12210
$$ packed form
311D4381k9957o0657O0302Q924n0178M6199L918o6360M5481L5684o6137K0391
323h009M2935o3557M379O1714m5533j7313M9857l5715j4548N9348l5406l4138
335c5986O6112j7155n6082O0335J3680o1570L2932K1418m9652L3791K6853o5591
347c0915J8200N2274n1393o134M7816m1800r880N5313l6864k7081N8336k4822
359C050m1154O2084l077n9604M1603J8958m7198L1106J5917n5957L0420L9528
371C5676n7079O057M5592m5573j646N2325m2777j8861N8713k9902l5722O0673
383B7476q743m9805M0876O022m0435M0001O311n6425L4768L0442n5471J8220L8435
396C1672n4713J746N2100l9226j1902M6767l7341j9743O2016k1072m5209M7115
$$ plain form
408 12210 13791 -23879 14651 15587 -30062 10287 25218 -29201 1676 35853 -23098 -16384 31757
421 31757 -6797 -14089 25802 -11387 -21678 30347 1908 -28875 19470 6967 -28869 15894
433 15894 12985 -29674 9277 16955 -31487 4073 29370 -27064 -13465 27833 -11308 -10867 23696
446 23696 -15071 -16135 31627 -2908 -23563 24274 3093 -25364 22756 13366 -26741 12891
458 12891 14918 -27507 11635 26416 -28860 -7557 26760 -15113 -8533 21338 -17379 -12810 26330
471 26330 -12301 -20363 27627 -4657 -30182 22439 11007 -26254 11499 9003 -25219 15697
483 15697 20625 -28719 19 25517 -17330 -2392 24643 -16447 -8118 25529 -12326 -11571 30586
496 30586 -8698 -27438 25024 8996 -23937 12595 4619 -24367 14894 13825 -28032 3905
$$ packed form
408A2210J581l7670L8530R36m5649M0349J4931n4419L0877L4177n8951O714M8141
421C1757l8554p292L9891l7189j0291N2025k8439l0783M8345j2503l5836M4763
433A5894k909m2659L8951P678m8442L5560K5297n6434J3599M1298l9141M41L4563
446B3696l8767j064M7762l4535k0655M7837k1181k8457M8120r390m0107L9632
458A2891K027m2425L9142J4781n5276K1303L4317m1873O580K9871l8717M569L9140
471B6330l8631q062M7990l2284k5525N2621j1432l7261L7753k496l4222M0916
483A5697M928m9344K8738K5498m2847J4938K7035m1090Q329L3647l7855P55M2157
496C0586l9284j8740N2462j6028l2933L6532p976k8986L9261j069m1857L1937
$$ plain form
508 3905 17118 -23346 1001 22953 -21107 -9260 22374 -13601 -7872 27053 -13342 -23147 27716
521 27716 6004 -20928 15047 3977 -18751 18120 9730 -22749 13063 15187 -26177 5112
533 5112 24043 -19350 -5562 19188 -17007 -5385 25086 -15959 -18909 23828 -3494 -20125
545 -20125 18370 -291 -22314 14629 5776 -19129 15010 6441 -28507 12161 24946 -22437
557 -22437 -5058 19260 -13244 697 22310 -17156 -10179 26449 -6488 -15961 21140 -2269
569 -2269 -18533 18429 2111 -19921 16183 4984 -25759 12855 15771 -25378 282 17406
581 17406 -18785 -2616 18578 -15787 -6671 18820 -14876 -9119 26489 -6510 -20814 17990
593 17990 3520 -13034 17824 -144 -22894 18345 15749 -22341 4533 15665 -17385 2805
$$ packed form
508C905J3213m0464K4347K1952m4060J1847L1634l5975N729L4925m0395r805N0863
521B7716k1712k6932L5975j1070k2728L6871q390l2479L5812K124m1364L1289
533E112J8931m3393J3788K4750l6195J1622L0471m1045k950M2737k7322j6631
545b0125L8495j8661k2023L6943q853k4905L4139q569l4948M0668J2785m7383
557b2437J7379K4318l2504J3941K1613l9466O977L6628l2937r473L7101k3409
569b269j6264L6962j6318k2032L6104j1199l0743L8614K916m1149K5660J7124
581A7406l6191J6169K1194l4365R116K5491l3696N757L5608l2999j4304L8804
593A7990j4470j6554L0858j7968k2750M1239k596l8090K6874J1132l3050K0190
$$ plain form
605 2805 17904 -16367 -3354 16990 -15570 -5710 22627 -13079 -17851 19915 -1750 -16242 16303
618 16303 -1760 -20450 15471 6967 -21352 10355 12066 -21420 4162 17213 -14614 989
630 989 15000 -16495 -306 23930 -12585 -12075 21766 -4509 -13401 19063 -1582 -17903 15752
643 15752 3836 -18558 13175 6689 -22693 6924 13592 -17776 1899 11637 -20315 767 21711
656 21711 -16137 -10410 18979 -8258 -10118 20173 -4643 -16297 16634 2381 -14155 15839
668 15839 3849 -19577 12808 13220 -17270 5236 11270 -17152 5091 18375 -18482 -6311 20058
681 20058 -10164 -10376 16656 -6524 -11956 14913 -5795 -14933 18277 1567 -20779 9789 7157
694 7157 -15659 9638 8929 -20861 4728 17699 -14226 -1322 15947 -13486 -3965 21532 -7128
$$ packed form
605B805J5099l4271J3013K0344l2560R860K8337l5706m772L7766k1665j4492L2545
618A6303j8063j8690L5921q504k8319L1707J711l3486K5582J3051l1827J5603
630I89J4011l1495J6189K4236l6515N10L3841k6275q892L2464k0645j6321L3655
643A5752j1916k2394L1733o486k9382K9617O668l1368J9675R738l1952K1082K0944
656B1711l7848N727K9389k7237j860L0291k4816j1654L2931j4253j6536K9994
668A5839j1990k3426L2385M12l0490K2506O034k8422K2243J3284l6857J2171K6369
681B0058l0222k12K7032k3180n432K6869k0708r138L3210j6710k2346L0568k632
694G157k2816K5297p09k9790K5589J2971l1925J2904J7269k9433R521K5497k8660
$$ plain form
707 -7128 -11600 14219 -4021 -6350 19346 -6800 -20570 18538 9320 -18915 6016 6926 -16064
720 -16064 7331 9566 -19136 2987 16194 -17190 -5822 17025 -9250 -6231 13938 -10701
732 -10701 -8223 20634 -4716 -16177 16619 2533 -16004 14822 8076 -18272 6364 11181 -11301
745 -11301 7645 8711 -20201 2663 21049 -12359 -8637 13371 -8458 -5182 16152 -10026 -13017
758 -13017 17593 -2487 -17967 12677 4787 -16598 6911 5962 -13644 8805 7464 -18441 5901
771 5901 16351 -15682 -2887 17620 -9400 -6279 15980 -5790 -7154 15146 -7074 -11501 19461
784 19461 1872 -18912 8318 7195 -10769 8031 2519 -18137 8951 12706 -18999 -1148 15668
797 15668 -13500 -6175 15222 -7908 -6911 12898 -8644 -8496 18529 -2204 -15703 12382 3347
$$ packed form
707g128m472K5819j8240k329K5696k6146j3770L9108r218k8235K4931R10k2990
720a6064K3395K235k8702K2123J3207l3384J1368K2847k6275L019K0169k4639
732a0701K478K8857k5350j1461L2796j4086j8537L0826o746k6348K4636M817k2482
745a1301J8946J066k8912K2864J8386l3408L722K2008k1829L276K1334k6178k991
758a3017L0610k0080j5480L0644p890k1385K3509r49j9606K2449j341k5905K4342
771E901J0450l2033J2795K0507k7020L121K2259k1770j364K2300k2220m427L0962
784A9461j7589k0784K7230j123j7964J8800n512k0656K7088L755l1705J7851J6816
797A5668k9168P325K1397k3130R97J9809k1542J48K7025k0733j3499K8085r035
$$ plain form
810 3347 -12815 12581 5754 -16239 7753 9857 -13636 6732 13059 -17711 -2798 18038 -7748
823 -7748 -6271 10518 -9664 -5200 17267 -7728 -14441 14938 563 -15610 9635 3420 -13762
836 -13762 9010 4196 -17120 8328 13474 -15899 -1318 13678 -8563 -770 12569 -10568 -3893
849 -3893 16685 -6481 -8355 15919 -3958 -13236 15064 4077 -14839 7264 4385 -11853 8757
862 8757 5822 -18150 3427 14174 -12928 -3711 9782 -10718 -994 13954 -11274 -8219 15434
875 15434 -5096 -10368 15151 -329 -13857 10696 3937 -11931 10898 6279 -14677 6331 10151
888 10151 -12628 4292 12804 -13485 -2756 13629 -8267 -2850 13730 -11430 -10940 17329 840
901 840 -13499 6823 -1718 -9376 12859 1365 -17729 7479 8660 -14015 4344 10357 -13359
$$ packed form
810C347j6162K5396o827k1993K3992K104k3493K0368O327l0770J4913K0836k5786
823g748J477J6789k0182M464K2467k4995o713K9379j4375j6173K5245o215j7182
836a3762K2772m814k1316K5448N146k9373J4581J4996k2241P793J3339k3137O675
849c893K0578k3166j874K4274j9877r278K8300j0987j8916K2103k879j6238K0610
862H757k935k3972K1577J0747k7102R217J3493k0500R724J4948k5228L055K3653
875A5434k0530n272K5519j5480j3528K4553o759j5868K2829m619k0956K1008L820
888A0151k2779J6920Q512k6289J0729J6385k1896N417J6580k5160M90K8269j6489
901H40j4339K0322q541p658K2235j1494j9094K5208J181k2675J8359O013k3716
$$ plain form
914 -13359 322 12258 -9887 -1070 14958 -9358 -6756 15666 -3512 -8984 13553 -361 -10970
927 -10970 10183 1449 -10931 11076 3060 -16547 7713 10949 -14392 -1196 9828 -10182 -66
940 -66 10038 -12562 -4473 15272 -6830 -9196 11228 -3833 -8499 13004 -477 -12316 10689
953 10689 3215 -12029 10145 7554 -14961 3554 11880 -8903 1166 8916 -11478 301 14574
966 14574 -9395 -6847 13277 -5499 -9173 11651 -2119 -9655 10061 -2591 -14329 12309 7134
979 7134 -15677 1924 6947 -10177 5277 9307 -12918 -541 11591 -9187 -275 14347 -9347
992 -9347 -8555 14663 -532 -8020 10569 -2332 -9989 13198 2721 -14272 7912 6770 -12878
1005 -12878 3189 7624 -10800 2071 7676 -13461 -52 13595 -10066 -7442 12133 -4474
$$ packed form
914a3359J3681J1936k2145Q817J6028k4316K602K2422j9178n472K2537j3914j0609
927a0970K1153q734j2380K2007q016j9607K4260L236k5341J3196J1024k0010J0116
940f6J0104k2600Q089J9745k2102k366K0424j5061m666K1503j3481j1839K3005
953A0689p474j5244K2174k591k2515J8515Q326k0783J0069P750k0394J1779J4273
966A4574k3969K548K0124j8776l674K0824j3770p536J9716j2652j1738K6638n175
979G134k2811J7601N023j7124J5454M030k2225J2377J2132k0778Q912J4622k3694
992i347P92K3218j5195p488J8589j2901p657K3187j0477j6993K2184j142j9648
1005a2878J6067M435j8424J2871N605k1137J3409J3647k3661K624J9575j6607
$$ plain form
1017 -4474 -7115 11555 -3714 -9823 11396 656 -11021 10032 4259 -12010 7274 7708 -11255
1030 -11255 3431 8607 -10046 3128 11676 -12472 -3791 14887 -4740 -7374 8668 -5162 -6414
1043 -6414 12341 -2992 -11640 9814 1066 -12819 8110 5270 -12609 3734 5873 -11638 4516
1056 4516 10216 -12901 -1847 12751 -7288 -3608 12658 -5206 -7311 10915 -2094 -5465 12320
1069 12320 -3321 -13118 12182 6727 -12124 3717 4240 -10779 6377 8067 -13493 242 10324
1082 10324 -10196 -2927 11642 -7236 -5758 9669 -5986 -5921 12669 -3647 -11027 10891 1722
1095 1722 -11398 8280 5119 -11034 5700 6791 -9951 4865 8748 -11422 590 12433 -8232
1108 -8232 -4314 10209 -5551 -3955 10947 -7082 -9367 13004 -49 -12425 6876 2413 -10267
$$ packed form
1017d474k641J8670j5269o109K1219j0740j1677K1053n773j6269J9284M34j8963
1030a1255J4686N176j8653J3174Q548k4148Q681J8678j9627k634J6042j3830j252
1043f414J8755j5333q648K1454q748j3885K0929k840j7879J6343K139j7511J6154
1056D516N700k3117J1054J4598k0039L680J6266j7864k105J8226j3009l371J7785
1069A2320j5641r797K5300n455j8851J5841N23j5019J7156J690k1560J3735J0082
1082A0324k0520P269J4569j8878J478J5427j5655O5J8590j6316p380K1918r169
1095A722j3120J9678l161j6153J6734J091j6742J4816L883k0170J2012J1843k0665
1108h232L918J4523j5760J596J4902j8029k285K2371j3053j2376J9301m463j2680
$$ plain form
1121 -10267 6719 3866 -11563 4448 6414 -11140 3400 10268 -11444 -2648 11621 -5578 -2748
1134 -2748 10561 -6727 -5930 13389 -1954 -9156 10671 1150 -10925 7738 4561 -8324 5915
1147 5915 2355 -13091 5963 10527 -12234 -2790 8781 -8336 -1509 10669 -8202 -6310 10426
1160 10426 -4832 -7053 11237 -2088 -10697 9020 2923 -8803 6985 2487 -10748 7758 7711
1173 7711 -11941 2612 10671 -8960 -1718 10012 -6061 -2304 9492 -7324 -5035 12531 -3412
1186 -3412 -10018 8521 -152 -9088 7886 418 -11672 7318 5261 -12169 3455 7833 -10063
1199 -10063 1310 9804 -8070 -2215 9214 -5982 -1131 11466 -6678 -7663 12471 641 -8180
1212 -8180 8109 -13 -8570 9063 3116 -11517 5967 6472 -11486 2051 8840 -8482 -733
$$ packed form
1121a0267J6986k853j5429J6011J966j7554J4540O868k1712Q796J4269j7199K830
1134b748J3309j7288P97J9319j5343p202J9827r521j2075J8663l177j2885J4239
1147E915l560j5446J9054M564k2761R444J1571j7117O827J2178j8871J892J6736
1160A0426j5258k221J8290j3325q609J9717o097j1726J5788m498j3235J8506m7
1173G711j9652J4553Q059j9631P242J1730j6073L757J1796j6816K289J7566j5943
1186c412o606J8539q673q936J6974p468j2090J8990k057j7430J5624M378j7896
1199a0063J1373Q494j7874N855J1429j5196M851J2597j8144r85K0134j1830q821
1212h180J6289q122q557J7633n947j4633J7484N05j7958J3537O789j7322P749
$$ plain form
1225 -733 6993 -9166 -771 11189 -8318 -6941 10528 -3282 -7609 9940 -963 -9727 7830
1238 7830 2036 -8117 8378 3076 -12472 5633 9947 -8672 581 6810 -7996 1482 10465
1251 10465 -8889 -3941 11733 -5013 -7268 10053 -1420 -8458 7462 -1120 -8688 7989 1142
1264 1142 -11878 5840 5715 -10855 2221 7047 -9088 1158 8309 -8338 -628 10610 -7481
1277 -7481 -4921 12423 -2496 -7842 7988 -603 -5378 9404 -933 -10203 8804 4872 -11058
1290 -11058 3810 6449 -9202 1762 7247 -8769 -439 7938 -9197 -2931 11432 -5735 -7947
1303 -7947 8167 -1833 -5751 8199 -2595 -8573 9527 1907 -10334 7157 5846 -10543 3168
1316 3168 7846 -6863 1784 6797 -8790 213 10985 -7023 -4779 9819 -3530 -6044 8623
$$ packed form
1225g33P726j6159Q395J1960j9507J377J7469j3810m327J7549j0903q764J7557
1238G830n794j0153J6495n302j5548J8105M314j8619R253O229j4806R478Q983
1251A0465j9354M948J5674j6746k255J7321j1473p038J5920q582p568J6677o847
1264A142j3020J7718j25j6570J3076M826j6135J0246P151j6647P710J1238j8091
1277g481K560J7344j4919n346J5830q591m775J4782j0337r270J9007l932j5930
1290a1058J4868K639j5651J0964N485j6016Q330Q377j7135O266J4363j7167k212
1303g947J6114j0000l918J3950j0794n978J8100p620j2241J7491j311j6389J3711
1316C168M678j4709Q647N013j5587R003J0772j8008K244J4598j3349k514J4667
$$ plain form
1329 8623 -2599 -7391 8529 -697 -9976 8159 3413 -11770 3204 5975 -7967 2152 5387
1342 5387 -9590 1258 9548 -7654 -2570 9294 -5485 -4065 10482 -2709 -6115 8921 -1124
1355 -1124 -6824 9485 1781 -10279 5967 5406 -8392 3030 4355 -8853 3012 7208 -9380
1368 -9380 -1162 9298 -7463 -4372 9182 -4246 -5651 7676 -3485 -6753 9751 -152 -9574
1381 -9574 6618 2952 -8116 5508 4791 -8800 3428 6812 -7744 2167 8278 -8333 -1622
1394 -1622 10522 -4737 -4837 7653 -3764 -4533 9203 -2516 -8943 7877 1188 -8608 5683
1407 5683 2051 -9301 4213 4731 -9391 2419 7427 -9097 -941 9086 -5584 -2541 7942
1420 7942 -5027 -3585 9885 -3002 -6531 9051 -23 -7586 7529 2442 -8501 4624 3534
$$ packed form
1329H623j1222m792J5920r226r279J8135m746j5183J4974K771j3942J0119L235
1342E387j4977J0848Q290j7202N084J1864j4779J420J4547j3191l406J5036j0045
1355a124n700J6309p704j2060J6246n61j3798J1422J325j3208J1865M196j6588
1368i380Q218J0460j6761L091J3554j3428j405J3327j1161l268J6504r903r422
1381i574J6192l666j1068J3624p17j3591J2228L384j4556R911O111j6611O711
1394a622J2144j5259j00J2490j1417p69J3736j1719o427J6820o689r796J4291
1407E683l632j1352J3514N18j4122J1810N008j6524Q156J0027j4670L043J0483
1420G942j2969J442J3470j2887l529J5582r074p563J5115n087j0943J3125j090
$$ plain form
1433 3534 -7806 4669 5087 -10623 830 9050 -6700 -2466 6540 -6005 -2679 8183 -5313
1446 -5313 -5238 8664 -2633 -7947 8072 1551 -7952 4885 2542 -7226 5963 4272 -9258 2738
1460 2738 7564 -7234 21 7721 -5801 -1780 7790 -4617 -2858 8521 -4568 -6287 9839
1473 9839 -32 -8685 5551 1460 -7204 5549 2037 -9475 4071 5383 -8659 1167 7313 -6680
1487 -6680 -986 6981 -5394 -1602 8188 -5681 -4370 10133 -1636 -7461 6870 1198 -6460 6040
1501 6040 1376 -7607 5397 3309 -8479 3911 6311 -8949 -766 7239 -5443 -1213 6070 -6805
1515 -6805 -2955 8637 -3974 -6930 7275 -627 -6132 6150 712 -6735 5631 1723 -7642 5783
1529 5783 5147 -8760 1388 7492 -5444 168 6476 -6126 -1483 8395 -4153 -3654 7944 -2909
$$ packed form
1433C534j1340J2475M18j5710J1453Q220j5750M234R006j2545L326J0862j3496
1446e313P5J3902j1297n314J6019o521r503J2837k343r768J3189j691j3530J1996
1460B738M826j4798P255P700j3522M021R570j2407J759J1379j3089j719J6126
1473I839r871q653J4236m091q664J2753l512j1512J3546J312j4042R826O146j3993
1487f680N694P967j2375L792R790j3869J311J4503j1769n825J4331n672p658J2500
1501F040m664q983J3004k088j1788J2390K400j5260Q183Q005j2682M230P283j2875
1515f805L850J1592j2611k956J4205p902n505J2282n438p447J2366l908r365J3425
1529E783o36j3907J0148O104j2936N612O308j2602M643R878j2548M99J1598j0853
$$ plain form
1543 -2909 -6233 6783 226 -6174 5059 -471 -7725 6180 3418 -9327 1844 5521 -6802
1556 -6802 403 5400 -6311 0 7049 -5884 -2137 8150 -4057 -4558 8420 -446 -5440 6308
1570 6308 -68 -6089 7135 1861 -8481 4087 5027 -7134 1576 5241 -6375 457 5473 -6627
1584 -6627 -578 7365 -6020 -4318 7982 -2153 -5831 5903 -1499 -5670 6911 285 -7592 5224
1598 5224 3161 -6975 3612 5175 -6599 1056 5430 -5521 1359 6866 -6574 -2384 8221
1611 8221 -2779 -4214 6332 -1686 -4643 6467 -876 -6375 5977 806 -8232 3979 3694 -7290
1625 -7290 1525 3685 -6005 1918 5611 -7075 -1375 7591 -4278 -3199 7111 -2421 -3891 6288
1639 6288 -1042 -4277 6671 -658 -6793 6322 3322 -6876 2435 3905 -5694 2460 4437 -7097
$$ packed form
1543b909l324J3016o557o400J1233n530p254J3905k762j2745J1171L677j2323
1556f802P205M997j1711O311P049j2933L747J0287j2207n01J2978q866m994J1748
1570F308o376o021J3224n274j0342J2568R40j2161Q710L665j1616O832N016j2100
1584f627O049P943j3385J702J2300j0135l678J1734p402m171J2581o626p877J2816
1598E224k063j0136J0587J563j1774P655M374j0951O880N507j3440M190J0605
1611H221j1000j435J0546q018k957J1110p343n499J2352n171r038J2211k85j0984
1625g290Q815K160r690P923L693j2686N700Q966j1869J079J0310r532j470J0179
1639F288p330l235J0948p329o135J3115l000j0198R311J470r599Q154J977j1534
$$ plain form
1653 -7097 383 6581 -6127 -2349 6779 -3685 -3912 5910 -2239 -3856 6030 -2151 -5869 6837
1667 6837 1393 -7075 3861 2947 -5912 2967 4145 -6306 1666 5295 -5788 327 6880 -4368
1681 -4368 -3067 6480 -2256 -2638 6096 -2876 -4870 6958 80 -6780 4629 1961 -6219 3128 2931
1696 2931 -6223 2162 3564 -6364 1458 6210 -6036 -2060 6345 -3005 -1914 5645 -3335 -3615 6852
1711 6852 -921 -5478 5897 1354 -6035 3852 3142 -4883 2665 2802 -6219 2716 5070 -6542 -927
1726 -927 5789 -4503 -2158 5313 -4162 -2883 5764 -2440 -4289 6246 -663 -6291 4364 2330
1740 2330 -5308 3182 1855 -5822 3635 4331 -5910 803 5652 -4681 -480 5879 -3662 -1931 5493
1755 5493 -2914 -3004 6386 -1812 -5807 5300 908 -5285 3522 964 -5681 3551 2500 -6354 2039
$$ packed form
1653g097P480O198j2708L778R128j0464k27R822q149j617R886q181l718J2706
1667F837n444q468J0936r14q859Q879J178j0451P972L629j1083O115O553j1248
1681d368J301R547q736l82Q734q972j994J1828o878o860J1409k668q180R347j97
1696B931r154Q385J402r928P822M752j2246L976Q405r350J091P559q980k80J0467
1711F852p773m557J1375m543p389R887p10q025P548J37r021Q935K354j1612N615
1726i27O716j0292K345P471r475J279Q647q204j849J0535o909n628J0655k034
1740B330p638Q490j327p677R457O96j0241O713M849j0333M201O359r541J731P424
1755E493q407r0R390q198l995J1107m392o193Q807k558o645R232j051q854Q393
$$ plain form
1770 2039 4486 -5843 -494 5482 -3752 -1410 4843 -3373 -1429 6537 -2751 -4298 6431 487
1784 487 -4810 4540 929 -4483 4430 1910 -5564 3327 3554 -6161 1394 5310 -4770 -1714 3908
1799 3908 -3614 -928 5185 -4343 -3279 5796 -1689 -4803 4801 -43 -4814 4060 1456 -4848 4013
1814 4013 2371 -6179 2196 4803 -4566 300 4468 -3768 399 5276 -4079 -2064 5931 -2340 -3556
1829 -3556 5743 -490 -5150 3940 699 -4267 3505 669 -6086 3006 3581 -5486 579 3797 -4577
1844 -4577 -51 4189 -4150 -805 5423 -3372 -2766 6298 -1251 -4281 4134 284 -3511 4090 395
1859 395 -4888 3909 2521 -5520 1881 3575 -4670 610 4102 -4312 -406 4106 -4451 -1667 5552
1874 5552 -2749 -4417 4230 -187 -3390 3648 -700 -4522 4389 1357 -5345 2745 2937 -5015 1393
$$ packed form
1770B039K447j0329N349N976r234K342O253q216J944P966r288j547J0729n944
1784D87n297R350l611n412Q913k520p474Q891K27r715P555L916j0080L056N622
1799C908p522K686O113r528J064R075p485l114R604m844m771Q874k604o304Q861
1814D013j642q550Q375K607r369M866M168q236M167M877r355K015P995q271j216
1829c556R299o233m660R090l241m966P772k836o755R092N75r067O065L218q374
1844d577M526M240q339L345O228q795O06R064p549l030Q415l850l795P601l695
1859C95n283Q797j388q041P401J694q245N280L492q414L906M512q557K784P219
1874E552q301j668Q647m417l203P038m348l822Q911l032o702Q090J92p952O408
$$ plain form
1889 1393 4098 -3885 490 3956 -3722 -173 5615 -3295 -3053 4774 -1234 -3025 4321 -1087 -4196
1904 -4196 3903 -48 -4615 4011 2182 -6013 1333 3451 -4391 623 2897 -4586 451 4533 -3846
1919 -3846 -2260 5120 -1885 -2762 4771 -895 -2950 4568 -482 -4012 4561 1554 -5222 2597 2919
1934 2919 -4393 1128 2694 -3910 767 3457 -4387 -522 4827 -3232 -2634 4647 -1566 -2852 4028
1949 4028 -1346 -3394 4421 -86 -5645 3447 2942 -4365 1264 2418 -3749 1958 3441 -4121 336
1964 336 4474 -3398 -1151 5283 -1953 -3141 3999 -1016 -2271 4278 -972 -4388 3585 1297 -4736
1979 -4736 2222 2033 -4777 1086 2199 -4207 1314 3348 -5148 -770 5335 -2513 -2523 3761 -1790 -1976
1995 -1976 4365 -1207 -3455 4113 276 -3764 3665 2085 -4031 1996 2151 -3436 1908 2517 -4859
$$ packed form
1889A393K705p983M375L466p678L549N788q910K42P827o008j791P346n408l109
1904d196Q099l951m567Q626j829q195P346K118p842N014K274p483N037M082q379
1919c846J586P380p005q77P533n666k055P518n050l530Q573l007o776P819L22
1934B919p312N521J566o604M677K690p844L865N349q059N98P281o213j286O880
1949D028n374k048P815m507n559R092n05p307N629J154o167N707J483p562M457
1964C36M138p872K247O434p236j188P140n015j255O549n250l416P973k288o033
1979d736O958j89o810N863J113o406N521K034q496M378O105p848j0O284n551j86
1995a976O341n572k248P568l837m040P429j580o116O027J55n587N344O09p376
$$ plain form
2010 -4859 643 4376 -3423 -1755 4343 -2077 -2394 3292 -1972 -2432 4074 -1277 -4161 3839 1178
2025 1178 -4256 2043 1842 -3561 1951 2220 -4184 922 3794 -3558 -320 4254 -2294 -1324 4116 -1328
2041 -1328 -2102 3857 -1582 -2785 4286 53 -4790 2603 1627 -3487 1650 1165 -3931 1593 2787 -3894
2057 -3894 239 3603 -3238 -1306 3844 -2031 -1346 3632 -1982 -2353 4941 -446 -3524 3263 930
2072 930 -3248 2855 1829 -3534 1812 2179 -3651 1172 3265 -3889 -1079 3750 -2214 -1161 3323
2087 3323 -2632 -1640 4292 -1629 -3438 3477 47 -3830 2471 878 -3508 2187 1428 -4088 1877
2102 1877 2733 -3781 52 3482 -2411 -358 3917 -2057 -958 3821 -1909 -2260 4031 -588 -3200
2117 -3200 3084 707 -3180 2181 822 -3639 2379 1896 -4611 587 3487 -3172 -744 2743 -2994
$$ packed form
2010d859N502L733p799J668O098o420l17N686n264m60O506n351k884Q000k661
2025A178n434O299k01n403N512K69o404N106K872p352L238M574o548R70N440n444
2041a328p74N959n439j203P071m233m843P393r76n114N137m85n096N524J194o681
2057c894M133L364o841J932N150n875O85M978n614l71P294n387l078O787k333
2072I30m178O103j026n363N346L67n830M823K093p154K810M829n964J053M484
2087C323n955R92N932n921j809O915l430l877O301j593m386N695p59n516N965
2102A877Q56o514L833L430n893K053M275n974J099M779n730l51O291m619k612
2117c200O284k377l887N361j359m461O018m83o507N198K900o659K428L487n737
$$ plain form
2132 -2994 -602 3218 -2139 -1698 3576 -1221 -2670 3718 120 -2888 2617 429 -2767 2699 1510
2147 1510 -4068 1542 2818 -3220 530 3510 -2783 -557 3074 -2612 -890 3612 -2741 -2700 3574
2162 3574 -607 -3102 2410 -403 -2892 2786 482 -4010 2334 1725 -4248 1157 3208 -2869 -161
2177 -161 2669 -2500 79 3362 -2682 -1325 4036 -1318 -2534 3409 41 -2724 2757 115 -3042
2192 -3042 2491 1028 -3968 1692 2518 -3710 -19 2004 -2486 161 2774 -3305 -864 3777 -1973
2207 -1973 -2136 3316 -391 -2576 2972 -105 -2560 2726 242 -3121 2621 2075 -3431 679 2583
2222 2583 -2489 454 2339 -3292 -36 3575 -2589 -1724 3354 -1599 -2580 2554 -252 -2256 2519
2237 2519 -601 -3237 2837 1086 -3769 1148 1932 -3125 925 2428 -2813 398 2985 -2408 -455
$$ packed form
2132b994K392L820n357M41N274m797j449O388l598l008N505k188l196N466j189
2147A510n578N610J276o038L750K980o293K226L631n686J722M502o353M1O274
2162C574m181k495N512k813k489N678k304m492O344o09n973N405K051o077K708
2177a61K830n169K579L283o044J357N361n354j216N943l368k765N481k642l157
2192c042N533j463m996N660Q26o228L691K023m490K647K613o079K441M641n750
2207a973j63N452l707k185N548l077k455N286k484l363N742n46n506M110J904
2222B583n072K943J885n631L256L611o164Q65N078m953r81N134k806k004M775
2237B519l120k636O074j751m855M917P84n057M050J503n241L211K587n393J953
$$ plain form
2252 -455 3406 -1643 -1716 3361 -213 -1782 2458 -894 -2207 3192 348 -3753 2034 1484 -3669 977
2268 977 2096 -2976 -11 1843 -2973 -178 3021 -2502 -1735 3298 -919 -1561 2735 -1086 -2106 3250
2284 3250 -161 -3012 2670 1295 -3200 1800 1941 -2608 841 1861 -2770 614 2751 -2804 -1006
2299 -1006 3244 -1484 -1806 2631 -1529 -2119 2761 -737 -2583 2853 303 -3212 1835 1908 -2799 1112
2315 1112 1435 -2364 1521 2199 -3300 -3 3007 -2079 -818 3167 -1502 -1186 2832 -702 -1744 2853
2331 2853 -431 -3180 2513 1211 -2971 1173 1200 -3016 1208 1475 -3256 422 2812 -2813 -605 3069
2347 3069 -1788 -1471 2655 -1130 -1497 2948 -991 -2400 2970 658 -2934 1552 1093 -2317 1583 1425
2363 1425 -2836 846 2040 -3222 98 2986 -2197 -1209 2519 -1582 -766 2535 -1480 -1842 2921 -456
$$ packed form
2252d55L861n049p3N077l574j569M240l352j313N399k844m101N787n50n153M646
2268I77J119n072K965J854m816K795L199n523P67N033m217o42M296l821j020N356
2284C250l411k851N682j375m495N000J41m549L449J020m631L384K137n555J798
2299a006M250m728l22M437m160n90M880l498j846N436k550l515N047P3m707L911
2315A112L23l799L885O78n499L297L010n086J261L985m669L16M018l534j042M597
2331B853l284k749N693j302m182M144K7m216M224K67m731L678K390n625K208L674
2347C069m857L17M126l785l67M445l939j409N370k312l592M486m59l410L900j58
2363A425m261L682J194n262L320K888n183R88L728m101Q16L301m015l62M763l377
$$ plain form
2379 -456 -2703 2332 409 -3104 1286 1133 -2753 1231 1504 -3345 861 3081 -2240 -652 2413 -1500
2395 -1500 -579 2440 -1320 -1345 3004 -831 -2418 2742 360 -2899 2031 986 -2707 1497 648 -3023
2411 -3023 966 2064 -3412 -117 2430 -1890 -655 2000 -1655 -1084 2707 -1358 -1464 3071 -507
2426 -507 -2449 2449 729 -2191 1789 860 -2411 1838 1763 -2821 551 2307 -2403 -197 2388 -1631
2442 -1631 -523 2247 -2119 -1446 3025 -1002 -2795 2253 83 -2428 1745 125 -2250 1715 902
2457 902 -2860 1571 1843 -2859 18 2420 -1690 -95 2317 -1804 -462 3205 -1302 -1630 2966 -160
2473 -160 -2032 2360 113 -2193 2015 287 -2624 1351 1400 -3319 397 2458 -2296 3 1887 -2224
2489 -2224 -135 2696 -2212 -1609 3094 -712 -2014 2622 -172 -1852 2379 136 -2429 2267 1077
$$ packed form
2379d56k247N035j923l513M390j53l886L984K73m849M206K220n321J588L065l913
2395a500R21L019l760k5M349l835j587N160k382l259M930j045l693M204q49l671
2411c023L989J098n476L295K547m320J235K655l655N71L791m065j06M535l578
2426e07j942M898j720k920L980r29l271M249p5m584L372J756m710K206K585m019
2442a631J108K770m366O73M471m027j793N048k170k511M173j620k375L965q13
2457I02l762M431K72m702K877K402m110J595K412m121J342L667m507l28M596l126
2473a60j872M392k247k306M208j728k911L975M9m719L716K061m754K299J884m111
2489b224K089K831m908O03M703l806j302M636k794j680M231k243k565M696j190
$$ plain form
2504 1077 -3028 1483 2005 -2354 130 1885 -2227 6 2298 -2411 -1041 2758 -1354 -1531 2879
2519 2879 -522 -2191 1525 -195 -1965 2118 152 -2808 1619 1821 -2792 539 1987 -2112 411
2534 411 1916 -2149 -300 2378 -1876 -1398 2901 -784 -1974 2240 -325 -1590 2325 -171 -2710
2549 -2710 1827 1074 -2721 825 1507 -2376 183 1584 -2005 213 1854 -2591 -648 2606 -1623
2564 -1623 -1643 2009 -651 -1556 2248 -24 -2025 2206 571 -2697 1554 1511 -1999 707 1575 -2003
2580 -2003 601 1969 -2287 -106 2777 -2053 -1307 2728 -752 -1496 2129 -616 -1983 2352 12
2595 12 -2557 1913 512 -2658 1098 1526 -2086 827 1448 -2330 556 2540 -1959 -597 2466 -1442
2611 -1442 -1097 2574 -490 -1218 2038 -626 -1913 2472 851 -2744 1065 962 -2047 1113 1037 -2452
$$ packed form
2504A077m105M511N22m359K484J755m112K233K292m709J370L799m112j77M410
2519B879l401j669L716j720j770M083j966k960M427K02m613L331J448m099K523
2534D11J505m065J849K678m254M78M299l685j190M214k565j265L915k496k539
2549b710M537p53l795L546O82l883K559J401l589K218J641m445J943L254m229
2564a623k0L652k660r05L804k272k001M231j635l268M251m3l510K706Q68l578
2580b003K604J368m256K181K883m830P46M035l480p44L625k745j367M335k340
2595A2k569M470j401l170L756M28l612K913O21l778K886J984m499J362L063l908
2611a442L45L671l064p28L256k664j287M385j621l595L809j03l009L160p6l489
$$ plain form
2627 -2452 442 1832 -2139 -168 2312 -1979 -1111 2179 -1015 -1575 2060 -1342 -1363 2438 -186 -2280
2643 -2280 1731 857 -2192 1394 979 -1869 1193 1649 -2209 438 2216 -2253 -758 2458 -979 -1132
2659 -1132 2114 -1235 -1189 2286 -726 -2382 2300 363 -2618 1258 585 -2054 1208 1034 -2039 1027
2675 1027 1455 -2269 -41 2774 -1385 -692 2215 -1329 -650 2504 -771 -1489 2407 -500 -2001 1691
2691 1691 617 -2182 1168 567 -1871 1194 1092 -2681 314 2561 -1998 -638 1854 -1542 -717 1937
2707 1937 -1128 -1270 2385 -474 -1954 2325 450 -2280 1528 779 -1790 1598 1014 -2311 936 1940
2723 1940 -2313 242 2159 -1470 -694 1868 -1405 -886 2126 -1156 -1728 2224 -177 -2454 1826 587
2739 587 -1799 1447 423 -2311 1150 1515 -2267 337 1911 -1684 -453 1802 -1133 -302 2119 -1522
$$ packed form
2627b452K894J390l971J971K480m291Q68L290l194n60L635l402k1L801k624k094
2643b280M011q74l049L586m15k848L062M56l858K647J778m469J495L216l437j53
2659a132L246l349M6L475l012j656M682j937k981L876o73k639L262j74l073L066
2675A027M28l724K228K815m159O93K907l544O79L154l275p18L896k907j501L692
2691A691j074k799L350o01k438L065j02l773K995K247m559J360K492l396Q25K654
2707A937l065j42L655k859j480M279j875k730L808p49k569L388n84l325L247J004
2723A940m253K555J917l629P76K562l273N19L012l282n72L952k401k277M280j239
2739E87k386L246j024k734L461L65l782K604J574l595J231K255k935Q31K421l641
$$ plain form
2755 -1522 -1063 2624 -521 -1855 2157 34 -1664 1616 99 -2104 1662 935 -2643 646 1813
2770 1813 -2090 -121 1815 -1573 -474 1732 -1547 -1036 2356 -1024 -1373 2149 -205 -2011 1901
2785 1901 165 -1981 1455 383 -2136 1640 1496 -2374 275 1757 -1419 265 1709 -1580 -375
2800 -375 2102 -1358 -1426 2392 -738 -1982 1823 18 -2226 1484 73 -1847 1603 799 -2335 762
2816 762 1438 -2028 188 1514 -1523 -163 2011 -1763 -485 2485 -971 -1252 2276 26 -1441 1519
2832 1519 -280 -2084 1705 449 -2298 1203 1420 -2368 406 1691 -1924 153 1570 -1630 -186
2847 -186 1965 -1542 -1135 2184 -532 -1590 1866 -246 -1743 1661 -125 -1878 1733 652 -2256
2862 -2256 807 1339 -1587 533 1364 -1375 211 1928 -1929 -861 2317 -847 -1287 1679 -335 -1273
$$ packed form
2755a522M59L687l145j334M012k123j698L280j517k203L766p27l578L289J167
2770A813l903J969J936l388J099K206l279N11L392l380l49L522k354j806L912
2785A901j736k146L436j072k519L776j44l870K649J482l176J684J444l289J205
2800c75K477l460o8L818l130j244L805j805k244L710j411j920L450q04l134L097
2816G62O76l466K216J326l037J360K174l774J278K970l456k81L528k250j467K960
2832A519j799j804L789j256k747L501K17l788K774J285l615K077J417l200J444
2847a86K151l507M07L319k716j058L456k112j497L404j786j753L611j081k908
2862b256L063N32k926K120Q31k739J586J717l857J068L178l164m40K966k014r38
$$ plain form
2878 -1273 1751 -272 -1718 1593 66 -2133 1352 1116 -2167 252 1455 -1677 374 1448 -1671
2893 -1671 15 1908 -1526 -905 2215 -488 -1245 1381 -633 -1230 1894 -253 -1824 1607 831 -1984
2909 -1984 809 1038 -2164 335 1197 -1934 0 1731 -1690 -524 2331 -1278 -1144 1978 -829 -1260
2925 -1260 1835 -385 -1785 1595 400 -2192 1282 1283 -1642 954 1085 -1601 688 1360 -1804 29
2941 29 1885 -1504 -810 1745 -971 -859 1620 -677 -1441 1860 -172 -1982 1239 603 -1749 688
2957 688 491 -1868 589 1122 -1630 -24 1705 -1867 -575 2054 -837 -583 1750 -994 -640 1682
2973 1682 -538 -1434 1631 429 -1855 1382 792 -1688 940 479 -1895 739 1296 -1922 -364 1719
2989 1719 -1305 -1028 1472 -775 -779 1814 -984 -1180 1868 -485 -1604 1600 419 -1491 888 927 -1783
$$ packed form
2878a273L024k023j446L311j527k199L485k36l283K419J203l132K051J074l119
2893a671J686J893l434O21L120k703p57K626k014n97L124k147j571L431p76k815
2909a984K793K29l202K499Q62l131J934J731l421J166K855l609J34L122k807m31
2925a260L095k220j400L380j195k592L474Jk925K596J31k686K289O72l164J833
2941B9J856l389O94K555k716J12K479k297p64L301k032j810L221o36k352K437
2957F88j97k359K457N33k752J606J729l572J292K629k891K54K333k744L54K322
2973A682k220q96L065j202k284L237n90k480K628m61k374K634N57l218J558K083
2989A719l024K77K500k247mK593k798j96L048k353j119L204j181j910K379L9k710
$$ plain form
3006 -1783 1311 1112 -1929 375 1972 -1520 -170 1934 -887 -507 1393 -1084 -910 1832 -864 -1684
3022 -1684 1560 254 -1770 1082 178 -1518 861 960 -1799 801 1397 -1994 -221 1644 -917 -219
3038 -219 1616 -1023 -511 1722 -1015 -1352 1900 98 -1543 1263 337 -1215 830 681 -1615 875
3054 875 874 -1840 250 1358 -1560 -482 1710 -1160 -401 1417 -1003 -978 1929 -543 -1412 1474 -2
3071 -2 -1501 1176 98 -1253 978 892 -2012 729 1411 -1227 81 1424 -1146 -405 1448 -1358 -679
3088 -679 1792 -719 -1194 1642 -253 -1287 1130 -107 -1445 1322 272 -1763 950 945 -1592 160
3104 160 1220 -1229 181 1168 -1283 -129 1497 -1139 -786 1654 -570 -1002 1355 181 -1355 1387
3120 1387 334 -1999 1385 823 -1848 655 1160 -1473 191 963 -1120 98 1411 -1194 -714 1656
$$ packed form
3006a783L094j99l041K304J597l492J350K104k821L80J900k477J74K742k696q20
3022a684L244j306k024K852r04j696K379R9k759K600N96l391J773J865k561O98
3038b19J835k639N12K233k737l37L252j802j641K806r26j552K045j49k296K490
3054H75jk714K090J108k918J078K192k870P59J818k420K5K907k472q69K886j476
3071bj499K677j078j351K231q6k904K741O82k638J308J343k570P41J853k806O79
3088f79K471k511m75K836j895j034K417j237j338K767j050k035K713nk537J752
3104A60J060k449J410R87k451J154J626k636L53K440k224m32K357j174j536K742
3120A387j053k333L384n62k671K503N05k633J664P72k083J218J313k605M80K370
$$ plain form
3136 1656 -841 -1465 1542 -88 -1199 1309 109 -1331 1158 346 -1632 880 722 -1373 450 966
3152 966 -1050 -84 1126 -1373 -153 1524 -1432 -333 1541 -681 -1023 1213 -417 -1255 1319 -38
3168 -38 -1343 1062 353 -1622 336 717 -1353 352 784 -1196 167 1247 -1610 -686 1685 -607
3184 -607 -724 1418 -593 -858 1100 -318 -939 1446 -69 -1746 1020 1000 -1331 574 707 -1354 0
3201 0 802 -1477 -466 1570 -1323 -818 1464 -701 -1042 1126 -417 -1155 1319 -241 -1678 1448 583
3218 583 -1546 574 1219 -1258 475 911 -1165 134 1474 -1262 -403 1643 -480 -870 1052 -655
3234 -655 -501 1483 -380 -1368 1064 245 -1512 847 361 -1297 326 1044 -1354 502 953 -1514 -39
3251 -39 1351 -908 -540 1415 -521 -707 1280 -360 -912 1325 -145 -1213 1202 627 -839 821
$$ packed form
3136A656k497o24L007j630j111K508j200j440K489q12j978K512j58k095J823N16
3152I66k016R66J210k499J220J677k956J099J874k222l42K236j630q38K574j357
3168c8j305K405p09j975J958L81k070J705M32j980J363J080k857R24K371k292
3184f07j17K142k011k65J958j418o21K385j515j677K766k0k331J905J33k061J354
3201@Q02k279J011K036k893N05K282k165l41K168j543p38K474j560j437L126q65
3218E83k129K120O45k477J733M36k076J299J340k736Q59K046k123l90J922j707
3234f55J54J984j863r88K432q19j757K359m86j658J623P18k398J856M51k467J475
3251c9J390k259L68J955j936j86J987j640n52K237j470j068K415n75j466J660
$$ plain form
3267 821 552 -1238 513 607 -1328 39 1037 -1251 -423 1047 -813 -612 1050 -673 -808 1572 -339
3284 -339 -1111 1309 296 -1213 1069 659 -1052 1029 890 -1309 480 1255 -1244 140 1013 -865
3300 -865 -483 1256 -539 -642 1216 -347 -795 1339 5 -1302 881 326 -1235 355 191 -1263
3316 -1263 440 907 -1292 693 1404 -1203 -495 1253 -682 -702 1008 -553 -356 1335 -226 -933 966
3333 966 68 -1274 653 76 -1056 863 331 -1301 441 745 -1404 -72 1290 -663 -300 1091
3349 1091 -651 -411 1236 -257 -1016 1392 -57 -933 868 190 -701 858 480 -984 891 670 -1496
3366 -1496 185 1118 -928 -128 862 -670 -249 1258 -739 -620 1177 -432 -1233 938 58 -955 570
3383 570 39 -1081 936 620 -1149 107 1053 -1040 -88 913 -948 -14 923 -455 -103 1420 -699
$$ packed form
3267H21k69j790J751R4j935J367R98k288Q28J470j860K01J662j723j35K380j911
3284c39p72K420j013j509K282m10j711K081j39k199J789P75k499J384Q73j878
3300h65L82J739j795j03J858j563m48K134j334j307K183n55j561J590j64j454
3316a263J703M67k199J985P11k607P08J748j935k0J710j561J97J691j561p07J899
3333I66q98j342J927n77j132J919n32j632J742L04k149J332J362j953L63J391
3349A091j742K40J647j493p59K408j449q76J801o78q91J559l78j464J875k21k166
3366a496J681R33k046Q00R90j532M21J507j997J19J797j609q01K171q80j013J525
3383E70n31j120K017l16j769J256R46k093R52J001j861R34R37j378L52J523k119
$$ plain form
3400 -699 -780 1071 84 -1043 781 124 -781 877 135 -1082 678 422 -1142 339 905 -687 -233
3417 -233 662 -964 -326 1031 -725 -735 1037 -374 -715 848 -2 -770 683 68 -1073 824 405
3434 405 -961 575 785 -892 144 991 -533 208 960 -870 -92 1062 -653 -651 756 -61 -811 781
3452 781 -143 -974 679 81 -1194 734 557 -716 33 545 -778 77 740 -914 -194 1015 -642
3469 -642 -388 1136 -82 -678 841 -212 -594 739 -166 -852 835 395 -1225 396 396 -949 243
3486 243 660 -1013 164 1101 -1204 -349 1052 -365 -838 1131 -254 -641 864 -190 -1060 669 153
3503 153 -1134 649 410 -854 334 640 -786 209 436 -900 142 909 -570 -511 892 9 -714
3520 -714 721 -194 -731 1092 -102 -1028 479 -53 -849 576 374 -620 206 656 -1101 275 1011 -702
$$ packed form
3400f99q1J851r87j127J824o57r05J658p42j217J760k56j564J481N66j592M54
3417b33Q95j626O38J357j756j0J772j411l41J563q50p68J453o15j141J897m19
3434D05j366J536K10j677J036Q47j524P41P52j830P78J154j715KJ407q17p50J592
3452G81r24q31J653n98j275J928j77j273P49N12j323Q55O63j654P20J209j657
3469f42K54J524j218n96J519j053l82J333r05o86J687m40j620J621%j345J192
3486B43M17j673J177R37k305Q55J401j417m73J969j385l87J505j054q70J729n16
3503A53j287J783k39j264J188L06j426R95K27j336J042P67j479N9J403q83p23
3520g14J435r15n37J823j194r26J507n32p96J425k02r94Q26M50j757J376P36j713
$$ plain form
3538 -702 -304 914 -223 -506 819 -437 -442 615 51 -653 813 137 -872 476 458 -846 211 348
3556 348 -847 156 648 -1002 -143 984 -435 -601 511 -206 -487 471 -577 -558 634 -157 -873 806
3574 806 160 -743 645 239 -842 322 503 -1085 294 898 -334 -682 959 -293 -148 522 -234
3591 -234 -169 891 -149 -734 919 410 -686 241 598 -760 534 369 -661 217 441 -666 -314 842
3609 842 -636 -387 460 -426 -99 745 -187 -584 990 -10 -967 251 404 -607 494 412 -662 775
3627 775 461 -1121 225 854 -817 -294 667 -288 -176 565 -644 -474 886 -189 -673 748 89 -671
3645 -671 488 159 -732 473 121 -513 308 888 -779 -293 745 -379 -283 606 -561 -131 748 -504
3663 -504 -638 829 -223 -692 416 132 -760 343 165 -778 320 467 -820 79 373 -625 -99 758
$$ packed form
3538g02L98J218j137k83J325j256nJ057n64p04J466o76j009J348j8j304J057J37
3556C48j195J003M92j650Q59J127j419j66J112p17k81R58j048J9J192p91p16J679
3574H06o46r03J388m06j081J164J81j588J379O04j232l48J641j252J45O70p56
3591b34O5J060j040n85J653n09j096R27L57j358J294j65j030Q78K24j107L52J156
3609H42j478K49Q47q86L27Q44r32l97J574j000r57J218J53j011J101q2j074J437
3627G75l14j582J346O29j671N23R61r55J12P41j209J70J360j075m84J421o59p60
3645f71J159l29q91J205l52o34Q21N80j667M86J038j124R6Q89j167M30Q79j252
3663e04j34J467j052m69J108k84q92J103j78r43J098J47j287Q99K94r98N26Q57
$$ plain form
3681 758 -361 -221 796 -295 -519 752 -456 -737 406 181 -653 550 142 -1018 799 256 -531
3698 -531 261 462 -868 -255 882 -377 -25 472 -560 -338 898 -414 -562 707 -150 -659 417
3715 417 158 -435 561 186 -680 604 500 -807 -11 463 -492 -240 256 -410 -243 893 -442 -382 712
3734 712 -391 -302 499 -132 -714 450 57 -638 575 267 -747 105 833 -554 -136 496 -369 -75 469
3753 469 -336 -140 697 -422 -607 591 202 -315 691 16 -526 443 295 -698 631 482 -672 169
3771 169 136 -782 -83 210 -802 -352 716 -201 -241 581 17 -603 449 -97 -753 444 -52 -534 723
3790 723 263 -528 179 509 -622 -142 460 -622 236 566 -441 -129 789 48 -283 522 81 -378 629
3809 629 -84 -526 606 247 -495 409 358 -454 -23 324 -546 87 653 -646 -17 867 -276 -194 613 -258
$$ packed form
3681G58j119J40J017j091k24J271j208k81J143k25q34J203m08j160J817n43p87
3698e31P92K01j330O13J137j259L52M97j032K22J236j312j48J269q57n09J076
3715D17k59n93R96l75q66J284j04j307P96M74r55K52M96o66J67J136j335O0J094
3734G12j103Q9Q01o31n82J164l93o95J213l08j014Q52P28j387M18O32q65K94N44
3753D69q05J96Q37j119j85J198l89n17J006o75n42R69j48r93J329j49j154Q41
3771A69l3r18O99K93j012M50J068r17m0Q22n64o20J052n46o56J197m96m82J257
3790G23m60p91P07L30j131M80O02j082Q58L30j007L12R18p41l31Q05m41m59J007
3809F29p13m42J132l59p42R04n1q12M31L47q70O33N66j299O29Q84j143Q2Q07q71
$$ plain form
3829 -258 -394 369 -334 -632 691 178 -769 577 271 -544 314 388 -379 110 231 -448 35 682 -710
3848 -710 -289 576 -349 -366 781 -159 -381 512 -114 -619 502 134 -578 332 176 -325 257 371 -774
3867 -774 240 767 -324 181 746 -245 -238 350 -336 -426 571 -264 -399 545 82 -526 286 396 -915 360
3887 360 -3 -329 343 282 -453 161 579 -315 -340 597 -25 -208 518 -222 -162 563 91 -553 437 106 -807
3908 -807 382 643 -445 222 449 -728 279 382 -519 -49 208 -408 -459 455 -344 -458 395 -309 -397
3927 -397 772 181 -552 381 467 -270 243 104 -621 131 601 -600 250 427 -207 -123 756 -130 -292 477
3947 477 -285 -296 698 -13 -508 512 120 -419 186 615 -375 320 461 -544 176 365 -541 -142 310 -360
3967 -360 -275 569 -462 -163 756 -319 -561 924 -58 -700 550 376 -331 416 7 -315 218 374 -661
$$ packed form
3829b58j36P63p03k98J323n13r47J346l06q15Q58P4p67M89J21o79M83O47j392
3848g10M21Q65r25j7J147r40k22Q93o26n05J121l68p12R10j56n01N82J14j145
3867g74J014N27j091N05N65r91PN88o86r0R97q35j35R44m63o08Q12J10j311J275
3887C60l63l26O72o1p35O14M18q94k5R37o22j83P26p40O0P25m72o44R90l31r13
3908h07J189K61j088O67K27j177J007J03r01M70K57o16n1R14p99j14Q53p04q8
3927c97J169n91p33R33Q6p37N13j39p25P52M70j201Q50J77o34Q4Q79q86j62P69
3947D77p62j1R94p11m95J020l92n39O05M29r90O95J41j005P20J89r06L99M52o70
3967c60Q5Q44j031K99R19j075k42J485r82o42J250j74p07P47m09l22N33J56j035
$$ plain form
3986 -661 206 513 -537 68 473 -338 -85 366 -424 -223 737 -115 -479 423 -56 -123 393 -63 -359 543
4006 543 230 -852 410 337 -323 106 380 -16 -160 558 -323 12 480 -198 -189 566 173 -318 313 49
4026 49 -203 467 20 -670 115 643 -476 -226 302 -552 10 167 -619 -244 412 -334 -196 671 -292 -300 436
4047 436 36 -284 341 350 -702 519 325 -310 157 297 -356 -185 385 -548 -74 300 -262 -288 426 -238
4067 -238 -272 517 238 -389 610 109 -601 254 288 -390 159 367 -695 66 235 -296 10 43 -409 -23 487
4088 487 -112 -253 541 -166 -360 377 -86 -301 729 -89 -486 18 459 -171 416 367 -252 78 203 -439
4108 -439 36 333 -323 -184 510 -148 -253 224 -178 -38 420 29 -146 430 -25 -743 152 703 -284 153
4128 153 388 -238 15 377 -485 170 357 -356 7 814 -75 -226 541 -146 -439 258 84 -433 43 -6
$$ packed form
3986f61Q67L07j050O05M05q11K53M51p90K01R60q52l64R02m79o7N16m56k96R02
4006E43l13j082J262p3o60M29K74l96j44P18q81L35M68o78RP55l93m91O31k64
4026D9k52O70m47o90P85N28j119K50N28q54N62J57p86L75O56p46J38Q67r63qP36
4047D36m00l20O25Rj052J221j94o35M67J40o53J71N70r33M74L74n62k6P14o64
4067b38l4P89k79o27R99n01p10Q55L4o78N49K08j062P61J69n31L06L3m52L86N10
4088D87n99j41P94p07j94P37m63k15J030q18l97N04M41o30N87m9o19L30J25o42
4108d39M75K97o56J39O94o58j05M77m02J40M58l91j75N76m55p18Q95N51r87M37
4128A53K35o26K53L62q62O55J87p13L63Q07q89j51P67o87k93O97j74n17M76m9
$$ plain form
4148 -6 -326 85 22 -219 251 507 -452 -129 593 -443 -64 668 -347 -334 333 -351 -208 162 135 -482 420
4169 420 200 -420 158 229 -469 52 139 -485 -312 286 -331 391 313 -208 -79 735 -387 -348 430 -37 -373
4190 -373 765 164 -271 467 83 -616 -199 68 -419 218 406 -244 339 410 -399 -287 624 -470 83 472
4210 472 -261 -148 346 94 -207 791 208 -367 329 -103 -357 146 167 -508 246 373 -760 51 594 -122
4230 -122 -358 225 -354 -75 166 -109 -490 304 -135 -261 314 101 -107 333 -31 -228 260 11 -295 -125
4250 -125 439 -335 -108 398 -208 -189 282 -630 -358 450 119 -474 273 -56 -140 330 419 -671 285 310 -598
4271 -598 184 481 -527 98 412 -266 -1 64 -488 -273 323 -194 -201 450 166 -634 405 252 -275 508
4291 508 24 -410 -158 48 -185 -33 255 -417 53 397 -213 -72 503 -375 -246 511 -291 -349 161 -120
$$ packed form
4148fl20M11o3k41M70K56r59L23P22j036L79P32j015J3O67o84J43L70k7o17R02
4169D20k20o20N78P1o98N21Q7o24J73N98o17P22p8n21J29Q14j122L9P78m67l36
4190c73J138o01m35P38l84o99M17K67m87O37J88o50N83P1q09J12R11j094N53L89
4210D72p33J13M94k52l01R98n83n75O96m32k54N03K1o75P54J27j133Q11N43p16
4230a22k36N83n79K79K41k75l81P94m39j26N75k13k08M40l64j97M88k49l06J70
4250a25N64p74K27N06o06J9M71r12K72Q08l31n93P47l29q4M70Q9j090R56K5r08
4271e98P82K97j008O25L14o78K65O5n52K15N96n17pO51k84q00J039j53n27P83
4291E08m84m34K52K06k33J52K88o72M70L44o10J41N75q78J29P57q02n8N10k81
$$ plain form
4311 -120 -536 40 -2 -404 103 154 -346 295 223 -410 -64 436 -201 -226 310 -460 -46 139 -175 -147 328 60
4333 60 -272 167 209 -525 152 146 -118 -125 62 -321 -354 408 -445 444 562 -446 -181 416 -225 -391 620 409
4355 409 -118 262 132 -367 226 -70 -596 368 19 -489 188 459 -472 81 372 -369 2 677 -272 -168
4375 -168 629 -138 -240 297 -141 -351 202 -24 -155 389 -53 -750 98 137 -120 -134 252 -627 29 501 -367
4396 -367 42 423 -214 -126 650 -356 -458 349 -119 -306 315 81 -112 207 250 -516 172 235 -266 107 236
4417 236 -260 224 410 -404 -460 183 -328 -284 333 57 -240 333 233 -640 405 307 -473 24 347 -513 -27
4438 -27 100 -707 85 385 -287 3 242 -129 -343 464 46 -200 320 -119 -319 298 -54 -594 366 268 -406
4459 -406 170 97 -377 49 98 -374 282 302 -235 -91 375 -260 -170 376 -98 -451 462 -30 -34 456 100 -385
$$ packed form
4311a20m16N76m2m02N07N1n00O41p2o33L46N00o37k5N36p70M14J85l14K8M75k68
4333F0l32M39M2p34O77ok64pJ87l83l3P62q53Q89J18j008K65N97o41j66J011k11
4355D09n27L80j30m99N93k96n26R64l49n08O77K71r31N53K91p41L71O75r49J04
4375a68P97p67j02N37m38k10N53k26j31N44m42o97Q48L9k57j4L86q79O56M72q68
4396c67M09L81o37Q8P76j006j02Q07m68j87O21k34j93L19M3p66O88O3n01L73J29
4417B36m96M84J86q14n6O43n11M4O17k76k97N73j00q73J045r8p80M97L23q60M86
4438b7J27q07P92L00o72K90K39l71k14Q07m18k46N20m39k00O17l52n40R60r8o74
4459d06N76p3m74M26M9m72O56K0n37J44M66o35R0N46m74l53R13m92mM90l56m85
$$ plain form
4481 -385 408 386 -92 300 80 -210 32 234 -318 -107 333 95 -388 278 -37 -174 136 100 -269 436 -120
4502 -120 -326 122 127 -437 68 -98 -200 285 369 -315 -300 627 -104 83 314 -38 -100 12 -22 -89 138 -53
4524 -53 -180 171 252 -250 33 171 -215 -154 212 -479 33 273 -225 -28 44 -156 -66 378 -75 -4 176 -192
4546 -192 -373 196 -126 -169 418 35 94 175 346 -416 419 219 -481 3 484 -250 -154 226 -298 -25 342
4567 342 -215 -144 507 91 -212 279 118 -396 294 -73 -184 359 53 -418 225 363 -258 68 235 -140
4587 -140 290 203 -203 133 571 25 68 120 266 -305 421 315 -131 144 32 -109 199 82 -321 213 454
4608 454 -209 -103 453 -117 51 131 -116 -221 254 -275 -230 356 168 -88 236 76 -109 175 -102 -198 -45
4629 -45 225 -127 187 302 -538 -210 359 33 -66 352 -41 12 226 254 33 116 1 -375 401 267 -399 -62
$$ packed form
4481c85P93k2m78L92k20k90K42K02n52K11M40k38m83O66l15j37L10l6l69P05n56
4502a20k06M48Nn64N05j66j02M85Q4o84J5R27p31J87K31l52o2J12l4o7K27j91
4524e3j27L51Q1n02K83J38l86O1L66o91N12K40m98J97P2k00R0M44m53P1J80l68
4546a92j81N69l22m3N87l83N9Q1J71p62Q35k00p00M84M81p34R6L80n24K73L67
4567C42n57P1O51m16l03M91j61n14O90l67j11N43l06m71O43J38o21L26J67l75
4587a40M30q7m06L36M38n46M3N2J46n71P26j06m46K75j12j41L08j17m03N34K41
4608D54o63J06N56n70J68Q0k47j05M75n29M5N86j88k56L24j60j85K84k77r6J53
4629d5K70l52L14J15q40L28N69l26r9M18l93N3K14K8k21Q3j15l76P76j34o66L37
$$ plain form
4651 -62 296 -145 -177 271 -452 -50 187 -257 -14 397 -186 -212 447 9 -241 112 -34 -184 306 168 -375
4672 -375 178 220 -171 -21 160 -24 173 162 -171 -78 139 -277 -50 190 -342 -42 486 -210 -272 492 -89
4693 -89 -17 21 5 -250 438 262 -304 110 202 -249 -9 238 -315 72 359 -162 -304 245 -173 -12 234 41
4715 41 -331 15 144 -29 201 190 -231 139 203 49 55 44 -501 -13 356 -183 -81 251 -243 -344 330 16
4737 16 19 178 218 -193 170 100 -272 -82 -144 -300 447 274 -147 203 163 -303 -187 263 -78 92 78 77 23 346
4761 346 -81 -282 288 263 -100 277 88 -119 17 223 -317 -58 227 -291 -272 402 -275 21 309 -344 -280
4782 -280 -53 -26 -1 -124 -371 -314 39 212 -93 214 132 -455 92 367 50 -166 213 -340 -357 513 -151 107
4804 107 15 -64 128 196 -189 -198 239 118 -293 313 158 -307 199 -34 -157 -7 93 -251 60 109 79 -260
$$ packed form
4651f2L58m41l2M48p23M02K37m44K43M11n83k6O59m38k50L53j46j50M90j38n43
4672c75N53M2l91J50J81j84J97j1l33R3K17m16K27K40n32L00N28o96o2P64n81
4693h9P2L8j6k55O88j76n66M14R2m51K40K47n53L87K87n21j42N49m18J61K46j93
4715D1l72L46J29j73K30j1m21L70O4j54Oj1n45M88L69n39J02L32m94j01O74l14
4737A6LJ59M0m11L63p0l72J90o2j56P47j73m21L50m0m66J16M50l41J70j4jn4L23
4761C46m27k01N70k5l63L77j89k07J36K06n40K59K85n18J9O74o77K96K88o53O4
4782b80K27K7K5j23k47N7L53J73l05L07q2n87N47K75l17k16L79n53j7Q70o64K58
4804A07r2p9J92O8l85rM37j21m11O06j55m65N06k33j23J50J00l44L11M9l0l39
$$ plain form
4826 -260 -58 -193 -1 372 -167 -59 380 -29 -264 34 -37 -248 83 -119 21 262 -20 -182 213 71
4846 71 -26 8 291 -220 -92 61 -149 -104 144 -66 -400 48 -185 222 -57 47 -184 426 70 -509 -167
4867 -167 213 -265 -146 34 -345 169 66 -121 -32 436 -207 -297 89 9 -194 452 107 -270 324 242 -309
4888 -309 26 71 -496 100 136 -462 -271 156 -48 -273 349 -41 -38 154 32 -202 -37 -4 -254 119 -321 -78
4910 -78 108 201 -290 208 214 -100 277 -124 117 -243 35 -56 130 57 -32 -131 34 9 -21 328 99 -260 38
4933 38 47 -45 -46 -122 -420 171 66 -391 -91 245 -118 -88 43 -243 23 343 -197 -121 -62 -38 -363 -8 -84 27
4957 27 136 30 -149 1 222 -324 239 -289 -142 -3 164 95 -62 -49 -36 -198 161 164 -386 56 -32 -124 -16
4980 -16 211 -242 148 196 -228 185 -85 143 11 194 17 141 2 -118 -60 -192 -187 -55 347 -119 -228 -94
$$ packed form
4826b60K02j35J92L73n39J08M39m09k35K98p1k11L31k02J40K41k82j62L95j42
4846G1r7L4K83n11J28J53k10M5K48k10l34M48k33M07k79J04k31O10l56n79L42
4867a67L80m78J19J80l79N14j03j87Q9M68o43r0L86q0k03O46l45l77N94q2n51
4888c09L35M5n67N96L6n98J91M27k04k25O22l90LJ92j22k34J65L3k50L73m40K43
4910g8J86R3m91M98Ol14L77m01K41l60K78r1J86p3q9r9J65k5l0L49k29l59K98
4933C8Rr2jp6k98N91j05m57L00L36l63L0J31k86K66L20n40P6N9K4l25L55p6J11
4957B7J09j06j79J50K21n46N63n28J47J39J67o9j57J3J3j62L59Ln50M42q8r2J08
4980a6K27m53L90M8m24M13k70K28j32J83j77J24j39j20N8j32NJ32M02m66j09J34
$$ plain form
5002 -94 332 -349 360 41 -141 273 33 -24 -131 24 -432 -137 294 -82 15 165 -116 147 -181 -197 -113 169
5024 169 93 31 227 50 -137 -119 397 36 -24 -63 46 79 84 67 -116 -29 -127 188 17 -169 -199 158 19 23 26
5049 26 -72 -15 18 246 82 251 -62 -86 391 -39 -47 193 165 16 168 299 -17 -64 221 -192 -86 21 165
5072 165 -30 254 60 -264 -160 -305 -82 85 -176 6 202 50 -106 -157 161 -265 -42 249 4 47 139
5093 139 -88 9 265 -211 -457 38 75 42 -200 -11 -378 79 142 -91 194 119 -337 94 102 -78 -204 144
5115 144 -80 -93 -263 -36 -380 21 -100 -63 137 44 132 162 -46 -438 286 252 -216 -186 204 75 -36 -53 -157
5138 -157 -311 137 -4 -84 281 3 -249 -147 65 -105 212 -214 -77 252 8 -356 -107 -3 105 -216
5158 -216 222 -136 34 -50 -53 -102 49 -109 120 -29 66 -204 127 -47 -213 37 372 -21 5 164 -142 28
$$ packed form
5002i4M26o81P09l19j82M14k40n7j07J55m56K95M31l76R7J50k81K63l28j6Q4K82
5024A69p6o2J96j77j87J8N16l61o0l9J09L3Nj7j83Q7r8L15j71j86l0L57j39ML
5049B6r8N7L3K28j64J69l13k4M77m30qK40k8j49J52J31l16m7K85m13J06J07J44
5072A65j95K84j94l24J04j45K23J67k61J82J96j52j56n1L18m26K23K91k45M3R2
5093A39k27R7K56m76k46M95L7l3k42J89l67M57O3k33K85p5m56M31Qj80j26L48
5115A44k24j3j70K27l44M01j21L7K00r3Q8L0k08l92P24l4m68L0L90j29j11j7j04
5138a57j54M48j41q0L65k78k52J02K12j70L17m26J37L29k44l64K49J04J08l21
5158b16M38l58J70q4lm9J51j58K29j49R5k70L31j74j66K50L35l93K6J59l06J70
$$ plain form
5180 28 47 -99 -79 -200 -367 -233 116 74 86 210 270 -138 -81 -104 -466 289 -192 -193 13 206 145 258 -110 257
5204 257 44 145 11 -147 82 111 -42 414 13 83 257 -7 -352 16 29 -52 331 -151 -47 -103 98 -19
5226 -19 -56 -1 -36 88 118 18 95 -142 97 -342 111 72 -374 -215 139 -21 132 134 -197 75 146 -11 -33 175
5250 175 -152 66 117 24 152 94 -287 -155 26 -4 40 491 -7 37 27 128 -375 98 43 125 133 126 39 139 304
5275 304 24 -76 102 20 -339 212 -69 -46 81 -55 -104 -126 171 106 166 -149 -86 302 -47 -116 67 186 -305
5298 -305 -155 108 52 -155 -169 -124 -106 -17 107 -30 16 -111 131 372 75 419 203 190 -82 -64 30 37 26 -154
5322 -154 -245 -136 -102 -99 125 144 43 -221 -124 348 48 -92 155 126 -148 -160 -8 83 -41 -424 199 60 -184
5345 -184 201 234 62 199 12 84 79 342 -190 -123 94 142 -39 125 -168 -136 1 67 -105 94 -36 -270 -33
$$ packed form
5180B8J9j46K0j21j67J34L49m2J2J24O0m08N7k3l62P55m81jK06J93o1J13l68L67
5204B57k13J01j34j58K29K9j53M56m01P0J74k64l45L68J3q1L83m82J04n6K01j17
5226a9l7N5l5J24L0j00P7k37K39m39M53l9m46J59L54j60J53Kl31K72P1j57k2K08
5250A75l27K18N1r3J28n8l81J32J81l0M4M51m98M4j0J01n03M73n5Q2Qpq7J00J65
5275C04k80j00J78q2l59N51k81K3J27j36m9k2K97o5O0l15O3L88l49o9J83J19m91
5298c05J50K63n6k07j4M5J8Q9J24j37M6j27K42K41k97L44k16j3k72J8R4Pj1j80
5322a54r1J09L4LK24J9j01k64R7M72l00j40K47k9k74j2J52R1j24l83O23j39k44
5345a84L85L3j72J37j87P2nK63n32O7K17M8j81J64k93L2J37O6j72J99j30k34K37
$$ plain form
5368 -33 93 -152 -75 93 -31 148 -25 -43 -5 217 -33 -324 41 -39 -172 8 -79 -214 322 304 -336 -21
5390 -21 -233 -83 -13 121 -297 -287 329 56 -46 54 -196 -195 346 -238 102 69 -129 -206 27 -161 -184 -123 215
5413 215 -12 -183 84 -98 29 177 36 -125 133 253 -104 -117 -272 -224 16 85 -339 -57 -96 97 40 -183
5435 -183 21 214 -50 55 11 -91 -192 45 229 113 -47 28 -79 -12 212 29 -18 146 -200 62 -239
5456 -239 -66 -74 -3 88 -61 -18 348 -37 -262 395 -89 -157 -179 -174 -357 349 -281 -474 100 -93 -19 395 -103
5479 -103 -28 -18 134 88 -8 361 -372 -38 100 -75 -144 82 -97 -20 -60 -290 -162 189 -56 -292 205 -55
5501 -55 -241 225 15 -181 -2 -8 -340 45 -31 -320 1 -29 81 -87 83 63 5 198 -225 -110 55 -99
5523 -99 -125 197 149 -74 89 252 -64 -63 86 -229 -15 -53 -58 -130 106 1 -7 -6 84 -91 54 15 -91 -87 -115 -320
$$ packed form
5368c3J26k45P7J68j24J79j73j8L8K22k50k91L65q0j33J80q7j35N36j8o40L15
5390b1k12J50P0J34m18J0O16k73j02J00k50JN41n84L40l3j98p7K33j88k3O1L38
5413B15k27j71K67j82J27J48j41j61K58J20l57j3j55M8K40O9m24K82l9J93n7k23
5435a83K04J93k64J05m4j02j01K37J84j16j60P5j07O7K24j83m7J64l46K62l01
5456b39J73qP1R1j49M3L66l85k25O57m84o8k2Nj83P06o30j93N74j93P4M14m98
5479a03P5J0J52m6r6L69p33L34J38j75o9K26j79P7m0k30J28L51k45k36M97k60
5501e5j86M66k10j96J79ol32L85p6k89L21l0J10j68J70k0n8J93m23J15J65j54
5523i9k6L22m8k23J63J63l16JJ49l15K14l8np2K36j05qJR0j75J45l9j06Mk8k05
$$ plain form
5549 -320 -4 -24 -47 163 -24 -89 51 338 -282 -102 278 -28 54 92 -191 -342 30 -196 -57 58 -32 102
5571 102 146 -211 202 72 250 -148 217 207 -7 -198 107 -89 -106 314 56 74 223 -332 22 239 -92
5592 -92 -124 220 -70 -195 -189 -130 80 -270 147 -91 163 53 -8 89 251 -162 108 -106 11 -75 169 -128 78
5615 78 -142 -39 -58 3 -68 -222 64 235 -112 -179 -36 -175 -6 275 161 -248 123 36 86 -71 -237 -309 207
5638 207 6 -31 528 -9 -159 -42 45 -157 -304 71 -148 194 -30 -185 -24 187 -55 -246 257 -204 -11
5659 -11 379 -135 2 240 -113 -176 -126 91 -303 -91 7 -216 73 11 -204 143 -157 -198 -23 378 -326 -50
5681 -50 172 -122 -258 87 -267 -19 109 -17 -22 5 197 -168 33 -166 -153 -11 302 -96 -153 263 -35 -167
5703 -167 244 118 -192 -5 280 -14 32 -156 -60 -61 -235 -129 262 -58 -274 27 102 -174 195 -258 31 143
$$ packed form
5549c20L16k0k3K10j87o5J40K87o20J80L80l06Q2L8k83j51L72k26J39J15r0J34
5571A02M4l57M13j30J78l98L65j0k14j91L05j96j7M20k58J8J49n55L54K17l31
5592i2l2L44k90j25ON9K10l50M17k38K54j10o1R7J62m13K70k14J17q6K44k97K06
5615G8k20J03j9O1p1j54K86J71l47o7J43j39J69K81j14m09L71q7N0j57j66p2N16
5638B07k01l7N59n37j50J17Q7k02j47L75k19L42k24j55J61K11k42j91N03m61J93
5659a1L90n14J37K38l53o3N0K17l94K12R8k23K89o2k15L47l00m1J75M01p04K76
5681e0K22k94j36L45l54K48J28j26nK7J92l65K01j99J3J42L13l98n7M16k98j32
5703a67M11j26l10J87K85k94M6j88R6jj74J06L91l20k16L01P5k76L69m53K89J12
$$ plain form
5725 143 209 -76 8 194 -137 -280 -10 -35 -74 190 -19 -192 -38 -115 -380 -63 175 61 -21 119 -131 -35
5747 -35 199 -320 330 111 -276 200 17 221 -181 -151 -147 111 -46 -61 -227 -156 93 -87 177 76 -80 -50
5769 -50 199 -233 106 314 -123 -179 188 149 -206 129 -277 -175 39 44 -143 -24 34 22 168 -134 -58 30 -22
5792 -22 -70 70 -65 -50 -39 139 -288 221 23 25 -51 54 -225 25 88 -4 -199 -153 289 -276 79 116 7 44
5816 44 38 6 20 161 -204 -75 -76 -157 -64 154 -100 -132 21 -193 -200 62 93 -288 407 196 -256 -207 57 -163 -240
5841 -240 -80 75 -127 -136 -199 23 117 77 -132 190 -108 -158 -231 -111 107 32 140 -306 -212 -57 -164 -148 -48
5864 -48 -316 84 30 -175 211 -113 -40 -264 -9 -168 -65 239 -52 13 138 104 -55 -302 164 4 -187 -148
5886 -148 -229 209 88 -83 -43 234 -102 68 -59 -54 -136 127 -132 -42 -14 -11 -228 259 244 -193 14 -47 -155 171
$$ packed form
5725A43O6k85Q4J86l31j43K70k5l9K64k09j73J54p7k65L17K38j14q2J40k50R6
5747c5K34n19O50k19l87M76j83K04m02L0MK58j57j5j66P1K49j80K64j01j56L0
5769e0K49m32L39K08m37n6L67l9l55L35m06J02K14Nj87J19N8j2J46l02P6Q8n2
5792b2m8J40j35J5J1J78m27N09j98Kp6J05k79K50O3r2j95M6M42n65L55L7j09L7
5816D4ol2J4J41l65J29jq1R3K18k54l2J53k14pK62L1l81O95k11m52M9K64k20p7
5841b40J60J55k02ro3K22R4m0k09L22k98n0p3J20K18p5J08m46R4J55j07J6J00
5864d8k68M00n4k05L86l24P3k24K55j59J03L04k91O5J25l4j59k47M66j60j91L9
5886a48q1M38j21j71M0K77l36J70j27Nq2K63k59R0K8Lk17M87j5m37K07o1j08L26
$$ plain form
5910 171 -69 -193 233 178 -176 210 42 119 303 321 -61 -68 117 -43 -51 129 -11 174 59 -3 -129 94 183
5933 183 -94 128 146 43 68 331 -206 0 98 -170 13 29 161 3 -4 3 -110 152 -73 -19 115 136 -19
5956 -19 204 82 -337 21 196 -182 -94 187 1 55 60 -157 71 133 -48 26 76 -311 -166 181 14 93 -255
5979 -255 -8 -158 -37 -7 197 172 17 -302 116 70 -200 -6 386 71 -118 83 73 187 128 -30 -120 85
6001 85 79 -191 87 -56 53 149 -59 -224 -104 222 -34 -53 242 178 24 551 236 -28 -109 67 -105 75
6023 75 287 3 79 114 -159 102 268 -11 -42 -222 -392 -197 -97 -173 -16 163 -40 -269 162 -4 212 229
6045 229 48 -41 30 -75 -201 -98 -239 -312 -204 -151 -151 -22 114 -73 23 70 184 -222 16 6 -8 190 -316
6068 -316 -140 279 -68 -142 102 184 65 -38 134 -45 -59 82 39 40 356 -164 313 33 -50 -227 -177 -16 74
$$ packed form
5910A71k40j24M26n5l54L86j68P7J84J8l82pJ85j60qJ80j40J85j15o2j26K23Q9
5933A83k77K22J8j03K5K63n37K06R8k68J83J6J32j58pPj13K62k25N4J34K1j55
5956a9K23j22m19L58J75l78Q8K81j86N4Nk17K28O2j81P4N0l87J45L47j67P9l48
5979b55K47j50J21L0K04k5j55l19M18m6k70J94L92l15j89K01j0J14n9j58r0K05
6001H5ok70K78j43J09R6k08j65J20L26k56j9K95o4j54N27l15k64q1J76j72J80
6023G5K12k84P6L5k73K61J66k79l1j80j70J95J00p6J57J79k03k29M31j66K16J7
6045B29j81q9P1j05j26J03j41p3J08N3%J29J36j87R6M7J14m06K38j0j4J98n06
6068c16J76M19l47p4K44Q2j19j03J72j79j4J41m3JL16n20M77k80q3j77N0J61R0
$$ plain form
6091 74 -37 -45 -140 292 57 -197 68 85 190 37 242 -4 36 141 -2 -69 264 12 -86 0 -257 4 -253
6114 -253 -116 187 190 -241 96 276 -164 -230 144 -132 -291 -228 146 50 -358 53 -71 11 -166 -451 112 85
6136 85 -161 122 149 -71 132 -32 -8 -354 311 -241 131 125 3 4 168 504 -197 139 -189 -77 -66 -27 -47
6159 -47 -70 160 52 106 122 100 -178 41 -38 -329 42 236 -202 175 101 20 -21 191 -117 -42 171 10 97 -80
6183 -80 129 25 12 -64 -15 76 188 -184 35 139 273 119 -175 58 58 283 -38 57 -37 -98 178 -164 -171 204
6207 204 428 -67 145 24 234 128 130 -170 -102 88 76 -355 165 146 -87 -13 -179 169 35 323 -18 194
6229 194 260 -135 -247 103 -142 -115 121 -178 -51 242 123 -276 -54 189 -276 194 12 -114 -62 29 205
6250 205 -163 -31 79 -238 343 -14 39 20 116 -93 158 -161 -56 -465 -60 -149 105 -8 -205 -95 169
$$ packed form
6091G4j11qr5M32k35k54K65J7J05j53K05k46M0J05j43o7L33k52r8Q6k57K61k57
6114b53J37L03Lm31L37J80m40o6L74k76j59O3L74r6m08M11j24Q2j77k85N63k7
6136H5k46K83K7k20K03j64K4l46O65n52L72oj22JJ64L36p01L36l28J12J1L9k0
6159d7k3K30j08N4J6k2k78K19p9k91L71J94m38L77p4q1m1K12l08P5K13j61Q7j77
6183h0K09j04j3p6M9R1J12l72K19J04J34j54k94K33%K25l21R5r4o1K76l42pL75
6207B04K24m95K12j21K10j06Kl00O8J90j2m31N20j9k33P4j66L48j34K88l41K12
6229A94O6l95j12L50k45K7K36k99J27K93j19l99K22K43m65M70j82j26N2R1J76
6250B05l68J32J10l17N81l57N3j9R6k09K51l19J05m09M05q9K54j13j97J10K64
$$ plain form
6271 169 -236 -142 -161 77 108 4 138 78 -96 -174 -315 97 -11 106 263 7 99 96 250 38 347 235 -84
6294 -84 26 156 -152 -289 271 -142 89 -206 -69 -193 45 127 -57 -329 14 265 -90 130 -22 -100 8
6315 8 49 122 -74 35 23 99 58 -147 -13 72 -15 412 270 -43 -91 -328 -89 207 203 -139 -238 -96 53 1 159
6340 159 97 -146 73 115 -75 142 -272 63 79 -206 97 -166 97 69 79 -1 19 -29 80 53 -35 64 40 37 418
6365 418 11 -43 -139 -50 -51 244 -202 -238 181 -64 71 -49 127 -62 178 40 198 46 259 -181 -22 60
6387 60 -137 -221 -233 -100 -54 30 -163 47 86 -29 -318 -64 13 -105 -268 73 37 -69 26 -306 128 86 -216
6410 -216 78 -5 -122 185 94 -157 -58 -16 -114 -8 137 18 148 -158 118 41 -57 -245 -204 137 30 -128 259
6433 259 -62 -22 -254 -167 -215 59 411 79 -84 125 -121 -67 148 -34 47 97 -75 -104 180 126 -105 124 223
$$ packed form
6271A69m05R4j9K38L1j04J34o0j74p8j41M12j08J17J57k56R2lJ54k12L09j12l19
6294h4J10J30l08j37N60m13K31k95J37j24K38Q2j84k72L43K51l55K20j52p8J08
6315HM1P3j96J09j2P6m1k05J34Q5q7M27j42l13m8k37K39K96ml42r9J42J49n2J58
6340A59o2k43K19M2j90K17m14L35J6k85L03k63K63k8J0q0K0m8J09k7q8R9k4lL81
6365D18m07n4r6Q9jK95m46l6M19k45J35j20J76j89K40j38J58j52K13m40J59Q2
6387F0j97q4j2J33M6Q4j93K10L9j15k89K54P7j18j63L41l6j06R5l32M34m2l02
6410b16K94q3j17L07r1k51R9M2r8J06J45j19J30l06K76p7r8j88M1L41j07j58L87
6433B59l21M0k32Q7m8K74L52l32j63K09k46N4K15j82Q1N0j72k9K84n4k31K29R9
$$ plain form
6456 223 -228 131 96 -189 64 -98 -40 147 120 106 -120 -77 -128 -325 183 51 -137 62 217 45 64 67 -148
6479 -148 156 14 47 135 -85 119 5 -2 -191 -54 2 -377 108 25 182 -267 29 132 -115 -311 -163 291
6501 291 136 1 152 -106 -239 147 -110 -50 130 45 251 91 -129 -180 117 -25 -27 -268 108 -212 184 -85
6523 -85 -11 -57 -220 -76 32 -109 336 133 -223 91 69 128 -212 149 -204 -156 123 28 -86 -71 9 -133 -65
6546 -65 8 331 151 -211 -108 -203 130 -13 136 -59 -99 104 30 93 152 208 -4 -74 -185 131 49 312 183
6569 183 87 -79 299 192 -2 49 -105 215 359 -48 -193 -32 -146 -17 -106 27 342 83 164 -106 -48 -46
6591 -46 -307 473 21 -31 390 241 -103 55 22 -270 -204 16 -118 -167 160 -53 -128 231 -182 -160 74 20 -13
6614 -13 -148 -119 35 75 -185 43 117 -77 32 197 299 -259 238 46 109 201 15 108 -45 246 25 -293
$$ packed form
6456B23m51L59l5k85K53j62N8J87k7j4k26M3n1j97N08j32j88J99J55j72J9Lk15
6479a48L04j42L3Q8k20K04j14pj89J37N6l79M85q3J57m49K96J03k47j96J48M54
6501B91j55j35J51k58j33L86k57O0J80q5K06j60k20n1K97j42kk41L76l20L96k69
6523h5P4m6j63J44J08j41M45k03l56L14k2N9l40L61l53M8K79r5j14J5Q0j42O8
6546f5P3L23j80l62J03r5L33j43J49j95m0K03p4O3N9N6k12p0j11L16q2K63j29
6569A83r6j66L78j07j94N1j54L20J44m07j45J61j14J29q9J33L15k59Q1k70N8K
6591d6k61P80m52n2M21j49l44J58l3k92O6K20j34m9L27k13p5L59m13K2K34n4l3
6614a3j35K9J54M0k60K28P4j94J09J65J02n58M97j92O3R2j86R3j53K91k21l18
$$ plain form
6636 -293 15 -149 -49 251 -175 -33 -53 189 -232 -66 142 -188 -59 94 -5 -53 -52 -232 51 110 48 -160
6658 -160 -122 -114 -177 -142 109 -243 -130 171 -29 -109 234 65 -85 238 8 -52 -39 86 -21 184 183 71 -156
6681 -156 -140 -129 -23 193 -1 132 -35 -25 16 150 63 66 13 -40 269 -101 -104 24 -85 -45 130 159 -125 160
6705 160 -68 245 65 -10 4 59 266 197 193 -123 -206 274 -81 90 72 -239 -71 34 -12 80 -12 93 81 24
6729 24 -85 278 127 -154 183 -89 92 176 219 -51 371 148 -99 -63 -64 -168 12 73 -190 -129 49 110 44
6752 44 204 69 -41 169 156 6 192 109 -13 -73 170 53 -68 117 140 -84 -138 294 30 38 -38 58 -38 -111
6776 -111 -79 -111 138 -266 -16 77 -151 -115 7 21 -12 -97 -49 49 -104 -51 142 155 -245 55 471 -106 11 11
6800 11 120 146 -84 73 -77 214 -127 -235 22 163 186 64 198 -93 107 109 -117 199 106 150 19 83 4
$$ packed form
6636b93L08j64J00L00m26J42k0K42m21J66K08l30J29J53r9m8Jj80K83N9o2k08
6658a60L8Qo3L5K51l52J13L01k00q0L43j69j50L23k30o0J3J25j07K05jj12k27
6681a56J6J1J06K16j94J33j67J0M1J34q7Ln3n3L09l70lJ28j09M0J75K9k84K85
6705A60k28L13j80p5J4N5K07o9ml16q3M80l55J71j8l11J68J05m6R2r2J05j2n7
6729B4j09L63j51k81L37k72J81Q4M3k70M22k23k47L6jj04J80O1k63O1J78O1o6
6752D4J60j35j10K10j3j50J86q3j22o0K43j17j21J85K3k24n4M32k64Qp6R6r6p3
6776a11L2l2K49m04K50R3k28L6J22J4l3q5M8R8j53N3J93J3m00L00M16n77J17%
6800A1J09K6k30J57j50K91l41j08K57J41K3j22J34k91K00Kk26L16r3M4j31O4p9
$$ plain form
6823 4 181 -41 -6 -240 0 -335 -36 -74 126 -52 -90 171 61 91 58 -122 -115 115 -107 129 155 191 -110 231
6847 231 39 150 23 -37 2 -23 -30 179 -27 129 16 -67 58 140 50 148 98 76 31 -154 102 92 -402 51
6871 51 446 -63 -174 409 -238 150 175 31 0 41 -51 -143 203 59 -4 -355 31 -88 18 -109 -116 105 126
6894 126 105 -192 -31 55 118 -3 -1 -317 -27 8 -255 194 -228 -170 303 116 77 340 175 283 -67 40 -150
6917 -150 -143 167 218 124 89 -227 96 -44 58 -111 -11 286 168 -72 243 213 240 140 54 48 132 5 -101 -79
6941 -79 268 -3 -36 -2 -53 301 -143 -21 -202 320 -67 -117 -61 159 86 170 -120 -5 22 22 -47 155 174 101 -5
6966 -5 -416 -148 159 7 -248 110 -34 177 150 -158 -133 262 -43 47 -97 13 -98 -303 227 28 45 -145
6988 -145 -117 55 105 50 -255 -103 -43 8 131 -437 95 55 1 -226 -12 183 -302 -134 -39 240 92 92 -255
$$ packed form
6823DJ77k22L5k34K40l35K99l8K00j78l8K61j10L0l3j80PK30k22K36K6L6l01L41
6847B31j92J11j27o0L9k5pK09k06J56j13q3J25Q2r0R8n0k2m5j85K56j0m94M53
6871E1L95n09j11N83o47L88K5j44l1M1r2r2L46j44o3l51L86j19J06j27pK21K1
6894A26k1k97J61Q6O3j21Kl16K90L5k63M49m22N8M73j87l9K63j65J08l50J07j90
6917a50PL10N1r4l5l16L23j40J02j69J00K97j18k40L15l0K7j00q6oQ4j27j06K2
6941g9L47k71l3L4n1L54m44J22j81N22l87n0N6K20p3Q4k90J15K7%o9K02J9p3j06
6966em11K68L07j52k55L58j44K11k7l08K5L95l05R0j44J10j11k05N30j99J7j90
6988a45K8J72N0n5l05J52O0N1J23n68N32m0n4k27K14J95m85J68R5K79j48%l47
$$ plain form
7011 -255 199 -106 -52 146 79 -144 270 -291 -240 -245 74 -23 32 140 -139 73 -133 -175 121 -8 -69 -313 78
7034 78 38 -62 -157 -49 10 -139 -229 24 -142 76 -63 -179 376 -66 64 -224 -128 -44 -57 -143 -233 38 -121
7057 -121 0 -91 -179 -374 -12 -4 61 278 104 -45 33 163 244 135 -75 148 175 -45 -96 129 -162 34 -115
7080 -115 -161 -59 1 119 -59 -222 -82 150 56 -54 283 14 46 144 12 61 -170 88 -170 -324 79 3
7102 3 162 120 -150 -56 -77 85 -81 167 -262 0 20 161 252 13 -111 -97 24 142 -306 -59 34 -17 158
7125 158 150 137 -133 -231 -43 -39 -32 -28 -24 34 -140 -146 93 -349 148 -108 -179 106 80 50 -263 -371 -62 -83 -90 252 2
7152 2 -11 403 -73 -19 292 73 110 123 308 -467 82 -114 -233 -265 177 -77 84 48 -309 -113 87 -31 159
7175 159 -19 -17 141 -166 -179 169 -10 -256 -92 358 -115 -41 -40 -103 -134 -112 -24 130 182 79 -229 -262 -65 -59 143
$$ packed form
7011b55M54l05N4J98o7k23M14n61N1nL19r7N5J08k79K12k06m2K96j29o1k44L91
7034G8m0j00r5J08N9j49r0K53j66K18j39j16N55m42J30k88R6Q4j3q6r0K71j59
7057a21J21r1q8j95L62QO5K17j74j49P8J30Q1j09k10K23K7k20n1K25k91J96j49
7080a15m6J02O0J18j78j63J40K32r4j10L37k69L2R8j32M9k31K58k58j54M03p6
7102CJ59m2k70R4k1J62j66K48m29K62K0J41R1k39j24J4J21J18m48K47R3n1J75
7125A58qj3k70r8J88MPMMN8j74oK39m42M97k56p1K85k6l0l13j08L09k1pL42k50
7152Bj3M14m76N4L11k19L7J3J85p75N49j96j19l2M42k54J61l6l57J96K00j18J90
7175A59j78KJ58l07j3L48j79k46J64M50m73P4Jo3l1K2Q8J54N2j03l08l3J97OK02
$$ plain form
7200 143 45 240 -122 98 64 72 93 -273 -59 -119 -41 -58 90 155 116 184 267 142 -33 128 11 -309 -93 -34
7224 -34 20 11 -84 -288 -67 -114 130 186 -105 -379 -22 161 -67 192 45 -146 -59 -126 -113 249 251 -10 -89 -96 20
7249 20 192 162 -334 -195 7 209 152 102 97 -142 19 97 90 48 -46 239 -191 191 -242 112 -37 73 -61 -137
7273 -137 -90 23 -104 -264 157 135 -29 -296 -202 -9 -157 267 -105 -171 46 -19 127 104 319 -157 -283 178
7295 178 -149 -53 -223 -128 -34 147 -139 249 197 72 30 94 -237 -233 55 16 -84 17 402 179 107 -28 -7 -138
7319 -138 -39 147 -93 59 -77 94 225 87 13 68 153 120 252 41 -5 229 -179 -33 -121 -83 -99 67 255
7342 255 144 119 -220 32 377 -39 117 -45 -49 1 -156 89 43 -100 151 342 63 -60 -141 -10 157 -77
7364 -77 -202 -115 8 -254 -99 -15 -4 -89 -151 165 59 86 -15 -145 -142 274 20 -177 -10 65 -73 218 -25
$$ packed form
7200A43r8J95l62K20l4QK1l66K14o0P8j7J48O5l9O8Q3j25j75J61j17l20K16N9
7224c4N4rr5k04K21m7K44N6k91k74L57J83k28K59j47j91Q7o7J3L62Kk61p9pJ16
7249B0J72l0m96J39K02K02n7n0nk39J61P8pm2r4K85m30L82m33L54j49J10j34p6
7273a37M7J13j27j60M21k2j64k67R4J93j48M24l72o6K17o5J46k3K15m76j26M61
7295A78l27R6j70R5R4J81k86L88n2j25m2O4l31MK88l9j00J01L85k23p2j35K1j31
7319a38R9J86k40J52j36J71J31j38p4N5Q5l3J32k11m6K34m08J46q8L8j6J66J88
7342B55j11k5l39K52L45m16J56j62mN0j57K45m6j43K51J91k79j23q1J31J67k34
7364g7j25Q7J23k62J55Q4J1q5o2L16j06K7j01j30LM16k54j97J67P5j38K91k43
$$ plain form
7387 -25 -45 155 -107 194 37 -59 -130 -202 114 -263 -71 128 -77 67 402 -9 -62 -131 -11 -66 181 132 -214
7410 -214 -153 -161 -260 256 -62 -159 155 -49 -208 -92 -46 -104 85 -104 -66 105 -178 -38 -7 -159 -90 -197 -110 100
7434 100 -74 0 -155 109 -86 -148 -98 212 -188 135 95 -77 255 45 41 -80 118 86 -145 48 -30 -351 -4
7457 -4 -294 -267 -171 0 -202 -13 318 -24 -34 67 -212 -117 -179 -48 154 -96 -36 -136 151 201 -48 -220 120
7480 120 -58 76 -56 -102 405 -341 55 232 146 -69 -15 52 162 76 179 230 -105 135 160 107 184 107 -15
7503 -15 82 187 -64 -134 88 -220 -102 -265 -85 -173 -42 6 -80 282 -262 -2 -8 -2 10 -33 -130 129 89 -69 -206
7528 -206 151 61 235 120 -75 149 -214 -17 -25 91 -8 -363 -85 182 51 -303 111 336 -180 -143 207 54
7550 54 117 40 -265 392 259 -181 -3 33 17 -119 -43 -39 228 182 -118 12 -79 -5 108 -51 340 64 11 -78
$$ packed form
7387b5k0K00k62L01j57r6p1p2L16l77J92J99k05J44L35m11n3o9J20n5K47m9l46
7410b14O1qr9N16l18r7L14k04j59J16M6n8J89j89L8J71k83J40L1j52O9j07Q7K10
7434A00j74P4j55K64j95o2N0L10m00L23m0j72L32k10mj21J98l2k31J93p8l21L47
7457dk90K7R6J71k02J89L31l42j0J01k79R5o2J31K02k50O0j00K87N0k49j72L40
7480A20j78J34j32m6N07p46L96J77q6k15N4O7J10q6J03N1l35K40K5n3P7p7j22
7503a5R7J05k51p0K22l08J18j63J80q8J31M8q6L62n44K60oOJ2m3r7K59m0j58j37
7528b06L57r0J74j15j95K24l63J97qJ16r9l55K78K67j31l54M14K25n16L7L50j53
7550E4O3p7l05O57j33m40J78L6j6j36P6MK67m6l00J30r1P4J13j59L91k76n3q9
$$ plain form
7574 -78 -31 20 30 -124 6 265 -22 178 -49 -385 103 -33 -109 177 101 105 184 -81 39 108 231 227 161 240 77
7599 77 40 -4 -80 -228 -134 22 98 60 -129 -89 -61 -136 -141 -112 36 87 -179 105 354 -40 -126 88 -84 -2 31 -165
7625 -165 177 -12 166 -62 74 -147 -191 85 -88 -80 -1 -60 16 -190 13 153 -203 -27 -59 38 48 213 91
7648 91 113 0 156 8 -59 113 221 40 -108 97 -193 0 -19 -81 17 317 -26 -141 -133 -159 -185 -288 -101
7671 -101 -31 -48 -207 -198 71 2 -13 -276 93 310 -104 380 179 -16 -293 38 13 25 -211 77 47 -154 162
7694 162 85 -63 156 30 -25 -25 356 -78 22 223 -275 -89 -16 -185 172 -40 15 -9 -101 -81 14 -53 -262 340
7718 340 -98 177 253 118 96 49 -120 -201 -349 -109 295 -55 -178 347 -139 -150 37 -86 -66 -293 -233 5
7740 5 246 -96 288 35 -108 -112 -163 404 -4 -5 -104 309 151 -129 102 -120 -118 -26 -60 -215 52 -112 -170 -28
$$ packed form
7574g8M7N1J0j54J30K59k87K00k27l36M88j36p6K86p6MP9k65J20O9J23mo6P9j63
7599G7l7m4p6j48R4J56P6l8j89M0K8p5nK9J48N1k66K84K49l94q6K14j72Q2L3j96
7625a65L42j89J78k28J36k21m4K76j73QP9n9P6k06K03J40l56J76l2R7J0J65j22
7648I1K2j13J56j48o7J72J08j81j48K05k90J93j9o2R8L00l43j15Qk6k6j03J87
7671a01P0j7j59RK69o9j5k63L69K17m14M84k01j95k77L31k5J2k36K88l0k01L16
7694A62p7j48K19j26n5%L81m34J00K01m98J86P3j69L57k12N5k4r2K0R5o7k09O02
7718C40m38K75P6j35k2m7j69q1j48K40M04l50j23N25m86j1J87j23K0k27O0K38
7740EK41l42L84k53j43mn1N67m08jr9M13j58k80K31k22KR2l4j55K67j64n8J42
$$ plain form
7764 -28 -159 -151 -165 167 78 150 10 135 -48 9 -244 69 233 46 101 218 212 250 377 214 -126 136 77 -66
7788 -66 -74 251 -146 7 -152 -94 -253 -64 -67 -148 254 104 66 -228 6 -344 -146 -80 35 -82 31 102 131 212
7812 212 -188 -135 71 200 -28 -359 -81 187 -109 128 -51 -192 -196 51 188 14 -146 404 -86 -121 27
7833 27 -33 72 -22 158 56 148 65 -51 -124 35 -143 -86 -214 -135 -362 16 -13 -253 98 -69 407 -49 -56 -127
7857 -127 -19 150 -44 167 54 -94 98 181 61 27 -133 97 301 208 -235 32 150 -6 281 192 130 348
7879 348 -296 -177 -127 18 2 198 -46 -230 67 82 369 -67 -231 51 188 -128 141 -5 -115 -101 -117 -255
7901 -255 -71 -3 -92 -64 135 41 24 -8 124 32 -200 68 -159 112 242 -23 157 -35 196 213 383 137 -188
7924 -188 -12 -227 165 -158 -120 -21 18 393 54 267 -43 10 44 102 -177 -295 90 109 33 200 205 -5 85 -160
$$ packed form
7764b8j31Qj4L32q9P2j40J25j83N7k53L13J64j87N5J17oL8J27j63l40K62n9j43
7788f6qL25l97J53j59N8j59J89lq1M02j50l8k94K34l50J98O6J15j17J13P1K9Q1
7812B12m00N3K06J29k28l31K78K68k96K37j79j41mK47J37j74j60N50m90l5J48
7833B7o0J05r4J80j02R2q3j16p3J59j78N7j28P9k27L78k9k40L51j67M76m56pp1
7857a27J08J69j94K11j13j48J92Q3j20l4j60K30K04r3m43K67J18j56K87q9o2K18
7879C48o44J19N0J45j6J96k44j84K97J5K87m36j64K82J37l16K69j46j10J4j6j38
7901b55J84O8q9K8J99r4j7l2J32r2k32K68k27K71J30k65J80j92K31J7J70k46l25
7924a88J76k15L92l23L8R9L9L75l39K13l10N3L4N8k79j18L85J9p6J67Nk10R0k45
$$ plain form
7948 -160 118 350 88 52 295 30 -61 51 -128 -24 22 -84 -43 245 202 -204 -11 21 -88 -174 120 -45
7970 -45 -49 -210 -1 -99 93 -27 78 4 361 160 74 -35 -316 -82 -153 196 0 324 -256 264 -11 91
7992 91 216 61 -297 55 48 -57 101 -142 -125 377 -199 -325 406 72 -179 -24 251 -327 -71 -15 -168 110
8014 110 -130 -35 179 74 53 -94 -231 -187 220 303 -77 61 36 -27 -317 183 -284 34 -56 31 225 -101 251
8037 251 -59 78 -69 -47 -310 -130 51 -17 -63 -170 -16 80 74 125 -63 100 177 -243 25 39 -106 64 -233
8060 -233 -202 207 -212 -16 -104 -247 81 107 -13 -14 -165 -120 -248 444 -88 -80 262 171 -250 4 -52 -9 152 -6
8084 -6 -110 -219 -135 22 -29 -87 318 -113 81 -24 169 -85 160 -357 -74 38 -129 -107 189 -204 -349 186
8106 186 -28 31 359 295 64 133 21 -16 -94 290 -4 -201 149 21 -42 -263 -4 9 -452 15 -56 143 158
$$ packed form
7948a60K78K32k62l6K43k65r1J12j79J04M6j06M1K88m3m06J93L2j09q6K94j65
7970d5mj61K09r8J92j20J05p4L57k01q6j09k81K34p1L49j96L24n80N20k75J02
7992I1J25j55l58L52pj05J58k43J7N02n76j26P31l34k51J55K75n78K56N6j53K78
8014A10k40R5K14j05k1j47j37M4M07Q3l80J38k5o3k90N00m67L18r0Q7J94l26L52
8037B51l10J37j47K2k63J80J81o8m6j07J54R6oN1j88J63P7m20K68J4j45J70k97
8060b33L1M09m19J96q8j43L28K6j20jj51M5j28O92n32QL42r1m21K54n6M3J61j58
8084fj04j09Q4J57n1n8M05m31J94j05J93k54K45n17K83J12j67K2K96l93j45N35
8106A86k14N9L28o4k31O9j12l7p8L84k94j97L50j28o3k21K59J3m61M67p1J99J5
$$ plain form
8129 158 -183 106 -336 -158 186 -174 -83 44 -107 -284 -43 -353 131 -106 -39 -171 -45 1 -99 -134 88
8150 88 -188 53 194 -219 173 160 -225 93 -129 172 -110 145 231 -172 129 -154 164 58 180 -165 209
8171 209 18 -293 139 -62 -18 264 38 -173 -13 52 -150 -74 164 -59 61 173 171 -16 49 -165
$$ packed form
8129A58l41K89m42J78L44l60R1J27j51j77K41l10M84k37O7j32J26M6j00l5K22
8150H8k76K41J41m13L92j3l85L18k22L01k82K55Q6m03L01k83L18j06J22l45L74
8171B09j91l11M32k01M4K82k26k11J60O5k02P6K38k23J20J12kj87O5k14
8191a65
$$ Imaginary data points
##PAGE= N=2
##DATA TABLE= (X++(I..I)), XYDATA
$$ plain form
0 0 0 0 0 0 0 0 0 1 -8 8 -8 8 -8 16 -16 22 -24 29 -33 40 -48 54 -62 71 -83 94 -108 121 -138 154 -173 196
32 196 -218 242 -271 301 -334 372 -412 455 -504 557 -617 686 -759 843 -938 1045 -1173 1321
50 1321 -1497 1710 -1977 2321 -2778 3421 -4388 6007 -9194 17750 -87070 -212369 77512
63 77512 113812 -20817 -24304 -41718 -33850 93804 19578 -93448 28581 51831 -68929 14461
75 14461 51618 -71540 -6540 76941 -48166 -39923 51641 -25487 -8851 79013 -48729 -77068
87 -77068 91473 51058 -61000 9984 4427 -31022 69943 27083 -92041 10564 55592
98 55592 -47618 8627 38878 -81570 -14829 88909 -37906 -66085 44176 1167 -19945
109 -19945 42322 -34133 -48367 72662 18248 -54852 40077 7472 -66814 60610 67057 -80673
$$ packed form
0@%%%%%%%JrJ6j6J6j6K4l2L8m6N3o2P3q8J02j16J33j54J77k02K29k59K92l27L69
32A96m14M60n13N72o35P06p84Q67r59J061j174J303j445J602j781J983k218K494
50A321k818L207l687M298n099O199p809J0395j5201K6944j04820j25299K89881
63G7512L6300j34629l487j7414P868J27654p4226j13026J22029K3250j20760Q3390
75A4461L7157j23158O5000Q3481j25107Q243R1564p7128J6636Q7864j27742k8339
87g7068J68541m0415j12058P0984n557l5449J00965m2860j19124J02605M5028
98E5592j03210N6245L0251j20448O6741J03738j26815k8179J10261m3009k1112
109a9945O2267p6455j4234J21029n4414p3100R4929l2605p4286J27424O447j47730
$$ plain form
121 -80673 -22246 59310 -16776 2458 29336 -56815 -639 74412 -46904 -52645 70207 7037
133 7037 -49464 23889 -11540 -26866 67899 -2123 -84722 32825 41636 -51169 25102 35416
145 35416 -78876 -8631 74407 -17386 -24870 14849 -38654 14100 73126 -47004 -48744 73286
157 73286 3069 -55528 46540 23458 -41640 28542 9612 -46722 40474 35077 -60735 3495
169 3495 35555 -44764 7449 46421 -55605 -25620 55039 -23760 -29984 42940 -21218 -31736
181 -31736 52845 -9920 -50476 50891 20238 -56013 23581 31543 -38366 14632 24737 -37348
193 -37348 20000 31144 -56255 6673 65740 -41406 -35818 52251 -9154 -27530 41931 -12875
205 -12875 -37687 39876 113 -39481 39759 7072 -59218 24148 31665 -43830 11083 26762
$$ packed form
121h0673N8427Q1556p6086J9234K6878q6151N6176P5051j21316n741J22852o3170
133G037n6501P3353l5429j5326R4765p0022q2599J17547Q811r2805P6271J0314
145C5416j14292P0245Q3038r1793p484L9719n3503N2754N9026j20130j740J22030
157G3286p0217n8597J02068k3082o5098P0182j8930n6334Q7196n397r5812O4230
169C495L2060q0319N2213L8972j02026K9985Q0659p8799o224P2924o4158j0518
181c1736Q4581o2765m0556J01367l0653p6251P9594P962o9909N2998J0105o2085
193c7348N7348J1144q7399O2928N9067j07146N588Q8069o1405j8376O9461n4806
205a2875k4812P7563l9763l9594P9240l2687o6290Q3366P517p5495N4913J5679
$$ plain form
217 26762 -51450 2367 48539 -32300 -9387 40269 -37649 -20609 63697 -3470 -37351 29748
229 29748 -6157 -21357 53336 3334 -53737 28798 23511 -38124 23710 22222 -52065 10480
241 10480 41027 -43754 -9013 44377 -30037 -24104 34010 -16140 -12673 36346 -29006 -33725 52784
254 52784 3159 -45895 29239 12271 -39187 27660 24496 -40489 13701 27386 -37169 12089
266 12089 41125 -38976 -12683 45426 -15819 -17340 29978 -19552 -14605 44932 -17581 -40547
278 -40547 40211 6600 -42699 26930 15701 -45599 11473 24297 -30448 9944 18788 -42825
290 -42825 5802 43013 -31507 -14859 37447 -20510 -16208 42318 -12470 -25621 40406 -4113
302 -4113 -37321 37122 18609 -35742 13411 10023 -29074 28426 22966 -50673 -1095 36917 -24039
$$ packed form
217B6762p8212N3817M6172q0839K2913M9656p7918J7040Q4306o7167l3881O7099
229B9748l5905j5200P4693n0002n7071Q2535n287o1635O1834j488p4287O2545
241A0480L0547q4781L4741N3390p4414N933N8114n0150L467M9019o5352m719Q6509
254E2784m9625m9054P5134j6968n1458O6847l164o4985N4190J3685o4555M9258
266A2089K9036q0101K6293N8109o1245j521M7318m9530M947N9537o2513k2966
278d0547Q0758l3611m9299O9629j1229o1300N7072J2824n4745M0392Q844o1613
290d2825M8627L7211p4520J6648N2306n7957M302N8526n4788j3151O6027m4519
302d113l3208P4443j8513n4351M9153l388l9097N7500n460p3639M9578L8012o0956
$$ plain form
315 -24039 -3754 26368 -35969 -13356 43733 -17202 -25928 34155 -12134 -32474 36534 8398
327 8398 -34434 18423 7858 -27886 25182 14901 -37420 17913 28092 -38434 3859 41482
339 41482 -25307 -14117 31282 -14874 -7836 34428 -20670 -25658 38354 -119 -32216 22300
351 22300 1817 -29982 23869 9285 -36797 15351 17201 -36931 10515 31201 -34931 -9778
363 -9778 33866 -15542 -8511 27228 -20807 -13228 39435 -8230 -26664 29640 1185 -24789 29141
376 29141 6086 -33077 22610 16107 -35538 13863 27912 -33455 -4916 25932 -20195 -1418
388 -1418 25017 -28929 -13592 34833 -14345 -21436 30027 -9922 -29781 29507 7153 -28207
400 -28207 19091 5807 -30949 23594 23458 -35177 2529 27733 -19323 1838 23529 -24000
$$ packed form
315b4039K0285L0122o2337K2613N7089o0935q726O0083m6289k0340O9008k8136
327H398m2832N2857j0565l5744N3068j0281n2321N5333J0179o6526M2293L7623
339D1482o6789J1190M5399m6156P038M2264n5098m988O4012l8473l2097N4516
351B2300k0483l1799N3851j4584m6082N2148J850n4132M7446K0686o6132K5153
363i778M3644m9408P031L5739m8035P579N2663m7665j8434N6304k8455k5974N3930
376B9141k3055l9163N5687o503n1645M9401J4049o1367K8539L0848m6127J8777
388a418K6435n3946J5337M8425m9178p091N1463l9949j9859N9288k2354l5360
400b8207M7298j3284l6756N4543j36n8635L7706K5204m7056K1161K1691m7529
$$ plain form
412 -24000 -2458 31434 -20192 -12622 35541 -13329 -28293 30132 4345 -26111 17642 599
424 599 -28022 21768 12155 -33703 8570 18117 -27626 4468 22307 -25719 -2654 25570 -21900
437 -21900 -6960 33669 -16493 -21875 31609 1804 -20203 20719 -976 -21207 26589 8253
449 8253 -29719 15195 14839 -27142 10631 21359 -27302 -1001 22352 -22905 -2742 28490 -23002
462 -23002 -19472 29189 -5143 -20357 19623 -5786 -20057 23587 601 -25880 21250 8734
474 8734 -31067 15718 22696 -25833 2066 20532 -19526 4555 26432 -23205 -10528 30482
486 30482 -9658 -14688 23359 -8099 -18591 23003 -2733 -21470 22672 723 -32550 17559
498 17559 18452 -27712 1850 14763 -21488 5043 20708 -24203 -5728 24545 -14902 -8740 26039
$$ packed form
412b4000K1542L3892n1626P570M8163m8870j4964N8425k5787l0456M3753j7043
424E99k8621M9790r613m5858M2273R547m5743L2094J7839m8026K3065K8224m7470
437b1900J4940M0629n0162n382N3484k9805k2007M0922k1695k0231M7796j8336
449H253l7972M4914l56m1981L7773J0728m8661K6301K3353m5257K0163L1232n1492
462b3002L530M8661l4332j5214L9980k5409j4271M3644k2986k6481M7130j2516
474H734l9801M6785O978m8529K7899J8466m0058K4081K1877m9637J2677M1010
486C0482m0140n030L8047l1458j0492M1594k5736j8737M4142k1949l3273N0109
498A7559Q93m6164K9562J2913l6251K6531J5665m4911J8475L0273l9447O162L4779
$$ plain form
511 26039 -11864 -16813 24961 -1457 -15662 23120 -2086 -26304 23281 16420 -25871 6076
523 6076 14215 -19146 7938 16161 -22828 1024 20634 -21844 -6470 26261 -14691 -17154 20363
536 20363 -7339 -14529 22286 -6322 -24722 21504 8059 -24246 12193 10528 -22130 9154
548 9154 16278 -18099 5149 15128 -22921 3946 30262 -18189 -15394 23418 -4515 -10026 20061
561 20061 -9330 -18684 23670 1504 -23925 14807 6373 -22980 10653 10309 -22641 6854 12776
574 12776 -23682 3709 22592 -21062 -8387 23531 -10486 -10619 21020 -6827 -13270 19970 -3538
587 -3538 -14875 23166 2252 -25099 14514 13870 -16709 8621 7642 -22430 9998 21016 -22467
600 -22467 -6167 20119 -13184 -7401 18959 -11788 -12558 17530 -7071 -13295 20059 -4670 -22949
$$ packed form
511B6039l7903m949M1774k6418j4205L8782k5206k4218M9585o861m2291L1947
523F076Q139l3361K7084Q223l8989K3852J9610m2478J5374L2731m0952k463L7517
536B0363k7702p190L6815k8608j8400M6226j3445l2305L6439j665l2658L1284
548I154P124l4377K3248R979l8049K6867K6316m8451K795L8812k7933n511L0087
561B0061k9391r354M2354k2166k5429L8732q434k9353L3633l44l2950K9495N922
574A2776l6458K7391J8883m3654J2675L1918l4017j33L1639k7847o443L3240k3508
587c538j1337L8041k0914k7351L9613o44l0579K5330r79l0072L2428J1018m3483
600b2467J6300K6286l3303N783K6360l0747p70L0088k4601o224L3354k4729j8279
$$ plain form
613 -22949 17813 8250 -19769 9886 8115 -19916 10176 16194 -19651 2894 18906 -16700 -3150
626 -3150 21998 -9744 -8439 17200 -9354 -8712 22166 -6942 -19851 18691 3772 -19814 12472
639 12472 5788 -21161 9084 10796 -19923 4526 13146 -20156 -567 19498 -14329 -6370 16035
652 16035 -12141 -5911 22971 -8764 -16814 20166 1774 -15353 16823 3858 -19257 12233
664 12233 10793 -16781 8115 10265 -19312 4867 17810 -17260 -4536 15500 -12783 -4254 18777
677 18777 -13855 -14115 20209 -2975 -17198 14301 1257 -16492 11661 3388 -16456 12879 9405
690 9405 -21118 5411 16046 -13517 2261 14298 -15849 -1656 22010 -9791 -9713 17081 -6218
703 -6218 -10469 19342 -2166 -18299 11553 3690 -11815 12044 -779 -22580 12731 15743 -21126
$$ packed form
613b2949M0762r563k8019K9655j771k8031L0092O018l5845K2545J6012l5606J3550
626c150K5148l1742J305K5639k6554O42L0878k9108j2909L8542j4919k3586L2286
639A2472o684k6949L0245J712l0719K4449Q620l3302J9589K0065l3827P959K2405
652A6035k8176O230K8882l1735q050L6980j8392j7127L2176j2965k3115L1490
664A2233j440k7574K4896K150k9577K4179J2943l5070J2724K0036k8283Q529K3031
677A8777l2632k60L4324k3184j4223L1499j3044j7749K8153q273j9844K9335l474
690I405l0523K6529J0635k9563J5778J2037l0147J4193K3666l1801P8K6794k3299
703f218m251K9811k1508j6133K9852p863j5505K3859j2823k1801L5311L012l6869
$$ plain form
716 -21126 -2209 13525 -12971 -142 13949 -14767 -4045 18873 -10866 -11219 19167 -1506
728 -1506 -12559 13474 -1921 -11757 17882 2747 -19384 12161 10654 -17196 7329 13297 -18294
741 -18294 -280 16421 -10100 -2302 10957 -15695 -3965 21775 -9184 -16736 13663 -1042
753 -1042 -11137 13367 -3031 -16978 14758 5676 -19662 8708 12546 -16176 1529 12756 -10986
766 -10986 2273 12406 -13900 -428 19335 -11069 -9851 18657 -3129 -12361 14227 70
778 70 -13166 11417 -48 -15382 13460 6868 -21825 3019 13576 -11556 31 7098 -15116
791 -15116 2724 16693 -15421 -7686 18582 -7008 -11351 16035 -963 -11661 12311 161
803 161 -11370 15615 4393 -18043 8763 10636 -13434 5132 10425 -15710 1007 14595 -11756
$$ packed form
716b1126J8917J5734k6496J2829J4091k8716J0722K2918k9739l53L0386k0673
728a506j1053K6033j5395r836K9639j5135k2131L1545j507k7850K4525N968l1591
741a8294J8014J6701k6521P798J3259k6652J1730K5740l0959p552L0399j4705
753a042j0095K4504j6398j3947L1736r082k5338K8370L838k8722J7705J1227k3742
766a0986J3259J0133k6306J3472J9763l0404J218K8508k1786r232K6588j4157
778G0j3236K4583j1465j5334K8842o592k8693K4844J0557k5132J1587P067k2214
791a5116J7840J3969l2114P735K6268k5590m343K7386j6998j0698K3972j2150
803A61j1531K6985j1222k2436K6806J873k4070J8566N293k6135J6717J3588k6351
$$ plain form
816 -11756 -1929 14200 -13768 -8956 19086 -3505 -13711 9346 -2940 -9593 14352 -1623 -17778
829 -17778 12062 7672 -16712 5480 10438 -12808 3476 10553 -13770 2856 17261 -12540 -7215
842 -7215 17103 -3718 -7328 12148 -5113 -8951 15097 -1153 -13672 12188 2027 -16182 9900
855 9900 9034 -17170 1463 10361 -11690 1560 9340 -15527 -1535 17220 -9318 -9450 12450
868 12450 -3969 -5917 14101 -4968 -12212 15276 2577 -13427 11919 6318 -15290 6576 10420
881 10420 -12058 4557 10300 -14112 -157 13569 -10684 -3628 13695 -10395 -9235 14173 -3499
894 -3499 -9848 11403 -5184 -14281 15483 5644 -17413 3448 6422 -9046 8190 6062 -16520
907 -16520 3504 14994 -11243 -1918 14066 -9259 -4998 14703 -5535 -6924 14497 -4421 -11728
$$ packed form
816a1756R827J6129k7968M812K8042k2591j0206K3057j2286o653K3945j5975j6155
829a7778K9840m390k4384K2192M958k3246J6284P077k4323J6626J4405k9801N325
842g215K4318k0821l610J9476j7261l838K4048j6250j2519K5860j0161j8209K6082
855I900q66k6204J8633Q898k2051J3250P780k4867J3992J8755k6538j32K1900
868A2450j6419j948K0018j9069p244K7488j2699j6004K5346n601k1608K1866L844
881A0420k2478J6615N743k4412J3955J3726k4253P056J7323k4090J160K3408j7672
894c499o349K1251j6587r097K9764r839k3057K0861K974j5468J7236k128k2582
907a6520K0024J1490k6237R325J5984k3325M261J9701k0238j389K1421j8918p307
$$ plain form
920 -11728 13760 1728 -13757 9056 4773 -13595 5554 6129 -12332 4514 6874 -15635 1917
933 1917 14693 -12605 -6724 13366 -5707 -5892 11408 -6551 -7971 15312 -940 -12806 10753
946 10753 3459 -10554 9801 5163 -13462 6334 8862 -11939 4314 11023 -13560 -2045 14843
959 14843 -7553 -5822 9621 -7637 -5344 13995 -5531 -12459 11486 246 -12663 9373 3696
972 3696 -12458 6884 3862 -13264 8203 11777 -15160 -2149 12495 -6525 -318 11818 -9256
985 -9256 -5035 14159 -4048 -6557 12933 -4462 -12615 13264 4251 -12642 6163 2761 -11962
998 -11962 8069 6495 -15183 2345 10866 -11789 -2370 11104 -8026 -3433 9811 -8701 -4318
1011 -4318 15030 -5576 -11395 12535 1608 -10082 9629 2516 -11170 8935 6208 -12067 5409
$$ packed form
920a1728K5488j2032j5485K2813m283j8368J9149N75j8461J6846K360k2509J7552
933A917J2776k7298N881K0090j9073j85J7300j7959j420K3283j6252j1866K3559
946A0753p294j4013K0355m638j8625J9796K528k0801J6253O709k4583J1515J6888
959A4843k2396J731J5443j7258K293J9339j9526o928K3945j1240j2909K2036n677
972C696j6154J9342l022j7126K1467L574k6937J3011J4644j9020O207J2136k1074
985i256M221J9194j8207k509J9490j7395q153K5879r013j6893J8805l402j4723
998a1962K0031j574k1678J7528Q521k2655R419J3474j9130M593J3244j8512M383
1011d318J9348k0606n819K3930j0927j1690J9711p113j3686K0105k727j8275J7476
$$ plain form
1024 5409 8723 -11825 1912 11087 -10210 -2266 10990 -7794 -3414 11490 -8931 -8457 14619
1037 14619 -1242 -12840 7040 882 -8979 9336 1844 -13751 6488 7284 -12433 4107 10018
1050 10018 -11173 -502 10372 -7913 -395 12546 -8874 -6525 14496 -2592 -8270 11241
1062 11241 -717 -10799 9427 2993 -9187 7467 1072 -13968 7984 10189 -13650 -1980
1074 -1980 8551 -8616 706 10081 -11077 -4732 12670 -5885 -7335 12109 -2368 -9427 9629
1087 9629 198 -8229 10626 1750 -12531 8552 7655 -12232 4201 9524 -10468 345 10000
1100 10000 -8566 -1264 10696 -9027 -4675 12594 -5242 -9819 9346 -1517 -8235 8621 -2107
1113 -2107 -11413 10407 4602 -14037 3730 8053 -9684 2504 8027 -10023 386 9966 -8070
$$ packed form
1024E409L314k0548J3737R175k1297P944J3256j8784M380J4904k0421M74K3076
1037A4619j5861j1598J9880o158r861J8315p492j5595K0239P96j9717J6540N911
1050A0018k1191J0671J0874j8285P518J2941k1420K349K1021j7088n678J9511
1062A1241j1958j0082K0226o434j2180J6654o395j5040K1952K205k3839J1670
1074a980J0531j7167R322R375k1158O345J7402j8555j450J9444j4477p059J9056
1087I629r431q427J8855q876j4281K1083q97j9887J6433N323j9992J0813R655
1100A0000j8566P302J1960j9723M352J7269j7836m577J9165j0863o718J6856j0728
1113b107r306K1820n805j8639J7767M323j7737J2188N523j8050J0409R580j8036
$$ plain form
1126 -8070 -1405 12259 -7513 -6404 13226 -1304 -7598 9250 -1756 -8931 11005 2321 -12198
1139 -12198 6880 5366 -12481 3062 8394 -9222 336 5804 -10989 1568 12553 -10383 -7272
1152 -7272 11220 -3719 -5983 10477 -3470 -8932 10439 1047 -9255 9076 3242 -11748 6532
1165 6532 8047 -9673 3464 6981 -9761 2942 10321 -10484 -3085 12001 -6853 -6699 10215
1178 10215 -3253 -7265 8450 -3153 -8595 10424 455 -12514 6410 4943 -9802 4392 5191
1191 5191 -10690 3845 9348 -10319 -571 11307 -6932 -3381 11672 -4700 -6068 9788 -1657
1204 -1657 -5824 10043 -3077 -10465 10605 4656 -11631 4090 4551 -9511 4537 6101 -11586
1217 -11586 824 9246 -10216 -2952 10962 -6148 -5496 8293 -5029 -4318 11103 -3796 -9771
$$ packed form
1126h070O665J3664j9772J109J9630j4530o294J6848j1006p175J9936q684j4519
1139a2198J9078j514j7847J5543N332j7616R558N468j6793J2557J0985k2936L111
1152g272J8492j4939k264J6460j3947n462J9371r392j0302J8331n834j4990J8280
1165F532J515j7720J3137L517j6742J2703P379k0805P399J5086j8854J54J6914
1178A0215j3468m012J5715j1603n442J9019r969j2969J8924j467j4745J4194P99
1191E191j5881J4535N503j9667R748J1878j8239L551J5053j6372j368J5856j1445
1204a657m167J5867j3120p388K1070n949j6287J5721M61j4062J4048J564j7687
1217a1586J2410Q422j9462P264J3914j7110O52J3789j3322P11J5421j4899n975
$$ plain form
1230 -9771 10588 2408 -10008 7786 4100 -10697 4908 6819 -8220 3647 6362 -11066 1615
1243 1615 12456 -7647 -5286 8450 -4961 -3185 10132 -6212 -8155 10784 -1341 -10520 8140
1256 8140 2706 -10590 4682 3973 -9243 4812 5439 -10765 2413 9362 -8765 -1815 9881
1269 9881 -5856 -3026 10319 -4993 -4763 10791 -2929 -8093 10737 1542 -10709 5811 3858
1282 3858 -7814 5281 2744 -10956 5056 8302 -11067 -1017 9043 -7795 -2778 8961 -6132
1295 -6132 -4390 9145 -4739 -6020 11051 -1459 -10125 8340 3275 -7490 6373 2330 -9127
1308 -9127 6866 6462 -10526 3017 9087 -9703 -1328 10068 -5483 -3355 7619 -6389 -3662
1321 -3662 11004 -4517 -8982 8752 220 -9153 6521 1560 -9447 5899 3445 -10286 4619
$$ packed form
1230i771K0359q180j2416J7794l686j4797J5605J911j5039J1867K715j7428J2681
1243A615J0841k0103K361J3736j3411J776J3317j6344j943J8939j2125r179J8660
1256H140n434j3296J5272p09j3216J4055O27j6204J3178O949j8127O950J1696
1269I881j5737K830J3345j5312K30J5554j3720n164J8830r195j2251J6520j953
1282C858j1672J3095k537j3700J6012L246j9369J0050J0060j6838N017J1739j5093
1295f132J742J3535j3884j281J7071j2510q666J8465n065j0765J3863m043j1457
1308i127J5993m04j6988J3543O070j8790Q375J1396j5551K128J0974j4008K727
1321c662J4666j5521m465J7734q532r373J5674m961j1007J5346k454j3731J4905
$$ plain form
1334 4619 7140 -10839 14 9912 -6536 -1649 8232 -6242 -1898 10799 -4437 -6260 9480
1347 9480 -1342 -7171 8806 1059 -8795 6451 2680 -8943 5636 4705 -10941 2286 8292
1360 8292 -8115 -1332 6654 -7077 -1145 8658 -6948 -4821 9999 -3613 -7246 9144 154
1373 154 -7904 6602 1423 -7488 7363 3928 -10091 3908 6840 -7737 1637 7209 -7916 -275
1387 -275 8617 -6407 -2718 8838 -5669 -5452 10244 -2246 -8758 6485 275 -7392 6597 738
1401 738 -10165 5401 5660 -9143 2153 6076 -8081 1125 7734 -7586 -889 9686 -6185
1414 -6185 -4308 10334 -2195 -5726 7781 -858 -6004 8481 236 -8931 6557 3877 -9262
1427 -9262 4238 5017 -8932 912 6314 -7142 76 6795 -8914 -2694 10560 -4046 -6550 7283
$$ packed form
1334D619K521j7979J0853R898j6448M887R881j4474M344J2697j5236j823J5740
1347I480j0822n829J5977p747r854J5246l771j1623J4579r31j5646J3227O006
1360H292j6407O783P986j3731N932R803j5606K127J4820j3612l633J6390q990
1373A54q058J4506n179q911J4851l435j4019J3999K932j4577R374N572j5125P641
1387b75Q892j5024L689J1556j4507K17J5696j2490o512J5243o210p667J3989n859
1401G38j0903J5566K59j4803J1296L923j4157R206O609j5320O697J0575j5871
1414f185J877J4642j2529l531J3507q639n146J4485q245r167J5488k680j3139
1427i262J3500P79j3949R844N402j3456P218O719j5709O220J3254j4606k504J3833
$$ plain form
1441 7283 -2085 -5077 7733 -964 -7001 7545 1408 -9022 6543 5353 -8884 2432 6284
1454 6284 -6494 1935 6423 -7921 -790 9378 -5426 -4142 8252 -3342 -5325 7446 -1707
1467 -1707 -6231 6878 -956 -8556 7362 2603 -10073 3002 5015 -7121 2157 5107 -7943
1480 -7943 1359 7895 -6995 -2006 9146 -4161 -4154 8233 -2254 -4683 7898 -1803 -6759 8619
1494 8619 1656 -9372 4556 4424 -7245 2519 3870 -7759 2174 5667 -8154 126 7802 -7257
1508 -7257 -4269 8645 -3275 -4719 6299 -3420 -4889 8853 -334 -8724 6105 3321 -7492
1521 -7492 4132 4412 -6901 2922 4765 -7108 2423 7260 -7745 -1737 8859 -3768 -3947 6521
1535 6521 -3602 -4731 7521 -1633 -6631 6176 298 -7995 5026 3446 -7606 2435 3188 -7362
$$ packed form
1441G283r368k992J2810q697o037J4546o137j0430J5565j190j4237J1316L852
1454F284j2778Q429M488j4344P131J0168j4804J284J2394j1594j983J2771r153
1467a707m524J3109p834p600J5918m759j2676J3075K013j2136R278K950j3050
1480g943R302O536j4890M989J1152j3307PJ2387j0487k429J2581r701m956J5378
1494H619o963j1028J3928j32j1669R764J351j1629R933L493j3821Q280P676j5059
1508g257K988J2914j1920j444J1018r719j469J3742r187q390J4829k784j0813
1521g492J1624K80j1313R823J843j1873R531M837j5005O008J0596j2627j79J0468
1535F521j0123j129J2252r154m998J2807n878q293J3021j580j1052J0041P53j0550
$$ plain form
1549 -7362 3428 5924 -8128 -702 8209 -4813 -2396 7286 -3711 -2880 7489 -2676 -4959 7930
1563 7930 -774 -6888 6697 2427 -7507 3902 2875 -6823 3786 4375 -8918 931 6774 -6412
1577 -6412 -2117 6559 -4770 -2937 6414 -3762 -3486 7392 -3220 -6480 7609 832 -7445 4530
1591 4530 2561 -6039 4600 3569 -7669 3054 6167 -6508 673 6967 -5604 -1846 6706 -3397
1605 -3397 -2045 6261 -4423 -5179 8108 -541 -7433 4636 948 -6465 4206 2168 -7169 3176
1619 3176 3918 -7395 2088 6617 -6421 -1201 6294 -3968 -1008 6662 -4665 -3632 8220 -1253
1633 -1253 -5743 6421 641 -5877 4883 1560 -5871 4277 2456 -7484 3495 5592 -7392 -812
$$ packed form
1549g362J0790K496j4052P426Q911j3022K417R682j0997Q31J0369j0165k283J2889
1563G930q704o114J3585m270r934J1409j027r698J0609N89j3293R849N843j3186
1577f412M295Q676j1329J833R351j0176K76J0878j0612l260J4089o777q277J1975
1591D530j969q600J0639j031j1238J0723L113j2675P181O294j2571L758Q552j0103
1605c397J352Q306j0684p56J3287q649o892J2069l688p413J0671k038r337J0345
1619C176P42j1313R483M529j3038N220P495j0262K960P670j1327J033J1852r473
1633a253m490J2164n780o518J0760l323p431J0148j821r940J0979K097j2984O580
$$ [...]
8191A20
##END NTUPLES=NMR FID
##END=
