##TITLE=1H_Pr Am-3-m
 CDCl3, 8 sc, 
 29.10.2020
##JCAMPDX= 6.0         $$ Bruker NMR JCAMP-DX V2.0
##DATA TYPE= NMR FID
##DATA CLASS= NTUPLES
##ORIGIN= UXNMR, Bruker Analytische Messtechnik GmbH
##OWNER= root
$$ XWIN-NMR		Version 3.5
$$ Thu Oct 29 12:35:44 2020 Russian Standard Time (UT+4h)  she@DPX200
##.OBSERVE FREQUENCY= 200.1315066352
##.OBSERVE NUCLEUS= ^1H
##.DELAY= (6, 6)
##.ACQUISITION MODE= SIMULTANEOUS
##.ACQUISITION SCHEME= undefined
##.AVERAGES= 8
##.DIGITISER RES= 18
##SPECTROMETER/DATA SYSTEM= spect
##.PULSE SEQUENCE= zg30
##.SOLVENT NAME= CDCl3
##.SHIFT REFERENCE= (INTERNAL, CDCl3, 0, 15.7039)
##AUDIT TRAIL= $$ (NUMBER, WHEN, WHO, WHERE, WHAT)
$$ ##TITLE= Audit trail, XWIN-NMR		Version 3.5
$$ ##JCAMPDX= 5.01
$$ ##ORIGIN= Bruker BioSpin GmbH
$$ ##OWNER= she
$$ F:/spectra/data/she/nmr/H-F/1/audita.txt
$$ ##AUDIT TRAIL=  $$ (NUMBER, WHEN, WHO, WHERE, WHAT)
(   1,<2020-10-29 12:34:28.67 +0400>,<she>,<DPX200>,
      <created by zg, POWCHK disabled, PULCHK disabled
       configuration hash MD5:
       00 E9 B6 7A A2 85 ED C7 34 08 36 98 17 FE 4E 26
       data hash MD5: 16K
       42 F0 86 E2 65 9D 98 E9 2F A7 92 8A D1 26 89 C5>)
$$ ##END=
$$ 
$$ hash MD5
$$ 14 A6 09 9B EF 32 8C 4E 06 C0 B7 74 F0 F6 C7 AA
##$RELAX= 
##$RELAX= 
##$RELAX= 
##$RELAX= 
##$RELAX= 
##$RELAX= 
$$ Bruker specific parameters
$$ --------------------------
##$DU= <F:/spectra>
##$EXPNO= 1
##$NAME= <H-F>
##$PROCNO= 1
##$TYPE= <nmr>
##$USER= <she>
##$AMP= (0..31)
100 100 100 100 100 100 100 100 100 100 100 100 100 100 100 100 100 100 
100 100 100 100 100 100 100 100 100 100 100 100 100 100 
##$AQSEQ= 0
##$AQ_mod= 1
##$AUNM= <au_zg>
##$AUTOPOS= <>
##$BF1= 200.13
##$BF2= 200.13
##$BF3= 200.13
##$BF4= 200.13
##$BF5= 200.13
##$BF6= 200.13
##$BF7= 200.13
##$BF8= 200.13
##$BYTORDA= 1
##$CFDGTYP= 0
##$CFRGTYP= 5
##$CHEMSTR= <none>
##$CNST= (0..31)
1 1 145 1 1 1 1 1 1 1 1 1 1 1 1 1 1 1 1 1 1 1 1 1 1 1 1 1 1 1 1 1 
##$CPDPRG= <>
##$CPDPRG1= <>
##$CPDPRG2= <>
##$CPDPRG3= <>
##$CPDPRG4= <mlev>
##$CPDPRG5= <mlev>
##$CPDPRG6= <mlev>
##$CPDPRG7= <mlev>
##$CPDPRG8= <mlev>
##$CPDPRGB= <>
##$CPDPRGT= <>
##$D= (0..31)
0 1.2 0 0 0 0 0 0 0 0.06 0 0.03 0 0 0 0 0.0002 0 0 0 0 0 0 0 0 0 0 0 0 
0 0 0 
##$DATE= 1603960468
##$DBL= (0..7)
120 120 120 120 120 120 120 120 
##$DBP= (0..7)
150 150 150 150 150 150 150 150 
##$DBP07= 0
##$DBPNAM0= <>
##$DBPNAM1= <>
##$DBPNAM2= <>
##$DBPNAM3= <>
##$DBPNAM4= <>
##$DBPNAM5= <>
##$DBPNAM6= <>
##$DBPNAM7= <>
##$DBPOAL= (0..7)
0.5 0.5 0.5 0.5 0.5 0.5 0.5 0.5 
##$DBPOFFS= (0..7)
0 0 0 0 0 0 0 0 
##$DE= 6
##$DECBNUC= <off>
##$DECIM= 32
##$DECNUC= <off>
##$DECSTAT= 4
##$DIGMOD= 1
##$DIGTYP= 9
##$DL= (0..7)
0 120 120 120 120 120 120 120 
##$DP= (0..7)
150 150 150 150 150 150 150 150 
##$DP07= 0
##$DPNAME0= <>
##$DPNAME1= <>
##$DPNAME2= <>
##$DPNAME3= <>
##$DPNAME4= <>
##$DPNAME5= <>
##$DPNAME6= <>
##$DPNAME7= <>
##$DPOAL= (0..7)
0.5 0.5 0.5 0.5 0.5 0.5 0.5 0.5 
##$DPOFFS= (0..7)
0 0 0 0 0 0 0 0 
##$DQDMODE= 0
##$DR= 18
##$DS= 0
##$DSLIST= <SSSSSSSSSSSSSSS>
$$ [...]
##$SUBNAM2= <"">
##$SUBNAM3= <"">
##$SUBNAM4= <"">
##$SUBNAM5= <"">
##$SUBNAM6= <"">
##$SUBNAM7= <"">
##$SUBNAM8= <"">
##$SUBNAM9= <"">
##$SW= 16.880792210976
##$SWIBOX= (0..15)
0 0 2 0 0 0 0 0 0 0 0 0 0 0 0 0 
##$SW_h= 3378.37837837838
##$TD= 16384
##$TD0= 1
##$TE= 0
##$TE2= 300
##$TE3= 300
##$TEG= 300
##$TL= (0..7)
0 120 120 120 120 120 120 120 
##$TP= (0..7)
150 150 150 150 150 150 150 150 
##$TP07= 0
##$TPNAME0= <>
##$TPNAME1= <>
##$TPNAME2= <>
##$TPNAME3= <>
##$TPNAME4= <>
##$TPNAME5= <>
##$TPNAME6= <>
##$TPNAME7= <>
##$TPOAL= (0..7)
0.5 0.5 0.5 0.5 0.5 0.5 0.5 0.5 
##$TPOFFS= (0..7)
0 0 0 0 0 0 0 0 
##$TUNHIN= 0
##$TUNHOUT= 0
##$TUNXOUT= 0
##$USERA1= <user>
##$USERA2= <user>
##$USERA3= <user>
##$USERA4= <user>
##$USERA5= <user>
##$V9= 5
##$VALIST= <valist>
##$VCLIST= <CCCCCCCCCCCCCCC>
##$VD= 0
##$VDLIST= <DDDDDDDDDDDDDDD>
##$VPLIST= <PPPPPPPPPPPPPPP>
##$VTLIST= <TTTTTTTTTTTTTTT>
##$WBST= 1024
##$WBSW= 4
##$XGAIN= (0..3)
0 0 0 0 
##$XL= 0
##$YL= 0
##$YMAX_a= 161971
##$YMIN_a= -186880
##$ZGOPTNS= <>
##$ZL1= 120
##$ZL2= 120
##$ZL3= 120
##$ZL4= 120
##$ABSF1= 10
##$ABSF2= 0
##$ABSG= 5
##$ABSL= 3
##$ALPHA= 0
##$AQORDER= 0
##$ASSFAC= 0
##$ASSFACI= 0
##$ASSFACX= 0
##$ASSWID= 0
##$AUNMP= <proc_1d>
##$AZFE= 0.1
##$AZFW= 0.1
##$BCFW= 1
##$BC_mod= 2
##$BYTORDP= 1
##$COROFFS= 0
##$CY= 11.3945322036743
##$DATMOD= 1
##$DC= 2
##$DFILT= <>
##$DTYPP= 0
##$F1P= 15.9154993809931
##$F2P= -4.1035820241983
##$FCOR= 0.5
##$FTSIZE= 0
##$FT_mod= 4
##$GAMMA= 1
##$GB= 0.15
##$INTBC= 1
##$INTSCL= 1
##$ISEN= 128
##$LB= 0.24
##$LEV0= 0
##$LPBIN= 0
##$MAXI= 10000
##$MC2= 0
##$MEAN= 0
##$ME_mod= 0
##$MI= 1.114404
##$NCOEF= 0
##$NC_proc= 0
##$NLEV= 6
##$NOISF1= 3.799351
##$NOISF2= 2.8
##$NSP= 1
##$NTH_PI= 0
##$NZP= 0
##$OFFSET= 15.70392
##$PC= 1
##$PHC0= -10688.79
##$PHC1= 11.20088
##$PH_mod= 1
##$PKNL= yes
##$PPARMOD= 0
##$PSCAL= 0
##$PSIGN= 0
##$REVERSE= no
##$SF= 200.130013532006
##$SI= 16384
##$SIGF1= 3
##$SIGF2= 2
##$SINO= 400
##$SIOLD= 16384
##$SREGLST= <1H.CDCl3>
##$SSB= 0
##$STSI= 0
##$STSR= 0
##$SW_p= 3612.71676300578
##$SYMM= 0
##$S_DEV= 0
##$TDeff= 0
##$TDoff= 0
##$TI= <>
##$TILT= no
##$TM1= 0
##$TM2= 0
##$TOPLEV= 0
##$USERP1= <user>
##$USERP2= <user>
##$USERP3= <user>
##$USERP4= <user>
##$USERP5= <user>
##$WDW= 1
##$XDIM= 8192
##$YMAX_p= 0
##$YMIN_p= 0
$$ End of Bruker specific parameters
$$ ---------------------------------
##NTUPLES= NMR FID
##VAR_NAME=  TIME,          FID/REAL,        FID/IMAG
##SYMBOL=    X,             R,               I
##VAR_TYPE=  INDEPENDENT,   DEPENDENT,       DEPENDENT
##VAR_FORM=  AFFN,          ASDF,            ASDF
##VAR_DIM=   8192,          8192,            8192
##UNITS=     SECONDS,       ARBITRARY UNITS, ARBITRARY UNITS
##FACTOR=    0.000296,      1,               1
##FIRST=     0,             0,               0
##LAST=      2.424536,      0,               0
##MIN=       0,             -186880,         0
##MAX=       2.424536,      161971,          0
$$ Real data points
##PAGE= N=1
##DATA TABLE= (X++(R..R)), XYDATA
$$ [...]
1907a37Q90q46J13N86p56L05k8P6j66N7l43M22l18Q6J01o11Q63p45J16N7m19N20
1929a77P0l49L06j11n72O41m33L46N4l94M53m16M18j07j17LM68m39q5N81m34L69
1951G5o56P29K03p92L44L15J13n72L85j20P03q61O20k36O6K77n96R26p33M89m70
1972B09J7Q8j74K72m77P45m55J50j92J28K23k53j97K24K50p90M45k71J71j43k99
1993c29K07J60J38o57M97j81q3J50n46P90o65M20m74J86j57K11j81j7N71n76M14
2014a22p00N20q8m2J18J24k17j76K32j8M40l46j4M55n16M21n32Q38n82K15R8K22
2036C30J40j29l3l99Q82q21L92j29K28R3m02L11k04L02j90O3o2K70L6p48P18o31
2058A7M31j93l44M87j48k60J55J18o22M48o18Q70n45j78N19j25J9k87k3k39N31
$$ y = [-137, 753, -93, 20, 606, -150, 155, 127, 203, 37, 94, -249, 173, -145, -59, 42, -569, 294, -451, -335, -278, -697, -177, -107, -456, -150, -261, -833, -192, -625, -279, -225, -619, -166, -582, -164, -271, -388, -385, 83, -356, -441, 140, -294, 75, -581, 148, 351, -441, -97, 218, 331, -241, 144, 24, 727, -134, 486, 250, 316, 593, -3, 923, 190, 679, 209, 226, 314, 140, 412, -65, 680, 225, 375, 183, 311, 534, 281, 84, 308, 558, -232, 213, -58, 113, -30, -329, -122, 38, 176, -481, 16, -165, -248, -98, -644, 146, -519, -99, -573, -387, -544, -333, -514, -531, 40, -536, -122, -822, -302, -390, -432, -314, -190, -407, -583, -351, -369, 71, -275, -289, 166, -350, 71, -461, 377, -205, 10, 108, 330, 470, 341, 308, -91, 791, -30, 362, 233, 461, 554, 152, 463, 259, 561, 371, 434, 372, 642, 678, -70, 648, 17, 448, 255, -89, 398, 250, -10, 145, 263, -359, 89, -529, 341, -204, -382, 137, 12, 31, -256, -279, -518, 13]
2079A3m45O9q3K04L47r64Q14l84J89j20n6K03n8r2j02M12n82L90J12K4L97q21
2101e33N23j42J02j94M11j97K82k47l60Q70p95R39n39j08O93q17O00j13q0K43
2121E38J23r21J030n27L1J33o70Q09n20P4j1J91l42M56k01K8L67j064J048p06
2141a34k39M34m66Q08n41l12M68K05p50Q16p39L69L56j320J006l09MM41p99K19
2161d83M16m32J6L09m59P51o34K31M71j014R89n94J84P4J41l25P41o88L58J33
2181A85r26J595o70k71M47l41L00j65j42P19l70o97R08n88N68j01n28P87l96l09
2201EN32k31p8M29n74K93o4p18J291r46M59K01p19M44l74q9L18l66n7R12j469
2222h01N36L18n56R56r89L04J64m46l5O89r62R88m51p64J685j423O55Lm73R28
$$ y = [13, -432, -363, -446, -242, 105, -859, -45, -429, -240, -360, -416, -213, -271, -363, -465, -53, -635, -245, -133, -109, 288, -533, -10, -152, -50, -244, 167, -30, 252, 5, -355, 515, -280, 659, 120, 12, 705, -112, 488, 375, 295, 538, 661, -260, 770, 243, 274, 407, -263, 546, 26, 100, 89, 280, -62, 394, 193, 221, 588, -476, 572, -134, -373, 61, -405, 403, -138, -450, 18, 223, -527, 289, -450, -81, 275, -1045, -39, -348, -344, 97, -702, -483, -67, -499, -483, -174, -633, 118, -516, -285, 186, -828, 161, -433, -249, -175, -34, -359, 382, -306, 52, 185, -741, 854, 184, -87, 360, 19, 319, 154, 12, 731, 361, -336, 572, -16, 552, 451, -77, 710, 314, 5, 537, 306, 228, 657, 83, 376, 312, -406, 885, -61, 398, 599, -120, 324, -50, -139, 179, -187, -244, 668, -801, -265, 53, -503, 453, -536, -232, -68, -514, -549, 140, -822, 166, -285, -1049, 636, -787, -132, -129, -602, 326]
2242C26q36nO00k15j7J12q28J135l66k61Q28r41Q16n43R9N82m74r9M62j31j42
2263A02M84j092J250m41l77P47o80K79J96m84K15M71n30M60p84J55J065j191O04
2282D49j13j35K65l76j06L89o54K86L50q21J008q48N3N19p98L85N6j07M05m95
2302b88j59Q36r18R8L60p98J012p11Q3J48k91K28L21m57L29J64o83J122o76J1
2322b69L66o40J020m16m79N21o8k23L81l37M14j2p69R68n47L14N74r46L77K27
2342D56n35N08Kl73O49j106R67j00o29P82n33K59M4n17M25M24r90N71k23l55Q87
2363F13q79M04J11n11M32m45K61K28n08l72P49o41N73j31m73O55o56K64M15m23
2383c34j6O9l21N60j86k22N82q04O37k22l85N73l40K27J12j6R7L79q53N55o9j64
$$ y = [326, -510, -515, 85, -130, -147, -35, -863, 272, -94, -355, 473, -468, 348, -195, -96, 486, 12, -87, 375, 244, 102, 586, -506, 744, 303, -74, 673, -7, 272, 468, -16, 199, 670, 140, 600, -184, -29, 1036, -155, 449, 336, 201, 466, 90, -16, 373, -281, 5, 355, -466, 542, -306, -253, 266, -532, -147, -91, -198, 207, -288, -447, 389, -529, -431, -71, -869, 143, -568, -485, -337, -628, -400, -79, -536, -207, -43, -726, 396, -280, -269, 97, -543, 477, 61, -418, 103, 35, -188, 193, -144, 270, 258, -511, 457, -90, 224, 798, -148, 229, 456, -79, 429, 431, 58, 707, -399, 568, 468, -161, 621, 88, 347, 391, -126, 299, 723, -267, 304, 81, -274, 613, -266, 138, 249, -262, 170, -275, -14, 214, -294, -666, 83, -558, 15, -116, -589, 66, -590, -326, 89, -334, -350, -281, -602, -42, -228, -450, 132, -672, -35, -257, -642, -69, -409, -182, -70, -86, 11, 390, -463, 92, 23, -141]
2405a41M64m10L27L1m55J70J20j06K49j68j22M69o82Q69l46k74N98m98J93M8j98
2426A38J39J7k43Q3j93K54M13r59Q66n73J08L39l62m6Q7pj76M38p68N27j68m5
2448a31M67p47L46l03l0K50j51k31M72m57K74M14p29N41m84K56p3P3n7J4p6J07
2470b55M04o50M36j99Q3L71m06M51k87P7O2K4J17q6p1J85Q8m51O07m99J63J76
2492C40p3J76k61K45k75qL8K22n46K75M12l26K43k88J64k67K75k21k1K20k53K30
2514C01m41K73Q9j46j57O9O3l48K11l00K72J12r1j20m6K3l46K49J27K66o78L56
2536b62L76o41K37k0K85m63M96j65J05Qj67K01j87L72l57M75m45ML21m63M72j32
2558E0L50l84N29n30M13l16QK18j30K28k82O9J4J59j10j18J62n6N0m10M77l69
$$ y = [-141, 323, -87, 240, 271, -184, -14, 106, 0, 249, 81, -41, 428, -254, 615, 269, -5, 593, 95, 288, 336, 138, 277, 294, 51, 134, -59, 195, 608, -351, 515, -58, 50, 389, 27, -19, 68, 61, -115, 323, -445, 82, -86, -131, 336, -411, -65, -368, -398, -148, -299, -530, -58, -515, -241, 173, -556, -15, -499, -243, -316, -243, -300, -286, -362, -255, 149, -501, -65, -264, -181, 190, -216, 235, -52, 25, 87, 111, 228, 142, 71, 256, 344, -107, 500, 1, 164, 340, 267, 443, 182, 427, 152, 144, 182, 404, -142, 133, 545, 219, 462, 174, 338, 71, 346, 125, 104, 324, 71, 301, -140, 133, 222, 76, -81, -12, 51, -297, -86, -386, -114, -2, -93, -213, -259, -236, -582, -333, -206, 60, -618, -262, 114, -527, -290, -310, -25, -488, 8, -157, -52, -44, -211, -10, -197, 175, -182, 293, -152, -148, 173, -290, 182, 50, 400, 16, 545, 15, 428, 112, 120, 338, 208, 436, 154, 223, 237, 396, 286, 168, 330, 274, 324, -86, 391, 22]
2580B2K84jP8j97m8n0J95ql85K68j58L8j5k66M92n23J58l4k23J86K0l7o7J79r3
2605a85Q7j66R7j00j56L23q5J00l28K57J6O1j49o4K09k33L32l79J84j68K98J59
2627A10k48K25O1j23j91M64k94L34l51R0L68m24K24R6L7j69J83k86L56j87k75
2648@M10p0o8O4k50K30k88K04j62l5n2M17m70L39k09n2R3m04N73l44jP7k31J78
2672e1J64l07j21O01n79M28n53J47L55o59M42K4l54k5M51k82O97r24M90L37r93
2693g12Q94n70L56M1l50N3J80j07K71P4m05O86m70p5M93m03M52j75k74L31k41
2714D9J52M7m66L93J74l21O73o16L35P1m84L78j30m29M82m1n12Q22p25K45L16
2735D13n07M93l64n3L21l37J14J04l46P9J40n49P78p06M42J53p35L96J74k65J40
$$ y = [22, 306, 305, 383, 186, 138, 88, 283, 275, -110, 158, 0, 38, 23, -243, 249, -274, -116, -150, -373, -187, -167, -204, -271, -92, -185, -98, -264, -167, -267, -423, -100, -185, -85, -413, -156, -140, -79, -228, -292, -83, -316, 16, -363, -179, -347, -49, 110, -138, 87, 148, 25, -166, 298, 4, 338, -13, 77, 445, 21, 245, 341, 378, 209, 392, 106, 462, 275, 0, 410, 340, 272, 336, 86, 316, 28, 232, 70, 35, -17, 400, -70, 269, 60, 8, 101, -303, 270, -74, -75, 2, -229, -51, 113, -194, -315, 286, -293, 135, -418, -271, 84, -575, -133, -109, -463, -488, -37, -319, 378, -546, -56, 281, -712, 182, -388, -32, 9, -341, -288, -108, -215, 56, 130, -275, 411, -59, -134, 359, -44, 408, 233, -41, 290, 49, 201, 248, -218, 175, 349, 28, 701, 85, 420, 491, 7, 385, 255, -174, 308, 267, -245, 577, -148, 97, 413, -94, 399, 35, -18, 303, -34, 80, 184, -162, -83, 57, -492, 286, -420, 22, 175, -560, -164, 10, -255, -115]
2756a15j20JJ70n25N15j06p0K96n93N54j49m3M8K6k39O14j91m68N37l22K71j23
2778c2m3K80k70K92k91LJ23L38n77M26j15l9M90o21K99K72m28L97l72j76P79m04
2800C31j83L88o57M96J5o03O60m90Q3K09k82J79J2l42M05k93j26M83p04O39j06
2821A14l33J31j96J98L20n94Q2M94q94Q79m40k43N72o25K77L9r7R7K03l12L94
2842F6m75K53K04n96O43k60j58N56j82k64J65j14J7L63l52M61l06j40N24p16O89
2863C78m93L91k08q5N1M55l61O4Pl88P79m57j17K89j51j25K55l46K48P1k25M35
2885D67m62J34K60o59L93m72J41K86k27N2K93o85L45K27o48P95o82L55m7k62L53
2906d3l43J4M86n28J6N01n02L66jn94Q55m47o6L81k69L11M0k62%L32k91M95r24
$$ y = [-115, -235, -234, -64, -589, -74, -180, -250, 46, -547, 7, -142, -185, -137, -111, -350, 264, 73, -395, 142, -180, 91, -32, -75, 205, -65, 227, -64, -61, 62, 400, -177, 249, 134, 95, 585, -36, 263, 535, 107, 504, 132, -44, 735, 331, 148, 536, -121, 375, 390, -213, 447, -43, 40, 249, -33, 146, 158, -184, 221, -72, -198, 285, -419, 220, 114, -219, -88, -284, -86, 234, -360, -278, 216, -678, 201, -239, -482, 90, -535, -258, -219, -316, -219, -16, -328, 66, -409, -156, 48, -548, 95, -165, -323, 233, 51, -213, -48, -162, -145, 218, -134, 327, 21, -119, 405, -311, 378, -115, 276, 68, -17, 34, 489, 128, 192, 199, -189, 590, 133, 16, 305, 154, 29, 284, -62, 186, 257, 32, 467, 5, 139, 399, -260, 133, -339, -198, 88, -139, -87, 206, -479, -134, 93, -555, 240, -442, -87, -134, -396, -43, -386, -372, 114, -414, -398, 103, -399, -33, -34, -628, 227, -220, -286, 95, -174, 137, 177, -85, -85, 247, -44, 451, -473]
2929d73M56K30l31L95k36L9L6m8j09J76j64K10j24j29N91m79o2J74l9l9PK79j73
2952A87l2j24L34n37N70j83k42L42m08N91j07l25k97L81j78K72k98j57N50n32
2972a93K33j96P8O1l98K21j07M63l68J35l06N13k81l08K84j71J39M9q0p9K60k65
2994c16J08k0K30L7l40O11m27J72l5k94L02kj33N6L56l90N25m76K78o2l7K51j07
3017B87N7l21J01k45L92nj51K54l22K24l68r0M88m21N48l53K8j25L00l77N37l02
3039A36j38N1j6L84o90K03r7J58Jj58o3J62J82n33K45j26J28J4l87M33k23K60
3061g4k31K6P9k17J17J66q4o1J02q8L54j11j6J88k77K26j80K51k55J98j91J82
3083A04J82l98N96l31k43J95O4l5J38p0j18O0p2L40j72k6l07K37j39M1L06l07
$$ y = [-473, -17, 213, -118, 277, 41, 80, 116, 68, -41, 135, -29, 181, 57, -72, 519, 40, -22, 152, 113, 74, 81, 360, 187, 155, 31, 365, -172, 398, 215, -27, 315, -93, 498, 391, 66, -231, 150, -28, 244, -54, -211, 339, -193, 40, -156, -78, -17, -415, -194, -301, 162, -206, -71, -377, 136, -145, -453, -169, -340, -201, -152, -232, -311, -51, -316, -208, -228, 2, 39, -301, 310, -117, 55, 20, -274, 28, 26, -107, -51, 305, -85, 440, -36, 242, 180, 143, 394, 287, 344, 23, 124, -121, 271, 266, 115, 369, 47, 271, -97, -187, 301, -120, 428, 75, 103, -22, 278, -99, 438, 136, -2, 49, 33, 417, -273, -70, -167, -9, -8, -166, -229, -67, 115, -418, -173, -299, -171, -157, -544, -111, -334, -74, -305, -279, -200, -417, -300, -134, -218, -279, -177, -265, 89, -22, -38, 150, -127, 99, -81, 170, -85, 113, -78, 104, 286, -112, 484, 153, -90, 105, 169, 134, 272, 202, 84, 144, 72, 412, 240, 214, -93, 144, 5, 46, 352, 45]
3105D5K44j54J74n69M60n2p8N6l68L85j55K16l60J69J69p6j17p0j26j8R9qQ2J
3129e1j59L78l40q6j29M4N4J65P4k33J90n2O6N4j04J3r4J21K6K60l53M08l98N
3153a41L0L64m43K72J53k28K82l80K43m2P9Mm8j64J4L17k59K53k32N5R9P5k3l04
3177b4J39q4L03n64L54j47K66j25k46K93l59M03l99J29J82k95K12l14L56k05K
3198a23k6J18P6o6J97m97M17k72P7o6L2P3j0p8l2J56k34J79p9j04N77p15K95J06
3222Ao1j15J86k82M40k33j8J37l61L29R5o5K64n23L62K10j58QOk58K82Pl42M63
3246C74n06K77j52K17J40j35m4J9j33k3K06m54N58k78j33K83j14jp5j72L21r1
3268H4j50j2o1j9Q5l99K75J2k10M66l31K3K35m17K28M01o93N53j71j49M12k51
$$ y = [45, 289, 135, 309, -260, 200, 148, 70, 126, -242, 143, -12, 204, -156, 13, 182, 106, -11, -81, -207, -225, -126, -134, -52, -51, -210, 168, -172, -258, -387, -343, -289, -124, -50, -283, -93, -145, -79, -25, -129, -116, -210, -89, -63, 197, -156, 252, -146, -141, -111, 253, -190, 82, 235, 7, 289, -91, 152, 110, 189, 193, 145, -19, -5, 312, 53, 306, 74, 129, 228, 303, 280, -24, 115, 31, 334, -230, 124, -23, 243, 118, -128, 165, -194, 209, -190, -61, 121, -174, 38, -276, 80, -125, -123, -149, -31, 45, -21, 176, -321, 96, -176, -99, -165, -133, -60, -70, -148, -180, -24, -258, -79, -158, -262, 315, -400, -105, 1, -60, -175, 11, -271, 169, -64, -82, 55, -306, 23, 118, 53, 317, -206, 156, 366, 208, 216, 222, -36, 246, 253, -89, 374, -132, 145, -7, 210, 350, 215, 171, 190, 57, 34, 240, -214, 344, 66, -67, 216, 102, 101, 26, -146, 175, 84, -66, -78, -139, -158, -73, -472, -197, -185, -395, 71, -260, -237, -2, -419, -191, 210, -483, 70, -101, -250, 162, -89]
3290h9J75J3j33j43q7J97N09j005O72k1j93J28j94l1L28k43j3K70l72L69P4n15
3312c04P51k52k12J91o0K46k17J83J79l24p1J00p2J86Nn73P72o89M27j08j31K27
3334B54k3j90J74n3l17M22n32K92k82j06M89j5J29j54k85j57L94o4m9M3l43L22
3356e1l39K65K3m47N76j45k46L73p7j3K87o14N36k86j48L29n5L0j7j83K42M2j66
3379h4K58l97J90M95o59M38L1l72K51k61J66J17j19J3J63k54L90j84qL06o30O03
3401D53j87k96K00P5j73L51k79j25N5l41N93l00n1L09n13K66N2l89L88l33O9L30
3423A54k85J42J61o27M96Q9m85L19o6Pj3l43O15m45k16M79j63j54M02m16L54l36
3445c31J76L06k49M5J61k35q9J49L5K22k06J09Q1k70L28j21KJ21K00k99R5k25
$$ y = [-89, 86, 99, -34, -177, -264, -67, 442, -563, 109, 88, -105, 23, -171, -202, 126, -117, -130, 140, -232, 137, 211, -304, 447, 195, -17, 174, 114, 360, 143, 326, 505, 181, 110, 210, 138, 324, 329, -244, 528, -161, 266, 158, 27, 254, 231, 41, 215, 162, -155, 267, -265, 27, -255, -361, 128, 113, 242, 88, -197, -354, 40, -24, -73, -30, -373, -51, -390, -125, -102, -549, 27, -118, -364, 9, -68, -81, 206, -408, 128, -158, -306, 23, -32, -2, -19, -202, 40, 82, -84, 174, -223, -33, 462, -197, 241, 272, -100, 151, -110, 56, 173, 54, 67, 230, -24, 366, 182, 174, 480, -150, 453, 266, -30, 170, 245, 72, 423, 144, 19, 74, -267, 326, 26, -25, 284, -229, 37, 89, -300, 88, -245, -176, 154, -131, 11, 172, -455, 41, 130, -355, -36, -102, -95, -108, -451, 164, -281, -497, -18, -181, -335, 67, -349, 5, -331, -155, 151, -98, -53, 108, -127, -216, -67, -32, 190, -16, 93, 174, -96, 232, 111, 113, 234, 434, 135, 230, 5]
3467Ej46M47l36M04p11J76M93l68K75J46m31L29j61p7K76m02P9lJ72L6k79K01
3489A25m5j96l07P24n44L45K1l22M8j64J60N5l27J56P5j59K39L7j83J94j53K73
3511E2l11K7pj76J39J96j8R7Q0m19K35R4j25J51j52K82m2l77K02K36k67K79j25
3534E1j0J73l12J18K49j36KRM1J54k27j64K80k86L02J12j85J71n15L80n8l3J51
3557B67l14M3M8l5p0O08p46J65j21K8L33j62R6k34l4K60j40j59M0J11j6j59l72
3580e63M49Rk02K07p0k9J33l17J02K56k35K87l00P0K37m52N61l29K57j62K87k00
3602dj01J04k4K87l09M47l10m8j06R6J57j97J02J38r0j26k5K21jk60r0M15k38
3625C8M24l82J32K1l76J22J26L1j84J98j32j86L58j87J36k73K84j47j28l8K40
$$ y = [5, -141, 306, -30, 374, -337, -161, 332, -36, 239, 385, -46, 283, 122, 45, 321, -81, -2, -5, 167, 203, -76, 125, 80, -116, -423, 301, -243, 102, 123, -199, -151, -315, -155, -100, -427, -271, -196, -355, -116, -79, -262, -68, -221, 52, -259, -232, -239, -415, -276, -80, -98, -1, 79, -340, -105, -11, -136, 15, -137, 145, 103, -274, -72, 164, -103, 176, 51, 41, 214, -98, 20, 269, 133, 135, 144, 185, 339, 112, -52, 228, -58, 244, 356, 171, 342, -173, 207, 149, 116, 267, -47, -4, 44, 9, -61, 547, -199, -34, -155, -127, 206, 44, 140, -94, -128, 132, -8, -167, -127, -16, -32, -191, -563, -114, -105, -307, -100, -170, -199, -66, -383, -281, -25, -260, 27, -273, -203, 34, -418, 143, -186, 71, -91, 196, -4, -105, -1, -25, 262, -47, 400, 90, 42, -64, 32, 189, -8, 94, 232, 142, 16, -9, 212, 211, -49, -139, 276, 38, 462, 80, 212, 233, -143, -21, 105, 136, -48, 150, 18, -168, 190, 3, 139, -134, 150, 3, -125, -163, 77]
3646G7j98n7k12K60K95m81K49k33K86P8l13K25k49K67J8l26K27J14K8l78J05p5
3668b93K79j26N1p1J20p1NJ2P7P2m3Mj43K52o5n5J55l9k6M4P0r4r2M3n6M1J00
3695A51Q9R0q6j14p5J40k66J48J40j37M2R5j59J88r6j09j0k8M20l01j74J69j57
3718d0J4j57L1Q3J16p5o2l0L1K4j80K39j92J96Rm47K24K90l00L68j68k26K91l12
3742b73L38l92j7L90j79m5L3l9K92L66n16K69n3J8k36R6K60j26j55k7r4K6J07
3765D3O3j7J46j91K95M0m22M79l55O6J46l47J09K80n91M58o1P3j24l25L70o8k78
3788b11M1J05K0R9j42R1Q5k28J08j81O6N4j14J36j41n5J40J4Ok6N2l4J46j7j2
3813Bl40J72L70n37R6K10j58M5k0l2K30l49L20L8l22L77n8m33K18R4l6L05j65
$$ y = [77, -121, -178, -390, -130, 165, -316, -67, -300, -14, 64, -249, -24, -273, -6, 12, -314, -87, 27, 55, -323, -218, -293, -14, -140, -89, -160, -40, -111, -106, -94, -17, 55, 12, 16, -127, 125, 60, 5, 160, 121, 95, 139, 209, 115, 23, 66, 10, 51, 151, 240, 330, 244, 130, 55, 195, -71, 77, 217, 80, 122, 217, 58, 246, 150, 41, 31, 3, 423, 122, -52, 117, -40, -26, -183, -152, -69, 47, -28, -90, -120, -89, -65, -245, -6, -198, -2, 7, -440, -216, 74, -226, 142, -26, -252, 39, -273, 65, -327, -344, 46, -133, -178, -145, -184, 108, 474, -42, 227, 174, 192, -44, 52, 312, 186, 31, 4, -90, -64, 43, 106, 89, 235, 44, 339, 379, -43, 436, 81, 147, 293, -54, 55, 335, -256, 202, 141, 214, 90, -235, 135, 67, -211, -170, -65, -45, 54, -88, 3, 88, -140, -32, -213, -147, -93, -207, -71, -212, -267, -127, -113, -107, -133, -81, -115, 31, 14, 2, -338, -166, 204, -333, -237, -27, -185, -140, -160, -192, 38, -311, 9, 47, -275, 102, 44, -389, -171, -77, -113, 192, 27]
3836B7J22j7k38K71l32K62L0j70K73L0k69K20n5l39N10j68k45J20j05M52k71l3
3858G5J25Q4j73J43j50m5j28m0J85k82J01L07l28K31k74P3K47l44PM32n24K61
3880a7K97m97M76m44J29l3k32K79M2j13O9J70l01L84m15K38j8j16J50r8P6j24
3902i8Q2k9J20l15L9K84q8J89j76K57k25%K93o3j47L46k97j38kr2L37L6k17M01
3926D97m91J85P3k57J02J67l13K32j47PK45l25M4R3J17j87q9j54L23k62Q2J66
3948A08l65L21j13p0K81l13K6J19k24J42j71j6M46o10L81Q4m33L40l7oJ56k33
3970a87j80Q3M83l27J1o4K72j16k16K36k03K54K5j73J83J01k55K61k67K36M4l70
3992a69M62k21J73o2r5K15j95k25L02j35m0O09q36L04K22j96J50k65K44j1k73
$$ y = [27, 149, 132, -106, 165, -167, 95, 125, -45, 228, 258, -11, 209, 154, -185, 325, 157, -88, 32, -73, 379, 108, 75, 200, 284, 111, 254, 104, 59, -69, -109, 76, -206, -105, 202, -126, 105, -169, -96, 151, -193, -186, 246, -278, -17, 280, -217, 259, -185, -56, -89, -321, -42, 0, -113, -44, 126, -175, 209, -206, 32, 14, -102, 48, -50, 26, -98, -16, -45, 75, -240, -201, 83, -5, 184, 8, 265, 40, 40, 333, 270, 123, 469, 172, 34, 32, -60, 277, 313, 96, 497, 6, 191, 264, 7, 109, 276, -37, 195, 48, 55, 300, -25, 19, 112, 229, 42, -47, -201, 122, -140, -58, 108, -257, 64, -49, -119, 162, -151, -125, -6, -230, -88, -259, -275, 171, -439, -58, 26, -407, -67, -104, -110, 46, -187, -367, -284, 199, -128, -117, -181, 91, -25, -241, -5, -208, 46, 71, -102, 81, 182, -73, 188, -79, 157, 201, -169, 293, 72, 245, 183, 88, 303, 108, -117, 185, 50, 10, 619, -217, 87, 309, 113, 263, -2, 242, 231, -42]
4013d2J65m1m23M22Ml10N30o78M13N8l20L80k71P5r7p1J51j82k55N23j67K2J46
4036C2j12K4n2j92Q5K58r0P3j65o3N24m72M8P0j47J88j46J97o7k50L84p2k39L62
4060A78P0l33J53j06N35l05j86L56l34o3L65k82l4K10p1j08J41k25J84JO2P1l11
4083c2K13k33qK36j56J26L2l17L42j84j08K87k22J1k46J60R6l44L81N3l98K3K09
4106g9j9p0J27q1L0J34k61J75r2r6J65j50L47j87J86j36R4m4j17J20n7K99l69
4129h1L0n7J93M7j44k38J26L18k41L4O4N2k2j9J25j90rp6K72j46O8R7j04J88k64
4154B3P9K09j68J57Qr4k67K06j73m8j07L04k71J88j32P5J53p1K06j98k70J96j20
4177a15J22r4K7P3l68K72l6K80j44k11j77K88m5K64l37J59k20K7Q3k22L51J01
$$ y = [-42, 123, 82, -341, 81, 85, -225, 305, -373, 40, 98, -222, 158, -113, -38, -135, -206, -55, -237, -492, 31, -136, -114, 32, -80, -56, -108, -300, -215, 43, -47, 26, -139, -202, 322, -150, -102, -32, -179, 9, -137, 60, -7, -257, 127, 55, -184, 178, 248, -85, 68, -38, 497, 192, 6, 362, 28, -35, 330, 48, 14, 224, 153, 45, 186, -39, 145, 146, 208, 279, -32, 181, -52, -60, 176, 20, 146, 178, -139, 203, 19, -89, 198, -24, -13, -259, -99, -3, -347, 34, 87, -311, -288, -79, -98, -168, -41, -122, -92, 42, -219, -44, -136, -232, -67, -217, 130, -57, 129, -7, 87, 43, -74, 46, -11, 288, -81, -51, -108, 85, 132, -12, -250, -124, 194, -47, -13, 51, 103, 81, 62, 187, -3, -12, -88, 184, 38, 106, 203, 99, 287, 23, 102, 311, 143, 300, 308, 214, -53, 153, -20, -68, -175, 129, -142, 46, -86, -11, 142, 71, 277, 79, -191, 5, -115, 7, -87, -60, 13, -355, -83, -119, 161, 17, -194, -371, -83, -128, 136, -201, -42, -262, -235, -152, -374, -23, 78]
4199G8j64J59q4K06k32rk43K85K54j10j51p7J95j74K23J20r3j11l8k09K42k3p3
4222b9K25r9M5Q8j46j16J66j43L1K75l25M19l54K51k83P6K39k90r5J89j08l78
4244c62M70r9j89K63j48J29l01L56k59J5J14j9k25O1J63l5M6k6K8J64l24K26k87
4267b39J13o0J43j86P8P2K24M1p3j01k29K05oL04l04j19L94n95K70J09N8j12K47
4290B34l28L8K15j60L66o54L63j18N4K90j28K9j30LK8K19l18J16M1k44J81k93
4312a96J95J88k15K5J30p0K4K3k72K55j94K02j98j30L95r6j02L5rj53J45j05R6
4335b7j20Q4n1K1m0j52j1L46L3j70J27m9MQ5l20K54j47N7j2r1L65j38j35J37n9
4360iJ39J86l41J43j1k55L67j84k86L99R8k16J30J27k01K19k78J62j25J8Q3k73
$$ y = [78, -86, 73, -11, 195, -37, -46, -289, -4, 250, 140, -11, -88, 107, -67, 156, 276, 183, 72, 34, -175, 67, 44, -29, 196, 97, 142, 230, 84, -32, 134, -9, 22, 297, -28, 391, 37, 288, 5, 81, 320, 30, -65, 124, 16, -362, 108, 9, -180, 83, -65, 64, -237, 119, -140, -125, -11, -30, -255, -194, -31, -66, -20, -46, -18, 146, -178, 48, -239, -126, -186, -43, -229, -151, -79, 145, 186, 113, 12, -217, -12, -18, 286, -18, -137, 257, -338, -68, 41, 99, -13, 234, -94, -56, 159, -1, 365, -289, 74, -44, 10, 300, 172, 201, 71, 74, 102, 321, 3, 119, 160, -84, 97, -196, -1, 187, -28, -3, 127, 57, 81, 104, -168, 87, -107, 95, -103, -233, 162, 66, -36, -1, -10, -163, -18, -123, -27, -147, -63, -114, -93, -133, -285, -296, 50, 83, -87, 40, -9, -5, 80, -240, 14, -133, -76, -88, -179, 186, 48, -87, 50, -9, 130, 316, -25, 118, 107, -148, 219, 35, -251, 148, 246, 30, 160, 287, 86, 305, 27, 189, 64, 82, 165, -108]
4382a08J71n8K7J04O5j95K01k30j27M53m27M60m37J67QM1k24J58j81J29j1n01
4404e15O96k10J2pk51R1J53q0R1l55K89%l92N75J10l19Q0j52K4L53k44j42K68
4427G5q3j31L13m75K77K9J21J09k74K60k26j04M40l12RK35l17M01j55j46L18j39
4449B25R4k37j81K60l4mk08K18k63M43r2k40LJ8K95j87j33P3P6k0J70m37J02J51
4473I2l93L46j42j00N3j34K88j71n4N27n28J77Nj81K58l09K77J57l85J02K84m11
4495b42M78l20R3l13J61k7J94j78K20J22j09MKK0J16j37J47j62R6O4m46L76j18
4518D1j8O2K40k27K53n6l44M07k58P0J94l17J56l53K3J02j23L06o1j89N7q1M6
4541g0R1j35J17J77l21K12j29P8J39m55M81r4j85J70q3r2L38n79N4K14n7M9Ro1
$$ y = [-108, 63, 5, 32, 136, 201, 6, 207, -23, -150, 303, -124, 336, -101, 66, 74, 115, -109, 49, -132, -3, -14, -515, 181, -29, -17, -24, -275, -184, -31, -111, -20, -375, -86, -86, -478, 97, 207, -112, -32, -184, -160, 193, -51, -193, 75, -8, -139, 174, -301, -24, 5, 126, 235, -39, 221, -5, -109, 331, 19, 28, 263, -54, 347, 192, 46, 364, 225, 319, 82, -99, 161, 127, 123, -85, 133, -130, 313, 221, -19, -16, 2, 297, 110, -23, 50, 126, 106, 276, -161, -59, 92, -301, 45, -97, -197, -144, -278, 10, -161, -215, 312, -216, -39, -34, -215, 43, -266, 11, 168, -217, -115, 169, -242, 236, -84, 9, -304, -143, -170, 24, -154, 66, 188, 79, 83, 85, 105, 221, 84, 231, 69, 165, 229, -217, 159, 41, 23, 85, 325, 98, 351, 295, -49, 358, 100, 170, 364, 47, 203, -150, -127, -25, -148, 158, 97, -92, -35, -116, -70, 21, -114, 3, 180, -141, 71, -58, 20, 159, -296, 185, 91, -94, 76, -7, -99, 239, -340, -286, -72, -129, -80, -71, -132]
4565a32L8o7R8O2K0o5J20l78L63r3Plk71N20k61K3PK7lK35l99J49J41k17L17l86
4591a48R6J91j75N2J36J49k22R7k41K05j31j65K73J04ml13Q1J93j37oK9%k20P9
4615g7q2j1%P3J62j28q9L27n18L46K3l44L66k61J40J41k87K66k61J62j49J47n3
4638a07Pk7M3J09J7R0j66J37q2k3p1O6K5p7K57l9l7k02N07l00j67l0J14K47j13
4663A78j89J11O6kJ29j50k46K01M6%j45J21L0J17k09J88j56M1k52J27J08O6m9
4686A31J00k26k06L51j11R1K23m05L1q4J76j00k60K90n6n1r2J39ok9K4j32J06
4709i6q2R3j77J58Q4P5k9j38O2p3K12k99K35j12J11J23O1r0j72J01L3j02k34K45
4733a1K6l8K11j18M9j83R3j08o8L17n5K50k48J66k11q2J98j20l2J32J24l03J5
$$ y = [-132, -94, -161, -63, -1, 19, -46, 74, -304, 59, -34, -27, -30, -301, 219, -42, -19, -12, 15, 12, 247, -152, -3, 138, -79, 238, -148, -52, 139, -36, 16, 152, 301, 79, 176, -65, 140, 9, -156, 117, 221, 217, -96, -15, 178, 41, 35, 64, 64, -156, -77, -159, -170, -170, -97, 65, -63, -152, 175, -343, 3, 26, -318, 48, -213, -73, 68, -219, 47, -214, -52, -201, -54, -107, -100, -127, -84, 25, 42, 132, -34, 103, 21, -2, -73, -7, 18, -59, 198, 159, 122, -80, 427, 127, -40, -70, 44, 291, 178, -11, 100, 166, 164, 293, 143, -103, 98, 144, 144, -1, 120, 150, 267, 58, 246, 90, 131, -121, 6, 114, 180, 131, 231, 5, -201, 150, 39, 130, 353, -52, -21, -105, 71, -29, -289, 1, -55, -106, -198, -59, -65, -94, -70, -202, -96, -178, -85, -262, -104, -20, 55, 26, -112, -50, -123, 89, -210, 25, -87, 24, 147, 208, 118, -54, 47, 80, -22, -256, -11, 15, -23, 188, 70, 119, -64, 29, -79, -147, 170, 115, 365, 117, 283, 72, -10, 188, 68, 36, 168, 292, -11, 4]
4756DJ03J5j27J54Rj26O5l1M1l21K43R3j76J3M3j89k32N28m0M1j5r1j46r7K36
4781cl6r5l9K6K9K01j65M0J07j83J19l82J35K08k89K05o4L73j26o8j10J75m10
4804c52M59J85k00K26j85q2J10Rl19J98k1K63j20j90K53j67Q0Q9l04RR3J85j21
4827I8kn9J16n3o3K06j88K09p6Mm05K67N9M8r4p2Q7l8l28J06J31j02j39J40L1
4852a17kJ73r7j94L48k98m4J31mp2L3L26l45J46L8j10K49m28N9J25J34n2J08m90
4876c83K43j84M92j15J4J06j22n4J09j49K41l08K82j63J48J37j60j12J38j64O7
4897F3r9m6J23l54K90K53p7j22P0q5J6L4k0J46j5o3Lm88N86l28m5J68j76J35j02
4922a33J10k7K05k00J62k65J62M3k40J17J60p5n1K5l11J26J56j61P2q8L16j22
$$ y = [4, 107, 122, -5, 149, 158, 32, 97, 66, 107, -214, 29, 122, -54, -41, 2, -187, -419, 109, 69, 110, 95, 4, -142, -239, -3, -39, -134, -173, -147, -118, 83, -82, -42, 65, -118, 1, -381, -246, -38, -327, -122, -186, 187, 61, -7, -117, 58, -352, 107, 292, 92, 318, 133, 51, 161, 170, -149, 49, 28, 291, 171, -19, 234, 67, 147, 236, -68, -59, 34, 219, 98, 96, 37, 153, 100, 37, 243, 55, 264, 188, 192, -213, 54, 113, 161, 67, -5, 82, 44, -284, -178, -47, -149, -288, -148, -117, -119, 54, -43, -237, 111, -187, -231, -100, -104, -176, -143, 183, -162, -16, 22, -88, 161, -267, -208, -83, 51, -1, 107, -383, -140, -324, 168, 53, 67, 173, 51, -3, 106, -43, 198, -110, 172, 9, 157, 294, 134, 22, 160, -4, 63, -36, -82, 41, -313, -23, 230, 153, 31, 101, 16, 32, 66, 46, 192, 177, 114, 117, -371, 215, -113, -158, 10, -166, -31, -133, -23, -50, 155, -45, 117, -148, 14, 57, -183, -66, 94, 19, -32, -7, -318, -192, -36, -197, -125, -213, 103, -19]
4944a9j05J74J11L0l35K10Pr1j20K96n8k37K35k51P8M5k4r5K09J18j80OJ83J48
4968C35j16j24j04J19j88n6N44l64J23j00Q0j45L36n60K05K37k35M2Kj25q3K97
4990A20k53Q8LK47k65J80K3j81K4l4M9j0j41q6K6l6M26k42Qj9j75OM47m93K52
5015c6m4j55K71K2j33K28k05j95K45j4p6j16J76N8p3M6j23Q2J53j2N4j42N2L7
5039A00j82n3L16nj97K97n19L44j2j77K05l1k04M11j96J36k8o0O8r6l02J85j1
5062a1l3J38m20L48J26j44J36m03J95K55n04L81j32J53k36K80j50K24l22PL72
5083B60m81J20j25J46j26P3K76r6N1k00J45j48L1k66J46J55j04N7O4l7m9L39l90
5106a59M40l13O8K96m11Q2j27J05J39j70j38K84J4j15J6o5K45l37P4K63m05M62
$$ y = [-19, -124, 50, 161, 191, -144, 66, 73, -18, -138, 158, 100, -137, 98, -153, -75, -30, -54, -149, 60, 178, -2, 4, 187, 335, 219, 95, -9, 110, -78, -134, 410, 46, 169, 69, 149, 4, 340, -220, -15, 222, -13, 29, 31, -94, -177, 120, -133, -45, -42, 205, -60, 120, 143, -38, -14, -48, 1, -9, -150, -236, -210, -246, 180, -62, -54, -73, -248, -242, 205, -288, -36, -80, -235, 36, 58, -75, 153, -52, -247, -2, -16, -92, -208, -32, 26, -47, -1, -124, -42, 111, 99, 153, 11, 63, 100, -82, -135, 181, 176, -21, 276, -243, 101, 89, -88, 117, 86, -118, 293, 97, 233, 205, 145, 213, 117, -185, 0, -11, -44, 94, -326, 22, 148, 4, 140, -263, -68, 187, -317, 64, -68, 85, -151, 129, -21, 203, -119, -112, 260, -221, -101, -226, -80, -206, -133, 143, 47, 98, -102, 43, -105, -74, -340, -194, -39, -143, -86, -22, -59, -108, 231, -159, 281, -32, 36, 332, -79, 3, -124, -19, 120, -50, -188, 96, 110, -5, 11, -54, 191, -146, -72, 191, -214, 248]
5128B48j46r7M8k7j47O6K10j89J05j03J61l59K49l7k5K18L7j58l70J79j5J94j45
5151a03Q1jk04K60k32K24j82O8L9J2mK95l08Q1L7l62M75l44J4J64M2k06L61k76
5175f9n6k45L19R8n1j15J35j64j9K86j75J82p7J64j96m5q8J79n1J29k1m7Mj24
5199d7K1pON3k09K37nj17K93k49k9L0R0j45M5j4o3K8K70k74J70O5l86J27j26J57
5225g9k4K85k50k61K53N6j3L2j92P0K26j40K07m13K43L1J00j63p5J74l2K22m79
5248b22jP5J69J46j33Rn1O2j7K6J9O0o0q1P1P9J53k19l7J22l53K28J21j25r2O7
5274A6o1J89l92L72R6k18lK24lk44L31k66n3JP4j01l6K73j56J14m0p7k17j63K68
5299g2O0r0q7O6o8q3M6J96j13J40O1j17j78K30P4j37N6k33R6L75l50O8K3P6j81
$$ y = [248, 102, 5, 53, 26, -121, -55, 155, -34, 71, -32, 129, -230, 19, -18, -43, 175, 212, 54, -316, -137, -152, 42, -103, -22, -23, -227, 33, -199, 25, -157, -89, -50, -38, -42, 253, -55, 26, 63, -299, 176, -168, -154, 10, 52, -154, 207, -69, -125, -370, -51, 47, -4, -119, 16, -148, -167, 119, -56, 126, 49, 213, 17, -28, -116, 63, 12, 141, 120, 73, 77, -47, -26, -33, -27, 26, -183, 54, 49, -68, 225, -24, -53, -23, 67, -78, -33, -47, -110, -82, 188, -86, 84, 149, -237, -110, -236, -79, -103, 182, -68, -329, -76, -20, -33, -1, -193, -123, 103, -37, 170, -243, 0, 31, 131, -32, -107, 67, 35, 257, -222, -223, -148, 21, 167, 34, 43, -8, 54, 37, 63, 82, 142, 82, 1, 72, 151, 304, 85, 48, 170, -183, 45, 166, 41, -51, 16, -45, 144, -248, 124, 220, 2, -1, 223, 220, -24, 307, 41, -12, -11, 63, -38, -74, 199, 43, 157, 117, 40, -177, -340, -72, -12, -102, -189, -123, -191, -274, -228, -32, -145, -5, 56, -61, -239, -9, 65, -72, -16, -249, -153, 222, -128, -60, -37, 39, -142]
5324a42J39j02n0K77j79K42o0P7Ok50j37L00oj76Q8k38K32ML8J36k50Q6m9RJ70
5349A65j33J8J3K05l56K27j52o9J64pJ44j84nk16L17j87K98m72K33j29Q5q3K0
5372a04J3k1k1J91j01k59L28jr8J93k86M27m53L8J07j95J22K1p2j45M05l00K25
5395A4n4l05O59o02RL31k2p0J73l87J94J57J23L2l01L0Q5j32J45j8K47n1j81j99
5419a23L57q4K71k56k46M01m49J98Q8j31j50P0j34K31R6O3Q7k95L7Q0k4P3k31
5442g1J35j94J90k29R9K10k6Ql00L36l44K66j07k24M49l94K05j77j97L08J7k4
5464f4j3k39O7O21o29M81k28q0O9J58k76q7M00j67PO8R4r0j38j11j5J96JP9J76
5489B80j51r7J23j09j4P3J3J09l84J55J39j13l7J59l34L72j21p5J41l84J27K17
$$ y = [-142, -3, -105, -155, 122, -57, 185, 125, 202, 208, -42, -179, 121, 115, -61, 27, -211, 21, 25, 63, 199, -51, 35, -14, -5, 165, 32, 50, 63, 268, -88, 139, -13, -82, 82, 75, 219, 35, 30, -186, 131, -56, 242, -230, 3, -126, -41, -124, -104, -91, -112, -133, 58, -43, -302, 26, 25, -73, 120, -166, 261, -192, -154, -47, -242, -120, -99, -171, -316, 89, -211, 14, -40, -345, 314, -288, -279, 52, 30, -40, 133, -254, -60, 97, 220, 252, -49, -19, 66, -66, 79, 61, 308, 257, 76, -123, 234, 150, 421, 165, -81, 320, -129, 69, 157, 26, -124, -54, -188, 43, 139, 202, 289, -6, 31, 111, 87, 160, -71, 64, -130, 60, -169, -70, 140, 114, 122, -178, 158, -186, 80, -27, -251, 198, -196, 9, -168, -365, -57, -40, -64, -77, -316, -249, 372, -257, 224, -4, -84, -15, 143, -133, -220, 180, 13, 20, 88, 182, 92, -46, -157, -172, 24, 25, 104, 280, 129, 32, 155, 46, 32, 105, 118, 227, -157, -2, 137, 24, -13, 146, -188, 184, 63, -12, 129, -255, -128, 89]
5511H9Q1M0m83j3M78j1K1l66K43r3j05q4M41l19J63K07l10RJ04l02M38l03p8J16
5535c7l19M53p7k03K72j17J10k5l4q4M0k25K96j30k64N29j35O0Ql8ro2j04L01
5559B06k89K0K22j64j48K69j31J60j6j6J10m8k68J20Q6j77J83k01L52j04k60L37
5581B43m25M24l45K13l5j36j23J82J35j03k28K67K15l07K90k52K0J58o8j42J37
5602A20k33J28K25l86K77j13k52J58n4J65J18l75L14k32P9n0j9K4J36j51K27j32
5624b6q5J61k61J06mO1j80M56l75J97j22K88K5n86M66O9j9q2j16mK61m51L21q8
5648A2j27K83j05J7l6m5Q9j04m9J35J37j16l4k10o8K93j65J40k11J82m1jk6pP
5673e0nq4Q4L01j87m6j91N7K08j9l35M39j85j06J77j55j20K90m02L55j45j49R0
$$ y = [89, 170, 210, -273, -286, 192, 181, 202, -164, 79, -14, -119, -203, 238, -81, 82, 289, -21, -12, 92, -210, 228, -75, -153, -37, -356, 97, 20, -183, 89, -28, 82, 57, 23, -61, -21, -246, 50, -80, -344, 185, 50, 110, 118, 80, 71, 9, -95, 206, -83, -63, 159, -5, -153, 116, -15, 145, 129, 113, 223, 175, -93, 27, 113, -64, 119, -82, 270, 166, -94, 243, -182, 242, -103, 110, 75, -61, -184, -2, 133, 30, -198, 69, 284, -23, 267, 15, 35, 193, 125, -17, 120, -113, 15, 240, -146, 131, 18, -234, -76, -130, 35, 153, -222, 92, -140, -61, -111, -130, -106, 30, -121, 106, -26, -111, 50, -211, -105, -109, -48, -228, 228, -147, 50, -72, 216, 241, -345, 121, 190, 171, 89, -27, -31, 230, -221, 100, 12, -115, 168, 63, 80, 44, -1, 88, -16, -65, 70, 207, 91, 57, -153, -221, 72, -93, 47, -164, 18, -23, -24, -50, -57, -50, -55, -139, -55, 246, 59, 13, -178, -121, 87, 68, -267, 172, -13, -119, 58, -97, -217, 73, -329, 26, -119, -268, -178]
5696a78Q5O8k78K27J1K2j17L59j83j18Q5q0J96j81n8L45rp9k4j10K7j9j54L39
5720A76j66J16n1q3J51n0L2R8j36j55L60Nn4r4j60J29P1r0j08m7p4qm3M29l22
5745g4k2J0J23l7m7Q7j69K9r2M21k25o8p8k0K98j66k9K7J65l63Q8j53M37j18j84
5770a60K37j13J22k22%J1J02p2K45j11o2J84j59K50J44l81m9K30j11Pq8O3J49
5793B16j63K1k5j90R4J86q6K81l52J35j57K9L69l80L66l50j7j72K91l12L36j11
5815Im8j73J09L16k44j58L20l04R1r7J80r7O8j9J2j86o8L81k72L24j94O3n4k17
5839b58K35k66K11L19j4J9j41l19K69j72J50J2J50l06J69K5k6J14j7j20N8j21
5861b9M6r7o1P6Q1q5j13P0J66j21j10J22N9J56r6m2O9O3k2r5P3J2J86m39J56p5
$$ y = [-178, -93, -25, -303, -76, -65, -43, -160, 199, 16, -102, -17, -97, 99, -82, -140, 205, 196, 117, 93, -17, 10, -9, -163, 176, 10, 126, 75, -8, 143, 93, 125, 223, 87, -68, 292, 297, 243, 149, -11, 118, 189, 99, -9, -56, -130, -138, -181, 248, -74, -96, -86, 37, 0, -47, 40, -129, -100, -192, 229, 4, -64, -142, -162, 136, -30, -59, -32, 133, -230, -142, -295, 142, 24, -160, 77, -36, 86, -136, -136, -125, -23, -95, 150, 39, -23, 161, 2, 252, 396, 15, -34, 196, 85, 92, 4, 67, 216, 53, 74, 49, -141, -47, 139, 53, 334, -18, 117, -40, -11, 358, -22, 344, -6, -23, -195, 96, -216, 120, 9, -39, -212, -103, 213, -31, -189, 131, -173, -82, -179, 1, -96, -28, -47, -35, -221, -289, 92, -180, 144, -50, 13, -41, -258, -23, -289, -78, 241, 227, 246, 105, -214, 55, -117, 33, 45, 195, -111, 58, 83, 57, 171, 154, 34, 92, -29, 17, -80, -141, -65, 16, -69, -182, -112, 54, -67, -177, -55, 4, 160, 64, 22, 91, 154, 132, 37, 110, 122, 308, -131, 25, -50]
5887e0o3J66K23j44j98L4N9p0j07J60j9j85J97j64p2L22k42J63l8K69l65J50m7
5910b1rj49R7Nk04M78j05j22j9J58j48J40J8Q7k04N1J5p0J88l7j60r5q6L64m42
5935b70K85j60J16K66m37K57K0k26J84Q6l21L27Lj08l7Q6l07j4M03J0j59n6J17
5958F5j60l0K68l6l36K01K70j21M7l34n8J37P4J65j9j17j78Q4J38k21J21n9K64
5981A65l31O6j33J48k06K76P4o1j5l0J62R2l08J54k99K08m1nL8k19M06l0Ml40
6005b25N98l87J66k51j17K47j91p2M61k2k32J82r5j43J73k79K64j49K66j40n9
6026el0K02l40L56K9j82P4k79N07n99L91p4l0rJ91O1k17j27N2j30J25J24J7J7
6050A24j83o3J57J92m04J2J5O3L2J61j99lN1r6J82k37l0M11k10l09K20k4M21k35
$$ y = [-50, -113, 53, 276, 132, -66, -32, 27, -43, -150, 10, -9, -194, 3, -161, -233, 89, -153, 10, -28, 241, -124, 26, -21, -30, -179, -82, -77, -281, 197, 92, -30, -49, 109, -39, 101, 119, 206, 2, 53, 68, -2, 186, 149, -11, -106, -192, 172, -270, 15, -145, -29, 237, -200, 57, 77, -149, 35, 121, -200, 127, 130, 22, -15, 71, -236, -250, 153, 163, 4, -52, 65, -95, -125, 143, 107, -229, -28, 242, 121, 168, -166, -224, -87, -13, 152, 133, 16, -162, -78, 60, -161, -40, -99, 165, -166, -100, -233, -85, -291, -15, 59, -2, -17, -47, 115, 207, -101, 53, -246, -38, -79, -84, -46, -265, 141, 111, 115, -225, 373, -14, 152, -99, -216, 31, -160, -232, 229, 207, -25, 157, 62, -81, 92, -187, 77, -72, 194, 54, -5, -35, 167, -173, 183, 212, 30, 104, -175, 332, -267, 124, 50, 20, 11, 202, 263, 46, -81, -29, -159, -34, 90, 107, 124, -59, -122, 35, 227, -177, -165, -150, -87, -55, 106, -93, -96, -45, -141, 41, -196, -226, 185, -25, -334, -114, -138, 283, 48]
6074D8j9K83l98K45q5J65l4k71j34J64j3NK03m49M11k16J73M2j92L64k55J5J86
6097B38j26j14J31j30j34J39J05Kj09N3n5l16L96j22j58L08m17J75Q5Q3P5O5m8
6120A26r5l41J71K39j45O3j70J44Q8J5j97J31J4j11n5R4q4q2J62j3RJ7J74l39
6144a85P6J65j50N5k15j4K62o6K96l16P9n5J08J35j55k5mk01J16M03l12k35L65
6167A27n8j10J70o6J93l22n2K48R2j28Q2k71J9nr5K56J7n8L4j2J50k74P9Q6j05
6192cK1n9r8M5L09l62Q4j05J89J68l25L71j40l20K29j26J12k26j48L91q9J12K24
6215B54m92K49p9PJ3J02m6J32k2k09Q0j57J66J17l21J80o0K56j59Qj39jQ1K11
6239A71l21lJ45k07K11J43l50M09j07O7Q5l40J67j35J65m1j08m9J19n2L9Kj60
$$ y = [48, 29, 312, -86, 159, 74, 239, 205, -66, -200, -36, -49, -44, 159, -290, 121, -95, 78, 120, -72, 292, 37, 52, 238, 112, -2, 129, -1, -135, 4, 109, 111, 2, 55, 0, -316, 80, -42, -200, 108, -309, -134, -49, 34, 109, 174, 126, 31, -310, -139, 100, -45, 18, -152, -8, 80, 95, -102, 29, 43, -68, -123, -29, -113, -195, -33, -46, -37, -20, 154, -185, -109, 56, -94, -39, -254, -268, -6, -72, 224, -92, -13, -68, 40, 175, 20, -5, -9, -210, -94, 309, -3, -238, 127, 69, -41, 129, 63, 256, -66, -118, 130, 222, 94, 176, -95, -76, -81, -176, 80, 97, 39, 73, 61, 211, -63, 16, 102, -3, 18, -41, -139, -94, 215, -147, -63, -168, 21, 189, -136, 235, 95, -225, 4, -122, -10, -236, -384, 7, -82, 30, 254, -238, 11, -68, -61, -48, 54, 8, 140, 118, -91, -11, -168, -2, 115, -206, -26, -86, 170, 11, 19, -120, -121, -40, 171, -150, -153, -8, -215, -4, 139, -211, 198, 91, 158, 243, -97, 70, -65, 100, 59, -49, -98, 21, -31, 8, 10, -150]
6262a50L52l54K21k05K3j6N6J85m6q5j44K99l19K51k28J76O3j23L6m9O0l1l0j3
6286g1J17J1j57Q6j79J79j19K83l3j39n0J45O6m4Mj52m0KJ90J61l90K61p9j2K7
6311F7Q8k49L54j47n9o9K07j67J15Q6k64J70k62J24R9k55N9K8j20K92k10K05k65
6334a73Q2J14j0p6j30Q7K17P0k54M2k2j92L47j35QJ39j12j63J51qKk00O0K18N8
6359A20k85j56J75J31p0j6J86o9J14n20M37j92l67N30R6n3J10M0k65J80k80J17
6381c7K85k76j25J41O2J9r3p6K85R4k85k8K1K51j25k25J47j42N2j89J29l2J38
6404iJ40K17l41k76M51j88J36l72J85j08Q3l2K17j39J2K1j81K14O6j9k06j04K26
6427gj30Q0Op1J61P7j06J05j33j95L00j83J40l1J41k06M7J03l59L18J4j71J05
$$ y = [-150, 202, -152, 69, -136, -113, -129, -73, 112, 66, -19, -163, 136, -183, 68, -160, 16, 79, -44, -8, -57, 3, -28, -58, -71, 46, 57, -100, -14, -193, -14, -133, 150, 117, -22, -72, 73, 139, 95, 99, -53, -93, -91, 99, 260, -130, 131, 52, 40, 67, 155, -94, 260, 113, 54, -15, 192, 25, 140, 226, -38, 132, -130, -6, 93, -162, -103, -75, -195, 97, -113, 92, -173, -91, 23, 13, -63, -193, -106, 111, 181, -73, -31, -53, -245, 102, -33, -25, 114, 2, -161, -10, -18, -16, -216, -156, 62, 120, -165, -321, -146, -15, -85, -101, 85, 16, 130, -390, 47, -145, -512, 18, 114, 61, 171, 211, -54, 126, -154, -37, 248, -28, -153, -12, 50, 69, -24, -100, 185, 279, -6, -34, -13, 238, 113, -112, 35, -107, -55, -244, -115, -147, -9, 131, 348, 7, -269, 182, -6, 130, -242, -57, -165, -82, -114, 103, -36, -24, -3, -184, 30, 96, 77, -129, -233, -7, -137, -57, -51, -122, 39, 116, 10, 115, -18, -213, 87, -96, 44, 13, 154, -52, -5, 98, -261, 57, 71, -100, 5]
6450EJ14k23o7O8O1o6J30r2J47j8j03j18J07K58k66J87j4q2j18J60k11J71j7L93
6474D06l40j64J47J61Q4k87K15n6k93J93k56K9J49K01l21K38m04J48M01k78L3
6495FQ2n0k11K07k80J76K1J25j56j24P6K21l56Q8p9NL50k40J78k39K00j52K32
6518H0K7k15l8Q9n9o1K18j08m2K13k39O9n9K19j12K13Q8j41J2L4k50K84mj68L8
6543H8J18l34J02L69l89K28j22q4q0n7PL90j86R7l30J99K41J6j42o4j21j47L67
6566A66l02J20K55j45o2n7J3j53K99j63J3j7k10L31M8o1j43J25m6j3j13J56j64
6589a23K45n11K65J60O5j12K25j02k81R9RK05O8j86J7J29o9J29m1j69RJ15j85
6612c9%l0N3K1J36j95J60p4kp9M4j43J24j09rQJ37K19J5k15kqO1L5j44M8p9K71
$$ y = [5, 119, -104, -171, -103, -42, -108, 22, -70, 77, 59, -44, -162, -55, 203, -63, 124, 110, 28, -90, 70, -141, 30, 13, 406, 66, -98, 49, 210, 294, 7, 222, 166, -127, 66, -190, -161, -12, 189, -132, 106, -298, -150, 251, -27, 6, 88, 38, -173, 34, -246, -70, -49, 76, -80, -204, -128, 93, -263, -175, -254, -249, 101, -139, 39, -200, 0, -152, 80, 107, -108, -146, -57, -116, -177, 41, -67, -109, 104, -135, -66, -125, 94, -18, 195, 283, 142, 154, 188, -62, 222, 218, 50, 88, 206, -128, -26, 343, -46, 182, 60, -24, -104, -161, -154, 236, 50, 147, -183, 16, 257, 273, 131, 67, -54, -201, 166, -136, -16, 239, 94, 32, -25, -12, -165, 134, -29, -16, -33, -243, 88, 136, 75, -68, 57, 11, -2, -115, 41, -123, 122, -389, -124, 36, 101, -11, 214, 112, -169, -70, -61, 144, 212, 26, 43, 172, 103, 232, 191, 22, 31, 146, -39, -39, -69, -16, 5, 141, -54, 106, 32, 30, -49, -5, -148, -24, -133, -142, -134, 3, 222, 237, 22, 20, 12, 73, 108, -36, 12, -67, 204]
6640B04l62J36J25k88J41J47n9J35j78o9M6Q0J2Nj65m7l3KN4J39j06k81J43P5
6664a44J75n9LN9k09M6J98K1l4m5K69J08k21r5l76J94K70k56J38Lj84M79l21J07
6688A26M4j84Q3Q7k62J45J88l31K73k83L39k68J43j8j01n1O5j32M74m13k0J0o5
6711a51JL30r7K9M0j60K18l59L35l05J33J8J7k42N8L17l84K03o1K6K17k97L47
6734B33k61L5l52K51j52J97J10j75K6j63L38k36J11K32j60k01L03o1j97l0L32
6755A80K6m23J11J42j14Q2J27n6K27k51j88K82l70L06R7j63K13m48K33J89j77
6776B5J90j44j5K10j85k20J23J28k5m0j71k7J94o9j05J54Jj65K09m9K3K5r9R9
6800F7Rj92K12o8k07J33J52k50K05k15J91j85O38k55m06K74k8K6l62M02j78O2
$$ y = [204, -158, -22, 103, -185, -44, 103, 44, 179, 1, -68, -22, 58, 70, 75, -90, -137, -170, -168, -114, 25, -81, -362, -219, -144, 31, -28, -25, 34, -175, -129, 69, 90, 56, 11, 280, 388, 167, 72, -304, -110, 160, -96, 42, 45, -139, 340, 19, 126, 170, -14, 69, 156, -106, 39, 227, -104, 169, -114, 225, -43, 100, 82, -19, -70, -5, -137, 337, -76, -96, -86, -151, -150, 180, 83, 112, 152, -8, 210, -149, 186, -119, 14, 32, 49, -193, -135, 182, -202, 1, -60, -34, 183, -114, 233, -28, 7, -345, -94, -246, -49, 61, -114, -88, -251, 87, -149, -38, 194, 34, -167, 136, 75, -122, -152, 180, 206, -217, -106, 36, -78, 4, 131, 75, 302, 51, -137, 145, -225, 81, 178, 15, 228, -220, 13, 202, 25, 215, 71, 56, 266, 81, -139, -16, 112, 87, 47, -124, -151, 43, -26, -131, 23, 24, -141, 68, 19, 42, 67, -32, 67, 76, -116, 96, 28, -179, -46, 106, -144, 61, -154, 37, -148, 490, 235, -171, 103, 75, 101, -261, 141, -37, 25]
6822B5o2j11J25P8n6K15k52J85m99K76q1L37l54k3L81l99N27j78m8p5m0jN3J99
6846B22j74Q2j42J29j58K74j96k86L10nq8M4r5J67r5J81l22J04j13Q2O0R6j05
6869b8n3o8R8M1J94l50K45n4r4K36k95O3j95J70J81j13j56K28j16j01M22j27o1
6892F7O4j48L6j42L61Q8k48p8j95J80j47J18J7R8k48L7n8K36P0j24J36m7J00k22
6916d9j66J03K00o3r0NL20q5k75l0K34J86k61r7J82j5K2O2l42Q2M9L4m6m9J52
6941F3k00L7L06q7k53K53J3k04J24j30j29K08j82K35j68J69M5l27K51k26j4L27
6963A11j54O5j99Q9J81j15k17J41L56l09J2k0J74j94O5j1p6NK55k50J11jJ8J2
6987D9J12j52k76K84k2J15L6J27k96Q3l63L30j86M10l60J10k7l0K62l11L16l36
$$ y = [25, -37, -148, -23, 55, -1, 214, -38, 147, -352, -76, -157, 180, -174, -197, 184, -215, 312, 134, 86, 11, -29, -30, 23, 222, 48, 130, -12, 117, -41, 233, 37, -249, 61, 56, -32, 12, -83, 84, -11, 170, -152, -48, -161, -79, -19, 77, -28, -81, -149, -51, -10, 184, -166, 79, 25, -69, 167, -128, -65, -260, -90, 91, -22, -178, 50, -66, -167, 255, 128, 67, 131, -17, 19, -123, 238, 326, 78, 0, -195, -15, -162, -44, -27, 71, -177, -140, -198, 38, 108, -16, 120, 73, 173, -49, -215, -112, 88, 25, -65, -60, 260, 175, -100, -130, 104, 290, 29, -68, 114, 99, 121, 183, -159, -77, -28, 6, -40, -89, 63, -137, -100, 206, 119, -134, 119, 132, -72, 52, -78, -207, 1, -181, 54, -114, 55, 100, -227, 24, -202, -216, 111, -43, 22, -177, -88, 93, -22, -239, -98, 258, -51, -39, -59, 115, -79, -14, -25, -101, -96, 159, -91, 20, 19, 37, 49, 161, 9, -267, 17, -5, 110, 146, 273, -23, 60, -303, 27, -159, 251, -109, 1, -26, -56, 206, -105, 211, -125]
7009a25L66m04K53J04l71Q6K09j15l0R8k8k42L01n6J21j66o0k03K27j57K46l4
7031B0j33J53j00r0k1P8J10K23k99r7L12m7K8k48L1Q0j00j8L48k35J60p1k17L32
7055A99k49L5J45j76r3O3j57L05K7k03K03l9O9k03j41L98l48M69k94j7J4J59k77
7078a11J04J38j34K95m61L86j59jj07qr6J53L5k58K58l10J90om9J54J38j78L1
7101Dj47K39k58J39K73j73J6q6K18l30M6p3K34k19L4J64o6j87N73m81J78q1j73
7124a56L83j17l45K14J06q8J86J5k4n9R7k14k16K52Q1k33K20Kj66Oo7J34m2R6
7148F5K6j54J58l7L6j65J71N9k36O5J67j19o7O7r5M9K69j25j52O2J43k48K21Q5
7172B45m76J49k5K26q8L3K98m29K83j63l2j45J9L33l72j53K37j2j7J07k70K80
$$ y = [-125, 241, -163, 90, 194, -177, -91, 118, 3, -27, 71, 43, -199, 102, 46, 167, 1, -59, -262, -35, -192, 54, 20, -113, 40, -60, -150, -171, -93, 17, 240, -59, -156, 156, 109, 137, -111, -80, 0, -100, -118, 230, -5, 155, 84, -133, 199, -50, -15, 130, -46, -139, -76, -233, 72, 99, -104, 99, 60, 129, -74, -215, 183, -165, 304, 10, -7, 7, 166, -111, -7, 131, -3, 292, -169, 217, 58, 57, -50, -58, -154, -1, 34, -224, 34, -276, -86, -92, -141, 13, 151, -27, 4, -143, 96, -162, -23, 250, 77, 93, 7, 225, -105, -59, -132, 102, -117, -83, 81, 15, -172, 401, -80, 98, 17, -156, 227, 110, -235, -21, 85, -3, 183, 198, 174, 115, 212, -2, -218, 34, 115, -118, 102, 104, -62, -56, -123, 11, -31, 65, 91, -63, 95, 58, 94, -71, 100, 159, -77, -12, 155, 36, -31, 36, -59, -10, 259, 134, -18, 44, 187, -61, 160, 245, -231, -82, -107, 119, 31, 64, 362, -67, 216, 53, 21, -124, -105, 228, -144, -297, -60, -72, -89, 18, -252, 28]
7194B8N6m77L27J5j44N3Q0J5J89k04L21k90Q5q7K81l59Oo2k8K05l9RP6NR4p8m6
7221C1P3k31K28j36R3m09M11J37l08j16Q2J51j65j2L17j9L6r7r7P7Q1P3l96K34
7245C8j58J06q1J26l2O2j17J20k84p6M26K0m55L89m1k88R0K11jl7J43k54l3J50
7269B4l6k60K92j41k0K23m66K92p0J78K09m01N1K69r8j49m4L72k06J77q9k3kK01
7293B83j64j52q5K02l57L83k03J7o1J4K12q6j83M28m58M2L52m40K24O7k13m5L08
7316H5k60J84j52J63J2j5j18r8J68L2J16n8O8j37m0N2j75J23r6R3M6jj47N0p0
7341a75p1K27K45j68m94L56J24j36j2P6J93k57K56k44m37O14N0q8q1m4n9K0J28
7364B3K0n0K9M2N2k00J95j35M6j12J1L01j04j89Q6j17R3M1j20J4J50j59O2J24
$$ y = [28, 84, -393, -66, -51, -195, -142, -62, -47, 142, -62, 259, -31, 54, -33, 248, -111, -105, -167, -195, 10, -29, -20, 56, 61, 155, 77, 31, 104, -127, 101, -35, 58, -351, 60, 197, -111, -227, -145, 6, -159, -171, 146, 127, 163, 66, -31, 46, 127, 200, -196, 38, -120, -14, -95, 31, -1, 61, -56, 64, -220, -296, 130, 150, -305, 84, 43, -245, -155, 56, 55, 18, 161, -93, -126, 24, -12, -272, 20, -121, -141, 82, -384, -92, -162, 16, 225, -176, -125, 144, 46, -103, -147, 225, 19, 196, 107, 84, 82, 283, 119, -33, -118, 84, -273, 110, -93, -76, -137, -123, 89, 3, -180, 248, -210, -168, 184, -256, -32, 35, -178, -223, 85, -175, 9, -143, 20, 32, 17, -101, -199, -31, 1, 117, 59, 127, -10, -50, 2, -173, -50, -146, -53, -7, -8, -155, -105, -175, -246, -19, 226, 58, -436, -80, 44, -92, -104, -28, 165, -92, 164, -80, -517, 97, 147, 59, -22, -66, -125, -105, 23, 43, -7, 22, 64, 116, -84, 111, -24, 22, -90, -79, 222, 118, -71, 15, -102, -9, 32, -88, -74, 76, -83, -21, 103]
7388A03j73J19p6r9K8j23J94m9J81J0j68K06j06q7o7o1J56o6j63L56j73l7J41
7411D6j29Q4K8q3J46k54R0K85j27k51q1P3L3k05K30J24m6kK23J30l32QM9k26J62
7436b5k7j64J44k27K05J62k08J99m9J51j60q6m4j6K57k8j66J48K24m34J74K47
7458B77l45q6J47j02rN6j25K61p7j07L16k85j10P8K09R5k50l3LL0k45J84J89N8
7482A29k33n1J95R0j93q8m0J01K6k1J7Q7O8n1k55K53j27K42j14j86N5o2J71k32
7506b19L14k53N9K88k07j00k6J52J31l8J46l27P9j0n1Lp9J61j01N8k77K44K0L2
7530aK51k40J20j02K21m17K35j51K23P0k09p4O3K7k2MR3M3k17r6J0K5j22K78l
7555IJ80j4J76m47j4o5J25J12k4j95l0K03j83n0L41P2j93j04K23J18k70k6J49
$$ y = [103, -70, 49, -27, -126, -98, -221, -27, -76, 105, 115, -53, 153, 47, -40, -107, -168, -12, -78, -241, 115, -58, -95, 46, -83, 1, 29, -54, 92, -162, -72, 213, 86, -165, -246, -173, -140, -345, -115, 9, -37, -39, 184, 314, -18, -10, 39, -187, -25, -52, -216, -72, -299, -94, 68, -140, 59, 10, 161, 1, -85, -129, -145, 112, 84, -82, 66, 290, -144, 30, 277, -68, -154, -7, -109, -118, -62, -187, 74, -3, -110, 206, -79, -189, -111, 98, 193, -57, -90, -87, -57, -302, -118, 71, 129, -104, -155, 40, 130, -63, -151, -191, -90, -64, -85, -68, 19, 87, 36, -219, 34, -93, 149, 35, -151, -96, -158, 13, -219, 95, -158, -99, 189, -18, -118, -144, 8, 139, 101, 247, -80, -1, -11, -62, -59, -138, 23, -78, -20, -297, -53, -33, -1, 250, 10, 130, 28, 249, -168, 67, -84, 139, 209, 0, -74, -11, 16, -6, -2, 91, 134, -83, -179, -169, -144, -266, 12, 9, 189, 175, 351, -96, -110, -175, -50, 62, 38, -157, -187, 16, -167, -217, 124, 196, 3, -101, 122, 240, -30, -56, 93]
7578I3j66J03m4j5k95L59j11J86j85kQ0J74k35j01K55l4j66K6L7J17J8k71L23
7601A46mj58J12j70J28N4r6J70j93m7q5L71j44PK2q8J64l91M8n1J59r3K72l6j28
7626c1j21J69n4R7j54Qnj3Q2K65k96k3J34k36Q6M3PJ73O6l44L04j68r8j2J37J6
7652C2J06q2k80J36j43K50J05K4m8j08M7M9j49R0J82k27LQ9j32J89J74k36k61
7675a90J47nN5n4l4M5K25l16K0J17n3P3J41n6jP3k48K63p3m2j70O1J50j93K51
7700A86j93J74k1J7j11K5o3r0L2q2J03K1J82j23m3k33L18k13L5J00j51K00j36
7723f6J21J63m39M55j73m5k11P6J57J07l30M33j84K8q8m4J17k79K11O6j57J52
7745G0J6J28l0m7k9pK3L3j82P0j50J11j8j2J0j85M12j02M3j76k81N42p4j70j44
$$ y = [93, -73, 30, -14, -29, -324, 35, -76, 110, -75, -77, 3, 177, -58, -159, 96, 62, -104, -78, -41, 76, 94, -177, 146, 142, -16, 96, -74, 54, 108, 12, 182, -11, -58, -143, 228, 84, 91, 113, 25, 189, -202, -154, -205, -46, -139, 133, 97, -31, -152, 17, -37, 60, -94, -86, -91, -104, -22, 243, -53, -76, 58, -178, -92, -49, -42, 131, 197, -147, 157, -11, -109, -121, 16, 32, 138, 56, -224, -88, -231, 19, 124, 148, 100, -8, 39, 88, -61, 29, 211, -16, -13, 76, -56, 133, 307, 71, -190, -43, -48, 7, -47, -81, -36, 189, -127, -107, 10, -43, 30, 171, 115, 114, 187, -61, 202, 129, 87, -83, -22, 128, -65, 186, -7, 167, 146, 163, 52, 77, 14, -76, -44, -126, -23, -2, 180, 57, 14, -219, 99, -114, -79, 21, -130, 70, -66, 55, 218, -221, 234, 61, 16, -195, -119, 38, 145, -185, 248, 64, 92, 4, -40, 77, -202, 9, 75, -82, 70, 86, 214, 184, 137, 108, 101, 124, 157, -25, 45, -105, 6, -12, -24, -14, -199, 213, 111, 154, -22, -303, 239, 165, -5, -149]
7770a49J84L4k26o0R0L40l34J28RJ49l01k7R5o8J04O5j20n2K81J37j59l1k39K22
7794G2K7o9N3j69J68K81l09J48l24P7J21K6j15j14n0j4L49j44p4J55j65J18j07
7817e9Q0q2m0J34M0j00J83m9J0q6m7J73k76M1L68l46K70J97k78j53K96j13k8j54
7841a9r5pJ99m2q3j58L09M4l20K08k13M76k46l6O0l2j10k0l5qL29l08J37l19K01
7866h8j79L67k50M8K0N6K31j02ml40Q0K17J42L7m09M26p1m4o8n5q3J03o7m3L0
7891d6J61p8n1J13J88l24r9J65j12J94JP1l24k2M9L1M6P0J02m50K95L13k21qj15
7916e1K91l6j62m8j00K26j87J85l31L25l86O0K10Q3k74J4J99k64J55J26j23J18
7938C0O2J92j73q5J1j04lp5J15l8N2J12m2J12K9m61L09j4l4O6o0Q4j69K8K62j67
$$ y = [-149, 35, 69, -157, -217, -127, 213, -121, 7, 16, 165, -136, -163, -68, -136, -32, 33, -87, -139, 142, 279, 120, 89, -150, 72, 99, 30, 83, -86, 82, 363, 54, 202, -122, -45, 76, 102, -13, -127, -177, -191, 158, 14, -60, 95, -70, 48, -59, 21, -61, -101, 33, 73, -27, 156, 107, 117, 31, -16, 157, -119, -78, 290, -56, 214, 411, 133, -20, 276, 163, 135, -19, -114, -121, 78, 36, -47, -205, 104, 148, -172, 36, -177, 299, 53, 17, 77, 45, -65, -85, -120, -128, 201, -107, 30, -289, -88, -267, 100, -150, -102, -82, -26, 205, 103, 99, -241, -161, 56, 198, 235, -174, 252, 181, 137, 69, 14, -69, 34, -33, -76, -46, 115, 37, -14, 99, 287, -37, -136, 29, -83, 111, 112, 183, -141, -163, -114, -83, -37, 33, 135, -315, -20, 293, 72, 64, -51, 240, 204, 42, -6, -106, 120, -67, 118, -213, 112, -274, -214, -4, 79, -195, -181, 18, -246, -91, 35, -88, 30, 92, 284, 111, 26, 37, -67, -70, -145, -30, -68, -16, 96, 54, 166, 195, -266, 43, 29, -5, 61, 1, 85, -84, -56, 206, 39]
7964C9j1j50n9K00k2Rk27L96n1n7k7j87Q7J5j6J28k28J62J27m13K54J41k81J55
7988a6J99j10k28L7K74j65J19j92K03k82J22p1J01R9j4m25L44P1mO9L6J9o3j47
8012b4N9P7j30J17M3l07j63K64LR6k63J06K28J7k90L7J18n4k50M55j22L0j78J92
8036F1NO9j08K29l4k03J42j90K5m4j06N15o01L59j36k08K23q7K12r3J3m60K13
8059b04K68P8j36JL3j01J60o1J58k79o3J66L6J53k93J04N0k06J75l6r7R9o5M2
8083a8j24O38n99JL65l88R3M5N9o4k5K13l27K99k74J68M0j00K11j66p7k1j62K65
8107E2o7o3J53r9J31l02R8J76l0L0j28O5J41Nj5j86J01m6J10o5j85J68N8J6n8
8132F0j64N1J69p3oL89m89J33r6J19M6j76K32m05J49J54K8p6o5J79l28J25J16
$$ y = [39, 28, -122, -181, 19, -3, 6, -221, 175, 124, 67, 40, -147, -60, -45, -61, 67, -161, 1, 128, -285, -31, 110, -171, -16, 183, 73, -155, -118, 156, -9, 110, -82, 121, -161, -39, -110, -9, 90, 76, -349, -5, 66, 62, 131, 167, 186, 123, -24, 35, 112, -18, 99, 142, -165, -328, -64, -61, 35, -228, -122, 106, 123, -167, -130, -12, -66, -316, 139, 17, 47, -131, 61, 66, 135, 27, 256, 222, 19, 161, -29, -4, -48, -154, 361, -240, 119, -17, -225, -2, -89, 123, 30, 43, -417, -204, 64, 142, 6, 7, 40, -61, 99, 38, 196, -83, -146, 20, 56, 209, -84, 20, 70, -136, 39, 3, -94, 5, -60, -18, -142, 496, -103, -102, 263, -125, -32, 13, 72, 8, -17, 196, -131, 168, -106, 62, 102, 2, 213, 47, -30, -51, -213, 52, -15, -78, 75, -24, 107, -195, -97, 79, 49, 79, -49, 16, 157, 162, 147, -39, 62, 16, 126, 61, -124, 44, 102, 118, 60, -104, -53, 116, 43, 37, 426, -63, 70, -26, 93, 139, -37, 195, -210, -61, 93, 121, 45, -20, 159, -169, -44, 72]
8155G2p7j5J65k95q4J57J17r0k1k2K28l7j8r1J31k03J68K4l7k28L31q3J30k33
8179a1K7P1K06l06n2L8q8P7J93k10J43k2
$$ y = [72, -5, -20, 145, -150, -234, -77, 40, -50, -71, -93, 135, 98, 80, -11, 120, -83, 85, 109, 72, -156, 175, 92, 222, -11, 16, 87, 293, -13, -65, -27, -115, -38, 155, -55, 88, 66]
8191F6
$$ Imaginary data points
##PAGE= N=2
##DATA TABLE= (X++(I..I)), XYDATA
0@%%%%%%%%%%%Pj5J6j6J6k4L2l2M0n3O1p2Q8j04J20j36J59j83K08k40K72l11L55
34A88l98M47n03N64o31P05p85Q73r69J073j187J310j446J595j755J933k131K348
52A231k589K856l152L488l870M306m813N407o117O984q068R470j1357J4046j8200
67a0378K5497m1888J39484k6112k73483K44663L2180j58557M1008O4388l8607
78a805J5523l8256M3754L3653q8816J2369R6666q9127n5016J34362m2363j03078
90h2134J16184J7149r2029L3341L3904j8546M250n7325M4461N3657r4526M597
102c7017P5561l2685k9819K2081R319R338l8479n96N1829m0940k4253M8291K18
115A2848m6231L9469J9156n7181K8340L5377n3793j60M0812k7783J0805j0930
$$ y = [0, 0, 0, 0, 0, 0, 0, 0, 0, 0, 0, 0, 7, -8, 8, -8, 8, -16, 16, -16, 24, -29, 32, -40, 48, -56, 64, -72, 87, -96, 112, -128, 144, -167, 188, -210, 237, -266, 298, -333, 372, -413, 460, -509, 564, -623, 687, -759, 836, -919, 1014, -1117, 1231, -1358, 1498, -1654, 1834, -2036, 2270, -2543, 2864, -3253, 3731, -4337, 5133, -6224, 7822, -10378, 15119, -26769, 112715, 86603, -186880, 57783, 89963, -68594, -27586, 36802, -1805, 13718, -24538, 19216, 52869, -35947, -23578, 73088, -16039, -71055, 63307, 20944, -82134, 34050, 51199, -40830, -7489, 26415, 7869, 12119, -45206, -745, 52912, -41614, -37017, 38544, 5859, -23960, -1879, 7440, 16778, -21701, -22297, 29532, -11408, -35661, 12630, 12848, -33383, 6086, 25242, -31939, -3599, 31778, -22015, -22175, 18637, -9146, 1659, -9271]
127i271j2203O1790m1671l9699P2343j1805n5002M8512l158l1697L7948j0841
139E246k4919L0500J4240m1767J2336K8666k6874l083Q142l238J1695o821k3056
152a8933L9516m752l4024L3999r769j5722K3952j2904j8023K8694k992j7731R567
165H78N684L836j4748J460P182k88q621p301J5877r14j0199L307N828l39O617
180H259k1635N087K8730l3843m469K4907q093q029Q282l288M729L836j0608N170
194i65k927M037j805p641L831Q879l07j6238J3195J4006j7790p962K1280q034
208A559q421J0648j2248J0379O752j2187P03R672P59n586n661M462J1461j7419
222e127j101J3185n1r444N56J3495p785k681K539k388N31L836r017O23R119o447
$$ y = [-9271, -21474, 40316, -1355, -41054, 31289, 19484, -35518, 12994, 9836, -21861, 16087, 5246, -19673, 10827, 25067, -16700, -4364, 24302, -2572, -5655, 2487, -751, 10944, 4123, -18933, 20583, 15831, -18193, 15806, 6037, -9685, 14267, 1363, -16660, 12034, 9042, -8689, 878, 6562, 10398, -4350, -2890, 4292, 4004, -4617, -11918, 3959, 3045, -7154, -3847, 1981, 1642, 8259, -13376, -8289, 20441, -13402, -17871, 7036, -1057, -9086, -804, -4092, 637, 4473, -6135, -965, -3892, 145, -1660, -9301, -5470, 3409, 3102, -13136, 59, 14065, -3725, -11687, 9593, 1559, -6862, 3786, -8462, 1917, 8669, -3518, -2815, 6857, 7616, 2030, -3631, 831, 12292, -5127, -6228, 6957, 6906, -2538, -1982, 11513, 3728, 1047, 3586, 1198, 1729, 5565, -3452, -2829, 6290, -157]
238a57L860o052L445Q049r874n099Q869J097r617K447N43P225n493o019O723M617
254D564k759j1961Q878M626p047l349M439J776L84j397m830J0357m773j692L25
269b459k981O433j331p112K100J2142o937n557L834P724l680r313O207K236R05
284B211p306K487P142k198l344K002L337k512K295p924N455L944o615m02K247
299H19N774l630k348p64P161k231o696J344M097K064r511L713L608J672m839l636
315c403Q338l4o989k557P612k007j614k922J577O703m590k800n50O532k619m900
331d223p89M767J538o661J253L243M237p058k09M004J32j185n747M466L432j795
347e95p064O062M616l386k952Q2P647m851k850J57N287n80m733K584K271K301
$$ y = [-157, 3703, -2349, 1096, 9145, -729, -5828, 3041, 4138, -5479, -3032, -2489, 4736, -757, -6776, -53, 4564, 1805, -10156, -1278, 3348, -3699, -7048, -2609, -833, -449, -1846, -6676, 3681, -1092, -2784, -2459, -5440, 993, -338, -7450, -5350, 6792, -145, -5702, -1868, 5856, 2176, -7137, -930, 1306, 2211, -5095, -2608, 4534, 2336, -1008, 994, 4331, 1819, 4114, -3810, 1645, 5589, -1026, -1428, 819, 6593, 2963, 615, -149, 7012, 4781, -1915, -571, 3526, 5590, -3921, -208, 3400, 5072, 233, -3403, 4935, 4901, -2088, -4645, 2967, 960, -654, -3576, -1999, 4704, 114, -2686, -3236, 3296, 677, -4223, -5012, -245, 1293, -5368, -4115, -872, 3365, -3693, -3902, 102, 234, -951, -6698, -2232, 1200, -595, -7659, -1597, 3019, -367, -3319, -3237, 4410, -441, -3291, -3134, 2153, 1573, -3160, -576, 1695, 3996]
363C996m919J011Q21L548l715l868N371R54k80n368L808L782p41n688O24O199
379E535k344l678l141Q516o19n428k90M459L415p892J2L196K715n570j768K370
395e12L876k038o899O811J083j279l539N17L141q11l457j188N012j677o09k894
411d463L998J323l147K16k760P051k057p074K588Q684m855o330N347M158k11r549
427g081N755N397m760m229K928O585n069l334M828L745o814L831J91m716O314
442C571j414l346j407P076O23p445Q39Q049j583p682L180K638L674r977j33J1837
458H500o207n629N006K792l596N96k513K222J012j706j554k017Q106n500k466
473b954M687k086L66K02m463L923M677j0856M273M097k789j242j236L938j313
$$ y = [3996, -923, 88, 909, 4457, 742, -3126, 2245, 3199, 2919, -2449, 1359, 5141, 4400, -1288, -664, 5535, 3191, -487, -3628, 4888, 4269, -1159, -1449, 3010, 6425, -1467, -1455, 1741, 4456, -1114, -2882, -512, 3364, 1326, -5573, 1238, 2321, 1042, -2497, -1980, 1161, 350, -3107, -4295, 717, -960, -1569, -4463, -465, 858, -2289, -2073, -4833, 2218, 161, -6913, -4325, 4359, -496, -6826, -1479, 2679, 2468, -7081, -1326, 4071, -689, -4918, -1990, 4595, -474, -3808, 1020, 4765, -2049, 1782, 1973, -2743, 3571, 2157, -1189, -2596, 4480, 5103, -2342, -1503, 6546, 4963, -2719, 461, 3099, 6773, -3204, -3337, 8500, 2293, -3336, 1670, 4462, 866, 1462, -1051, 1171, 2183, 477, -1077, -3094, 5012, -488, -2954, 1733, -353, 13, 215, -4248, -325, 4352, -6504, -2231, 1866, -923, -2165, -3401, 537, -776]
488g76n67j306l06K647J930p983L477P200q489K806m76J940K632p288L62P841
504C644j758p972L932N812o11r731Q315M150j0707P421l21m515M159J150l638
519f70J250o99L837J61r289R230K792p100l743Q101N084j4358J350J4059p035
534B970r584J1024j341k518K4k718O648m957j775N260l198k059M524j027l191
549a918M03L034K111j2006Q416O227j2556K656N768j461l439j295M617L003r646
564f086L228N009m630J686l258M422l59l766N383k883m053R093l163q326J0540
579B837k007k572j87J073N151o606J66N129j610l149K317j49K763l957l92O621
595E428p931N114J872q088N940K711n711J01J825J806J91p841Q452J187p440M258
$$ y = [-776, -1343, -2649, -2955, -308, 1622, -6361, -2884, 4316, -4173, -1367, -1843, 97, 2729, -4559, -4197, 3644, 1886, -6086, -2154, 3658, 3047, -6684, 1631, 5781, -4926, 2495, 2174, -2341, 1818, 2968, -670, 580, -119, 3718, 3879, -5410, 3820, 6612, -488, -4231, 3870, 8954, -5404, -4054, 10005, 2970, -6614, 4410, 3069, 551, 575, -2143, 4505, -452, -2227, 3033, -165, -2224, 2300, 1273, -1918, -1515, 1519, 3630, -8376, 40, 6267, -6289, -3633, 2135, 674, -2765, -4060, 557, 3560, -6086, -2858, 2151, -2479, -793, -4051, 371, 12, -3754, 1629, -1254, -5307, 3786, 623, -7703, 2837, 830, -1742, -1929, -856, 4295, -2311, -2145, 2984, 1374, -1775, 542, 393, 3156, -801, -1193, 5428, -2503, 2611, 4483, -3605, 2335, 5046, -665, -564, 1261, 3067, 3258, -4583, 3869, 5056, -2384, 1874]
611A874p94J227j746k356M611m71n631N111p03k361M461o353L874l11j520K993
627A905n727K030N346n213k547M817j870L496n733n45Q419p483m24M023j274p95
643a575n05K35L598l950m05L938m804M996k722k255M442j683J379j547k089N786
659B839m41p355P049l65k599K338l774N669j658l522L941k89j354J871k707J515
675A158K500m852L396j755J358J197n358M606J070l506M67R61m72K821n616J323
691g02N011n617K421k002J065K632m334n3L092k029m92P51k204M855m335j85K734
708F08k212K542l489k14M205j965l203L393j039J469j039l604O736k656k084K462
724i0j523J589j48k362K356J302k586K074k356L000j9m134M227m96k87n73n28
$$ y = [1874, 1080, 2307, 561, -1795, 2816, 2345, -3286, 1825, 1122, -1239, 3222, -3131, 743, 432, -1088, 1905, -3822, -1792, 3554, -1659, -4206, 611, -1259, 2237, -3496, -4041, 4378, -3105, -3529, 494, -780, -1575, -2080, -1845, 1753, -2197, -2602, 1336, -3468, 1528, -1194, -3449, 993, -690, 689, -858, -2947, 2839, 2398, -4957, 2092, 1727, -872, 1466, -2308, 3361, 1703, -1819, 2122, 1833, 479, 2350, -357, 1158, 3658, -1194, 2202, 447, 1805, 3002, -2356, 2250, 3320, -186, 281, 1242, 770, 3591, -2025, -702, 4309, -1308, 1113, -889, 176, 2808, -1526, -1579, 1513, -516, -1008, -257, -2461, 2394, -1941, -2126, 608, -1604, 938, -2551, -2765, 1440, -525, -3728, -335, -1374, 95, -944, -4548, 2188, -468, -2552, -90, -1613, -24, -172, -2534, -178, 1124, -1462, 612, -1744, 1256, 1237, -2897, 1330, 834, 547, -26, -554]
741e54J899R98l893J995K014k505K726m261K998J951l846P36R27R86o14j615L47
758B89L629l967L32R21m22K013m296J637J988j474p28q9L50J963k432k462M447
775A699k011K94j203l23L010k486r65J234J134j323j00j738L253m47k966K461
791d77q46J733k372m74K817m03j926P38R02m36J341l706L391J9j144L17q50K790
809A414q59k280Q09K721j573l63o7J324J304m023K563M31k16m81r08J660N16j321
827F51r56K474r91N08k458J260K512k882O22q71J687j14j204r34J928J91k100
844f77O63k93K209l128r0K009k88o75j540J843M11n72k408K283K06q35l37n26
862a745J947j519K90p29J168J65j261j03J080R72k329J472p13J572m67j831J330
$$ y = [-554, 1345, 2343, -1550, 445, 2459, -46, 2680, -1581, 1417, 3368, -478, 258, 1185, 2171, 1557, -58, 289, 3918, -49, 283, 1204, 782, 2795, -1501, 136, 2124, 650, -78, -167, 183, 2146, -286, -2748, 1699, -312, -18, -1221, -1544, 1466, -1020, -1985, -751, 383, -940, -1040, -2778, 475, 28, -2938, -477, -1323, 410, -1962, -2436, 381, -22, -1948, -1210, -308, -744, 597, -3109, 282, 301, -843, -526, -1376, 1414, 555, -1725, -916, 1805, 232, -131, -198, 1126, 2430, -1593, 970, 1401, 1185, 704, -204, 1456, 1972, 651, -305, 2169, 1178, 1686, -772, 488, 3000, 118, 740, -131, 1556, 1442, 238, -696, 1232, 1423, -677, -14, -307, 1902, -1226, -1316, 693, 405, -270, -1810, 33, 444, -128, -2536, -253, -47, -882, -1219, -1745, 202, -1317, -1027, -1756, -588, -423, -1684, -1787, -707, 265, -2064, -592, -1305, 267, -200, -2031, -701]
879g01J404k34k591K101P07qj568N80J491n58l25j446L172q16j660P07J077j70
897A162j295J416q85J304j044m6k53J171M32k611J690r7P89j772L50N69P43j066
915E57j589K530m08j295j092K899r39j218Q06p32J307j248p64L5K371k016j135
932a931K205n70l06j242J667j164J244o09j708K760n55j447J73J695j895J761
948G8j178q95K814j153o14q93L265j528j635J263J345l63j694Q93M37J952l572
965a478J288K418k434L72K97R35j283Q63n77N10p27J562m12k524L798j580o05
982D23j4M06R32j191j404J897J577l538J013O29J142k535m96L602l172L74P08
999C53p25M99M32j947J312M08j995K704k843J107J138j659p64J171J562k237p17
$$ y = [-701, 703, 469, -2122, -21, 686, 678, -890, -310, 1181, 623, 298, -1148, 2024, 1208, -452, 255, 1332, 1162, -133, 1283, 398, 1702, 658, 612, 359, 1530, 1962, -649, 1041, 944, 1733, -39, 311, 880, 1623, 557, -1032, 1498, 1090, -205, -1297, 1602, 663, -555, 251, -481, 826, -422, -1186, -1151, 1220, -796, -1931, 274, -296, -602, -1844, -177, -1341, -97, -706, -2414, 346, -209, -1656, -1483, 212, -1683, 78, -1100, -1995, 819, -334, -948, -1841, 1424, -104, -1739, -476, 869, 506, -1188, -295, 142, 2094, -1478, -190, 2228, -206, 166, 463, 1398, 115, 978, 401, 911, 184, 1746, 1334, -1190, 2608, 1028, 423, 409, 815, 1747, 556, -848, 1049, 2626, -912, 101, 730, 1872, -663, -1159, 2443, -729, -355, 353, -372, 127, 559, -1388, -76, 332, -1663, 1041, -1802, -695, 443, -1216, -1980, -809, 753, -1484, -2201]
1016b201J926J356l388J450O16p23J427k823K215N19j751N77J083j495J565m03
1032e0j850L379k154J387j288KK790k716l60K075j9j455Q64n95K077j818p51K997
1050B515k834J788n52j006J589n61q14J161r30M73J389m193L516J79k630J212
1066C02m79J992j685j431J792R91k594J382m27j8J034l133L295j510r65K017j946
1083a383QK144j921o09K108j719K273k965J81L888l744K47J045O93m20j473K98
1100a349K610k654J80K031k520L103k424K90J873j968J177L19j886K099K27l124
1116b016L955j658j53N70j623L477j867j347J604M08p05Q0j373K247J76l109L396
1133B062k089P93P27k446K226L6j869J426m05p90K325l809J903J874l404K066
$$ y = [-2201, -275, 1081, -2307, -857, -241, -964, 463, -2360, -145, 374, -1377, -800, 283, -1212, 353, -50, -1900, 1479, -675, 712, -576, -574, 2216, -500, -860, 1215, 1196, -259, 605, 10, 2087, 269, -482, 2515, -319, 1469, 917, -89, 1500, 939, 125, 1286, 356, 829, 2218, -1975, 1541, 1720, -910, 302, -177, 1815, 130, -1301, 491, 1482, -1112, 270, -157, -175, 859, -2274, 1021, -489, -1454, 563, -1383, -1375, 769, -1152, -1761, 347, -1372, 901, -2064, -1883, 2005, -1739, -1492, -447, 246, -174, -1647, -1349, 1261, -1393, -1213, 818, -1702, 1401, -1023, -733, 1140, -828, 349, 668, -1218, 881, 1108, -2016, 1939, 281, 128, 698, -925, 2552, 685, -662, 942, 1350, 645, 725, -648, 1599, 1775, -1334, 2062, -27, 766, 1493, -953, 1273, 1309, -560, 866, 461, -329, 1996, -1813, 90, 1964, -1440, 626]
1149F26j367Q32Q31k479Q80J652j671K30k55q05L340l883J112J049j786K369k079
1166a404j36K345j597j122K380k137J644l96j726L561k665P0J460o27O52j080
1182g78o36K183m84j268J975k325K996n77k682L051r83k1N12j509R83J639l320
1199a244K344M01j945K201k567K422j40k310J978j22n58O49j452M44K347l236
1215g88J633k78o76J968l255J395R35j169K13L4r02K335k068o50K867l069J319
1232a56n94l01J784j929k01J427l32o55M05j261K600j730q00J932j572J562p54
1249e75j196K209m98j281J373r36M87J036k420K530o08r25J400j090J363k01j287
1266f19R95Q74j552J114j131J159J204l244K079n6j64K61j074Q84P10j450L05
$$ y = [626, -741, 91, 922, -1557, -677, 975, -696, -466, -721, -1526, 1814, -2069, -957, 92, -1694, 675, -1404, -1540, 805, -792, -1914, 466, -1671, -27, -423, -2149, 1412, -1253, -1183, 277, -350, 302, -778, -1414, 769, 285, -983, 992, -1333, 1663, 1086, -1596, 1455, 472, 451, 963, -546, 437, 2076, -1244, 1100, 1501, -444, 1757, -810, 1612, 1472, -838, 1140, 1018, 460, 1109, -343, 101, 2448, -788, 845, 567, -109, 1859, -1396, -1, 934, -235, -22, 12, -890, 1445, -623, -1273, 1594, -1475, -156, -750, -1051, 733, -1196, -1397, 30, -302, -957, -552, -1813, 787, -943, -1743, 189, -1383, 179, -575, -1771, 438, -60, -1341, 32, -904, -417, 619, -1801, 729, 121, -804, 596, -494, 869, 668, -619, 376, 1250, -302, 812, -319, 840, 2044, -1200, 879, 823, 659, 920, -154, 730, 1440, -10, 295]
1283B95J105j721J838j686L91J388k272J115j13pL84p65p96K131j502j0N59j325
1301i91K349k314j32J344p61K3K0l18P09m25j604K697j478K7O02j190K032j166
1319e76l07O81j97q1N25j144R21L81j598J456r16J219m42r46J248K30o60K22J3
1338B9o6J291k161J467O65j672J375r23J067n21m05M4Q35o46P8P5n26J466j726
1357b54P76K31m01P07j194L10N98j43j104J160o22N82o80o02J786j423K70n24
1375e27K97M60o69m10J015n2j027Q79r64Q18j49p88J039j85J14p72K73L90K68
1394A0j241Q07L66m46M33j279J455j61m70j99P07O3k08O4m99J193q87K80l44Q43
1414D87q8j030J167k77K79n36L23M05J66m80k41J007p38L0l63O47k50k17L74k40
$$ y = [295, 1400, -321, 1517, -169, 222, 1610, -662, 453, 340, 333, 717, -48, -844, 1287, -215, -225, 334, -991, 1358, -956, -1088, 256, -505, -482, -462, -780, -71, -496, -2100, 597, -881, -854, -252, -1442, 590, -576, -883, -202, -399, -480, 45, -1099, -178, 203, -1395, 61, -855, 364, -78, -1024, 224, 454, -206, 16, 29, -37, 1254, -907, 560, 1225, -447, 928, 5, 1072, 551, 146, 190, 1025, 379, 457, 532, 6, 1472, -254, 522, 753, 352, 1059, -135, 175, 773, 630, -474, 686, 64, 646, -34, -636, 1150, -273, -3, -527, -230, 230, -439, -849, 166, 114, -913, -34, -998, -180, -329, -1117, -78, -263, -149, -921, -648, -258, 10, -1231, -424, -58, -504, -71, -1350, 105, -56, -526, -725, -18, 45, -163, -99, -598, 595, -292, -12, -356, 487, 399, -631, 536, 259, 538, 2, 325, 730, 896, 416, 175, 1182, 444, 474, 111, 758, 508, 291, 665, 425]
1434D25M67m74L9n21J116n08l53j37K06M87j452Q86j50N16p90K2N13k39l38m62
1454g47R80n16J25p5j70K46o58L16n42R43m20j66l59M96O82r38P3k12J230j480
1474a192P54L15Qr4l79P24l87L39o50N48k7K92l77P3O90r37R37j131O53N99o97
1495F1k26J033L6q82M44n09J513j331l19J248n08J99o34N02K61l89n24O36j47
1514D64k82M59j074J390n74m80J45j61Q98q26m64K77P93j312P66l11P3L71j542
1533a390J133j75j98J99K8J00L3k60o6M49j019J307j158M52R89j700P24k28O17
1552a63j2l68J85J010j232j06J207r26P79j014P50K88n02J91J44k31M14J50j065
1571e01J798j091L38l40k05J265p58n80J029l65l56L14o10R62j70j242J779j341
$$ y = [425, 892, 418, 457, -64, 1052, 544, 191, 54, 260, 747, -705, 181, 31, 547, -243, -221, 292, 53, -285, -747, 233, -283, -158, -233, -403, -157, -815, -499, -1041, -98, -518, -684, -1043, -547, 135, -803, -730, -942, 288, -1192, -438, -123, -115, -209, -588, 136, -251, 88, -562, -14, -41, 251, -126, -53, 637, -300, 637, -494, 159, 758, 61, -165, 868, 904, 22, 466, -43, 1470, 139, -180, 1068, 560, 759, 125, 627, 888, 499, -25, 611, 464, 182, 641, -433, 957, 383, -97, 48, -113, 785, -41, -505, -228, 565, -747, 19, -292, -219, 152, -1390, -257, -432, -630, -431, -403, -303, -270, -530, -596, -147, -1166, 141, -1017, -565, 424, -1276, -552, -780, -163, -175, -543, -358, 652, -580, -686, 521, -405, 374, -640, 110, 398, -104, 87, 231, 0, 414, 564, -501, 1297, 206, 544, 204, -1, 1264, 506, -74, 955, 590, 234, 548, -62, 900, 730, -512, 1267, -74]
1589g4O01P1p58Q57l72o21O22m93k05J267j946J220M12j338R29j010Q15O3j073
1608a033P62P03j324N36l15j96J338j898J134J42j039J322q19M2R05p64j85J003
1626C14j311J368r34m37J546j342O36K09j19P72o71q63J788o74o32J385j485J511
1644A061q28n37J468r87J51M20p83R14L3j462J775q21m39J236j568J303l04q59
1662b27R03k45l43O57p53M37O75j972J386o37m5J157j855J047K80j312P56J31
1680D0o90J287j580J42J249j686J595j273J59J019j176K95O27p47N70L4j125J838
1698E78j360L70R42j531J301p33k16J029n03n38J190p30M02Q9j503K424j196j81
1716a66O14o15J267l16q51N79J00o97J352j463R27K03j375J583o93j80M41p19
$$ y = [-74, 527, 598, -160, 697, 325, -296, 326, -167, -372, 895, -1051, 169, 581, -757, 172, -838, -23, 40, -1033, -271, 432, -892, -356, -671, -867, 471, -1427, -293, -151, -1190, 132, -687, -645, 260, -504, -689, 314, -997, 371, -563, -1000, 546, -796, -160, 49, -70, 702, 31, -832, 956, 282, -350, 1035, -450, 1061, 233, -304, 1164, 177, 328, 748, -35, 879, 912, -550, 1225, 404, -35, 1201, -367, 936, 632, -227, 676, 431, 88, 745, -8, 429, 1104, -868, 518, -119, -164, 993, -862, 185, 465, -847, -91, 40, -650, 637, -943, -801, 448, -1238, 357, -916, -757, 262, -914, -619, 8, -739, -169, -135, -1260, 578, -782, -412, 530, -1001, 300, -433, -649, 380, -123, -661, 529, -201, 201, 290, -1213, 1211, 15, -166, 448, -167, 1100, 784, -67, 512, 612, -85, 1267, -196, 731, 934, -441, 1142, 449, 269, 710, -9]
1734iN93L68j251O79O19j272J615j872Q01P79j563P78k90j81L87o34j88J405j731
1753i67R28P8r61J454j405O61K57r10M98L36o15O18m81p17J803j402N81R5q87
1772a036J392q32k75P01q0k1M70j715J839l15q02J269j043N74J57n97Q58l07n66
1791c29J077q31j0R65j528J415k77o27Q90j121J087K08r17L89P21j306J275r67
1809A14j93J402j606P87k64j69O02o88M8P36q71j66Q75j146R67j029L5J243j296
1828f19N57k12k48N29m18o93J308l28m61Q73j363J386p29k58L30l19J85J17l27
1847f90M32K40j304J523m23n9K80p40J079n80k3L17j86q1N14o24L19O39r42R36
1867F27q77M78O69j293O66M28m14P7j03L1O66r21K90M49p38P42r28N58J22m60
$$ y = [-9, 584, 952, -299, 380, 999, -273, 1342, -530, 271, 1050, -513, 265, -25, -206, 181, -453, -641, 764, -967, -39, 39, -922, 532, -873, -212, 45, -865, -367, -31, -646, -28, -509, -1226, 577, -825, -244, -149, -1036, 356, -476, -751, -50, -130, -151, 319, -1396, 443, 128, -674, 595, -448, 126, 283, -314, 544, 237, -329, 748, -83, -93, 872, -656, 759, 482, -145, 745, -376, 711, 919, 2, 391, 1112, -194, 1081, 114, -79, 1323, -283, 504, 240, 71, 673, -15, 33, 769, -102, -268, 607, -539, 428, -601, -566, 677, -619, -62, -274, -522, 7, -411, -1104, 204, -124, -585, 288, -1075, 311, -418, -676, -346, -665, -480, -363, -690, -258, -18, -1322, 201, -222, -281, -1, -741, 338, -242, -265, 52, -134, -215, 299, -325, -6, 633, -309, 627, -250, 228, 897, -396, 270, 698, 284, 361, 258, 289, 955, 34, 324, 773, 35, 777, -151, 407, 529, 69]
1887F9K41L89n60J69j4p11J166r67K61K83n32O19p15J59L88j63n81O77k90P4r7
1908a35p08J070r79N61k06n40O32O8m70J42J81m08P66r07Q49O0p27O24l04M20
1928a1m50K43K76M0m64J94M07m74L73l92P26m76m6K03k44L87K37n46JQ91p92O18
1950G01l92k54Q53j007M67j78M10n20K92j3K6j29j60O24o38L30l02K85O1n43K04
1971A17l4J83o94Q07q48L35J02k59j5j67O85q97M67j13J28k33j74M10j38K40m53
1992e51M96l50m3J10P4J86l01L15m15M63m1k02nk01O70m25R5j96P25n79M6M13
2014B84l79L59n13M58J41J12o09M40K29k25J13k51N61p15L25k36L58J26l63J13
2034C28K04j00l72M59n43K57j11n9Q9l11L14n9N1l92N53n33K47R6j49R8o56O53
$$ y = [69, 310, 699, 139, 308, 294, -417, 749, -218, 43, 326, -206, 413, -302, -143, 245, 82, -499, 178, -112, -38, -135, -843, 227, -752, -191, -397, -937, -305, -237, -707, -565, -384, -792, -26, -933, -84, -24, -751, -127, -431, -11, -461, -218, 58, 98, -366, -172, 235, -239, 134, -258, 468, -8, -54, 149, -95, 292, 529, -17, -16, 875, 83, 701, 309, 55, 908, -99, 368, 190, 600, 80, 372, 359, 385, 256, 96, 720, 82, 412, 110, 395, 456, -87, 117, 83, 266, -428, 379, -469, -134, -32, -291, -306, -473, 212, -685, -218, -331, -203, -436, -610, -200, -338, -98, -551, -55, -405, -448, -338, -264, -78, -379, -64, -479, -16, -57, -259, -264, -465, 205, -220, -125, -321, 404, -175, -129, 284, -95, 264, -249, 209, 350, 462, -147, 293, 522, 297, 410, 159, 720, 5, 330, 94, 452, 578, 215, 328, 532, 432, 60, 519, -24, 233, 122, 63, 152, -159, 155, 96, 147, -245, 308, -225, 22, 118, -31, 67, -589, 64]
2056F4n39J22O6j0L09m66k07L16K21m99L78l74k6O44p02O75l69K63j35q5J7J53
2078a84K10n28P07o34N16j94Q4K49m43L89j52L1J26J5k82N90l47j06M73m08M75
2099E87p14K20N69j96j54j68J26LM87r99Q05l56Q4L91q86P16l43j67L39k96R5
2120A43J15m13K38L35q28R38o39J75q7n91N80j09j92m0K83l11M99p54M34J43p14
2141g95Q36p01L48M08q31M20J95k25P5O7n40J152q67K12N31q02P79l05l5L17k09
2162C0k78P75o42L82k91l86J114r01L97J49j78L66q9n16O72l32j91O42j176J110
2182F57j24r13J000m65J11R4J14n99O95q90Q19l52n42J024j216Q86j07p96P10
2201A06k23l7NM3k28O26j010O59k12n00J199j114L58o6r1j6J37l16P24m25k48
$$ y = [64, -475, -353, -287, -297, 12, -454, -661, -345, -124, -623, -245, -619, -645, -1, -703, -28, -397, -134, -269, -354, -337, -184, 26, -502, 205, -429, 87, -107, -23, 226, -217, 172, 20, 51, 177, 192, -90, 500, 153, 47, 520, 112, 587, -127, 93, 662, 466, 312, 144, 270, 273, 760, -239, 566, 210, 294, 685, -201, 515, 172, 5, 344, 48, 143, 258, -155, 83, 418, -410, 528, -111, 64, -23, -614, -34, -143, -335, -375, -92, -403, 96, -658, -224, -81, -795, 41, -660, -312, 96, -735, -315, -120, -345, -270, -203, -743, 409, -458, -246, 285, -517, 262, -43, -78, 239, 30, -248, 527, -115, 267, -24, -410, 704, -197, 200, 349, 171, 537, 448, -68, 604, 272, 81, 723, -453, 657, 533, -380, 620, 155, 266, 360, 474, -125, 570, -320, 499, 147, -395, 629, -587, 299, 192, -604, 106, -117, -154, -149, -106, -334, 292, -718, -59, -271, -771, 428, -686, -328, -394, -485, -501, -364, -680, 44, -381, -629]
2222f29R91j248R22k80n5O11n86KL47j65j05M02o45R83o96l7P88r36J086n26o03
2243c79Q19n6o10N32k68k8O71j004J068m32k10M88p56P75p1m53L56K21r58J061
2263G66q58K71N33j239J049n58n2M34n49OO98r72N59j32m26J210j034K8P99j372
2283h39Q15k96j03K95r8l06N79p54K75J44m92J247j294K93O32m73O5J99o93R38
2303A34j60o17J020q20L99M18j160J110n85q6P48m93J76K24n62N15K27o12Q50
2322G26r59P60j13o06N69K5k92K04j98K77K71q37L82J52o09Q38o99K26J49l16
2342e0L92J33p42O63j95m52Q31j188O82N1n06O55m63l48N62k28j59M43q87P60
2362d6p5n90J048r48M34M0l24K11q5j15M84j81k19O02q16O25K5n34O95l82J26
$$ y = [-629, 362, -886, 36, -244, -299, 312, -274, -272, 75, -90, -195, 207, -438, 545, -151, -188, 600, -336, 750, 224, -379, 440, 384, -226, 306, 38, 10, 681, -323, 745, 313, 103, 591, -165, 610, 539, 86, 442, 663, -295, 766, -92, 179, 712, -527, 522, -36, -88, 346, -203, -197, 501, -471, 88, -44, -470, 740, -294, -266, 533, -839, -24, -320, -423, -128, -226, -532, 47, -707, -432, -288, -780, 467, -827, -534, 98, -375, -310, -111, -804, 134, -26, -643, 377, -443, -44, 374, -786, 324, -261, -347, 401, -92, 84, 308, -254, 261, 488, -124, 726, -233, 527, 414, -192, 377, 402, 110, 314, 116, 393, 664, -173, 209, 361, -248, 590, -109, 117, 266, -50, 342, 475, -267, 396, 201, -251, 580, -608, 74, 125, -381, 274, -189, -537, 25, -203, -362, 81, -806, -46, -121, -711, 337, -611, -177, -137, -461, -250, -335, -450, 34, -147, -366, 236, -580, 45, 70, -464, 231, -151, -25]
2383b5p9q8J1N22o14N93l30j09R57j558R70o6m7K18l08j8L49k85J24N54q29N52
2405D94l37LL52m44L68j29k29K34j61m58Q08l25m7J55m59L74l48j1N65m55k08
2426b58K37j13pJ92n00Q33p33q1K66j33K72j33j40J17r7j38K67j0k04K31l65O63
2448A66n62M19J45l66J50k11j0L10ml21M44l21J28J41k52L79j61l3J56l63K10
2469D4M21m09N8M45n87N14m08L76o8k87N90m79L07l35K51k24L09n50K87k44k0
2490iN36o25J98J93q1j9k45k9R5O8m68K42l9M5k61L04K2j62j9l0L68l43J94j00
2514a65J19Q8o09N56n34M60k79K85K64m13n8p3K35r5P9k43K58k7K61N0l60K04
2536Cj74M40l43K67k50K28nk95M92l99L46k63K28j82j02K27J0K42m39J63k50N00
$$ y = [-25, -104, -192, -181, 341, -273, 320, -10, -119, 838, -720, 250, 184, 137, 355, 47, 29, 378, 93, 217, 771, -58, 494, 157, 160, 512, 68, 436, 307, 78, 312, 151, -307, 501, 176, 129, 284, -175, 199, -149, -160, 405, -50, -258, -21, -134, -141, 51, -449, 384, -349, -430, -164, -297, -25, -158, -298, -181, -278, -416, -149, -159, -363, -132, -497, 166, -396, 23, 168, -198, -48, -259, -269, 41, 37, -284, 160, -161, -33, 108, -144, 235, 74, 41, 197, -166, 44, 465, 56, 114, 559, -28, 486, 78, 454, 386, 99, 689, 210, 517, 182, 433, 209, 518, -32, 255, 11, -9, 527, -98, 100, 293, 212, 193, -52, -81, 14, 82, -386, -144, -183, -138, -399, -95, -73, -235, -254, -284, 84, -259, -65, -165, -46, 42, -567, -11, -545, -85, -364, -79, 185, -228, -286, -359, -124, -219, -140, -383, -125, -152, 109, 159, -201, 3, -171, 269, -74, 193, -57, 171, 166, -129, 363, -36, 310, 47, 275, 93, -9, 218, 228, 470, 31, 194, -56, 444]
2558D44j90j1J11l49L32l39L05j51K08m02J39j98K16M8l62O94p19J84j20J04J25
2579F9m79K72Q4Q6j23Qj74j3O8k03J81o0L53n13L98j52j68K25j55L00l87L03j93
2602b73P1J15J26j71j69N20l86L48j39k0K53k72r1J45L37o29N48l89M52k31m2
2623A03N21n04l6n5Q1k5J66p1J53k26j18M43k57J46l35J55L13j96j65KP0J52l20
2646ck84L75m5j86K43l73L14j05Lp3P3j06p5k3J24K53n90M65m28L46M0n74L89
2669b40j09r5K26M1m10N77k64J33L47m46J13n8Q3J59n10L30M24m03N06l45k94
2690b35N67m32Q5N11l87K65m10JM51m5j32L69n72K64%j68N48p64K55J51l62K85
2712B45j2j91J10m1k45N30o99N14J2m40L55n41J63R4j23J41J98m41K11M4l37N56
$$ y = [444, 254, 243, 354, 5, 337, -2, 303, 152, 360, -42, 97, -101, 115, 163, -199, 495, -224, -40, -160, -56, 69, -410, -138, -54, 32, -91, -83, -257, -270, -202, -405, -224, -284, 69, -444, -46, -198, -366, -141, -296, 4, -383, -80, -273, -202, -87, 39, -132, -301, 219, -167, 181, 42, 22, 275, 3, -88, 57, 394, -235, 313, -76, 376, 145, 103, 624, 120, 84, 29, 110, 85, 251, 180, 333, 107, -11, 432, 175, 321, -14, 141, 454, 258, 93, 95, 165, 317, -3, -287, 88, 43, -143, 100, -273, 41, -64, -61, -134, -61, -167, -242, -265, -141, 112, -478, -13, -441, -95, -55, -629, -240, -349, -444, -218, -177, -587, -10, -274, -141, 206, -240, -127, -185, -102, 57, -453, -123, 301, -102, 404, 59, -235, 332, -100, -15, 496, 109, 374, -36, -35, 416, 371, 239, 608, 36, 300, 300, 132, 680, -84, 171, 322, -40, 245, 233, 42, 152, 111, -134, 396, -303, 211, 223, -217, 138, -403, -240, -146, -269, -128, 70, -371, -160, -116, -453, 103]
2734A03n24K99J07l37K99r9J40k7l92L23O9n62K60K04l02Q10q40L72K24l34k1
2755b28L08m15K97j95n5M79l72O68k98j87M00n89L87K34k38n3Q2l42P49n28l3
2776G1N17n41N1L09m78N02k43j95M08m62P6L66n88Q05k88n10N99m03P9k92j54
2797c71N23j14n66P90n74M99K08r44N76m82R1K85j84QK53k52K59K2m27N14n39
2818d25M18L59r73P42n1l80L31q9n91Q97l90R7J53p43R64n32K74P7l07J91Q5J7
2840A24M5N9n34Q39n28K3M33n55P92n98j83L90k00k11L71l97K68K59l52M98o61
2861a18N27N5m97L96l09j9K41l09j79O60n36K20q3m66N41l78K06J10r6r9J91l77
2883c19L15n4m04N38m36K94l38K42L7l32j6L66j35N6K94n03M07m48RN45p12O04
$$ y = [103, -421, -122, -15, -352, -53, -152, -12, -39, -431, -108, -39, -601, -341, -137, -439, 371, -469, -97, 127, -207, -228, 80, -335, -38, -233, -288, 191, -181, 487, 189, 2, 402, -187, 200, 434, 196, 143, 225, -117, 632, 104, 71, 588, 47, 98, 407, -71, 431, 188, -7, 401, -61, 15, 381, -207, 598, 310, -200, 399, -4, 75, -217, -371, 152, 38, -528, 262, -312, 187, 395, -549, 27, -455, -364, -79, -263, -255, -2, -254, 5, 27, -400, 114, -425, -7, 352, -621, 121, 70, -310, 21, -68, -659, 238, -152, -55, 98, -645, 319, -213, 61, 138, -169, 22, 107, 124, 169, 228, -306, 533, 5, 28, 461, -94, 698, 100, -83, 307, 107, -104, 267, -130, 138, 397, 45, 543, -118, 409, 464, -33, 363, 54, 35, 276, -33, -212, 448, -88, 132, 49, -417, 124, -254, -48, 62, -34, -133, 58, -319, -4, -58, -462, 76, -360, -66, -404, -162, -125, -457, -473, -107, -242, -186, 108, -395, 12, -436, -427, 118, -594, 10]
2905A0M7m43O81l18p1J25l7J36K00n42O40l43r7L25k37O8K31m09L44j8j15M16
2927E93l92n8L63m41M26k94k68N39m73J40L33m51M1M36m40j11P2l1K44l82K99
2948A45j72l3K12n3n24N37j08k04L25n17P52o60j40M43l77P6J63o6j42J37l66
2969e72N68jk63L53o49N83q5m54P69p7n14K90j31K23J05l48N96n94J35J24o3R3
2991H8J48j1j31J88l18N91o51J85L90l78J84l26K40nk38N01M0l64l0L52l93L49
3013D11n18L51r9m10M47l16j1P8J67r8K34k78m4J31k90M88p50M74j94J61r7j9
3035a82M9j33K68l72M64m08J14p6k24M94k95K8K36j1n38N87l13L84j52r3L94j85
3057C6k22J76N4j70L66j85r9K47m00O25o87L55K0o6J41j94J22o5L20l14R2M32
$$ y = [10, 57, -386, 295, -23, -94, 31, -6, 130, 330, -212, 428, 85, -12, 313, 76, 144, 375, -34, 310, 292, 177, 593, 201, 143, 506, 65, 491, 197, -71, 468, -5, 135, 468, 17, 58, 494, 54, -57, 15, -16, 228, -154, 145, -27, -60, 152, 99, -425, 112, 4, -200, 125, -392, 360, -300, -440, 3, -374, -298, -135, -201, -343, -206, -572, -4, -5, -268, 85, -564, 19, -66, -520, 249, 172, -342, -52, -183, 40, 145, -203, 393, -201, -66, 58, -5, 88, 236, 225, 94, 282, -36, 555, -96, 89, 479, 101, 285, -41, 199, 194, -44, 457, 497, 133, 103, 455, 62, 411, -107, 244, 145, -265, 182, -134, -145, -67, 100, 2, 236, -42, -86, 45, -245, 243, -507, -33, -227, -66, -163, -182, -133, -266, 2, -370, 94, -314, -200, -276, -500, -6, -301, -273, -37, -48, -586, 1, -312, 72, -80, -173, 221, 36, -186, -10, 44, -126, 240, 55, -44, 203, -197, 428, -259, 96, 116, 50, 191, -3, 119, 54, 374, 60, 152, 584]
3079E84n12j84J63K13l85M43k49j51K86k63J01k08K52m9J98k60J26K0l07K92o6
3100D4R3m76O07o97N13k09R5j54K27l26l69N28l4p0M5J00r9M9J14j47l6j4oM28
3124B06m13J16kK49m97L60l94L17P7kK22m32K41O9K8k29L31k49L6J72j7J78n41
3147a74L11j37N7R4k31L98j9k27K65J91m09j5o7m6J89j73M4n6J37L3j73Mk01L52
3171A47j61J87l31K57j6k01L12k37L3R2l01j55K84j39M24k49n8R4l71N52k93k30
3193c60J62K01k52K50k42p2K15j64L60k70r1M52o37N50m7k79K53j8LJ88l13O2
3215d9L94m01N33m40J78J60m07J23M03m41L01l2o4K64k73j19J04j84K27j86jJ26
3237B16j03kJ6J49m8j01n35R13o23J57R1n23K48K17m69K33K28k06O20n80n5O8
$$ y = [584, 72, -112, 51, 264, -121, 322, 73, -78, 208, -55, 46, -162, 90, 41, 239, -21, 105, 125, -182, 110, 44, 137, -339, 268, -429, 84, -125, -30, -184, 43, -283, -652, -124, -158, -228, -183, -83, -182, -133, -19, -166, -202, -216, -222, 206, -207, -91, -93, 156, -341, 19, -375, -58, 19, 17, 239, -193, 48, 117, 145, -84, 247, -2, 34, 206, 189, 367, -174, 137, 0, 57, 151, -80, 318, 299, 72, 337, 528, 119, 104, 37, -9, 180, 7, 51, -5, 132, 165, -8, -4, -205, 147, -14, 173, -158, 99, 83, -118, 194, -43, -10, 82, -219, -374, -90, -229, 195, -54, -112, -18, -389, 163, -130, -360, -198, 3, -249, 1, -241, -313, -98, -262, 98, -172, -263, 189, -448, 102, 55, -224, 29, 11, 14, 202, -111, -49, 345, -56, 477, 37, 215, 375, -32, 91, 494, 53, 354, 322, 258, 522, 249, 130, 234, 50, 277, 91, 90, 216, 113, 111, 127, 276, 228, 127, -408, 505, -118, 39, 130, -393, -145, 72, -397, -164, 64, -142, 478, -102, -157, -89]
3259h9j76L89k98J31Q3k35j30K20k06P8K08k37K95o88N31l9j9J49q4P9l3m6PK87
3283A77m20L85nl30N95q13L08L02k77N8J43J5J81P4m73L34l31L92j49j92N72m96
3305E0K14J11l35j19L63k38K73j83j05R9n92O00j43R5J90m62M0J51q5P0Q8n32
3327d50N70k16K97j07m60K42J9j78K51L8m45O57n20j10M15m40M26k22j23K31j17
3348b42L3K41l28M15R5n86M20k59k32M11N5P7Q2k88K79r7k79M52k42M0L20n84
3370b17N89m67K05O8m05J81J50Q6J2p3k91M29l12j5M40k55J88k36J5P0j21r6L37
3393B82o48M81j08j83L13k11L48o0k12J22K8l32P9p0p8L77l92O1K23m41O22o38
3415d37L00%k9r7J58j92M53j12k91L80m29L16j20nL11k63o2J1j76J18J74k82M37
$$ y = [-89, -265, 124, -174, -43, 40, -195, -325, -105, -311, -233, -25, -262, 33, -655, -124, -163, -182, -33, -117, -38, -71, -117, -110, 177, -243, 142, 137, -193, 402, -411, -103, 199, -78, -20, 123, 138, 319, 393, -80, 254, -77, 315, 166, -26, 546, 50, 264, 375, 40, -79, 284, 46, 319, 136, 31, 130, -462, 138, -5, 90, 280, -182, -142, 9, -76, -6, 82, -450, 120, -96, 201, 94, -366, -124, -105, -283, -32, 6, -439, 218, -302, -412, 3, -437, -11, -233, -356, -125, -242, -209, 32, -296, 119, 214, -372, 48, -211, -443, -32, 23, 100, 182, -106, 173, 76, -203, 249, 7, 47, 367, -217, 372, -95, 110, 178, -227, -46, 104, 190, 202, 129, -162, 267, -45, -60, 380, 125, 313, 77, 92, 162, 41, -55, 282, -366, 115, 7, -176, 137, -74, 274, 214, 2, 124, 152, -180, -101, -171, -249, 128, -264, -203, 20, -421, 201, -437, -137, -137, -166, -263, -105, -297, 156, 44, -247, 133, -296, 20, -100, -105, 206, -57, -119, -108, -284, -166, 8, -274, 163]
3438A63Q5k90L72l50L53k09q0J1J87p6K40k48Q6K07m95J02J45j2L29m86L9J74
3460B47k04M44l74j93L17Qj66K83p29O51k02q4J7p4K56j76j31m3L74l64J72l86
3482c57L32K29n28J84L22l51J98l7l25M05m37L9O21o28O03p26R8O02n72M67l83
3503b44J83J20r8j55L42j11l28L21k83P20l28l45K52J08K17k77pk7L83n71M97
3524C69k21j69L53n02L83k5m39M32O2q5O4k32J46K47j57M1l46L2P7P4MJ57j92
3547G3j86L14m11M24m86K18K2k69J87L62n35J67J65m73N43p2j69N0N7M4k65J63
3569g7Q2o4M9o7J64j72J29l84K26L1L1p7J04k6j28L29k38K28j45J71m9Q4K29m20
3593A0J20k22M51j40l09K49k5j39J04J08j95J39J5j41L02r9l0r3J39k21J76k81
$$ y = [163, 248, -42, 330, -20, 333, 124, 44, 55, 242, 166, 406, 158, 244, 451, -44, 58, 203, 191, 520, 34, 73, 247, 43, 487, 113, -80, 237, 245, 79, 362, -367, 284, 82, -2, 15, -59, 197, 21, -110, -153, 221, -143, 29, -357, -25, 204, -324, -140, 182, -169, 29, -8, -333, 72, -365, -326, 295, -333, 270, -456, -358, 244, -328, 139, -244, -61, 59, -39, -194, 148, 37, -291, 30, -253, 467, 139, -206, 46, 154, 371, 94, 87, 60, 443, -128, 369, 148, -21, 332, -170, 213, 188, -251, 181, 243, 158, 222, -10, 136, 383, 226, 267, -79, -47, 30, 104, 108, 265, 73, -113, 201, -210, 214, -272, -54, -32, -301, -114, 248, -287, -120, 45, -428, 115, 43, -126, -76, -19, 25, -240, -77, 5, -59, -10, -77, 87, -85, 44, -340, -114, -83, -52, -129, -25, -51, -179, 150, -88, 140, -5, 166, 117, 201, 430, 10, 130, -92, 359, 219, -90, 159, 134, -5, 99, 207, 12, 151, 166, 25, 327, 228, 198, 105, 244, 23, 199, -82]
3615h2M69l31k89M52k35K61l74K66k24K96k59j71Kj68L81k34M9M8j28N2J44K12
3637A37l15L41j85r6m0J90j38j72K24j14n6Q3K5k2K50r9J2J41k81J23k03M43j52
3660I6J06k95J59J0m06K42n9M12k72J20O6o8J27j4K99k96j30j13K81k03P3K16
3682C51k88Q4Q4J8p5l13L40n4J15j70j7l79L38r8L4j02J09P0k82N02k71k26K36
3705FNk55K06k4j04R6j87N3K98m91M34j70Jj18Q4k35K77R6o0O2j66O3p6L34k59
3730a30J95l1k29K01j33J44k77L70j47J30J65k83L49k90r9j5MJ36K1j95K77N6
3752B19j17L50n86M82m38L34K73m24J6j75J67k21J01m4J11j64p0M28m30L98l90
3773a80K10R0k03K88j59l02M19m1k42K70j29j74L0k87L88J2j83J79j10J9m0k64
$$ y = [-82, 387, 56, -233, 219, -16, 245, -129, 137, -87, 209, -50, -221, -219, -387, -6, -240, -191, -143, -271, -219, -75, 137, -178, 163, -22, -118, -158, 32, -106, -278, -54, -168, -224, -141, -116, -138, 112, 13, 25, 166, -115, 8, -195, 248, 96, 202, -93, 66, 76, -330, -88, -147, 265, -7, 113, 179, 111, 238, 224, 523, 227, 97, -16, 265, 62, 135, 351, 63, 147, 231, 249, 174, -139, 201, 147, 262, 92, 75, -304, 34, -64, -30, -132, -23, 47, -235, 267, -4, -230, 6, 11, -244, -38, -62, -166, -70, -257, -204, 94, -397, 37, -133, -132, -250, -166, -401, -124, -28, -88, -26, -192, -129, -205, 129, -130, 65, 34, -195, 6, -127, 17, -260, 110, -37, 93, 258, -25, 324, 34, -65, -80, -76, 60, 81, -114, 163, 219, 102, 452, -134, 348, -90, 244, 517, 93, 109, -66, 101, -120, -19, -63, 48, -116, -186, 242, -188, 210, -180, 30, 120, -83, 205, 46, -256, 163, 122, -120, 150, 21, -153, -123, -410, -22, -10, -193, -14, -124, -105, -145, -409]
3795d09M20K17m31K91l78J33O4q0O8K51l07L10p6l85M68j60N7q2j52M10j38k2
3817F9P5j14j29M88m75N03k7m93M00m27M03O9k63J51K9l00L79m23o4L16j45P4
3839I6J6j44K46k15L40m92R0J12n2l2K35l35j64K50R7K44j83k62J87j94k11K80
3861i1o4K6J31n27M83Q1k29K64l45K16l9k87J94k5J55j06Mr7L89l39J64J99m22
3884b65L62n1N3J58k25q7K47l47L72j99M7J82m24L81J73N3l00n8J02jj32j24N81
3907D98o33L69Q2m44L57l19K34J44k09j92J91M2L94n23O7Q1j52K23kl55L74k51
3929b4j70o1J4j0L41m01M62k17k22L22m17L51J3j13K4r6J36M3j09K29P1m06K94
3952E4k43K34M5j58J63m6j72K51p1m84N52k80K05K21k21J72q2l0K77k42O6n3j08
$$ y = [-409, 11, 228, -203, 88, -290, -157, -93, -173, -105, 146, -161, 149, 73, -312, 156, -4, 53, -29, -181, 229, 91, 69, 144, 30, -99, 389, -86, 417, 390, -103, 297, -130, 273, 342, 79, 230, 259, -41, 338, -85, -149, 167, 22, 96, 112, -32, 214, -1, 339, -153, -63, 49, -3, -35, 200, -135, -299, -49, 48, 292, 109, -153, 34, -160, -371, -91, -155, -129, 2, -525, -42, 39, -190, 74, -271, -55, -94, -381, -187, -212, -57, -163, -159, -256, 133, -206, -42, 157, -265, 97, 46, 99, 257, 32, -55, 192, -155, 217, 18, 65, 247, -177, 204, 377, 430, 130, 72, 174, 173, 41, -83, 498, -135, 234, 316, -128, 229, -90, 144, 288, 79, -113, 78, 120, 514, -9, 58, 139, -13, 210, 208, -147, 227, -24, -194, -255, -241, -251, 90, -311, 151, -66, -288, 34, -383, -32, -19, -132, -108, -204, -68, -25, -134, 95, 166, -240, 54, -189, 45, 90, -68, 95, 49, -123, 128, 57, -427, 125, -155, 50, 271, 50, 222, 140, 110, 387, 145, 211, 158, 50]
3975E0N9R4k93L12l67M01k63l0M47k74p1O7m7J3J57n32L32J76r4J24j91o8j04
3998a02J64j51L9N1r0K29l78M52o48N83j83r1K51k43n6L85k34k45M08m92Q6K19
4020d6j97j1O1K35K4k00J64o5j61K84j01J19k0k30L02j77k20L63l7MJ44l01J26
4043F0J89l71L48k15j4K27k30J51J51n2K13l92K3j62K53R6J90o3o5k75k4K33l61
4066i0J68J71l64R7j44K9J88j62j03N51n42K19J03k92K1j3J48j68L4P0J79o39
4088e39O20k85L13j33j76P6m3o6K71j31j32K02j95K7R5m4L00m15J50J86q4j44
4110a47J45R7j45J83k61K07j65J01L09k57J51j29o3N1M6L2r8Q5r0L04o40M85k19
4133a8K28J00k79J37q4m2K24j52k14O8J22k40lK75k24j69M52l31L9J10R0k58M7
$$ y = [50, 109, 203, -90, 222, -145, 256, -7, -37, 410, 136, 65, 132, 85, 98, 255, -277, 55, 231, 137, 261, 70, 2, -102, 62, -89, -50, 1, -89, 140, -238, 214, -434, 149, -34, -125, 126, -117, -173, 212, -22, -267, 141, -351, -265, -46, -243, -254, -193, 42, 66, -134, 30, -35, -196, 88, -13, 106, 86, -144, 158, -19, -239, 124, 87, 91, 235, -66, 60, 249, -122, 226, 11, -3, 224, -6, 145, 296, 244, 457, 65, 88, -74, 179, 275, 465, 402, 337, 62, 38, 271, -90, 78, 249, -115, -18, -162, -133, 55, -107, -210, 341, -201, 18, 121, -171, -150, -163, -15, -183, -149, -79, 100, -539, 81, -204, 109, -24, -200, -124, -167, -233, 38, -93, -225, -23, -218, -191, -96, -140, 160, -255, -105, 81, -3, -147, -2, 95, -50, 133, -128, 79, -86, 15, 324, 67, 218, 89, 26, 77, 123, 155, 57, 142, 52, 356, -284, 201, -18, 210, 310, 31, 168, 84, 42, 266, 114, -100, -32, 90, -150, -153, 122, -102, -271, 181, -150, -111, -1, 89, -169, -122]
4156a22K17m35L73j81J24q1j24K78j98J02k17J57J6L9M2k68L03j66Q7q1J62j48
4178a21mR3p6J9O8R3j94J57j23K90j40j52j88L30Q6k12K24m5k18L67o5J04m46
4201a53K27O3J66l39N8K0m0K08j46J5k91K44j20N6o6P1K65l5j75j53J4R4K7j4
4225dQ5L5k28J99j19J37k68K50l99J85P2p3K16l42J13P1l0k71P5K54k15L74l99
4248b82L19k21j19K74%K70m51K43k75J21J05J70m22K28R5j61L47j04n5q2K7J89
4270B16j18j25K14j16m0%J13O8j99O7P9j4J83l13K35j49p0J88r7o1q6K05r5P9
4294A64j25j4J10n4j68j3K71j26J44j44p2j72L6K90m00N71o20Q7J61Jj20K52k48
4317a89K36k5k57P7j62L60Q0j17J6j20p1K59j4r3L00j54q3o6j52K35%K06l66o2
$$ y = [-122, 95, -340, 33, -148, -24, -105, -229, 49, -149, -47, -264, -107, -91, -52, -10, -278, 25, -141, -54, -135, 27, -121, -125, -32, -108, -89, -21, 72, -122, 35, -88, 202, 62, -90, -278, 52, 138, -74, 150, 105, -113, 254, 189, 293, -153, 74, 137, 303, -36, 22, 42, 2, 210, 64, 79, -212, 32, -88, -32, -98, -27, 238, 203, 28, -125, -111, -17, 10, -4, 81, 116, -112, 87, -32, 105, -163, 87, -312, -127, -55, -128, 88, -254, -141, -70, -100, -371, -296, -42, -257, 117, -282, 37, -184, -303, -29, -29, 241, -210, 33, -242, -121, -16, 154, -268, -40, 55, -106, 241, 137, 82, 0, 27, 216, 98, -27, 187, 71, 31, 31, 144, 212, 13, 80, 159, 145, 328, 15, 250, 101, 31, 219, 122, 61, -25, 180, 85, 164, 39, 25, 135, 81, -87, -100, 171, 45, 189, 45, -27, -199, -163, 127, -273, 298, -322, -235, -74, -73, -193, 59, -189, 47, 22, -235, -158, -320, 40, 120, 3, 19, -101, -172, 87, 73, -20, 280, 126, 43, -23, -175, 60, 60, 266, -100, -162]
4341a62P6K40k32O7J90k37K31k20oK03j97L05j82J61j28M2k06J81m8j52K59j95
4363a0K07j18j40J29m48L84j0K38k55L2J86n7j02p4J21j96J55k44Q3j47J72K3
4385g1k9k65L88J07m24J39k50J51O2J06J08l08Q4K76o1P1j22k85N73l68M3L88
4407C13l93J36nk11J91J17k87K56k44J08K46l55L50l40N0J03K86l07L22l80K25
4428A81j03J56J8j09j31L71o50L27J87l32K18Nn8L10l99j94O45o49M82k76P3L0
4450A02k65K04J12k73R6j3k3N3j01J05J13k07N9r1k49K99J76j92J03k47J99L0
4472a0l29L68k04Q3m2lL37l55OR9R9j07K11j81q8L64l21K90j86J15j81J37j21
4495a9J34k76L35K11k94N5k10N34l68MK03lk07J28k12O3J69l07K30k67l0M22l93
$$ y = [-162, -86, 154, -78, -11, 179, -58, 173, -47, -53, 150, -47, 258, 76, 237, 109, 151, -55, 126, 78, -74, 185, -10, 197, 79, -61, 68, -380, 4, -6, 232, -23, 9, 195, 138, 36, -38, 83, -113, 42, -202, -119, -266, -94, -71, -100, -365, 23, 130, -294, -155, -405, -254, -192, -86, 22, -286, -202, 74, 13, 84, -38, -323, 250, -118, -75, 313, -80, 56, 51, -160, 31, 148, -139, 117, -127, -19, 227, -128, 222, -118, -68, 35, 321, 14, 336, -44, 181, 78, 234, 252, 143, 12, 383, -267, 60, 247, -85, 133, 138, 80, 390, -9, -203, 442, -207, 275, -1, 72, 102, -163, 41, 153, -120, -24, -37, -60, -7, -108, -3, 110, -97, -38, -129, -378, -79, 97, -95, 8, -239, -40, -10, -339, 29, -175, -92, -134, -137, 200, -155, -149, -50, 49, -58, 153, -28, -116, 248, -73, 217, 31, 146, -35, 102, -19, 115, -161, 174, 385, 91, 146, -64, 470, 102, 106, 309, 306, 99, 227, 15, 78, 247, -60, 170, -97, -127, 295, -98]
4518i8J04J88J6m5k37R2j28J99k57M03l53K14j10j74K79k28j8R6j48P4J95r9j23
4541a58J00j34P8j84K35j1K7L69m72J01J53ql07L27k28j3K6q1L34l52L55m02J57
4564h8J77J3o7K21q0j50L88m64L91k87J0j35J56j98M86l69K54o1L8j82j61K28
4586A20R7k09L22n65J47L6J20QK1j70J78L50n90mJ32j71K73m63J67K11j00l0J29
4609IL8q6M0l51L70l33K14j03k0L7O9Lm8j5J21P0k2J66l89K7K20Q8j13K73l81
4634a16J63k43O4K87k66L95l89J63J1L1J90k00m6J24k07L1k1J33n3j74M56k86
4656D7J28q4J99n80N47j64j60L9m1l41L79K36l04K33j89N6l0P3k50mM50k09j1
4679B0k77L29j09j85J79k2K93j72n6J38j46m25N52j95J58l31QK96k87K74j85n8
$$ y = [-98, 6, 194, 210, 165, -72, 20, -108, 91, -166, 237, -116, 98, -12, -186, 93, -135, -153, -57, -205, -131, 64, -35, -158, -58, -192, -114, -298, -63, -74, -47, 322, -150, -49, 104, 96, -211, 116, -112, -125, -99, -180, 154, -198, 157, -245, -88, 89, 102, 35, 256, 176, 26, 414, -50, 341, 54, 64, -71, 85, -113, 373, 4, 258, 197, 235, 53, -108, 120, 217, 8, 330, -235, -88, -52, 68, 76, 97, -73, 105, 455, -135, -139, -7, -178, 95, -368, -201, 10, -90, -120, 9, 47, -39, 1, -350, 20, -313, -99, -202, -222, -185, -116, -113, -161, -176, -55, 15, -7, 159, -230, -203, 17, 105, -8, 265, -116, 47, -196, -132, 155, -111, 284, -105, 58, 69, 100, 290, 90, 44, 168, -39, -8, -29, 104, 51, -123, 333, 47, 175, 91, 290, -290, 257, 93, -67, -28, -69, -410, -31, 205, -99, 134, -55, 1, -29, 44, -206, -210, 240, 31, 20, -257, 72, -37, -222, -43, -65, 228, 56, 0, 138, -8, -433, 119, -76, 82, -249, -241, 55, -232, 42, -143, -201]
4701b01J96j08l8r7L71n1O5m82L45J6K9L29n17L04j63q1J98mJ33p4M8l68J20J
4725b9O1J87r7p3L8J47M6j75OJ41J9m5k50L7M9p6K17l14K64m4j71j8r9L00j67
4750d6K84k12j05n1N1M0j12K09j61K19j12k02QK87J0k39J73k54K08j85R2oJ04
4773@r6K05k21P8J37l9k48J41O1K6m2J67l0j00j41J56n8J1J18J5j31N7M1J45p4
4798A78N9j04k06QL61k57L8M9J21j47m0k2r9K79j64R9l80M20p9N5j32Q2M2j02
4822E9k75M51l02J74l9j47J05m5p5J1k77P7L45q1ok19J1O9K12k41Q7J06l21M38
4846A17k12JJ27k63L61j06Oq8K38j05j85R8J66k92K59j07O7m2j24k11M17j48P7
4869E1J03j77JL29p0l28K63j67K81l36J82Pq5j00L22l84J56P8k91N24k39J4K2
$$ y = [-201, -5, -113, -151, -248, 123, 72, 137, -345, 0, 16, 45, 374, -143, 161, -2, -83, 115, 111, 244, 170, 218, -150, -30, -29, 32, 219, 122, 49, 87, 234, 280, 105, 111, 252, 271, 226, -24, 13, 62, -14, 203, -111, 153, 109, -62, -80, -179, 121, -46, 238, 26, -79, -130, -79, -39, -151, 58, -103, 116, 4, -198, -190, 97, 107, -132, 41, -213, -5, -190, -98, -104, 0, -96, 109, -112, -34, 103, 64, -184, -43, 18, 44, 2, 169, 139, 39, -102, 54, -4, 7, 125, 140, 9, 66, 107, 252, 178, 237, 133, -73, -65, 296, 39, 77, 126, 247, 100, 60, 38, -61, 218, 54, 153, -227, 193, 114, 169, 37, 119, 161, 59, -216, 235, -67, 107, 68, -79, 26, -19, -94, -83, -360, -283, 62, -19, -25, -244, -233, -164, 48, -193, -106, 0, -321, 117, -95, -94, 33, -230, 131, 25, 31, -57, 181, 76, -109, -11, 155, -137, 122, 15, 82, 40, -84, -295, 122, -26, 51, 154, -23, -22, 307, 237, -91, 172, 5, 286, -50, 132, 139, 54, -46, 276, -108, 48, 126, -165, 359, 120, 134, 156]
4892A56j33n4K59m39K83Nl46K54J95k38k2J03k4j62K18j93J05j41P2j86K15N6
4914a7l82O34m28K2j49L60N0l52L32m8j34K56j55o4J14k3j08L01j64J19j09j84
4936a29J28j9J43m7l00P8J79J38R1j01k74J03K7N2J31k78R7J34l5J12o8m15N09
4959B56j10J05l43Q7j17m7K58p5n1K10Nk01n3m4R1K48n19M17j87J52j85k49L46
4982fK34l17q8q9J75j79N4N4j00R3k51N22n08K04L85l94K32j17J8k0q6K68l60
5005b76N39k45J41m4J1j30K29j54K43r8k10J3k6J88P1q7n6J18p3j44k9k54M26
5028A53M3j31K77n66L04k7K7lPk40K88j18J32j20j79J97j39L40k61N1k75L05l84
5051c19L46o4p9K40l16K26j97K4J53j11R8k10J88l10L07j80j42J46J41K09j85
$$ y = [156, 23, -31, 228, -211, 72, 77, -269, -15, 180, -58, -80, 23, -1, -163, 55, -138, -33, -174, -102, -288, -73, -17, -399, 235, -193, -171, -320, 40, 90, -262, 70, 22, -112, 144, -11, -75, 39, 16, -92, 209, 45, 164, 55, -129, -1, -20, 123, 76, -224, -146, 33, 171, 262, 161, -113, -10, 17, 69, 200, -78, 19, 153, 118, 230, 162, -253, 256, 146, 251, -92, -5, -122, -169, 89, 14, -37, 173, 178, -23, -76, -120, -29, 219, -300, 117, -70, 82, -103, -352, -6, 228, -89, -177, -266, -91, -270, -216, -162, -262, -169, -420, 102, -406, -202, 183, -211, 21, -96, -78, -98, -184, 84, -276, 263, 18, 159, 115, 126, -4, 225, 71, 314, 216, 6, 19, -7, 181, 252, 165, 109, 227, 154, 10, -19, -273, 153, 196, 65, 342, -224, 80, 53, 80, 77, 84, -156, 132, 14, 146, 26, -153, 44, -95, 245, -16, 35, -240, 65, -319, 27, -37, -116, 124, -192, 34, -163, -139, 14, -97, 1, -209, -21, -331, -24, -204, -346, -200, -59, 150, -35]
5072c5j00K08m8o8nO4l1n8M6N7o5M7J65j81k3O8k93M16o4J54j87P7j09m3l8L41
5098B95j33o6r0j41K69k67J25J53J73k93K14m53M17o4k48K76j23j68J83j96j4
5119a51J82JK8j74k3J75r8Q8q2M9J39l69J11J15k12k06L25m6J88j62l61M50k25
5142b58K27K27l49J90mn4j32q4L4N5j99K87J19l71L26j92J76rj50L55l17j66N90
5165C01m45k73Q59n70L18k0k57J67j96L19r5lo4kk19L51N2j29n0N2q0j10L18j71
5189E3Q4m9j32K86k43J2M9l28M18j37k21O2K47n8l65K71J30j81L21l33K10J1k19
5212a12l2JM6qp1R4J68k21J53l51L08q4N4J27K2k10L7r7j4J19K52j71L22m42J44
5237C4J01K5p1j30K69l43J65qj48J53R3r1k09L07K71l21j81q9M83l31J84j38K38
$$ y = [-35, -135, 73, 25, -43, -48, 16, -15, -73, -27, 30, -35, 12, 177, -4, -27, 41, -252, 164, 100, 254, 67, 144, 35, -8, -46, 295, 162, 96, 6, -135, 134, -133, -8, 145, 318, 25, 239, -214, 203, 139, -109, 167, 44, -124, 59, -137, -151, 31, 32, 60, -114, -137, 38, -60, 28, -54, -5, 134, -235, -124, -9, -221, -427, -102, -148, 40, -122, -483, -33, -258, -31, 196, -153, 37, 33, -21, -153, -237, -203, -148, -347, -60, 59, -312, 14, -178, -2, -11, -161, 194, -123, -289, 301, -144, -417, 442, -128, 190, 170, -87, 80, -116, 203, 108, 105, 41, 39, -180, 171, 223, 94, 44, 96, 16, -94, 224, 53, 137, 88, -44, 242, -1, 11, 60, -268, 150, 13, -208, -146, 101, 43, -322, -51, 79, -102, 219, -114, 96, 107, -112, -144, -143, -97, -105, -176, -82, 86, -135, 18, -333, -25, -109, -55, 72, 94, -116, -79, -176, -190, -71, 181, 10, 332, -110, 34, 135, 160, 89, -41, 228, -115, 50, 42, -106, 47, 140, 49, -160, 147, 418, 97, -84, -173, 310, -21, 163, 25, 263]
5260B63k34L7j56r5M51l30J87P7k36j53K21j8j10J93j93j02O1J34RK21l67J40
5282@j81L3M9N0Kq6K70k21P3k99J63J62j18l2M8J85l9rj0l9P7j67J89j80J10j76
5308a46J81K82m39K7jK32k85j14L67J17m57N1J44N3R0R6k32j24L10Rm9J47k71
5331a2J95j33J66p3j6M3k45m2J66R%K9Nr8J4j47K64j34R8q8J7J08j76J44n22K61
5357a67J1J10J87k27N4m5Q3j81M2M8m6J34k45J13J11J57j98Q2L0l70J30k38K00
5380b25L01j1k27L39k41n7J02O7J29k53K4j06K30K7n8k24K81J01l03K59j06l31
5402b82L64qq1J42k12K6J31m8k0j37K52r7r1L3q7j05L87k18l8N1M2J7r3N4K0j53
5428a51K08L7j39J78k25m7K34j70k16K56j33J19P2j03N9j33K01j82K2L06k66n6
$$ y = [263, 29, 66, -90, -185, 266, -64, 123, 200, -36, -189, 32, 14, -96, 97, -96, -198, -137, -3, 6, 227, -140, 0, -181, -148, -99, -49, -47, -133, 137, -84, -11, -310, -147, 15, -103, -135, -87, 98, 59, 50, 40, 1, 78, -89, 100, -80, 30, -146, 35, 317, -122, -95, -96, 136, -149, -263, 104, 221, -236, -185, -41, 12, 102, 198, -34, -158, 152, 161, 112, 259, -12, 183, 50, 216, 143, 127, 170, -75, -117, 49, 58, 58, 87, 92, -6, 8, -139, 125, -9, 89, 1, 18, 126, -50, 94, -428, -167, -156, -46, 141, -86, -32, -77, 6, -175, -133, -85, -131, 3, -242, -129, -18, 139, -59, 23, 53, -317, -187, -425, -225, 76, 65, -162, 177, -64, -121, -19, 48, 177, -76, -52, -158, 72, 99, 41, -183, 98, 199, -104, 155, 49, -282, 82, 74, -7, 135, -77, -51, 80, 32, 12, -125, 127, 30, -61, -28, -115, -220, 167, -51, -89, -38, 4, 21, -72, -18, 2, -151, 57, 94, -45, 133, -92, -139, 95, -75, -291, -35, -168, -49, 23, -80, -21, -154, 47, -135, -113, 193, -73, -129]
5450a29L16m45M56l06o3K96l0j90O1j64K74K02l58P7k19O1M47l10m6M26k64k0
5472G2P2Jj64K28l99L53j67J10m2j10K37j81J06l6R0k89K46j70J5M52l20r3k1
5495a0J85j16n6K35k86l0lj56L05m8j67O1K39j82k3n5p3L48l66J05o3R9K31n83
5519d09L61J54j60J04J11m70M23l46K96k51J69j81L31k84J06j92L80j31k09L07
5539A09q7o9L05m8j18N7j19J66n0k80R3J63j43L98l11J14q4m6k2j11J1J73k91
5562a90O14l73p0J20k6o4J40j92J96Q8m64J85L4K6P8k42LM36n27J05K07m30L02
5585d4l8j47J29q0n4n9J1M81l81J8l3j38K19L46l01J40r5o3k8j41K47J68k88J73
5609D2j52j58M24k65J21j02O6K18j04j37K16k63l6J97l0M1k00qL71j72NK3l6l0
$$ y = [-129, 187, -258, 198, -108, -171, 125, 95, -95, -34, -198, 76, 278, -80, -3, -222, -161, 286, -24, -70, 356, 92, 72, 144, 145, -19, 209, -190, 163, -4, 106, 64, -46, 191, 10, 116, 80, 170, -119, 127, -43, -28, 424, 104, 11, -10, 175, 59, 3, 238, -48, -78, -81, -237, 68, 20, -147, -86, 153, -29, -52, -107, -180, 168, -198, -93, -156, -57, 174, -409, -48, 106, -54, 50, 161, -309, 114, -232, 64, -187, -18, -199, 132, -152, -46, -238, 142, 11, -198, 109, 22, -47, 258, 210, 92, 149, 30, 196, 146, -134, -41, 122, -21, 377, 66, 180, 96, 50, 28, -83, -72, 101, -190, 424, 51, -19, 101, 75, 11, 151, -41, 155, 243, -221, -36, -2, 24, 102, -140, -137, 299, -228, -123, 84, -346, -44, -82, -229, -100, -180, -234, -293, -282, 199, -182, -164, -197, -335, -116, 230, -71, 69, -26, -89, -117, -258, -11, 157, -131, 42, -110, -268, 156, -109, 12, -90, -24, 194, 90, -47, 169, -94, -130, 67, 37, 78, -122, -130, 241, 69, 74, 97, 61, 31]
5633C1R3m71O71m53M6qK41K58m25L5j03J02j54K64jk09K37l24J38M6P4o7J32m33
5657b80K39p1n6K09j06K80l81J40M6m4K75k42J54q2n67P03j95K1j09L24k37rj46
5680a34M38k88k4R2j02k86L46Rl53O46m36M4J35q9J21l2J98j97p5j94K5J21K41
5703B06l42j07N22n7k26j5j41J3L60j78J93m33K79r2k0R8j99J01J54L7M6j54q3
5726c8j56L9J61j70L7N0J07j69K17j81k09M47Q5l26J49k01L30j72P5M4l07p0L71
5749A13P4q2o1k0j60l3L39q1j53L21l29P7l0n5J11j59L22k08J75l4j79J59k88
5772a81K93J07r3K64n99K01M7J13j47kp7%K31j39J78k82J76j6l6j82J36J69q6
5795G5J4Rl09J49o3J10j98m3m9J62P4K27k61p7K91j25k20L35k51j61K99m7K1K20
$$ y = [31, 124, -347, 324, -129, -83, -91, 150, 408, -17, 18, -85, 17, -137, 127, 126, -83, 154, -170, -32, 14, 88, 21, 153, -280, -41, -112, -168, 41, -65, 215, -166, -26, 20, -24, 251, 9, 163, 81, -486, 217, 22, 43, -66, 258, 21, 12, -134, 304, 16, -8, 84, -18, -304, 42, 51, -302, 344, -92, -48, 87, -2, 119, 87, 285, 88, 13, -181, -156, -35, 206, -136, -243, 279, 222, -4, -19, -160, -147, 213, 35, 228, -205, 74, -18, -38, 60, -139, -38, 116, 153, 199, 45, -38, -194, -155, 6, -164, -127, -77, 30, -139, 78, -103, -312, 135, 220, -106, 43, -158, 172, 0, 75, 119, -188, -258, 113, 187, 105, 44, 24, -136, -169, 170, 89, -64, 257, -72, 5, -25, -80, 31, -128, 194, -14, 161, 127, -52, 107, -181, 112, 219, 126, 390, -209, -8, 39, 152, 5, 3, -74, -74, 157, 18, 196, -86, 90, 74, 38, -144, -8, 161, 75, 89, 98, -211, -62, -125, -15, -213, -256, -305, -143, -69, 158, -103, -180, 111, -14, -234, 101, -150, -311, -12, -59, -38, 182]
5819A82l32q1K43J0J44k53J8N5r0K0Q1j25J73j42L42m38k1L72j34L3J8l16K16
$$ y = [182, -150, -231, 12, 22, 166, -87, -69, -14, -104, -84, -3, -128, 45, -97, 245, -193, -214, 158, 24, 57, 75, -241, -25]
$$ [...]
8191a02
##END NTUPLES=NMR FID
##END=
